New Ticket     Tickets     Wiki     Browse Source     Timeline     Roadmap     Ticket Reports     Search

Ticket #41567: main.2.log

File main.2.log, 16.3 KB (added by ryandesign@…, 16 months ago)

libLASi build log

Line 
1version:1
2:msg:main --->  Computing dependencies for libLASi:msg:main
3:debug:main libLASi has no conflicts
4:debug:main Searching for dependency: cmake
5:debug:main Found Dependency: receipt exists for cmake
6:debug:main Searching for dependency: pkgconfig
7:debug:main Found Dependency: receipt exists for pkgconfig
8:debug:main Searching for dependency: pango
9:debug:main Found Dependency: receipt exists for pango
10:debug:main Executing org.macports.main (libLASi)
11:debug:main changing euid/egid - current euid: 0 - current egid: 0
12:debug:main egid changed to: 528
13:debug:main euid changed to: 501
14:debug:archivefetch archivefetch phase started at Wed Nov 27 05:39:56 CST 2013
15:warn:archivefetch Your DNS servers incorrectly claim to know the address of nonexistent hosts. This may cause checksum mismatches for some ports.
16:debug:archivefetch Executing org.macports.archivefetch (libLASi)
17:debug:archivefetch Privilege de-escalation not attempted as not running as root.
18:debug:fetch fetch phase started at Wed Nov 27 05:39:56 CST 2013
19:notice:fetch --->  Fetching distfiles for libLASi
20:debug:fetch Executing org.macports.fetch (libLASi)
21:debug:fetch Privilege de-escalation not attempted as not running as root.
22:debug:checksum checksum phase started at Wed Nov 27 05:39:56 CST 2013
23:notice:checksum --->  Verifying checksums for libLASi
24:debug:checksum Executing org.macports.checksum (libLASi)
25:info:checksum --->  Checksumming libLASi-1.1.1.tar.gz
26:debug:checksum Calculated (md5) is bc5161b1d820db3dbcea24ce1c2ed5ec
27:debug:checksum Correct (md5) checksum for libLASi-1.1.1.tar.gz
28:debug:checksum Calculated (sha1) is d17fdebf4bb4a29512e321c7af157a694dc855a0
29:debug:checksum Correct (sha1) checksum for libLASi-1.1.1.tar.gz
30:debug:checksum Calculated (rmd160) is dc9efdef39615b4c293c61e3506ee8f2e66bc751
31:debug:checksum Correct (rmd160) checksum for libLASi-1.1.1.tar.gz
32:debug:checksum Privilege de-escalation not attempted as not running as root.
33:debug:extract extract phase started at Wed Nov 27 05:39:56 CST 2013
34:notice:extract --->  Extracting libLASi
35:debug:extract Executing org.macports.extract (libLASi)
36:info:extract --->  Extracting libLASi-1.1.1.tar.gz
37:debug:extract setting option extract.args to '/opt/local/var/macports/distfiles/libLASi/libLASi-1.1.1.tar.gz'
38:debug:extract Environment:
39CC_PRINT_OPTIONS='YES'
40CC_PRINT_OPTIONS_FILE='/opt/local/var/macports/build/_Users_rschmidt_macports_dports_print_libLASi/libLASi/work/.CC_PRINT_OPTIONS'
41CPATH='/opt/local/include'
42LIBRARY_PATH='/opt/local/lib'
43MACOSX_DEPLOYMENT_TARGET='10.9'
44:debug:extract Assembled command: 'cd "/opt/local/var/macports/build/_Users_rschmidt_macports_dports_print_libLASi/libLASi/work" && /usr/bin/gzip -dc '/opt/local/var/macports/distfiles/libLASi/libLASi-1.1.1.tar.gz' | /usr/bin/tar -xf -'
45:debug:extract Executing command line:  cd "/opt/local/var/macports/build/_Users_rschmidt_macports_dports_print_libLASi/libLASi/work" && /usr/bin/gzip -dc '/opt/local/var/macports/distfiles/libLASi/libLASi-1.1.1.tar.gz' | /usr/bin/tar -xf -
46:debug:extract euid/egid changed to: 0/0
47:debug:extract chowned /opt/local/var/macports/build/_Users_rschmidt_macports_dports_print_libLASi/libLASi/work to macports
48:debug:extract euid/egid changed to: 501/528
49:debug:extract Privilege de-escalation not attempted as not running as root.
50:debug:patch patch phase started at Wed Nov 27 05:39:56 CST 2013
51:debug:patch Executing org.macports.patch (libLASi)
52:debug:patch Privilege de-escalation not attempted as not running as root.
53:debug:configure configure phase started at Wed Nov 27 05:39:56 CST 2013
54:notice:configure --->  Configuring libLASi
55:debug:configure Using compiler 'Xcode Clang'
56:debug:configure Executing proc-pre-org.macports.configure-configure-0
57:debug:configure Executing org.macports.configure (libLASi)
58:debug:configure Environment:
59CC='/usr/bin/clang'
60CC_PRINT_OPTIONS='YES'
61CC_PRINT_OPTIONS_FILE='/opt/local/var/macports/build/_Users_rschmidt_macports_dports_print_libLASi/libLASi/work/.CC_PRINT_OPTIONS'
62CFLAGS='-pipe -Os -isystem/opt/local/include -arch x86_64'
63CPATH='/opt/local/include'
64CPPFLAGS='-isystem/opt/local/include'
65CXX='/usr/bin/clang++'
66CXXFLAGS='-pipe -Os -isystem/opt/local/include -arch x86_64 -stdlib=libc++'
67F77FLAGS='-m64'
68F90FLAGS='-pipe -Os -m64'
69FCFLAGS='-pipe -Os -m64'
70FFLAGS='-pipe -Os'
71INSTALL='/usr/bin/install -c'
72LDFLAGS='-L/opt/local/lib -Wl,-headerpad_max_install_names -arch x86_64'
73LIBRARY_PATH='/opt/local/lib'
74MACOSX_DEPLOYMENT_TARGET='10.9'
75OBJC='/usr/bin/clang'
76OBJCFLAGS='-pipe -Os -arch x86_64'
77OBJCXX='/usr/bin/clang++'
78OBJCXXFLAGS='-pipe -Os -arch x86_64 -stdlib=libc++'
79:debug:configure Assembled command: 'cd "/opt/local/var/macports/build/_Users_rschmidt_macports_dports_print_libLASi/libLASi/work/libLASi-1.1.1" && /opt/local/bin/cmake -DCMAKE_INSTALL_PREFIX=/opt/local -DCMAKE_VERBOSE_MAKEFILE=ON -DCMAKE_COLOR_MAKEFILE=ON -DCMAKE_BUILD_TYPE=Release -DCMAKE_BUILD_WITH_INSTALL_RPATH=ON -DCMAKE_INSTALL_NAME_DIR=/opt/local/lib -DCMAKE_SYSTEM_PREFIX_PATH="/opt/local;/usr" -DCMAKE_MODULE_PATH=/opt/local/share/cmake/modules -DCMAKE_FIND_FRAMEWORK=LAST -Wno-dev -DCMAKE_C_FLAGS_RELEASE="-DNDEBUG" -DCMAKE_CXX_FLAGS_RELEASE="-DNDEBUG" -DCMAKE_OSX_ARCHITECTURES="x86_64" -DCMAKE_OSX_SYSROOT=/ -DCMAKE_OSX_DEPLOYMENT_TARGET=""'
80:debug:configure Executing command line:  cd "/opt/local/var/macports/build/_Users_rschmidt_macports_dports_print_libLASi/libLASi/work/libLASi-1.1.1" && /opt/local/bin/cmake -DCMAKE_INSTALL_PREFIX=/opt/local -DCMAKE_VERBOSE_MAKEFILE=ON -DCMAKE_COLOR_MAKEFILE=ON -DCMAKE_BUILD_TYPE=Release -DCMAKE_BUILD_WITH_INSTALL_RPATH=ON -DCMAKE_INSTALL_NAME_DIR=/opt/local/lib -DCMAKE_SYSTEM_PREFIX_PATH="/opt/local;/usr" -DCMAKE_MODULE_PATH=/opt/local/share/cmake/modules -DCMAKE_FIND_FRAMEWORK=LAST -Wno-dev -DCMAKE_C_FLAGS_RELEASE="-DNDEBUG" -DCMAKE_CXX_FLAGS_RELEASE="-DNDEBUG" -DCMAKE_OSX_ARCHITECTURES="x86_64" -DCMAKE_OSX_SYSROOT=/ -DCMAKE_OSX_DEPLOYMENT_TARGET=""
81:info:configure -- The CXX compiler identification is Clang 5.0.0
82:info:configure -- Check for working CXX compiler: /usr/bin/clang++
83:info:configure -- Check for working CXX compiler: /usr/bin/clang++ -- works
84:info:configure -- Detecting CXX compiler ABI info
85:info:configure -- Detecting CXX compiler ABI info - done
86:info:configure -- Looking for pkg-config - found
87:info:configure -- checking for modules 'pangoft2;pango;freetype2'
88:info:configure --   found pangoft2, version 1.36.1
89:info:configure --   found pango, version 1.36.1
90:info:configure --   found freetype2, version 17.0.11
91:info:configure -- checking for module 'freetype2'
92:info:configure --   found freetype2, version 17.0.11
93:info:configure -- FOUND FreeType 2.2+ (NEW API): Library version is 17.0.11
94:info:configure -- Found Doxygen: /opt/local/bin/doxygen (found version "1.8.5")
95:info:configure
96:info:configure Summary of CMake build system results for libLASi
97:info:configure
98:info:configure Install location variables which can be set by the user:
99:info:configure CMAKE_INSTALL_PREFIX:           /opt/local
100:info:configure CMAKE_INSTALL_EXEC_PREFIX:      /opt/local
101:info:configure CMAKE_INSTALL_BINDIR:           /opt/local/bin
102:info:configure CMAKE_INSTALL_DATADIR:          /opt/local/share
103:info:configure CMAKE_INSTALL_LIBDIR:           /opt/local/lib
104:info:configure CMAKE_INSTALL_INCLUDEDIR:       /opt/local/include
105:info:configure CMAKE_INSTALL_INFODIR:          /opt/local/share/info
106:info:configure CMAKE_INSTALL_MANDIR:           /opt/local/share/man
107:info:configure
108:info:configure Other important CMake variables:
109:info:configure
110:info:configure CMAKE_SYSTEM_NAME:              Darwin
111:info:configure UNIX:                           1
112:info:configure WIN32:                         
113:info:configure APPLE:                          1
114:info:configure MSVC:                                   (MSVC_VERSION:  )
115:info:configure MINGW:                         
116:info:configure MSYS:                           
117:info:configure CYGWIN:                         
118:info:configure BORLAND:                       
119:info:configure WATCOM:                         
120:info:configure
121:info:configure CMAKE_BUILD_TYPE:               Release
122:info:configure CMAKE_CXX_COMPILER:             /usr/bin/clang++
123:info:configure CMAKE_CXX_FLAGS_RELEASE:        -DNDEBUG
124:info:configure -- Configuring done
125:info:configure -- Generating done
126:info:configure CMake Warning:
127:info:configure   Manually-specified variables were not used by the project:
128:info:configure
129:info:configure     CMAKE_C_FLAGS_RELEASE
130:info:configure
131:info:configure
132:info:configure -- Build files have been written to: /opt/local/var/macports/build/_Users_rschmidt_macports_dports_print_libLASi/libLASi/work/libLASi-1.1.1
133:debug:configure Privilege de-escalation not attempted as not running as root.
134:debug:build build phase started at Wed Nov 27 05:39:58 CST 2013
135:notice:build --->  Building libLASi
136:debug:build Executing org.macports.build (libLASi)
137:debug:build Environment:
138CC_PRINT_OPTIONS='YES'
139CC_PRINT_OPTIONS_FILE='/opt/local/var/macports/build/_Users_rschmidt_macports_dports_print_libLASi/libLASi/work/.CC_PRINT_OPTIONS'
140CPATH='/opt/local/include'
141LIBRARY_PATH='/opt/local/lib'
142MACOSX_DEPLOYMENT_TARGET='10.9'
143:debug:build Assembled command: 'cd "/opt/local/var/macports/build/_Users_rschmidt_macports_dports_print_libLASi/libLASi/work/libLASi-1.1.1" && /usr/bin/make -w all'
144:debug:build Executing command line:  cd "/opt/local/var/macports/build/_Users_rschmidt_macports_dports_print_libLASi/libLASi/work/libLASi-1.1.1" && /usr/bin/make -w all
145:info:build make: Entering directory `/opt/local/var/macports/build/_Users_rschmidt_macports_dports_print_libLASi/libLASi/work/libLASi-1.1.1'
146:info:build /opt/local/bin/cmake -H/opt/local/var/macports/build/_Users_rschmidt_macports_dports_print_libLASi/libLASi/work/libLASi-1.1.1 -B/opt/local/var/macports/build/_Users_rschmidt_macports_dports_print_libLASi/libLASi/work/libLASi-1.1.1 --check-build-system CMakeFiles/Makefile.cmake 0
147:info:build /opt/local/bin/cmake -E cmake_progress_start /opt/local/var/macports/build/_Users_rschmidt_macports_dports_print_libLASi/libLASi/work/libLASi-1.1.1/CMakeFiles /opt/local/var/macports/build/_Users_rschmidt_macports_dports_print_libLASi/libLASi/work/libLASi-1.1.1/CMakeFiles/progress.marks
148:info:build /Applications/Xcode.app/Contents/Developer/usr/bin/make -f CMakeFiles/Makefile2 all
149:info:build make[1]: Entering directory `/opt/local/var/macports/build/_Users_rschmidt_macports_dports_print_libLASi/libLASi/work/libLASi-1.1.1'
150:info:build /Applications/Xcode.app/Contents/Developer/usr/bin/make -f CMakeFiles/documentation.dir/build.make CMakeFiles/documentation.dir/depend
151:info:build make[2]: Entering directory `/opt/local/var/macports/build/_Users_rschmidt_macports_dports_print_libLASi/libLASi/work/libLASi-1.1.1'
152:info:build cd /opt/local/var/macports/build/_Users_rschmidt_macports_dports_print_libLASi/libLASi/work/libLASi-1.1.1 && /opt/local/bin/cmake -E cmake_depends "Unix Makefiles" /opt/local/var/macports/build/_Users_rschmidt_macports_dports_print_libLASi/libLASi/work/libLASi-1.1.1 /opt/local/var/macports/build/_Users_rschmidt_macports_dports_print_libLASi/libLASi/work/libLASi-1.1.1 /opt/local/var/macports/build/_Users_rschmidt_macports_dports_print_libLASi/libLASi/work/libLASi-1.1.1 /opt/local/var/macports/build/_Users_rschmidt_macports_dports_print_libLASi/libLASi/work/libLASi-1.1.1 /opt/local/var/macports/build/_Users_rschmidt_macports_dports_print_libLASi/libLASi/work/libLASi-1.1.1/CMakeFiles/documentation.dir/DependInfo.cmake --color=
153:info:build Scanning dependencies of target documentation
154:info:build make[2]: Leaving directory `/opt/local/var/macports/build/_Users_rschmidt_macports_dports_print_libLASi/libLASi/work/libLASi-1.1.1'
155:info:build /Applications/Xcode.app/Contents/Developer/usr/bin/make -f CMakeFiles/documentation.dir/build.make CMakeFiles/documentation.dir/build
156:info:build make[2]: Entering directory `/opt/local/var/macports/build/_Users_rschmidt_macports_dports_print_libLASi/libLASi/work/libLASi-1.1.1'
157:info:build make[2]: Nothing to be done for `CMakeFiles/documentation.dir/build'.
158:info:build make[2]: Leaving directory `/opt/local/var/macports/build/_Users_rschmidt_macports_dports_print_libLASi/libLASi/work/libLASi-1.1.1'
159:info:build /opt/local/bin/cmake -E cmake_progress_report /opt/local/var/macports/build/_Users_rschmidt_macports_dports_print_libLASi/libLASi/work/libLASi-1.1.1/CMakeFiles  5 6
160:info:build [ 22%] Built target documentation
161:info:build /Applications/Xcode.app/Contents/Developer/usr/bin/make -f src/CMakeFiles/LASi.dir/build.make src/CMakeFiles/LASi.dir/depend
162:info:build make[2]: Entering directory `/opt/local/var/macports/build/_Users_rschmidt_macports_dports_print_libLASi/libLASi/work/libLASi-1.1.1'
163:info:build cd /opt/local/var/macports/build/_Users_rschmidt_macports_dports_print_libLASi/libLASi/work/libLASi-1.1.1 && /opt/local/bin/cmake -E cmake_depends "Unix Makefiles" /opt/local/var/macports/build/_Users_rschmidt_macports_dports_print_libLASi/libLASi/work/libLASi-1.1.1 /opt/local/var/macports/build/_Users_rschmidt_macports_dports_print_libLASi/libLASi/work/libLASi-1.1.1/src /opt/local/var/macports/build/_Users_rschmidt_macports_dports_print_libLASi/libLASi/work/libLASi-1.1.1 /opt/local/var/macports/build/_Users_rschmidt_macports_dports_print_libLASi/libLASi/work/libLASi-1.1.1/src /opt/local/var/macports/build/_Users_rschmidt_macports_dports_print_libLASi/libLASi/work/libLASi-1.1.1/src/CMakeFiles/LASi.dir/DependInfo.cmake --color=
164:info:build Scanning dependencies of target LASi
165:info:build make[2]: Leaving directory `/opt/local/var/macports/build/_Users_rschmidt_macports_dports_print_libLASi/libLASi/work/libLASi-1.1.1'
166:info:build /Applications/Xcode.app/Contents/Developer/usr/bin/make -f src/CMakeFiles/LASi.dir/build.make src/CMakeFiles/LASi.dir/build
167:info:build make[2]: Entering directory `/opt/local/var/macports/build/_Users_rschmidt_macports_dports_print_libLASi/libLASi/work/libLASi-1.1.1'
168:info:build /opt/local/bin/cmake -E cmake_progress_report /opt/local/var/macports/build/_Users_rschmidt_macports_dports_print_libLASi/libLASi/work/libLASi-1.1.1/CMakeFiles 1
169:info:build [ 33%] Building CXX object src/CMakeFiles/LASi.dir/drawGlyph.cpp.o
170:info:build cd /opt/local/var/macports/build/_Users_rschmidt_macports_dports_print_libLASi/libLASi/work/libLASi-1.1.1/src && /usr/bin/clang++   -DLASi_EXPORTS -pipe -Os -isystem/opt/local/include -arch x86_64 -stdlib=libc++  -DNDEBUG -arch x86_64 -fPIC -I/opt/local/var/macports/build/_Users_rschmidt_macports_dports_print_libLASi/libLASi/work/libLASi-1.1.1/include -I/opt/local/var/macports/build/_Users_rschmidt_macports_dports_print_libLASi/libLASi/work/libLASi-1.1.1 -I/opt/local/include/pango-1.0 -I/opt/local/include/harfbuzz -I/opt/local/include -I/opt/local/include/freetype2 -I/opt/local/include/glib-2.0 -I/opt/local/lib/glib-2.0/include    -o CMakeFiles/LASi.dir/drawGlyph.cpp.o -c /opt/local/var/macports/build/_Users_rschmidt_macports_dports_print_libLASi/libLASi/work/libLASi-1.1.1/src/drawGlyph.cpp
171:info:build /opt/local/var/macports/build/_Users_rschmidt_macports_dports_print_libLASi/libLASi/work/libLASi-1.1.1/src/drawGlyph.cpp:9:10: fatal error: 'freetype/ftoutln.h' file not found
172:info:build #include <freetype/ftoutln.h>
173:info:build          ^
174:info:build 1 error generated.
175:info:build make[2]: *** [src/CMakeFiles/LASi.dir/drawGlyph.cpp.o] Error 1
176:info:build make[2]: Leaving directory `/opt/local/var/macports/build/_Users_rschmidt_macports_dports_print_libLASi/libLASi/work/libLASi-1.1.1'
177:info:build make[1]: *** [src/CMakeFiles/LASi.dir/all] Error 2
178:info:build make[1]: Leaving directory `/opt/local/var/macports/build/_Users_rschmidt_macports_dports_print_libLASi/libLASi/work/libLASi-1.1.1'
179:info:build make: *** [all] Error 2
180:info:build make: Leaving directory `/opt/local/var/macports/build/_Users_rschmidt_macports_dports_print_libLASi/libLASi/work/libLASi-1.1.1'
181:info:build Command failed:  cd "/opt/local/var/macports/build/_Users_rschmidt_macports_dports_print_libLASi/libLASi/work/libLASi-1.1.1" && /usr/bin/make -w all
182:info:build Exit code: 2
183:error:build org.macports.build for port libLASi returned: command execution failed
184:debug:build Error code: CHILDSTATUS 82939 2
185:debug:build Backtrace: command execution failed
186    while executing
187"system -nice 20 $fullcmdstring"
188    ("eval" body line 1)
189    invoked from within
190"eval system $notty $nice \$fullcmdstring"
191    invoked from within
192"command_exec build"
193    (procedure "portbuild::build_main" line 8)
194    invoked from within
195"portbuild::build_main org.macports.build"
196    ("eval" body line 1)
197    invoked from within
198"eval $procedure $targetname"
199:info:build Warning: targets not executed for libLASi: org.macports.activate org.macports.build org.macports.destroot org.macports.install
200:notice:build Please see the log file for port libLASi for details:
201    /opt/local/var/macports/logs/_Users_rschmidt_macports_dports_print_libLASi/libLASi/main.log