Ticket #41639: main.log

File main.log, 129.1 KB (added by DanielO (Daniel O'Connor), 7 years ago)
Line 
1version:1
2:debug:main epoch: in tree: 0 installed: 0
3:debug:main cmake 2.8.12_2 exists in the ports tree
4:debug:main cmake 2.8.12_2  is the latest installed
5:debug:main cmake 2.8.12_2  is active
6:debug:main Merging existing variants '' into variants
7:debug:main new fully merged portvariants: python27 +
8:debug:main Changing to port directory: /opt/local/var/macports/sources/rsync.macports.org/release/tarballs/ports/devel/cmake
9:debug:main OS darwin/13.0.0 (Mac OS X 10.9) arch i386
10:debug:main Reading variant descriptions from /opt/local/var/macports/sources/rsync.macports.org/release/tarballs/ports/_resources/port1.0/variant_descriptions.conf
11:debug:main universal variant already exists, so not adding the default one
12:debug:main Requested variant +python27 is not provided by port cmake.
13:debug:main Running callback portconfigure::add_automatic_compiler_dependencies
14:debug:main Finished running callback portconfigure::add_automatic_compiler_dependencies
15:debug:main Running callback portbuild::add_automatic_buildsystem_dependencies
16:debug:main Finished running callback portbuild::add_automatic_buildsystem_dependencies
17:debug:main No need to upgrade! cmake 2.8.12_2 >= cmake 2.8.12_2
18:debug:main epoch: in tree: 0 installed: 0
19:debug:main libidn 1.26_0 exists in the ports tree
20:debug:main libidn 1.26_0  is the latest installed
21:debug:main libidn 1.26_0  is active
22:debug:main Merging existing variants '' into variants
23:debug:main new fully merged portvariants: python27 +
24:debug:main Changing to port directory: /opt/local/var/macports/sources/rsync.macports.org/release/tarballs/ports/mail/libidn
25:debug:main OS darwin/13.0.0 (Mac OS X 10.9) arch i386
26:debug:main adding the default universal variant
27:debug:main Reading variant descriptions from /opt/local/var/macports/sources/rsync.macports.org/release/tarballs/ports/_resources/port1.0/variant_descriptions.conf
28:debug:main Requested variant +python27 is not provided by port libidn.
29:debug:main Running callback portconfigure::add_automatic_compiler_dependencies
30:debug:main Finished running callback portconfigure::add_automatic_compiler_dependencies
31:debug:main Running callback portbuild::add_automatic_buildsystem_dependencies
32:debug:main Finished running callback portbuild::add_automatic_buildsystem_dependencies
33:debug:main No need to upgrade! libidn 1.26_0 >= libidn 1.26_0
34:debug:main epoch: in tree: 0 installed: 0
35:debug:main libiconv 1.14_0 exists in the ports tree
36:debug:main libiconv 1.14_0  is the latest installed
37:debug:main libiconv 1.14_0  is active
38:debug:main Merging existing variants '' into variants
39:debug:main new fully merged portvariants: python27 +
40:debug:main Changing to port directory: /opt/local/var/macports/sources/rsync.macports.org/release/tarballs/ports/textproc/libiconv
41:debug:main OS darwin/13.0.0 (Mac OS X 10.9) arch i386
42:debug:main Reading variant descriptions from /opt/local/var/macports/sources/rsync.macports.org/release/tarballs/ports/_resources/port1.0/variant_descriptions.conf
43:debug:main universal variant already exists, so not adding the default one
44:debug:main Requested variant +python27 is not provided by port libiconv.
45:debug:main Running callback portconfigure::add_automatic_compiler_dependencies
46:debug:main Finished running callback portconfigure::add_automatic_compiler_dependencies
47:debug:main Running callback portbuild::add_automatic_buildsystem_dependencies
48:debug:main Finished running callback portbuild::add_automatic_buildsystem_dependencies
49:debug:main No need to upgrade! libiconv 1.14_0 >= libiconv 1.14_0
50:debug:main epoch: in tree: 0 installed: 0
51:debug:main gettext 0.18.3.1_1 exists in the ports tree
52:debug:main gettext 0.18.3.1_1  is the latest installed
53:debug:main gettext 0.18.3.1_1  is active
54:debug:main Merging existing variants '' into variants
55:debug:main new fully merged portvariants: python27 +
56:debug:main Changing to port directory: /opt/local/var/macports/sources/rsync.macports.org/release/tarballs/ports/devel/gettext
57:debug:main OS darwin/13.0.0 (Mac OS X 10.9) arch i386
58:debug:main Reading variant descriptions from /opt/local/var/macports/sources/rsync.macports.org/release/tarballs/ports/_resources/port1.0/variant_descriptions.conf
59:debug:main compiler clang 500.2.79 not blacklisted because it doesn't match {clang < 211.10.1}
60:debug:main universal variant already exists, so not adding the default one
61:debug:main Requested variant +python27 is not provided by port gettext.
62:debug:main Running callback portconfigure::add_automatic_compiler_dependencies
63:debug:main Finished running callback portconfigure::add_automatic_compiler_dependencies
64:debug:main Running callback portbuild::add_automatic_buildsystem_dependencies
65:debug:main Finished running callback portbuild::add_automatic_buildsystem_dependencies
66:debug:main No need to upgrade! gettext 0.18.3.1_1 >= gettext 0.18.3.1_1
67:debug:main epoch: in tree: 0 installed: 0
68:debug:main expat 2.1.0_0 exists in the ports tree
69:debug:main expat 2.1.0_0  is the latest installed
70:debug:main expat 2.1.0_0  is active
71:debug:main Merging existing variants '' into variants
72:debug:main new fully merged portvariants: python27 +
73:debug:main Changing to port directory: /opt/local/var/macports/sources/rsync.macports.org/release/tarballs/ports/textproc/expat
74:debug:main OS darwin/13.0.0 (Mac OS X 10.9) arch i386
75:debug:main adding the default universal variant
76:debug:main Reading variant descriptions from /opt/local/var/macports/sources/rsync.macports.org/release/tarballs/ports/_resources/port1.0/variant_descriptions.conf
77:debug:main Requested variant +python27 is not provided by port expat.
78:debug:main Running callback portconfigure::add_automatic_compiler_dependencies
79:debug:main Finished running callback portconfigure::add_automatic_compiler_dependencies
80:debug:main Running callback portbuild::add_automatic_buildsystem_dependencies
81:debug:main Finished running callback portbuild::add_automatic_buildsystem_dependencies
82:debug:main No need to upgrade! expat 2.1.0_0 >= expat 2.1.0_0
83:debug:main epoch: in tree: 0 installed: 0
84:debug:main ncurses 5.9_2 exists in the ports tree
85:debug:main ncurses 5.9_2  is the latest installed
86:debug:main ncurses 5.9_2  is active
87:debug:main Merging existing variants '' into variants
88:debug:main new fully merged portvariants: python27 +
89:debug:main Changing to port directory: /opt/local/var/macports/sources/rsync.macports.org/release/tarballs/ports/devel/ncurses
90:debug:main OS darwin/13.0.0 (Mac OS X 10.9) arch i386
91:debug:main adding the default universal variant
92:debug:main Reading variant descriptions from /opt/local/var/macports/sources/rsync.macports.org/release/tarballs/ports/_resources/port1.0/variant_descriptions.conf
93:debug:main Requested variant +python27 is not provided by port ncurses.
94:debug:main Running callback portconfigure::add_automatic_compiler_dependencies
95:debug:main Finished running callback portconfigure::add_automatic_compiler_dependencies
96:debug:main Running callback portbuild::add_automatic_buildsystem_dependencies
97:debug:main Finished running callback portbuild::add_automatic_buildsystem_dependencies
98:debug:main No need to upgrade! ncurses 5.9_2 >= ncurses 5.9_2
99:debug:main epoch: in tree: 1 installed: 1
100:debug:main openssl 1.0.1e_1 exists in the ports tree
101:debug:main openssl 1.0.1e_1  is the latest installed
102:debug:main openssl 1.0.1e_1  is active
103:debug:main Merging existing variants '' into variants
104:debug:main new fully merged portvariants: python27 +
105:debug:main Changing to port directory: /opt/local/var/macports/sources/rsync.macports.org/release/tarballs/ports/devel/openssl
106:debug:main OS darwin/13.0.0 (Mac OS X 10.9) arch i386
107:debug:main Reading variant descriptions from /opt/local/var/macports/sources/rsync.macports.org/release/tarballs/ports/_resources/port1.0/variant_descriptions.conf
108:debug:main universal variant already exists, so not adding the default one
109:debug:main Requested variant +python27 is not provided by port openssl.
110:debug:main Running callback portconfigure::add_automatic_compiler_dependencies
111:debug:main Finished running callback portconfigure::add_automatic_compiler_dependencies
112:debug:main Running callback portbuild::add_automatic_buildsystem_dependencies
113:debug:main Finished running callback portbuild::add_automatic_buildsystem_dependencies
114:debug:main No need to upgrade! openssl 1.0.1e_1 >= openssl 1.0.1e_1
115:debug:main epoch: in tree: 0 installed: 0
116:debug:main zlib 1.2.8_0 exists in the ports tree
117:debug:main zlib 1.2.8_0  is the latest installed
118:debug:main zlib 1.2.8_0  is active
119:debug:main Merging existing variants '' into variants
120:debug:main new fully merged portvariants: python27 +
121:debug:main Changing to port directory: /opt/local/var/macports/sources/rsync.macports.org/release/tarballs/ports/archivers/zlib
122:debug:main OS darwin/13.0.0 (Mac OS X 10.9) arch i386
123:debug:main adding the default universal variant
124:debug:main Reading variant descriptions from /opt/local/var/macports/sources/rsync.macports.org/release/tarballs/ports/_resources/port1.0/variant_descriptions.conf
125:debug:main Requested variant +python27 is not provided by port zlib.
126:debug:main Running callback portconfigure::add_automatic_compiler_dependencies
127:debug:main Finished running callback portconfigure::add_automatic_compiler_dependencies
128:debug:main Running callback portbuild::add_automatic_buildsystem_dependencies
129:debug:main Finished running callback portbuild::add_automatic_buildsystem_dependencies
130:debug:main No need to upgrade! zlib 1.2.8_0 >= zlib 1.2.8_0
131:debug:main epoch: in tree: 0 installed: 0
132:debug:main pkgconfig 0.28_0 exists in the ports tree
133:debug:main pkgconfig 0.28_0  is the latest installed
134:debug:main pkgconfig 0.28_0  is active
135:debug:main Merging existing variants '' into variants
136:debug:main new fully merged portvariants: python27 +
137:debug:main Changing to port directory: /opt/local/var/macports/sources/rsync.macports.org/release/tarballs/ports/devel/pkgconfig
138:debug:main OS darwin/13.0.0 (Mac OS X 10.9) arch i386
139:debug:main adding the default universal variant
140:debug:main Reading variant descriptions from /opt/local/var/macports/sources/rsync.macports.org/release/tarballs/ports/_resources/port1.0/variant_descriptions.conf
141:debug:main Requested variant +python27 is not provided by port pkgconfig.
142:debug:main Running callback portconfigure::add_automatic_compiler_dependencies
143:debug:main Finished running callback portconfigure::add_automatic_compiler_dependencies
144:debug:main Running callback portbuild::add_automatic_buildsystem_dependencies
145:debug:main Finished running callback portbuild::add_automatic_buildsystem_dependencies
146:debug:main No need to upgrade! pkgconfig 0.28_0 >= pkgconfig 0.28_0
147:debug:main epoch: in tree: 0 installed: 0
148:debug:main gsl 1.16_2 exists in the ports tree
149:debug:main gsl 1.16_2  is the latest installed
150:debug:main gsl 1.16_2  is active
151:debug:main Merging existing variants '' into variants
152:debug:main new fully merged portvariants: python27 +
153:debug:main Changing to port directory: /opt/local/var/macports/sources/rsync.macports.org/release/tarballs/ports/math/gsl
154:debug:main OS darwin/13.0.0 (Mac OS X 10.9) arch i386
155:debug:main adding the default universal variant
156:debug:main Reading variant descriptions from /opt/local/var/macports/sources/rsync.macports.org/release/tarballs/ports/_resources/port1.0/variant_descriptions.conf
157:debug:main Requested variant +python27 is not provided by port gsl.
158:debug:main Running callback portconfigure::add_automatic_compiler_dependencies
159:debug:main Finished running callback portconfigure::add_automatic_compiler_dependencies
160:debug:main Running callback portbuild::add_automatic_buildsystem_dependencies
161:debug:main Finished running callback portbuild::add_automatic_buildsystem_dependencies
162:debug:main No need to upgrade! gsl 1.16_2 >= gsl 1.16_2
163:debug:main epoch: in tree: 0 installed: 0
164:debug:main readline 6.2.000_0 exists in the ports tree
165:debug:main readline 6.2.000_0  is the latest installed
166:debug:main readline 6.2.000_0  is active
167:debug:main Merging existing variants '' into variants
168:debug:main new fully merged portvariants: python27 +
169:debug:main Changing to port directory: /opt/local/var/macports/sources/rsync.macports.org/release/tarballs/ports/devel/readline
170:debug:main OS darwin/13.0.0 (Mac OS X 10.9) arch i386
171:debug:main Reading variant descriptions from /opt/local/var/macports/sources/rsync.macports.org/release/tarballs/ports/_resources/port1.0/variant_descriptions.conf
172:debug:main universal variant already exists, so not adding the default one
173:debug:main Requested variant +python27 is not provided by port readline.
174:debug:main Running callback portconfigure::add_automatic_compiler_dependencies
175:debug:main Finished running callback portconfigure::add_automatic_compiler_dependencies
176:debug:main Running callback portbuild::add_automatic_buildsystem_dependencies
177:debug:main Finished running callback portbuild::add_automatic_buildsystem_dependencies
178:debug:main No need to upgrade! readline 6.2.000_0 >= readline 6.2.000_0
179:debug:main epoch: in tree: 0 installed: 0
180:debug:main plplot 5.9.9_18 exists in the ports tree
181:debug:main plplot 5.9.9_18 +aquaterm+python27+x11 is the latest installed
182:debug:main plplot 5.9.9_18 +aquaterm+python27+x11 is active
183:debug:main Merging existing variants '+aquaterm+python27+x11' into variants
184:debug:main new fully merged portvariants: aquaterm + x11 + python27 +
185:debug:main Changing to port directory: /opt/local/var/macports/sources/rsync.macports.org/release/tarballs/ports/science/plplot
186:debug:main OS darwin/13.0.0 (Mac OS X 10.9) arch i386
187:debug:main Reading variant descriptions from /opt/local/var/macports/sources/rsync.macports.org/release/tarballs/ports/_resources/port1.0/variant_descriptions.conf
188:debug:main adding the default universal variant
189:debug:main Executing variant python27 provides python27
190:debug:main Executing variant aquaterm provides aquaterm
191:debug:main Executing variant x11 provides x11
192:debug:main Running callback portconfigure::add_automatic_compiler_dependencies
193:debug:main Finished running callback portconfigure::add_automatic_compiler_dependencies
194:debug:main Running callback portbuild::add_automatic_buildsystem_dependencies
195:debug:main Finished running callback portbuild::add_automatic_buildsystem_dependencies
196:debug:main No need to upgrade! plplot 5.9.9_18 >= plplot 5.9.9_18
197:debug:main epoch: in tree: 0 installed: 0
198:debug:main qhull 2012.1_2 exists in the ports tree
199:debug:main qhull 2012.1_2  is the latest installed
200:debug:main qhull 2012.1_2  is active
201:debug:main Merging existing variants '' into variants
202:debug:main new fully merged portvariants: python27 +
203:debug:main Changing to port directory: /opt/local/var/macports/sources/rsync.macports.org/release/tarballs/ports/math/qhull
204:debug:main OS darwin/13.0.0 (Mac OS X 10.9) arch i386
205:debug:main adding the default universal variant
206:debug:main Reading variant descriptions from /opt/local/var/macports/sources/rsync.macports.org/release/tarballs/ports/_resources/port1.0/variant_descriptions.conf
207:debug:main Requested variant +python27 is not provided by port qhull.
208:debug:main Running callback portconfigure::add_automatic_compiler_dependencies
209:debug:main Finished running callback portconfigure::add_automatic_compiler_dependencies
210:debug:main Running callback portbuild::add_automatic_buildsystem_dependencies
211:debug:main Finished running callback portbuild::add_automatic_buildsystem_dependencies
212:debug:main No need to upgrade! qhull 2012.1_2 >= qhull 2012.1_2
213:debug:main epoch: in tree: 0 installed: 0
214:debug:main fontconfig 2.11.0_0 exists in the ports tree
215:debug:main fontconfig 2.11.0_0  is the latest installed
216:debug:main fontconfig 2.11.0_0  is active
217:debug:main Merging existing variants '' into variants
218:debug:main new fully merged portvariants: python27 +
219:debug:main Changing to port directory: /opt/local/var/macports/sources/rsync.macports.org/release/tarballs/ports/graphics/fontconfig
220:debug:main OS darwin/13.0.0 (Mac OS X 10.9) arch i386
221:debug:main Reading variant descriptions from /opt/local/var/macports/sources/rsync.macports.org/release/tarballs/ports/_resources/port1.0/variant_descriptions.conf
222:debug:main universal variant already exists, so not adding the default one
223:debug:main Requested variant +python27 is not provided by port fontconfig.
224:debug:main Running callback portconfigure::add_automatic_compiler_dependencies
225:debug:main Finished running callback portconfigure::add_automatic_compiler_dependencies
226:debug:main Running callback portbuild::add_automatic_buildsystem_dependencies
227:debug:main Finished running callback portbuild::add_automatic_buildsystem_dependencies
228:debug:main No need to upgrade! fontconfig 2.11.0_0 >= fontconfig 2.11.0_0
229:debug:main epoch: in tree: 0 installed: 0
230:debug:main freetype 2.5.1_1 exists in the ports tree
231:debug:main freetype 2.5.1_1  is the latest installed
232:debug:main freetype 2.5.1_1  is active
233:debug:main Merging existing variants '' into variants
234:debug:main new fully merged portvariants: python27 +
235:debug:main Changing to port directory: /opt/local/var/macports/sources/rsync.macports.org/release/tarballs/ports/print/freetype
236:debug:main OS darwin/13.0.0 (Mac OS X 10.9) arch i386
237:debug:main Reading variant descriptions from /opt/local/var/macports/sources/rsync.macports.org/release/tarballs/ports/_resources/port1.0/variant_descriptions.conf
238:debug:main universal variant already exists, so not adding the default one
239:debug:main Requested variant +python27 is not provided by port freetype.
240:debug:main Running callback portconfigure::add_automatic_compiler_dependencies
241:debug:main Finished running callback portconfigure::add_automatic_compiler_dependencies
242:debug:main Running callback portbuild::add_automatic_buildsystem_dependencies
243:debug:main Finished running callback portbuild::add_automatic_buildsystem_dependencies
244:debug:main No need to upgrade! freetype 2.5.1_1 >= freetype 2.5.1_1
245:debug:main epoch: in tree: 0 installed: 0
246:debug:main bzip2 1.0.6_0 exists in the ports tree
247:debug:main bzip2 1.0.6_0  is the latest installed
248:debug:main bzip2 1.0.6_0  is active
249:debug:main Merging existing variants '' into variants
250:debug:main new fully merged portvariants: python27 +
251:debug:main Changing to port directory: /opt/local/var/macports/sources/rsync.macports.org/release/tarballs/ports/archivers/bzip2
252:debug:main OS darwin/13.0.0 (Mac OS X 10.9) arch i386
253:debug:main Reading variant descriptions from /opt/local/var/macports/sources/rsync.macports.org/release/tarballs/ports/_resources/port1.0/variant_descriptions.conf
254:debug:main universal variant already exists, so not adding the default one
255:debug:main Requested variant +python27 is not provided by port bzip2.
256:debug:main Running callback portconfigure::add_automatic_compiler_dependencies
257:debug:main Finished running callback portconfigure::add_automatic_compiler_dependencies
258:debug:main Running callback portbuild::add_automatic_buildsystem_dependencies
259:debug:main Finished running callback portbuild::add_automatic_buildsystem_dependencies
260:debug:main No need to upgrade! bzip2 1.0.6_0 >= bzip2 1.0.6_0
261:debug:main epoch: in tree: 0 installed: 0
262:debug:main libpng 1.5.17_0 exists in the ports tree
263:debug:main libpng 1.5.17_0  is the latest installed
264:debug:main libpng 1.5.17_0  is active
265:debug:main Merging existing variants '' into variants
266:debug:main new fully merged portvariants: python27 +
267:debug:main Changing to port directory: /opt/local/var/macports/sources/rsync.macports.org/release/tarballs/ports/graphics/libpng
268:debug:main OS darwin/13.0.0 (Mac OS X 10.9) arch i386
269:debug:main adding the default universal variant
270:debug:main Reading variant descriptions from /opt/local/var/macports/sources/rsync.macports.org/release/tarballs/ports/_resources/port1.0/variant_descriptions.conf
271:debug:main Requested variant +python27 is not provided by port libpng.
272:debug:main Running callback portconfigure::add_automatic_compiler_dependencies
273:debug:main Finished running callback portconfigure::add_automatic_compiler_dependencies
274:debug:main Running callback portbuild::add_automatic_buildsystem_dependencies
275:debug:main Finished running callback portbuild::add_automatic_buildsystem_dependencies
276:debug:main No need to upgrade! libpng 1.5.17_0 >= libpng 1.5.17_0
277:debug:main epoch: in tree: 0 installed: 0
278:debug:main freefont-ttf 20060126_1 exists in the ports tree
279:debug:main freefont-ttf 20060126_1  is the latest installed
280:debug:main freefont-ttf 20060126_1  is active
281:debug:main Merging existing variants '' into variants
282:debug:main new fully merged portvariants: python27 +
283:debug:main Changing to port directory: /opt/local/var/macports/sources/rsync.macports.org/release/tarballs/ports/x11/freefont-ttf
284:debug:main OS darwin/13.0.0 (Mac OS X 10.9) arch i386
285:debug:main universal_variant is false, so not adding the default universal variant
286:debug:main Requested variant +python27 is not provided by port freefont-ttf.
287:debug:main Running callback portconfigure::add_automatic_compiler_dependencies
288:debug:main Finished running callback portconfigure::add_automatic_compiler_dependencies
289:debug:main Running callback portbuild::add_automatic_buildsystem_dependencies
290:debug:main Finished running callback portbuild::add_automatic_buildsystem_dependencies
291:debug:main No need to upgrade! freefont-ttf 20060126_1 >= freefont-ttf 20060126_1
292:debug:main epoch: in tree: 0 installed: 0
293:debug:main libLASi 1.1.1_1 exists in the ports tree
294:debug:main libLASi 1.1.1_1  is the latest installed
295:debug:main libLASi 1.1.1_1  is active
296:debug:main Merging existing variants '' into variants
297:debug:main new fully merged portvariants: python27 +
298:debug:main Changing to port directory: /opt/local/var/macports/sources/rsync.macports.org/release/tarballs/ports/print/libLASi
299:debug:main OS darwin/13.0.0 (Mac OS X 10.9) arch i386
300:debug:main adding the default universal variant
301:debug:main Reading variant descriptions from /opt/local/var/macports/sources/rsync.macports.org/release/tarballs/ports/_resources/port1.0/variant_descriptions.conf
302:debug:main Requested variant +python27 is not provided by port libLASi.
303:debug:main Running callback portconfigure::add_automatic_compiler_dependencies
304:debug:main Finished running callback portconfigure::add_automatic_compiler_dependencies
305:debug:main Running callback portbuild::add_automatic_buildsystem_dependencies
306:debug:main Finished running callback portbuild::add_automatic_buildsystem_dependencies
307:debug:main No need to upgrade! libLASi 1.1.1_1 >= libLASi 1.1.1_1
308:debug:main epoch: in tree: 1 installed: 1
309:debug:main pango 1.36.1_0 exists in the ports tree
310:debug:main pango 1.36.1_0 +x11 is the latest installed
311:debug:main pango 1.36.1_0 +x11 is active
312:debug:main Merging existing variants '+x11' into variants
313:debug:main new fully merged portvariants: x11 + python27 +
314:debug:main Changing to port directory: /opt/local/var/macports/sources/rsync.macports.org/release/tarballs/ports/x11/pango
315:debug:main OS darwin/13.0.0 (Mac OS X 10.9) arch i386
316:debug:main Reading variant descriptions from /opt/local/var/macports/sources/rsync.macports.org/release/tarballs/ports/_resources/port1.0/variant_descriptions.conf
317:debug:main adding the default universal variant
318:debug:main Requested variant +python27 is not provided by port pango.
319:debug:main Executing variant x11 provides x11
320:debug:main Running callback portconfigure::add_automatic_compiler_dependencies
321:debug:main Finished running callback portconfigure::add_automatic_compiler_dependencies
322:debug:main Running callback portbuild::add_automatic_buildsystem_dependencies
323:debug:main Finished running callback portbuild::add_automatic_buildsystem_dependencies
324:debug:main No need to upgrade! pango 1.36.1_0 >= pango 1.36.1_0
325:debug:main epoch: in tree: 0 installed: 0
326:debug:main glib2 2.38.2_0 exists in the ports tree
327:debug:main glib2 2.38.2_0  is the latest installed
328:debug:main glib2 2.38.2_0  is active
329:debug:main Merging existing variants '' into variants
330:debug:main new fully merged portvariants: python27 +
331:debug:main Changing to port directory: /opt/local/var/macports/sources/rsync.macports.org/release/tarballs/ports/devel/glib2
332:debug:main OS darwin/13.0.0 (Mac OS X 10.9) arch i386
333:debug:main compiler clang 500.2.79 not blacklisted because it doesn't match {clang < 318}
334:debug:main adding the default universal variant
335:debug:main Reading variant descriptions from /opt/local/var/macports/sources/rsync.macports.org/release/tarballs/ports/_resources/port1.0/variant_descriptions.conf
336:debug:main Requested variant +python27 is not provided by port glib2.
337:debug:main Running callback portconfigure::add_automatic_compiler_dependencies
338:debug:main Finished running callback portconfigure::add_automatic_compiler_dependencies
339:debug:main Running callback portbuild::add_automatic_buildsystem_dependencies
340:debug:main Finished running callback portbuild::add_automatic_buildsystem_dependencies
341:debug:main No need to upgrade! glib2 2.38.2_0 >= glib2 2.38.2_0
342:debug:main epoch: in tree: 0 installed: 0
343:debug:main libffi 3.0.13_0 exists in the ports tree
344:debug:main libffi 3.0.13_0  is the latest installed
345:debug:main libffi 3.0.13_0  is active
346:debug:main Merging existing variants '' into variants
347:debug:main new fully merged portvariants: python27 +
348:debug:main Changing to port directory: /opt/local/var/macports/sources/rsync.macports.org/release/tarballs/ports/devel/libffi
349:debug:main OS darwin/13.0.0 (Mac OS X 10.9) arch i386
350:debug:main Reading variant descriptions from /opt/local/var/macports/sources/rsync.macports.org/release/tarballs/ports/_resources/port1.0/variant_descriptions.conf
351:debug:main universal variant already exists, so not adding the default one
352:debug:main Requested variant +python27 is not provided by port libffi.
353:debug:main Running callback portconfigure::add_automatic_compiler_dependencies
354:debug:main Finished running callback portconfigure::add_automatic_compiler_dependencies
355:debug:main Running callback portbuild::add_automatic_buildsystem_dependencies
356:debug:main Finished running callback portbuild::add_automatic_buildsystem_dependencies
357:debug:main No need to upgrade! libffi 3.0.13_0 >= libffi 3.0.13_0
358:debug:main epoch: in tree: 0 installed: 0
359:debug:main perl5 5.12.4_0 exists in the ports tree
360:debug:main perl5 5.12.4_0 +perl5_12 is the latest installed
361:debug:main perl5 5.12.4_0 +perl5_12 is active
362:debug:main Merging existing variants '+perl5_12' into variants
363:debug:main new fully merged portvariants: perl5_12 + python27 +
364:debug:main Changing to port directory: /opt/local/var/macports/sources/rsync.macports.org/release/tarballs/ports/lang/perl5
365:debug:main OS darwin/13.0.0 (Mac OS X 10.9) arch i386
366:debug:main universal_variant is false, so not adding the default universal variant
367:debug:main Requested variant +python27 is not provided by port perl5.
368:debug:main Executing variant perl5_12 provides perl5_12
369:debug:main Running callback portconfigure::add_automatic_compiler_dependencies
370:debug:main Finished running callback portconfigure::add_automatic_compiler_dependencies
371:debug:main Running callback portbuild::add_automatic_buildsystem_dependencies
372:debug:main Finished running callback portbuild::add_automatic_buildsystem_dependencies
373:debug:main No need to upgrade! perl5 5.12.4_0 >= perl5 5.12.4_0
374:debug:main epoch: in tree: 0 installed: 0
375:debug:main perl5.12 5.12.4_3 exists in the ports tree
376:debug:main perl5.12 5.12.4_3  is the latest installed
377:debug:main perl5.12 5.12.4_3  is active
378:debug:main Merging existing variants '' into variants
379:debug:main new fully merged portvariants: python27 +
380:debug:main Changing to port directory: /opt/local/var/macports/sources/rsync.macports.org/release/tarballs/ports/lang/perl5.12
381:debug:main OS darwin/13.0.0 (Mac OS X 10.9) arch i386
382:debug:main adding the default universal variant
383:debug:main Reading variant descriptions from /opt/local/var/macports/sources/rsync.macports.org/release/tarballs/ports/_resources/port1.0/variant_descriptions.conf
384:debug:main Requested variant +python27 is not provided by port perl5.12.
385:debug:main Running callback portconfigure::add_automatic_compiler_dependencies
386:debug:main Finished running callback portconfigure::add_automatic_compiler_dependencies
387:debug:main Running callback portbuild::add_automatic_buildsystem_dependencies
388:debug:main Finished running callback portbuild::add_automatic_buildsystem_dependencies
389:debug:main No need to upgrade! perl5.12 5.12.4_3 >= perl5.12 5.12.4_3
390:debug:main epoch: in tree: 0 installed: 0
391:debug:main gdbm 1.10_2 exists in the ports tree
392:debug:main gdbm 1.10_2  is the latest installed
393:debug:main gdbm 1.10_2  is active
394:debug:main Merging existing variants '' into variants
395:debug:main new fully merged portvariants: python27 +
396:debug:main Changing to port directory: /opt/local/var/macports/sources/rsync.macports.org/release/tarballs/ports/databases/gdbm
397:debug:main OS darwin/13.0.0 (Mac OS X 10.9) arch i386
398:debug:main adding the default universal variant
399:debug:main Reading variant descriptions from /opt/local/var/macports/sources/rsync.macports.org/release/tarballs/ports/_resources/port1.0/variant_descriptions.conf
400:debug:main Requested variant +python27 is not provided by port gdbm.
401:debug:main Running callback portconfigure::add_automatic_compiler_dependencies
402:debug:main Finished running callback portconfigure::add_automatic_compiler_dependencies
403:debug:main Running callback portbuild::add_automatic_buildsystem_dependencies
404:debug:main Finished running callback portbuild::add_automatic_buildsystem_dependencies
405:debug:main No need to upgrade! gdbm 1.10_2 >= gdbm 1.10_2
406:debug:main epoch: in tree: 0 installed: 0
407:debug:main cairo 1.12.16_1 exists in the ports tree
408:debug:main cairo 1.12.16_1 +x11 is the latest installed
409:debug:main cairo 1.12.16_1 +x11 is active
410:debug:main Merging existing variants '+x11' into variants
411:debug:main new fully merged portvariants: x11 + python27 +
412:debug:main Changing to port directory: /opt/local/var/macports/sources/rsync.macports.org/release/tarballs/ports/graphics/cairo
413:debug:main OS darwin/13.0.0 (Mac OS X 10.9) arch i386
414:debug:main Reading variant descriptions from /opt/local/var/macports/sources/rsync.macports.org/release/tarballs/ports/_resources/port1.0/variant_descriptions.conf
415:debug:main compiler clang 500.2.79 not blacklisted because it doesn't match {clang < 318.0.61}
416:debug:main universal variant already exists, so not adding the default one
417:debug:main Requested variant +python27 is not provided by port cairo.
418:debug:main Executing variant x11 provides x11
419:debug:main Running callback portconfigure::add_automatic_compiler_dependencies
420:debug:main Finished running callback portconfigure::add_automatic_compiler_dependencies
421:debug:main Running callback portbuild::add_automatic_buildsystem_dependencies
422:debug:main Finished running callback portbuild::add_automatic_buildsystem_dependencies
423:debug:main No need to upgrade! cairo 1.12.16_1 >= cairo 1.12.16_1
424:debug:main epoch: in tree: 0 installed: 0
425:debug:main libpixman 0.32.4_0 exists in the ports tree
426:debug:main libpixman 0.32.4_0  is the latest installed
427:debug:main libpixman 0.32.4_0  is active
428:debug:main Merging existing variants '' into variants
429:debug:main new fully merged portvariants: python27 +
430:debug:main Changing to port directory: /opt/local/var/macports/sources/rsync.macports.org/release/tarballs/ports/graphics/libpixman
431:debug:main OS darwin/13.0.0 (Mac OS X 10.9) arch i386
432:debug:main Reading variant descriptions from /opt/local/var/macports/sources/rsync.macports.org/release/tarballs/ports/_resources/port1.0/variant_descriptions.conf
433:debug:main compiler clang 500.2.79 not blacklisted because it doesn't match {clang < 211.10.1}
434:debug:main universal variant already exists, so not adding the default one
435:debug:main Requested variant +python27 is not provided by port libpixman.
436:debug:main Running callback portconfigure::add_automatic_compiler_dependencies
437:debug:main Finished running callback portconfigure::add_automatic_compiler_dependencies
438:debug:main Running callback portbuild::add_automatic_buildsystem_dependencies
439:debug:main Finished running callback portbuild::add_automatic_buildsystem_dependencies
440:debug:main No need to upgrade! libpixman 0.32.4_0 >= libpixman 0.32.4_0
441:debug:main epoch: in tree: 0 installed: 0
442:debug:main xrender 0.9.8_0 exists in the ports tree
443:debug:main xrender 0.9.8_0  is the latest installed
444:debug:main xrender 0.9.8_0  is active
445:debug:main Merging existing variants '' into variants
446:debug:main new fully merged portvariants: python27 +
447:debug:main Changing to port directory: /opt/local/var/macports/sources/rsync.macports.org/release/tarballs/ports/x11/xrender
448:debug:main OS darwin/13.0.0 (Mac OS X 10.9) arch i386
449:debug:main adding the default universal variant
450:debug:main Reading variant descriptions from /opt/local/var/macports/sources/rsync.macports.org/release/tarballs/ports/_resources/port1.0/variant_descriptions.conf
451:debug:main Requested variant +python27 is not provided by port xrender.
452:debug:main Running callback portconfigure::add_automatic_compiler_dependencies
453:debug:main Finished running callback portconfigure::add_automatic_compiler_dependencies
454:debug:main Running callback portbuild::add_automatic_buildsystem_dependencies
455:debug:main Finished running callback portbuild::add_automatic_buildsystem_dependencies
456:debug:main No need to upgrade! xrender 0.9.8_0 >= xrender 0.9.8_0
457:debug:main epoch: in tree: 0 installed: 0
458:debug:main xorg-libX11 1.6.2_0 exists in the ports tree
459:debug:main xorg-libX11 1.6.2_0  is the latest installed
460:debug:main xorg-libX11 1.6.2_0  is active
461:debug:main Merging existing variants '' into variants
462:debug:main new fully merged portvariants: python27 +
463:debug:main Changing to port directory: /opt/local/var/macports/sources/rsync.macports.org/release/tarballs/ports/x11/xorg-libX11
464:debug:main OS darwin/13.0.0 (Mac OS X 10.9) arch i386
465:debug:main adding the default universal variant
466:debug:main Reading variant descriptions from /opt/local/var/macports/sources/rsync.macports.org/release/tarballs/ports/_resources/port1.0/variant_descriptions.conf
467:debug:main Requested variant +python27 is not provided by port xorg-libX11.
468:debug:main Running callback portconfigure::add_automatic_compiler_dependencies
469:debug:main Finished running callback portconfigure::add_automatic_compiler_dependencies
470:debug:main Running callback portbuild::add_automatic_buildsystem_dependencies
471:debug:main Finished running callback portbuild::add_automatic_buildsystem_dependencies
472:debug:main No need to upgrade! xorg-libX11 1.6.2_0 >= xorg-libX11 1.6.2_0
473:debug:main epoch: in tree: 0 installed: 0
474:debug:main xorg-libXdmcp 1.1.1_0 exists in the ports tree
475:debug:main xorg-libXdmcp 1.1.1_0  is the latest installed
476:debug:main xorg-libXdmcp 1.1.1_0  is active
477:debug:main Merging existing variants '' into variants
478:debug:main new fully merged portvariants: python27 +
479:debug:main Changing to port directory: /opt/local/var/macports/sources/rsync.macports.org/release/tarballs/ports/x11/xorg-libXdmcp
480:debug:main OS darwin/13.0.0 (Mac OS X 10.9) arch i386
481:debug:main adding the default universal variant
482:debug:main Reading variant descriptions from /opt/local/var/macports/sources/rsync.macports.org/release/tarballs/ports/_resources/port1.0/variant_descriptions.conf
483:debug:main Requested variant +python27 is not provided by port xorg-libXdmcp.
484:debug:main Running callback portconfigure::add_automatic_compiler_dependencies
485:debug:main Finished running callback portconfigure::add_automatic_compiler_dependencies
486:debug:main Running callback portbuild::add_automatic_buildsystem_dependencies
487:debug:main Finished running callback portbuild::add_automatic_buildsystem_dependencies
488:debug:main No need to upgrade! xorg-libXdmcp 1.1.1_0 >= xorg-libXdmcp 1.1.1_0
489:debug:main epoch: in tree: 0 installed: 0
490:debug:main xorg-libXau 1.0.8_0 exists in the ports tree
491:debug:main xorg-libXau 1.0.8_0  is the latest installed
492:debug:main xorg-libXau 1.0.8_0  is active
493:debug:main Merging existing variants '' into variants
494:debug:main new fully merged portvariants: python27 +
495:debug:main Changing to port directory: /opt/local/var/macports/sources/rsync.macports.org/release/tarballs/ports/x11/xorg-libXau
496:debug:main OS darwin/13.0.0 (Mac OS X 10.9) arch i386
497:debug:main adding the default universal variant
498:debug:main Reading variant descriptions from /opt/local/var/macports/sources/rsync.macports.org/release/tarballs/ports/_resources/port1.0/variant_descriptions.conf
499:debug:main Requested variant +python27 is not provided by port xorg-libXau.
500:debug:main Running callback portconfigure::add_automatic_compiler_dependencies
501:debug:main Finished running callback portconfigure::add_automatic_compiler_dependencies
502:debug:main Running callback portbuild::add_automatic_buildsystem_dependencies
503:debug:main Finished running callback portbuild::add_automatic_buildsystem_dependencies
504:debug:main No need to upgrade! xorg-libXau 1.0.8_0 >= xorg-libXau 1.0.8_0
505:debug:main epoch: in tree: 0 installed: 0
506:debug:main xorg-xproto 7.0.24_0 exists in the ports tree
507:debug:main xorg-xproto 7.0.24_0  is the latest installed
508:debug:main xorg-xproto 7.0.24_0  is active
509:debug:main Merging existing variants '' into variants
510:debug:main new fully merged portvariants: python27 +
511:debug:main Changing to port directory: /opt/local/var/macports/sources/rsync.macports.org/release/tarballs/ports/x11/xorg-xproto
512:debug:main OS darwin/13.0.0 (Mac OS X 10.9) arch i386
513:debug:main only one arch supported, so not adding the default universal variant
514:debug:main Requested variant +python27 is not provided by port xorg-xproto.
515:debug:main Running callback portconfigure::add_automatic_compiler_dependencies
516:debug:main Finished running callback portconfigure::add_automatic_compiler_dependencies
517:debug:main Running callback portbuild::add_automatic_buildsystem_dependencies
518:debug:main Finished running callback portbuild::add_automatic_buildsystem_dependencies
519:debug:main No need to upgrade! xorg-xproto 7.0.24_0 >= xorg-xproto 7.0.24_0
520:debug:main epoch: in tree: 0 installed: 0
521:debug:main xorg-libxcb 1.9.1_0 exists in the ports tree
522:debug:main xorg-libxcb 1.9.1_0 +python27 is the latest installed
523:debug:main xorg-libxcb 1.9.1_0 +python27 is active
524:debug:main Merging existing variants '+python27' into variants
525:debug:main new fully merged portvariants: python27 +
526:debug:main Changing to port directory: /opt/local/var/macports/sources/rsync.macports.org/release/tarballs/ports/x11/xorg-libxcb
527:debug:main OS darwin/13.0.0 (Mac OS X 10.9) arch i386
528:debug:main adding the default universal variant
529:debug:main Reading variant descriptions from /opt/local/var/macports/sources/rsync.macports.org/release/tarballs/ports/_resources/port1.0/variant_descriptions.conf
530:debug:main Executing variant python27 provides python27
531:debug:main Running callback portconfigure::add_automatic_compiler_dependencies
532:debug:main Finished running callback portconfigure::add_automatic_compiler_dependencies
533:debug:main Running callback portbuild::add_automatic_buildsystem_dependencies
534:debug:main Finished running callback portbuild::add_automatic_buildsystem_dependencies
535:debug:main No need to upgrade! xorg-libxcb 1.9.1_0 >= xorg-libxcb 1.9.1_0
536:debug:main epoch: in tree: 0 installed: 0
537:debug:main xorg-xcb-proto 1.8_0 exists in the ports tree
538:debug:main xorg-xcb-proto 1.8_0 +python27 is the latest installed
539:debug:main xorg-xcb-proto 1.8_0 +python27 is active
540:debug:main Merging existing variants '+python27' into variants
541:debug:main new fully merged portvariants: python27 +
542:debug:main Changing to port directory: /opt/local/var/macports/sources/rsync.macports.org/release/tarballs/ports/x11/xorg-xcb-proto
543:debug:main OS darwin/13.0.0 (Mac OS X 10.9) arch i386
544:debug:main only one arch supported, so not adding the default universal variant
545:debug:main Executing variant python27 provides python27
546:debug:main Running callback portconfigure::add_automatic_compiler_dependencies
547:debug:main Finished running callback portconfigure::add_automatic_compiler_dependencies
548:debug:main Running callback portbuild::add_automatic_buildsystem_dependencies
549:debug:main Finished running callback portbuild::add_automatic_buildsystem_dependencies
550:debug:main No need to upgrade! xorg-xcb-proto 1.8_0 >= xorg-xcb-proto 1.8_0
551:debug:main epoch: in tree: 0 installed: 0
552:debug:main libxml2 2.9.1_0 exists in the ports tree
553:debug:main libxml2 2.9.1_0  is the latest installed
554:debug:main libxml2 2.9.1_0  is active
555:debug:main Merging existing variants '' into variants
556:debug:main new fully merged portvariants: python27 +
557:debug:main Changing to port directory: /opt/local/var/macports/sources/rsync.macports.org/release/tarballs/ports/textproc/libxml2
558:debug:main OS darwin/13.0.0 (Mac OS X 10.9) arch i386
559:debug:main adding the default universal variant
560:debug:main Reading variant descriptions from /opt/local/var/macports/sources/rsync.macports.org/release/tarballs/ports/_resources/port1.0/variant_descriptions.conf
561:debug:main Requested variant +python27 is not provided by port libxml2.
562:debug:main Running callback portconfigure::add_automatic_compiler_dependencies
563:debug:main Finished running callback portconfigure::add_automatic_compiler_dependencies
564:debug:main Running callback portbuild::add_automatic_buildsystem_dependencies
565:debug:main Finished running callback portbuild::add_automatic_buildsystem_dependencies
566:debug:main No need to upgrade! libxml2 2.9.1_0 >= libxml2 2.9.1_0
567:debug:main epoch: in tree: 0 installed: 0
568:debug:main xz 5.0.5_0 exists in the ports tree
569:debug:main xz 5.0.5_0  is the latest installed
570:debug:main xz 5.0.5_0  is active
571:debug:main Merging existing variants '' into variants
572:debug:main new fully merged portvariants: python27 +
573:debug:main Changing to port directory: /opt/local/var/macports/sources/rsync.macports.org/release/tarballs/ports/archivers/xz
574:debug:main OS darwin/13.0.0 (Mac OS X 10.9) arch i386
575:debug:main adding the default universal variant
576:debug:main Reading variant descriptions from /opt/local/var/macports/sources/rsync.macports.org/release/tarballs/ports/_resources/port1.0/variant_descriptions.conf
577:debug:main Requested variant +python27 is not provided by port xz.
578:debug:main Running callback portconfigure::add_automatic_compiler_dependencies
579:debug:main Finished running callback portconfigure::add_automatic_compiler_dependencies
580:debug:main Running callback portbuild::add_automatic_buildsystem_dependencies
581:debug:main Finished running callback portbuild::add_automatic_buildsystem_dependencies
582:debug:main No need to upgrade! xz 5.0.5_0 >= xz 5.0.5_0
583:debug:main epoch: in tree: 2 installed: 2
584:debug:main python27 2.7.6_0 exists in the ports tree
585:debug:main python27 2.7.6_0  is the latest installed
586:debug:main python27 2.7.6_0  is active
587:debug:main Merging existing variants '' into variants
588:debug:main new fully merged portvariants: python27 +
589:debug:main Changing to port directory: /opt/local/var/macports/sources/rsync.macports.org/release/tarballs/ports/lang/python27
590:debug:main OS darwin/13.0.0 (Mac OS X 10.9) arch i386
591:debug:main Reading variant descriptions from /opt/local/var/macports/sources/rsync.macports.org/release/tarballs/ports/_resources/port1.0/variant_descriptions.conf
592:debug:main universal variant already exists, so not adding the default one
593:debug:main Requested variant +python27 is not provided by port python27.
594:debug:main Running callback portconfigure::add_automatic_compiler_dependencies
595:debug:main Finished running callback portconfigure::add_automatic_compiler_dependencies
596:debug:main Running callback portbuild::add_automatic_buildsystem_dependencies
597:debug:main Finished running callback portbuild::add_automatic_buildsystem_dependencies
598:debug:main No need to upgrade! python27 2.7.6_0 >= python27 2.7.6_0
599:debug:main epoch: in tree: 0 installed: 0
600:debug:main sqlite3 3.8.1_0 exists in the ports tree
601:debug:main sqlite3 3.8.1_0  is the latest installed
602:debug:main sqlite3 3.8.1_0  is active
603:debug:main Merging existing variants '' into variants
604:debug:main new fully merged portvariants: python27 +
605:debug:main Changing to port directory: /opt/local/var/macports/sources/rsync.macports.org/release/tarballs/ports/databases/sqlite3
606:debug:main OS darwin/13.0.0 (Mac OS X 10.9) arch i386
607:debug:main adding the default universal variant
608:debug:main Reading variant descriptions from /opt/local/var/macports/sources/rsync.macports.org/release/tarballs/ports/_resources/port1.0/variant_descriptions.conf
609:debug:main Requested variant +python27 is not provided by port sqlite3.
610:debug:main Running callback portconfigure::add_automatic_compiler_dependencies
611:debug:main Finished running callback portconfigure::add_automatic_compiler_dependencies
612:debug:main Running callback portbuild::add_automatic_buildsystem_dependencies
613:debug:main Finished running callback portbuild::add_automatic_buildsystem_dependencies
614:debug:main No need to upgrade! sqlite3 3.8.1_0 >= sqlite3 3.8.1_0
615:debug:main epoch: in tree: 20090923 installed: 20090923
616:debug:main libedit 20121213-3.0_0 exists in the ports tree
617:debug:main libedit 20121213-3.0_0  is the latest installed
618:debug:main libedit 20121213-3.0_0  is active
619:debug:main Merging existing variants '' into variants
620:debug:main new fully merged portvariants: python27 +
621:debug:main Changing to port directory: /opt/local/var/macports/sources/rsync.macports.org/release/tarballs/ports/devel/libedit
622:debug:main OS darwin/13.0.0 (Mac OS X 10.9) arch i386
623:debug:main Reading variant descriptions from /opt/local/var/macports/sources/rsync.macports.org/release/tarballs/ports/_resources/port1.0/variant_descriptions.conf
624:debug:main universal variant already exists, so not adding the default one
625:debug:main Requested variant +python27 is not provided by port libedit.
626:debug:main Running callback portconfigure::add_automatic_compiler_dependencies
627:debug:main Finished running callback portconfigure::add_automatic_compiler_dependencies
628:debug:main Running callback portbuild::add_automatic_buildsystem_dependencies
629:debug:main Finished running callback portbuild::add_automatic_buildsystem_dependencies
630:debug:main No need to upgrade! libedit 20121213-3.0_0 >= libedit 20121213-3.0_0
631:debug:main epoch: in tree: 0 installed: 0
632:debug:main db46 4.6.21_8 exists in the ports tree
633:debug:main db46 4.6.21_8  is the latest installed
634:debug:main db46 4.6.21_8  is active
635:debug:main Merging existing variants '' into variants
636:debug:main new fully merged portvariants: python27 +
637:debug:main Changing to port directory: /opt/local/var/macports/sources/rsync.macports.org/release/tarballs/ports/databases/db46
638:debug:main OS darwin/13.0.0 (Mac OS X 10.9) arch i386
639:debug:main Reading variant descriptions from /opt/local/var/macports/sources/rsync.macports.org/release/tarballs/ports/_resources/port1.0/variant_descriptions.conf
640:debug:main universal variant already exists, so not adding the default one
641:debug:main Requested variant +python27 is not provided by port db46.
642:debug:main Running callback portconfigure::add_automatic_compiler_dependencies
643:debug:main Finished running callback portconfigure::add_automatic_compiler_dependencies
644:debug:main Running callback portbuild::add_automatic_buildsystem_dependencies
645:debug:main Finished running callback portbuild::add_automatic_buildsystem_dependencies
646:debug:main No need to upgrade! db46 4.6.21_8 >= db46 4.6.21_8
647:debug:main epoch: in tree: 0 installed: 0
648:debug:main db_select 0.1_2 exists in the ports tree
649:debug:main db_select 0.1_2  is the latest installed
650:debug:main db_select 0.1_2  is active
651:debug:main Merging existing variants '' into variants
652:debug:main new fully merged portvariants: python27 +
653:debug:main Changing to port directory: /opt/local/var/macports/sources/rsync.macports.org/release/tarballs/ports/sysutils/db_select
654:debug:main OS darwin/13.0.0 (Mac OS X 10.9) arch i386
655:debug:main universal_variant is false, so not adding the default universal variant
656:debug:main Requested variant +python27 is not provided by port db_select.
657:debug:main Running callback portconfigure::add_automatic_compiler_dependencies
658:debug:main Finished running callback portconfigure::add_automatic_compiler_dependencies
659:debug:main Running callback portbuild::add_automatic_buildsystem_dependencies
660:debug:main Finished running callback portbuild::add_automatic_buildsystem_dependencies
661:debug:main No need to upgrade! db_select 0.1_2 >= db_select 0.1_2
662:debug:main epoch: in tree: 0 installed: 0
663:debug:main python_select 0.3_3 exists in the ports tree
664:debug:main python_select 0.3_3  is the latest installed
665:debug:main python_select 0.3_3  is active
666:debug:main Merging existing variants '' into variants
667:debug:main new fully merged portvariants: python27 +
668:debug:main Changing to port directory: /opt/local/var/macports/sources/rsync.macports.org/release/tarballs/ports/sysutils/python_select
669:debug:main OS darwin/13.0.0 (Mac OS X 10.9) arch i386
670:debug:main universal_variant is false, so not adding the default universal variant
671:debug:main Requested variant +python27 is not provided by port python_select.
672:debug:main Running callback portconfigure::add_automatic_compiler_dependencies
673:debug:main Finished running callback portconfigure::add_automatic_compiler_dependencies
674:debug:main Running callback portbuild::add_automatic_buildsystem_dependencies
675:debug:main Finished running callback portbuild::add_automatic_buildsystem_dependencies
676:debug:main No need to upgrade! python_select 0.3_3 >= python_select 0.3_3
677:debug:main epoch: in tree: 0 installed: 0
678:debug:main xorg-libpthread-stubs 0.3_0 exists in the ports tree
679:debug:main xorg-libpthread-stubs 0.3_0  is the latest installed
680:debug:main xorg-libpthread-stubs 0.3_0  is active
681:debug:main Merging existing variants '' into variants
682:debug:main new fully merged portvariants: python27 +
683:debug:main Changing to port directory: /opt/local/var/macports/sources/rsync.macports.org/release/tarballs/ports/x11/xorg-libpthread-stubs
684:debug:main OS darwin/13.0.0 (Mac OS X 10.9) arch i386
685:debug:main only one arch supported, so not adding the default universal variant
686:debug:main Requested variant +python27 is not provided by port xorg-libpthread-stubs.
687:debug:main Running callback portconfigure::add_automatic_compiler_dependencies
688:debug:main Finished running callback portconfigure::add_automatic_compiler_dependencies
689:debug:main Running callback portbuild::add_automatic_buildsystem_dependencies
690:debug:main Finished running callback portbuild::add_automatic_buildsystem_dependencies
691:debug:main No need to upgrade! xorg-libpthread-stubs 0.3_0 >= xorg-libpthread-stubs 0.3_0
692:debug:main epoch: in tree: 0 installed: 0
693:debug:main xorg-kbproto 1.0.6_0 exists in the ports tree
694:debug:main xorg-kbproto 1.0.6_0  is the latest installed
695:debug:main xorg-kbproto 1.0.6_0  is active
696:debug:main Merging existing variants '' into variants
697:debug:main new fully merged portvariants: python27 +
698:debug:main Changing to port directory: /opt/local/var/macports/sources/rsync.macports.org/release/tarballs/ports/x11/xorg-kbproto
699:debug:main OS darwin/13.0.0 (Mac OS X 10.9) arch i386
700:debug:main only one arch supported, so not adding the default universal variant
701:debug:main Requested variant +python27 is not provided by port xorg-kbproto.
702:debug:main Running callback portconfigure::add_automatic_compiler_dependencies
703:debug:main Finished running callback portconfigure::add_automatic_compiler_dependencies
704:debug:main Running callback portbuild::add_automatic_buildsystem_dependencies
705:debug:main Finished running callback portbuild::add_automatic_buildsystem_dependencies
706:debug:main No need to upgrade! xorg-kbproto 1.0.6_0 >= xorg-kbproto 1.0.6_0
707:debug:main epoch: in tree: 0 installed: 0
708:debug:main xorg-renderproto 0.11.1_0 exists in the ports tree
709:debug:main xorg-renderproto 0.11.1_0  is the latest installed
710:debug:main xorg-renderproto 0.11.1_0  is active
711:debug:main Merging existing variants '' into variants
712:debug:main new fully merged portvariants: python27 +
713:debug:main Changing to port directory: /opt/local/var/macports/sources/rsync.macports.org/release/tarballs/ports/x11/xorg-renderproto
714:debug:main OS darwin/13.0.0 (Mac OS X 10.9) arch i386
715:debug:main only one arch supported, so not adding the default universal variant
716:debug:main Requested variant +python27 is not provided by port xorg-renderproto.
717:debug:main Running callback portconfigure::add_automatic_compiler_dependencies
718:debug:main Finished running callback portconfigure::add_automatic_compiler_dependencies
719:debug:main Running callback portbuild::add_automatic_buildsystem_dependencies
720:debug:main Finished running callback portbuild::add_automatic_buildsystem_dependencies
721:debug:main No need to upgrade! xorg-renderproto 0.11.1_0 >= xorg-renderproto 0.11.1_0
722:debug:main epoch: in tree: 0 installed: 0
723:debug:main xorg-libXext 1.3.2_0 exists in the ports tree
724:debug:main xorg-libXext 1.3.2_0 +docs is the latest installed
725:debug:main xorg-libXext 1.3.2_0 +docs is active
726:debug:main Merging existing variants '+docs' into variants
727:debug:main new fully merged portvariants: docs + python27 +
728:debug:main Changing to port directory: /opt/local/var/macports/sources/rsync.macports.org/release/tarballs/ports/x11/xorg-libXext
729:debug:main OS darwin/13.0.0 (Mac OS X 10.9) arch i386
730:debug:main adding the default universal variant
731:debug:main Reading variant descriptions from /opt/local/var/macports/sources/rsync.macports.org/release/tarballs/ports/_resources/port1.0/variant_descriptions.conf
732:debug:main Requested variant +python27 is not provided by port xorg-libXext.
733:debug:main Executing variant docs provides docs
734:debug:main Running callback portconfigure::add_automatic_compiler_dependencies
735:debug:main Finished running callback portconfigure::add_automatic_compiler_dependencies
736:debug:main Running callback portbuild::add_automatic_buildsystem_dependencies
737:debug:main Finished running callback portbuild::add_automatic_buildsystem_dependencies
738:debug:main No need to upgrade! xorg-libXext 1.3.2_0 >= xorg-libXext 1.3.2_0
739:debug:main epoch: in tree: 0 installed: 0
740:debug:main xorg-xextproto 7.2.99.901_0 exists in the ports tree
741:debug:main xorg-xextproto 7.2.99.901_0  is the latest installed
742:debug:main xorg-xextproto 7.2.99.901_0  is active
743:debug:main Merging existing variants '' into variants
744:debug:main new fully merged portvariants: python27 +
745:debug:main Changing to port directory: /opt/local/var/macports/sources/rsync.macports.org/release/tarballs/ports/x11/xorg-xextproto
746:debug:main OS darwin/13.0.0 (Mac OS X 10.9) arch i386
747:debug:main only one arch supported, so not adding the default universal variant
748:debug:main Requested variant +python27 is not provided by port xorg-xextproto.
749:debug:main Running callback portconfigure::add_automatic_compiler_dependencies
750:debug:main Finished running callback portconfigure::add_automatic_compiler_dependencies
751:debug:main Running callback portbuild::add_automatic_buildsystem_dependencies
752:debug:main Finished running callback portbuild::add_automatic_buildsystem_dependencies
753:debug:main No need to upgrade! xorg-xextproto 7.2.99.901_0 >= xorg-xextproto 7.2.99.901_0
754:debug:main epoch: in tree: 0 installed: 0
755:debug:main xorg-xcb-util 0.3.9_0 exists in the ports tree
756:debug:main xorg-xcb-util 0.3.9_0  is the latest installed
757:debug:main xorg-xcb-util 0.3.9_0  is active
758:debug:main Merging existing variants '' into variants
759:debug:main new fully merged portvariants: python27 +
760:debug:main Changing to port directory: /opt/local/var/macports/sources/rsync.macports.org/release/tarballs/ports/x11/xorg-xcb-util
761:debug:main OS darwin/13.0.0 (Mac OS X 10.9) arch i386
762:debug:main adding the default universal variant
763:debug:main Reading variant descriptions from /opt/local/var/macports/sources/rsync.macports.org/release/tarballs/ports/_resources/port1.0/variant_descriptions.conf
764:debug:main Requested variant +python27 is not provided by port xorg-xcb-util.
765:debug:main Running callback portconfigure::add_automatic_compiler_dependencies
766:debug:main Finished running callback portconfigure::add_automatic_compiler_dependencies
767:debug:main Running callback portbuild::add_automatic_buildsystem_dependencies
768:debug:main Finished running callback portbuild::add_automatic_buildsystem_dependencies
769:debug:main No need to upgrade! xorg-xcb-util 0.3.9_0 >= xorg-xcb-util 0.3.9_0
770:debug:main epoch: in tree: 0 installed: 0
771:debug:main gobject-introspection 1.38.0_1 exists in the ports tree
772:debug:main gobject-introspection 1.38.0_1  is the latest installed
773:debug:main gobject-introspection 1.38.0_1  is active
774:debug:main Merging existing variants '' into variants
775:debug:main new fully merged portvariants: python27 +
776:debug:main Changing to port directory: /opt/local/var/macports/sources/rsync.macports.org/release/tarballs/ports/gnome/gobject-introspection
777:debug:main OS darwin/13.0.0 (Mac OS X 10.9) arch i386
778:debug:main python27 is installed with the following variants:
779:debug:main   required: ucs4, forbidden:
780:debug:main   rejected, because required variant ucs4 is missing
781:debug:main adding the default universal variant
782:debug:main Reading variant descriptions from /opt/local/var/macports/sources/rsync.macports.org/release/tarballs/ports/_resources/port1.0/variant_descriptions.conf
783:debug:main Requested variant +python27 is not provided by port gobject-introspection.
784:debug:main Running callback portconfigure::add_automatic_compiler_dependencies
785:debug:main Finished running callback portconfigure::add_automatic_compiler_dependencies
786:debug:main Running callback portbuild::add_automatic_buildsystem_dependencies
787:debug:main Finished running callback portbuild::add_automatic_buildsystem_dependencies
788:debug:main No need to upgrade! gobject-introspection 1.38.0_1 >= gobject-introspection 1.38.0_1
789:debug:main epoch: in tree: 0 installed: 0
790:debug:main libtool 2.4.2_3 exists in the ports tree
791:debug:main libtool 2.4.2_3  is the latest installed
792:debug:main libtool 2.4.2_3  is active
793:debug:main Merging existing variants '' into variants
794:debug:main new fully merged portvariants: python27 +
795:debug:main Changing to port directory: /opt/local/var/macports/sources/rsync.macports.org/release/tarballs/ports/devel/libtool
796:debug:main OS darwin/13.0.0 (Mac OS X 10.9) arch i386
797:debug:main adding the default universal variant
798:debug:main Reading variant descriptions from /opt/local/var/macports/sources/rsync.macports.org/release/tarballs/ports/_resources/port1.0/variant_descriptions.conf
799:debug:main Requested variant +python27 is not provided by port libtool.
800:debug:main Running callback portconfigure::add_automatic_compiler_dependencies
801:debug:main Finished running callback portconfigure::add_automatic_compiler_dependencies
802:debug:main Running callback portbuild::add_automatic_buildsystem_dependencies
803:debug:main Finished running callback portbuild::add_automatic_buildsystem_dependencies
804:debug:main No need to upgrade! libtool 2.4.2_3 >= libtool 2.4.2_3
805:debug:main epoch: in tree: 0 installed: 0
806:debug:main harfbuzz 0.9.25_0 exists in the ports tree
807:debug:main harfbuzz 0.9.25_0  is the latest installed
808:debug:main harfbuzz 0.9.25_0  is active
809:debug:main Merging existing variants '' into variants
810:debug:main new fully merged portvariants: python27 +
811:debug:main Changing to port directory: /opt/local/var/macports/sources/rsync.macports.org/release/tarballs/ports/graphics/harfbuzz
812:debug:main OS darwin/13.0.0 (Mac OS X 10.9) arch i386
813:debug:main adding the default universal variant
814:debug:main Reading variant descriptions from /opt/local/var/macports/sources/rsync.macports.org/release/tarballs/ports/_resources/port1.0/variant_descriptions.conf
815:debug:main Requested variant +python27 is not provided by port harfbuzz.
816:debug:main Running callback portconfigure::add_automatic_compiler_dependencies
817:debug:main Finished running callback portconfigure::add_automatic_compiler_dependencies
818:debug:main Running callback portbuild::add_automatic_buildsystem_dependencies
819:debug:main Finished running callback portbuild::add_automatic_buildsystem_dependencies
820:debug:main No need to upgrade! harfbuzz 0.9.25_0 >= harfbuzz 0.9.25_0
821:debug:main epoch: in tree: 0 installed: 0
822:debug:main graphite2 1.2.4_0 exists in the ports tree
823:debug:main graphite2 1.2.4_0  is the latest installed
824:debug:main graphite2 1.2.4_0  is active
825:debug:main Merging existing variants '' into variants
826:debug:main new fully merged portvariants: python27 +
827:debug:main Changing to port directory: /opt/local/var/macports/sources/rsync.macports.org/release/tarballs/ports/graphics/graphite2
828:debug:main OS darwin/13.0.0 (Mac OS X 10.9) arch i386
829:debug:main Reading variant descriptions from /opt/local/var/macports/sources/rsync.macports.org/release/tarballs/ports/_resources/port1.0/variant_descriptions.conf
830:debug:main universal variant already exists, so not adding the default one
831:debug:main Requested variant +python27 is not provided by port graphite2.
832:debug:main Running callback portconfigure::add_automatic_compiler_dependencies
833:debug:main Finished running callback portconfigure::add_automatic_compiler_dependencies
834:debug:main Running callback portbuild::add_automatic_buildsystem_dependencies
835:debug:main Finished running callback portbuild::add_automatic_buildsystem_dependencies
836:debug:main No need to upgrade! graphite2 1.2.4_0 >= graphite2 1.2.4_0
837:debug:main epoch: in tree: 0 installed: 0
838:debug:main Xft2 2.3.1_0 exists in the ports tree
839:debug:main Xft2 2.3.1_0  is the latest installed
840:debug:main Xft2 2.3.1_0  is active
841:debug:main Merging existing variants '' into variants
842:debug:main new fully merged portvariants: python27 +
843:debug:main Changing to port directory: /opt/local/var/macports/sources/rsync.macports.org/release/tarballs/ports/x11/Xft2
844:debug:main OS darwin/13.0.0 (Mac OS X 10.9) arch i386
845:debug:main adding the default universal variant
846:debug:main Reading variant descriptions from /opt/local/var/macports/sources/rsync.macports.org/release/tarballs/ports/_resources/port1.0/variant_descriptions.conf
847:debug:main Requested variant +python27 is not provided by port Xft2.
848:debug:main Running callback portconfigure::add_automatic_compiler_dependencies
849:debug:main Finished running callback portconfigure::add_automatic_compiler_dependencies
850:debug:main Running callback portbuild::add_automatic_buildsystem_dependencies
851:debug:main Finished running callback portbuild::add_automatic_buildsystem_dependencies
852:debug:main No need to upgrade! Xft2 2.3.1_0 >= Xft2 2.3.1_0
853:debug:main epoch: in tree: 0 installed: 0
854:debug:main swig-tcl 2.0.11_0 exists in the ports tree
855:debug:main swig-tcl 2.0.11_0  is the latest installed
856:debug:main swig-tcl 2.0.11_0  is active
857:debug:main Merging existing variants '' into variants
858:debug:main new fully merged portvariants: python27 +
859:debug:main Changing to port directory: /opt/local/var/macports/sources/rsync.macports.org/release/tarballs/ports/devel/swig
860:debug:main OS darwin/13.0.0 (Mac OS X 10.9) arch i386
861:debug:main only one arch supported, so not adding the default universal variant
862:debug:main Requested variant +python27 is not provided by port swig-tcl.
863:debug:main Running callback portconfigure::add_automatic_compiler_dependencies
864:debug:main Finished running callback portconfigure::add_automatic_compiler_dependencies
865:debug:main Running callback portbuild::add_automatic_buildsystem_dependencies
866:debug:main Finished running callback portbuild::add_automatic_buildsystem_dependencies
867:debug:main No need to upgrade! swig-tcl 2.0.11_0 >= swig-tcl 2.0.11_0
868:debug:main epoch: in tree: 0 installed: 0
869:debug:main tcl 8.6.1_0 exists in the ports tree
870:debug:main tcl 8.6.1_0 +corefoundation+threads is the latest installed
871:debug:main tcl 8.6.1_0 +threads is active
872:debug:main Merging existing variants '+threads-corefoundation' into variants
873:debug:main new fully merged portvariants: corefoundation - python27 + threads +
874:debug:main Changing to port directory: /opt/local/var/macports/sources/rsync.macports.org/release/tarballs/ports/lang/tcl
875:debug:main OS darwin/13.0.0 (Mac OS X 10.9) arch i386
876:debug:main adding the default universal variant
877:debug:main Reading variant descriptions from /opt/local/var/macports/sources/rsync.macports.org/release/tarballs/ports/_resources/port1.0/variant_descriptions.conf
878:debug:main Requested variant +python27 is not provided by port tcl.
879:debug:main Executing variant threads provides threads
880:debug:main Running callback portconfigure::add_automatic_compiler_dependencies
881:debug:main Finished running callback portconfigure::add_automatic_compiler_dependencies
882:debug:main Running callback portbuild::add_automatic_buildsystem_dependencies
883:debug:main Finished running callback portbuild::add_automatic_buildsystem_dependencies
884:debug:main No need to upgrade! tcl 8.6.1_0 >= tcl 8.6.1_0
885:debug:main epoch: in tree: 0 installed: 0
886:debug:main swig 2.0.11_0 exists in the ports tree
887:debug:main swig 2.0.11_0  is the latest installed
888:debug:main swig 2.0.11_0  is active
889:debug:main Merging existing variants '' into variants
890:debug:main new fully merged portvariants: python27 +
891:debug:main Changing to port directory: /opt/local/var/macports/sources/rsync.macports.org/release/tarballs/ports/devel/swig
892:debug:main OS darwin/13.0.0 (Mac OS X 10.9) arch i386
893:debug:main adding the default universal variant
894:debug:main Reading variant descriptions from /opt/local/var/macports/sources/rsync.macports.org/release/tarballs/ports/_resources/port1.0/variant_descriptions.conf
895:debug:main Requested variant +python27 is not provided by port swig.
896:debug:main Running callback portconfigure::add_automatic_compiler_dependencies
897:debug:main Finished running callback portconfigure::add_automatic_compiler_dependencies
898:debug:main Running callback portbuild::add_automatic_buildsystem_dependencies
899:debug:main Finished running callback portbuild::add_automatic_buildsystem_dependencies
900:debug:main No need to upgrade! swig 2.0.11_0 >= swig 2.0.11_0
901:debug:main epoch: in tree: 0 installed: 0
902:debug:main pcre 8.33_0 exists in the ports tree
903:debug:main pcre 8.33_0  is the latest installed
904:debug:main pcre 8.33_0  is active
905:debug:main Merging existing variants '' into variants
906:debug:main new fully merged portvariants: python27 +
907:debug:main Changing to port directory: /opt/local/var/macports/sources/rsync.macports.org/release/tarballs/ports/devel/pcre
908:debug:main OS darwin/13.0.0 (Mac OS X 10.9) arch i386
909:debug:main adding the default universal variant
910:debug:main Reading variant descriptions from /opt/local/var/macports/sources/rsync.macports.org/release/tarballs/ports/_resources/port1.0/variant_descriptions.conf
911:debug:main Requested variant +python27 is not provided by port pcre.
912:debug:main Running callback portconfigure::add_automatic_compiler_dependencies
913:debug:main Finished running callback portconfigure::add_automatic_compiler_dependencies
914:debug:main Running callback portbuild::add_automatic_buildsystem_dependencies
915:debug:main Finished running callback portbuild::add_automatic_buildsystem_dependencies
916:debug:main No need to upgrade! pcre 8.33_0 >= pcre 8.33_0
917:debug:main epoch: in tree: 0 installed: 0
918:debug:main py27-numpy 1.8.0_2 exists in the ports tree
919:debug:main py27-numpy 1.8.0_2  is the latest installed
920:debug:main py27-numpy 1.8.0_2  is active
921:debug:main Merging existing variants '' into variants
922:debug:main new fully merged portvariants: python27 +
923:debug:main Changing to port directory: /opt/local/var/macports/sources/rsync.macports.org/release/tarballs/ports/python/py-numpy
924:debug:main OS darwin/13.0.0 (Mac OS X 10.9) arch i386
925:debug:main Re-registering default for build.cmd
926:debug:main Re-registering default for destroot.cmd
927:debug:main Re-registering default for destroot.destdir
928:debug:main adding the default universal variant
929:debug:main Reading variant descriptions from /opt/local/var/macports/sources/rsync.macports.org/release/tarballs/ports/_resources/port1.0/variant_descriptions.conf
930:debug:main Requested variant +python27 is not provided by port py27-numpy.
931:debug:main Running callback portconfigure::add_automatic_compiler_dependencies
932:debug:main Finished running callback portconfigure::add_automatic_compiler_dependencies
933:debug:main Running callback portbuild::add_automatic_buildsystem_dependencies
934:debug:main Finished running callback portbuild::add_automatic_buildsystem_dependencies
935:debug:main No need to upgrade! py27-numpy 1.8.0_2 >= py27-numpy 1.8.0_2
936:debug:main epoch: in tree: 0 installed: 0
937:debug:main fftw-3 3.3.3_5 exists in the ports tree
938:debug:main fftw-3 3.3.3_5  is the latest installed
939:debug:main fftw-3 3.3.3_5  is active
940:debug:main Merging existing variants '' into variants
941:debug:main new fully merged portvariants: python27 +
942:debug:main Changing to port directory: /opt/local/var/macports/sources/rsync.macports.org/release/tarballs/ports/math/fftw-3
943:debug:main OS darwin/13.0.0 (Mac OS X 10.9) arch i386
944:debug:main Reading variant descriptions from /opt/local/var/macports/sources/rsync.macports.org/release/tarballs/ports/_resources/port1.0/variant_descriptions.conf
945:debug:main compiler clang 500.2.79 not blacklisted because it doesn't match {clang <= 211.10.1}
946:debug:main universal variant already exists, so not adding the default one
947:debug:main Requested variant +python27 is not provided by port fftw-3.
948:debug:main Running callback portconfigure::add_automatic_compiler_dependencies
949:debug:main Finished running callback portconfigure::add_automatic_compiler_dependencies
950:debug:main Running callback portbuild::add_automatic_buildsystem_dependencies
951:debug:main Finished running callback portbuild::add_automatic_buildsystem_dependencies
952:debug:main No need to upgrade! fftw-3 3.3.3_5 >= fftw-3 3.3.3_5
953:debug:main epoch: in tree: 0 installed: 0
954:debug:main py27-nose 1.3.0_0 exists in the ports tree
955:debug:main py27-nose 1.3.0_0  is the latest installed
956:debug:main py27-nose 1.3.0_0  is active
957:debug:main Merging existing variants '' into variants
958:debug:main new fully merged portvariants: python27 +
959:debug:main Changing to port directory: /opt/local/var/macports/sources/rsync.macports.org/release/tarballs/ports/python/py-nose
960:debug:main OS darwin/13.0.0 (Mac OS X 10.9) arch i386
961:debug:main Re-registering default for build.cmd
962:debug:main Re-registering default for destroot.cmd
963:debug:main Re-registering default for destroot.destdir
964:debug:main only one arch supported, so not adding the default universal variant
965:debug:main Requested variant +python27 is not provided by port py27-nose.
966:debug:main Running callback portconfigure::add_automatic_compiler_dependencies
967:debug:main Finished running callback portconfigure::add_automatic_compiler_dependencies
968:debug:main Running callback portbuild::add_automatic_buildsystem_dependencies
969:debug:main Finished running callback portbuild::add_automatic_buildsystem_dependencies
970:debug:main No need to upgrade! py27-nose 1.3.0_0 >= py27-nose 1.3.0_0
971:debug:main epoch: in tree: 0 installed: 0
972:debug:main py27-setuptools 1.4.2_0 exists in the ports tree
973:debug:main py27-setuptools 1.4.2_0  is the latest installed
974:debug:main py27-setuptools 1.4.2_0  is active
975:debug:main Merging existing variants '' into variants
976:debug:main new fully merged portvariants: python27 +
977:debug:main Changing to port directory: /opt/local/var/macports/sources/rsync.macports.org/release/tarballs/ports/python/py-setuptools
978:debug:main OS darwin/13.0.0 (Mac OS X 10.9) arch i386
979:debug:main Re-registering default for build.cmd
980:debug:main Re-registering default for destroot.cmd
981:debug:main Re-registering default for destroot.destdir
982:debug:main only one arch supported, so not adding the default universal variant
983:debug:main Requested variant +python27 is not provided by port py27-setuptools.
984:debug:main Running callback portconfigure::add_automatic_compiler_dependencies
985:debug:main Finished running callback portconfigure::add_automatic_compiler_dependencies
986:debug:main Running callback portbuild::add_automatic_buildsystem_dependencies
987:debug:main Finished running callback portbuild::add_automatic_buildsystem_dependencies
988:debug:main No need to upgrade! py27-setuptools 1.4.2_0 >= py27-setuptools 1.4.2_0
989:debug:main epoch: in tree: 0 installed: 0
990:debug:main nosetests_select 0.1_0 exists in the ports tree
991:debug:main nosetests_select 0.1_0  is the latest installed
992:debug:main nosetests_select 0.1_0  is active
993:debug:main Merging existing variants '' into variants
994:debug:main new fully merged portvariants: python27 +
995:debug:main Changing to port directory: /opt/local/var/macports/sources/rsync.macports.org/release/tarballs/ports/python/nosetests_select
996:debug:main OS darwin/13.0.0 (Mac OS X 10.9) arch i386
997:debug:main universal_variant is false, so not adding the default universal variant
998:debug:main Requested variant +python27 is not provided by port nosetests_select.
999:debug:main Running callback portconfigure::add_automatic_compiler_dependencies
1000:debug:main Finished running callback portconfigure::add_automatic_compiler_dependencies
1001:debug:main Running callback portbuild::add_automatic_buildsystem_dependencies
1002:debug:main Finished running callback portbuild::add_automatic_buildsystem_dependencies
1003:debug:main No need to upgrade! nosetests_select 0.1_0 >= nosetests_select 0.1_0
1004:debug:main epoch: in tree: 0 installed: 0
1005:debug:main swig-python 2.0.11_0 exists in the ports tree
1006:debug:main swig-python 2.0.11_0  is the latest installed
1007:debug:main swig-python 2.0.11_0  is active
1008:debug:main Merging existing variants '' into variants
1009:debug:main new fully merged portvariants: python27 +
1010:debug:main Changing to port directory: /opt/local/var/macports/sources/rsync.macports.org/release/tarballs/ports/devel/swig
1011:debug:main OS darwin/13.0.0 (Mac OS X 10.9) arch i386
1012:debug:main only one arch supported, so not adding the default universal variant
1013:debug:main Requested variant +python27 is not provided by port swig-python.
1014:debug:main Running callback portconfigure::add_automatic_compiler_dependencies
1015:debug:main Finished running callback portconfigure::add_automatic_compiler_dependencies
1016:debug:main Running callback portbuild::add_automatic_buildsystem_dependencies
1017:debug:main Finished running callback portbuild::add_automatic_buildsystem_dependencies
1018:debug:main No need to upgrade! swig-python 2.0.11_0 >= swig-python 2.0.11_0
1019:debug:main epoch: in tree: 0 installed: 0
1020:debug:main aquaterm 1.1.1_0 exists in the ports tree
1021:debug:main aquaterm 1.1.1_0  is the latest installed
1022:debug:main aquaterm 1.1.1_0  is active
1023:debug:main Merging existing variants '' into variants
1024:debug:main new fully merged portvariants: python27 +
1025:debug:main Changing to port directory: /opt/local/var/macports/sources/rsync.macports.org/release/tarballs/ports/aqua/aquaterm
1026:debug:main OS darwin/13.0.0 (Mac OS X 10.9) arch i386
1027:debug:main Re-registering default for use_configure
1028:debug:main Re-registering default for universal_variant
1029:debug:main Re-registering default for build.type
1030:debug:main Re-registering default for build.pre_args
1031:debug:main Re-registering default for build.target
1032:debug:main Re-registering default for destroot.pre_args
1033:debug:main Re-registering default for destroot.target
1034:debug:main Re-registering default for destroot.destdir
1035:debug:main adding the default universal variant
1036:debug:main Reading variant descriptions from /opt/local/var/macports/sources/rsync.macports.org/release/tarballs/ports/_resources/port1.0/variant_descriptions.conf
1037:debug:main Requested variant +python27 is not provided by port aquaterm.
1038:debug:main Running callback portconfigure::add_automatic_compiler_dependencies
1039:debug:main Finished running callback portconfigure::add_automatic_compiler_dependencies
1040:debug:main Running callback portbuild::add_automatic_buildsystem_dependencies
1041:debug:main Finished running callback portbuild::add_automatic_buildsystem_dependencies
1042:debug:main No need to upgrade! aquaterm 1.1.1_0 >= aquaterm 1.1.1_0
1043:debug:main epoch: in tree: 0 installed: 0
1044:debug:main tk 8.6.1_1 exists in the ports tree
1045:debug:main tk 8.6.1_1  is the latest installed
1046:debug:main tk 8.6.1_1  is active
1047:debug:main Merging existing variants '-quartz' into variants
1048:debug:main new fully merged portvariants: python27 + quartz -
1049:debug:main Changing to port directory: /opt/local/var/macports/sources/rsync.macports.org/release/tarballs/ports/x11/tk
1050:debug:main OS darwin/13.0.0 (Mac OS X 10.9) arch i386
1051:debug:main Reading variant descriptions from /opt/local/var/macports/sources/rsync.macports.org/release/tarballs/ports/_resources/port1.0/variant_descriptions.conf
1052:debug:main adding the default universal variant
1053:debug:main Requested variant +python27 is not provided by port tk.
1054:debug:main Running callback portconfigure::add_automatic_compiler_dependencies
1055:debug:main Finished running callback portconfigure::add_automatic_compiler_dependencies
1056:debug:main Running callback portbuild::add_automatic_buildsystem_dependencies
1057:debug:main Finished running callback portbuild::add_automatic_buildsystem_dependencies
1058:debug:main No need to upgrade! tk 8.6.1_1 >= tk 8.6.1_1
1059:debug:main epoch: in tree: 0 installed: 0
1060:debug:main xorg-libXScrnSaver 1.2.2_0 exists in the ports tree
1061:debug:main xorg-libXScrnSaver 1.2.2_0  is the latest installed
1062:debug:main xorg-libXScrnSaver 1.2.2_0  is active
1063:debug:main Merging existing variants '' into variants
1064:debug:main new fully merged portvariants: python27 +
1065:debug:main Changing to port directory: /opt/local/var/macports/sources/rsync.macports.org/release/tarballs/ports/x11/xorg-libXScrnSaver
1066:debug:main OS darwin/13.0.0 (Mac OS X 10.9) arch i386
1067:debug:main adding the default universal variant
1068:debug:main Reading variant descriptions from /opt/local/var/macports/sources/rsync.macports.org/release/tarballs/ports/_resources/port1.0/variant_descriptions.conf
1069:debug:main Requested variant +python27 is not provided by port xorg-libXScrnSaver.
1070:debug:main Running callback portconfigure::add_automatic_compiler_dependencies
1071:debug:main Finished running callback portconfigure::add_automatic_compiler_dependencies
1072:debug:main Running callback portbuild::add_automatic_buildsystem_dependencies
1073:debug:main Finished running callback portbuild::add_automatic_buildsystem_dependencies
1074:debug:main No need to upgrade! xorg-libXScrnSaver 1.2.2_0 >= xorg-libXScrnSaver 1.2.2_0
1075:debug:main epoch: in tree: 0 installed: 0
1076:debug:main xorg-scrnsaverproto 1.2.2_0 exists in the ports tree
1077:debug:main xorg-scrnsaverproto 1.2.2_0  is the latest installed
1078:debug:main xorg-scrnsaverproto 1.2.2_0  is active
1079:debug:main Merging existing variants '' into variants
1080:debug:main new fully merged portvariants: python27 +
1081:debug:main Changing to port directory: /opt/local/var/macports/sources/rsync.macports.org/release/tarballs/ports/x11/xorg-scrnsaverproto
1082:debug:main OS darwin/13.0.0 (Mac OS X 10.9) arch i386
1083:debug:main only one arch supported, so not adding the default universal variant
1084:debug:main Requested variant +python27 is not provided by port xorg-scrnsaverproto.
1085:debug:main Running callback portconfigure::add_automatic_compiler_dependencies
1086:debug:main Finished running callback portconfigure::add_automatic_compiler_dependencies
1087:debug:main Running callback portbuild::add_automatic_buildsystem_dependencies
1088:debug:main Finished running callback portbuild::add_automatic_buildsystem_dependencies
1089:debug:main No need to upgrade! xorg-scrnsaverproto 1.2.2_0 >= xorg-scrnsaverproto 1.2.2_0
1090:debug:main epoch: in tree: 0 installed: 0
1091:debug:main netcdf-cxx 4.2_3 exists in the ports tree
1092:debug:main netcdf-cxx 4.2_3  is the latest installed
1093:debug:main netcdf-cxx 4.2_3  is active
1094:debug:main Merging existing variants '' into variants
1095:debug:main new fully merged portvariants: python27 +
1096:debug:main Changing to port directory: /opt/local/var/macports/sources/rsync.macports.org/release/tarballs/ports/science/netcdf-cxx
1097:debug:main OS darwin/13.0.0 (Mac OS X 10.9) arch i386
1098:debug:main adding the default universal variant
1099:debug:main Reading variant descriptions from /opt/local/var/macports/sources/rsync.macports.org/release/tarballs/ports/_resources/port1.0/variant_descriptions.conf
1100:debug:main Requested variant +python27 is not provided by port netcdf-cxx.
1101:debug:main Running callback portconfigure::add_automatic_compiler_dependencies
1102:debug:main Finished running callback portconfigure::add_automatic_compiler_dependencies
1103:debug:main Running callback portbuild::add_automatic_buildsystem_dependencies
1104:debug:main Finished running callback portbuild::add_automatic_buildsystem_dependencies
1105:debug:main No need to upgrade! netcdf-cxx 4.2_3 >= netcdf-cxx 4.2_3
1106:debug:main epoch: in tree: 2 installed: 2
1107:debug:main netcdf 4.3.0_1 exists in the ports tree
1108:debug:main netcdf 4.3.0_1 +dap+netcdf4 is the latest installed
1109:debug:main netcdf 4.3.0_1 +dap+netcdf4 is active
1110:debug:main Merging existing variants '+dap+netcdf4' into variants
1111:debug:main new fully merged portvariants: netcdf4 + dap + python27 +
1112:debug:main Changing to port directory: /opt/local/var/macports/sources/rsync.macports.org/release/tarballs/ports/science/netcdf
1113:debug:main OS darwin/13.0.0 (Mac OS X 10.9) arch i386
1114:debug:main hdf5-18 is installed with the following variants: +cxx
1115:debug:main   required: openmpi, forbidden:
1116:debug:main   rejected, because required variant openmpi is missing
1117:debug:main adding the default universal variant
1118:debug:main Reading variant descriptions from /opt/local/var/macports/sources/rsync.macports.org/release/tarballs/ports/_resources/port1.0/variant_descriptions.conf
1119:debug:main Requested variant +python27 is not provided by port netcdf.
1120:debug:main Executing variant netcdf4 provides netcdf4
1121:debug:main Executing variant dap provides dap
1122:debug:main Running callback portconfigure::add_automatic_compiler_dependencies
1123:debug:main Finished running callback portconfigure::add_automatic_compiler_dependencies
1124:debug:main Running callback portbuild::add_automatic_buildsystem_dependencies
1125:debug:main Finished running callback portbuild::add_automatic_buildsystem_dependencies
1126:debug:main No need to upgrade! netcdf 4.3.0_1 >= netcdf 4.3.0_1
1127:debug:main epoch: in tree: 0 installed: 0
1128:debug:main hdf5-18 1.8.11_0 exists in the ports tree
1129:debug:main hdf5-18 1.8.11_0 +cxx is the latest installed
1130:debug:main hdf5-18 1.8.11_0 +cxx is active
1131:debug:main Merging existing variants '+cxx' into variants
1132:debug:main new fully merged portvariants: python27 + cxx +
1133:debug:main Changing to port directory: /opt/local/var/macports/sources/rsync.macports.org/release/tarballs/ports/science/hdf5-18
1134:debug:main OS darwin/13.0.0 (Mac OS X 10.9) arch i386
1135:debug:main Reading variant descriptions from /opt/local/var/macports/sources/rsync.macports.org/release/tarballs/ports/_resources/port1.0/variant_descriptions.conf
1136:debug:main universal variant already exists, so not adding the default one
1137:debug:main Requested variant +python27 is not provided by port hdf5-18.
1138:debug:main Executing variant cxx provides cxx
1139:debug:main Running callback portconfigure::add_automatic_compiler_dependencies
1140:debug:main Finished running callback portconfigure::add_automatic_compiler_dependencies
1141:debug:main Running callback portbuild::add_automatic_buildsystem_dependencies
1142:debug:main Finished running callback portbuild::add_automatic_buildsystem_dependencies
1143:debug:main No need to upgrade! hdf5-18 1.8.11_0 >= hdf5-18 1.8.11_0
1144:debug:main epoch: in tree: 0 installed: 0
1145:debug:main curl 7.33.0_0 exists in the ports tree
1146:debug:main curl 7.33.0_0 +ssl is the latest installed
1147:debug:main curl 7.33.0_0 +ssl is active
1148:debug:main Merging existing variants '+ssl' into variants
1149:debug:main new fully merged portvariants: ssl + python27 +
1150:debug:main Changing to port directory: /opt/local/var/macports/sources/rsync.macports.org/release/tarballs/ports/net/curl
1151:debug:main OS darwin/13.0.0 (Mac OS X 10.9) arch i386
1152:debug:main Reading variant descriptions from /opt/local/var/macports/sources/rsync.macports.org/release/tarballs/ports/_resources/port1.0/variant_descriptions.conf
1153:debug:main universal variant already exists, so not adding the default one
1154:debug:main Requested variant +python27 is not provided by port curl.
1155:debug:main Executing variant ssl provides ssl
1156:debug:main Running callback portconfigure::add_automatic_compiler_dependencies
1157:debug:main Finished running callback portconfigure::add_automatic_compiler_dependencies
1158:debug:main Running callback portbuild::add_automatic_buildsystem_dependencies
1159:debug:main Finished running callback portbuild::add_automatic_buildsystem_dependencies
1160:debug:main No need to upgrade! curl 7.33.0_0 >= curl 7.33.0_0
1161:debug:main epoch: in tree: 0 installed: 0
1162:debug:main curl-ca-bundle 7.33.0_0 exists in the ports tree
1163:debug:main curl-ca-bundle 7.33.0_0  is the latest installed
1164:debug:main curl-ca-bundle 7.33.0_0  is active
1165:debug:main Merging existing variants '' into variants
1166:debug:main new fully merged portvariants: python27 +
1167:debug:main Changing to port directory: /opt/local/var/macports/sources/rsync.macports.org/release/tarballs/ports/net/curl
1168:debug:main OS darwin/13.0.0 (Mac OS X 10.9) arch i386
1169:debug:main universal_variant is false, so not adding the default universal variant
1170:debug:main Requested variant +python27 is not provided by port curl-ca-bundle.
1171:debug:main Running callback portconfigure::add_automatic_compiler_dependencies
1172:debug:main Finished running callback portconfigure::add_automatic_compiler_dependencies
1173:debug:main Running callback portbuild::add_automatic_buildsystem_dependencies
1174:debug:main Finished running callback portbuild::add_automatic_buildsystem_dependencies
1175:debug:main No need to upgrade! curl-ca-bundle 7.33.0_0 >= curl-ca-bundle 7.33.0_0
1176:debug:main epoch: in tree: 0 installed: 0
1177:debug:main hdf4 4.2.9_0 exists in the ports tree
1178:debug:main hdf4 4.2.9_0  is the latest installed
1179:debug:main hdf4 4.2.9_0  is active
1180:debug:main Merging existing variants '' into variants
1181:debug:main new fully merged portvariants: python27 +
1182:debug:main Changing to port directory: /opt/local/var/macports/sources/rsync.macports.org/release/tarballs/ports/science/hdf4
1183:debug:main OS darwin/13.0.0 (Mac OS X 10.9) arch i386
1184:debug:main adding the default universal variant
1185:debug:main Reading variant descriptions from /opt/local/var/macports/sources/rsync.macports.org/release/tarballs/ports/_resources/port1.0/variant_descriptions.conf
1186:debug:main Requested variant +python27 is not provided by port hdf4.
1187:debug:main Running callback portconfigure::add_automatic_compiler_dependencies
1188:debug:main Finished running callback portconfigure::add_automatic_compiler_dependencies
1189:debug:main Running callback portbuild::add_automatic_buildsystem_dependencies
1190:debug:main Finished running callback portbuild::add_automatic_buildsystem_dependencies
1191:debug:main No need to upgrade! hdf4 4.2.9_0 >= hdf4 4.2.9_0
1192:debug:main epoch: in tree: 0 installed: 0
1193:debug:main jpeg 9_1 exists in the ports tree
1194:debug:main jpeg 9_1  is the latest installed
1195:debug:main jpeg 9_1  is active
1196:debug:main Merging existing variants '' into variants
1197:debug:main new fully merged portvariants: python27 +
1198:debug:main Changing to port directory: /opt/local/var/macports/sources/rsync.macports.org/release/tarballs/ports/graphics/jpeg
1199:debug:main OS darwin/13.0.0 (Mac OS X 10.9) arch i386
1200:debug:main adding the default universal variant
1201:debug:main Reading variant descriptions from /opt/local/var/macports/sources/rsync.macports.org/release/tarballs/ports/_resources/port1.0/variant_descriptions.conf
1202:debug:main Requested variant +python27 is not provided by port jpeg.
1203:debug:main Running callback portconfigure::add_automatic_compiler_dependencies
1204:debug:main Finished running callback portconfigure::add_automatic_compiler_dependencies
1205:debug:main Running callback portbuild::add_automatic_buildsystem_dependencies
1206:debug:main Finished running callback portbuild::add_automatic_buildsystem_dependencies
1207:debug:main No need to upgrade! jpeg 9_1 >= jpeg 9_1
1208:debug:main epoch: in tree: 0 installed: 0
1209:debug:main grib_api 1.11.0_0 exists in the ports tree
1210:debug:main grib_api 1.11.0_0 +python27 is the latest installed
1211:debug:main grib_api 1.11.0_0 +python27 is active
1212:debug:main Merging existing variants '+python27' into variants
1213:debug:main new fully merged portvariants: python27 +
1214:debug:main Changing to port directory: /opt/local/var/macports/sources/rsync.macports.org/release/tarballs/ports/science/grib_api
1215:debug:main OS darwin/13.0.0 (Mac OS X 10.9) arch i386
1216:debug:main adding the default universal variant
1217:debug:main Reading variant descriptions from /opt/local/var/macports/sources/rsync.macports.org/release/tarballs/ports/_resources/port1.0/variant_descriptions.conf
1218:debug:main Executing variant python27 provides python27
1219:debug:main Running callback portconfigure::add_automatic_compiler_dependencies
1220:debug:main Finished running callback portconfigure::add_automatic_compiler_dependencies
1221:debug:main Running callback portbuild::add_automatic_buildsystem_dependencies
1222:debug:main Finished running callback portbuild::add_automatic_buildsystem_dependencies
1223:debug:main No need to upgrade! grib_api 1.11.0_0 >= grib_api 1.11.0_0
1224:debug:main epoch: in tree: 0 installed: 0
1225:debug:main jasper 1.900.1_10 exists in the ports tree
1226:debug:main jasper 1.900.1_10  is the latest installed
1227:debug:main jasper 1.900.1_10  is active
1228:debug:main Merging existing variants '' into variants
1229:debug:main new fully merged portvariants: python27 +
1230:debug:main Changing to port directory: /opt/local/var/macports/sources/rsync.macports.org/release/tarballs/ports/graphics/jasper
1231:debug:main OS darwin/13.0.0 (Mac OS X 10.9) arch i386
1232:debug:main adding the default universal variant
1233:debug:main Reading variant descriptions from /opt/local/var/macports/sources/rsync.macports.org/release/tarballs/ports/_resources/port1.0/variant_descriptions.conf
1234:debug:main Requested variant +python27 is not provided by port jasper.
1235:debug:main Running callback portconfigure::add_automatic_compiler_dependencies
1236:debug:main Finished running callback portconfigure::add_automatic_compiler_dependencies
1237:debug:main Running callback portbuild::add_automatic_buildsystem_dependencies
1238:debug:main Finished running callback portbuild::add_automatic_buildsystem_dependencies
1239:debug:main No need to upgrade! jasper 1.900.1_10 >= jasper 1.900.1_10
1240:debug:main epoch: in tree: 0 installed: 0
1241:debug:main openjpeg15 1.5.0_0 exists in the ports tree
1242:debug:main openjpeg15 1.5.0_0  is the latest installed
1243:debug:main openjpeg15 1.5.0_0  is active
1244:debug:main Merging existing variants '' into variants
1245:debug:main new fully merged portvariants: python27 +
1246:debug:main Changing to port directory: /opt/local/var/macports/sources/rsync.macports.org/release/tarballs/ports/graphics/openjpeg15
1247:debug:main OS darwin/13.0.0 (Mac OS X 10.9) arch i386
1248:debug:main adding the default universal variant
1249:debug:main Reading variant descriptions from /opt/local/var/macports/sources/rsync.macports.org/release/tarballs/ports/_resources/port1.0/variant_descriptions.conf
1250:debug:main Requested variant +python27 is not provided by port openjpeg15.
1251:debug:main Running callback portconfigure::add_automatic_compiler_dependencies
1252:debug:main Finished running callback portconfigure::add_automatic_compiler_dependencies
1253:debug:main Running callback portbuild::add_automatic_buildsystem_dependencies
1254:debug:main Finished running callback portbuild::add_automatic_buildsystem_dependencies
1255:debug:main No need to upgrade! openjpeg15 1.5.0_0 >= openjpeg15 1.5.0_0
1256:debug:main epoch: in tree: 0 installed: 0
1257:debug:main tiff 4.0.3_2 exists in the ports tree
1258:debug:main tiff 4.0.3_2  is the latest installed
1259:debug:main tiff 4.0.3_2  is active
1260:debug:main Merging existing variants '' into variants
1261:debug:main new fully merged portvariants: python27 +
1262:debug:main Changing to port directory: /opt/local/var/macports/sources/rsync.macports.org/release/tarballs/ports/graphics/tiff
1263:debug:main OS darwin/13.0.0 (Mac OS X 10.9) arch i386
1264:debug:main Reading variant descriptions from /opt/local/var/macports/sources/rsync.macports.org/release/tarballs/ports/_resources/port1.0/variant_descriptions.conf
1265:debug:main universal variant already exists, so not adding the default one
1266:debug:main Requested variant +python27 is not provided by port tiff.
1267:debug:main Running callback portconfigure::add_automatic_compiler_dependencies
1268:debug:main Finished running callback portconfigure::add_automatic_compiler_dependencies
1269:debug:main Running callback portbuild::add_automatic_buildsystem_dependencies
1270:debug:main Finished running callback portbuild::add_automatic_buildsystem_dependencies
1271:debug:main No need to upgrade! tiff 4.0.3_2 >= tiff 4.0.3_2
1272:debug:main epoch: in tree: 0 installed: 0
1273:debug:main lcms2 2.4_2 exists in the ports tree
1274:debug:main lcms2 2.4_2  is the latest installed
1275:debug:main lcms2 2.4_2  is active
1276:debug:main Merging existing variants '' into variants
1277:debug:main new fully merged portvariants: python27 +
1278:debug:main Changing to port directory: /opt/local/var/macports/sources/rsync.macports.org/release/tarballs/ports/graphics/lcms2
1279:debug:main OS darwin/13.0.0 (Mac OS X 10.9) arch i386
1280:debug:main Reading variant descriptions from /opt/local/var/macports/sources/rsync.macports.org/release/tarballs/ports/_resources/port1.0/variant_descriptions.conf
1281:debug:main universal variant already exists, so not adding the default one
1282:debug:main Requested variant +python27 is not provided by port lcms2.
1283:debug:main Running callback portconfigure::add_automatic_compiler_dependencies
1284:debug:main Finished running callback portconfigure::add_automatic_compiler_dependencies
1285:debug:main Running callback portbuild::add_automatic_buildsystem_dependencies
1286:debug:main Finished running callback portbuild::add_automatic_buildsystem_dependencies
1287:debug:main No need to upgrade! lcms2 2.4_2 >= lcms2 2.4_2
1288:debug:main epoch: in tree: 0 installed: 0
1289:debug:main jbigkit 2.0_2 exists in the ports tree
1290:debug:main jbigkit 2.0_2  is the latest installed
1291:debug:main jbigkit 2.0_2  is active
1292:debug:main Merging existing variants '' into variants
1293:debug:main new fully merged portvariants: python27 +
1294:debug:main Changing to port directory: /opt/local/var/macports/sources/rsync.macports.org/release/tarballs/ports/graphics/jbigkit
1295:debug:main OS darwin/13.0.0 (Mac OS X 10.9) arch i386
1296:debug:main adding the default universal variant
1297:debug:main Reading variant descriptions from /opt/local/var/macports/sources/rsync.macports.org/release/tarballs/ports/_resources/port1.0/variant_descriptions.conf
1298:debug:main Requested variant +python27 is not provided by port jbigkit.
1299:debug:main Running callback portconfigure::add_automatic_compiler_dependencies
1300:debug:main Finished running callback portconfigure::add_automatic_compiler_dependencies
1301:debug:main Running callback portbuild::add_automatic_buildsystem_dependencies
1302:debug:main Finished running callback portbuild::add_automatic_buildsystem_dependencies
1303:debug:main No need to upgrade! jbigkit 2.0_2 >= jbigkit 2.0_2
1304:debug:main epoch: in tree: 0 installed: 0
1305:debug:main libproj4 3_20081120_3 exists in the ports tree
1306:debug:main libproj4 3_20081120_3  is the latest installed
1307:debug:main libproj4 3_20081120_3  is active
1308:debug:main Merging existing variants '' into variants
1309:debug:main new fully merged portvariants: python27 +
1310:debug:main Changing to port directory: /opt/local/var/macports/sources/rsync.macports.org/release/tarballs/ports/gis/libproj4
1311:debug:main OS darwin/13.0.0 (Mac OS X 10.9) arch i386
1312:debug:main Reading variant descriptions from /opt/local/var/macports/sources/rsync.macports.org/release/tarballs/ports/_resources/port1.0/variant_descriptions.conf
1313:debug:main universal variant already exists, so not adding the default one
1314:debug:main Requested variant +python27 is not provided by port libproj4.
1315:debug:main Running callback portconfigure::add_automatic_compiler_dependencies
1316:debug:main Finished running callback portconfigure::add_automatic_compiler_dependencies
1317:debug:main Running callback portbuild::add_automatic_buildsystem_dependencies
1318:debug:main Finished running callback portbuild::add_automatic_buildsystem_dependencies
1319:debug:main No need to upgrade! libproj4 3_20081120_3 >= libproj4 3_20081120_3
1320:debug:main epoch: in tree: 0 installed: 0
1321:debug:main GraphicsMagick 1.3.18_0 exists in the ports tree
1322:debug:main GraphicsMagick 1.3.18_0 +q8 is the latest installed
1323:debug:main GraphicsMagick 1.3.18_0 +q8 is active
1324:debug:main Merging existing variants '+q8' into variants
1325:debug:main new fully merged portvariants: q8 + python27 +
1326:debug:main Changing to port directory: /opt/local/var/macports/sources/rsync.macports.org/release/tarballs/ports/graphics/GraphicsMagick
1327:debug:main OS darwin/13.0.0 (Mac OS X 10.9) arch i386
1328:debug:main adding the default universal variant
1329:debug:main Reading variant descriptions from /opt/local/var/macports/sources/rsync.macports.org/release/tarballs/ports/_resources/port1.0/variant_descriptions.conf
1330:debug:main Requested variant +python27 is not provided by port GraphicsMagick.
1331:debug:main Executing variant q8 provides q8
1332:debug:main Running callback portconfigure::add_automatic_compiler_dependencies
1333:debug:main Finished running callback portconfigure::add_automatic_compiler_dependencies
1334:debug:main Running callback portbuild::add_automatic_buildsystem_dependencies
1335:debug:main Finished running callback portbuild::add_automatic_buildsystem_dependencies
1336:debug:main No need to upgrade! GraphicsMagick 1.3.18_0 >= GraphicsMagick 1.3.18_0
1337:debug:main epoch: in tree: 0 installed: 0
1338:debug:main udunits2 2.1.24_0 exists in the ports tree
1339:debug:main udunits2 2.1.24_0  is the latest installed
1340:debug:main udunits2 2.1.24_0  is active
1341:debug:main Merging existing variants '' into variants
1342:debug:main new fully merged portvariants: python27 +
1343:debug:main Changing to port directory: /opt/local/var/macports/sources/rsync.macports.org/release/tarballs/ports/science/udunits2
1344:debug:main OS darwin/13.0.0 (Mac OS X 10.9) arch i386
1345:debug:main adding the default universal variant
1346:debug:main Reading variant descriptions from /opt/local/var/macports/sources/rsync.macports.org/release/tarballs/ports/_resources/port1.0/variant_descriptions.conf
1347:debug:main Requested variant +python27 is not provided by port udunits2.
1348:debug:main Running callback portconfigure::add_automatic_compiler_dependencies
1349:debug:main Finished running callback portconfigure::add_automatic_compiler_dependencies
1350:debug:main Running callback portbuild::add_automatic_buildsystem_dependencies
1351:debug:main Finished running callback portbuild::add_automatic_buildsystem_dependencies
1352:debug:main No need to upgrade! udunits2 2.1.24_0 >= udunits2 2.1.24_0
1353:debug:main epoch: in tree: 0 installed: 0
1354:debug:main fftw-3-single 3.3.3_5 exists in the ports tree
1355:debug:main fftw-3-single 3.3.3_5  is the latest installed
1356:debug:main fftw-3-single 3.3.3_5  is active
1357:debug:main Merging existing variants '' into variants
1358:debug:main new fully merged portvariants: python27 +
1359:debug:main Changing to port directory: /opt/local/var/macports/sources/rsync.macports.org/release/tarballs/ports/math/fftw-3
1360:debug:main OS darwin/13.0.0 (Mac OS X 10.9) arch i386
1361:debug:main Reading variant descriptions from /opt/local/var/macports/sources/rsync.macports.org/release/tarballs/ports/_resources/port1.0/variant_descriptions.conf
1362:debug:main compiler clang 500.2.79 not blacklisted because it doesn't match {clang <= 211.10.1}
1363:debug:main universal variant already exists, so not adding the default one
1364:debug:main Requested variant +python27 is not provided by port fftw-3-single.
1365:debug:main Running callback portconfigure::add_automatic_compiler_dependencies
1366:debug:main Finished running callback portconfigure::add_automatic_compiler_dependencies
1367:debug:main Running callback portbuild::add_automatic_buildsystem_dependencies
1368:debug:main Finished running callback portbuild::add_automatic_buildsystem_dependencies
1369:debug:main No need to upgrade! fftw-3-single 3.3.3_5 >= fftw-3-single 3.3.3_5
1370:debug:main epoch: in tree: 1 installed: 1
1371:debug:main cmsvlib 2012-10-02_0 exists in the ports tree
1372:debug:main cmsvlib 2012-10-02_0  is the latest installed
1373:debug:main cmsvlib 2012-10-02_0  is active
1374:debug:main Merging existing variants '' into variants
1375:debug:main new fully merged portvariants: python27 +
1376:debug:main Changing to port directory: /opt/local/var/macports/sources/rsync.macports.org/release/tarballs/ports/math/cmsvlib
1377:debug:main OS darwin/13.0.0 (Mac OS X 10.9) arch i386
1378:debug:main universal_variant is false, so not adding the default universal variant
1379:debug:main Requested variant +python27 is not provided by port cmsvlib.
1380:debug:main Running callback portconfigure::add_automatic_compiler_dependencies
1381:debug:main Finished running callback portconfigure::add_automatic_compiler_dependencies
1382:debug:main Running callback portbuild::add_automatic_buildsystem_dependencies
1383:debug:main Finished running callback portbuild::add_automatic_buildsystem_dependencies
1384:debug:main No need to upgrade! cmsvlib 2012-10-02_0 >= cmsvlib 2012-10-02_0
1385:debug:main epoch: in tree: 0 installed: 0
1386:debug:main pslib 0.4.5_4 exists in the ports tree
1387:debug:main pslib 0.4.5_4  is the latest installed
1388:debug:main pslib 0.4.5_4  is active
1389:debug:main Merging existing variants '' into variants
1390:debug:main new fully merged portvariants: python27 +
1391:debug:main Changing to port directory: /opt/local/var/macports/sources/rsync.macports.org/release/tarballs/ports/print/pslib
1392:debug:main OS darwin/13.0.0 (Mac OS X 10.9) arch i386
1393:debug:main adding the default universal variant
1394:debug:main Reading variant descriptions from /opt/local/var/macports/sources/rsync.macports.org/release/tarballs/ports/_resources/port1.0/variant_descriptions.conf
1395:debug:main Requested variant +python27 is not provided by port pslib.
1396:debug:main Running callback portconfigure::add_automatic_compiler_dependencies
1397:debug:main Finished running callback portconfigure::add_automatic_compiler_dependencies
1398:debug:main Running callback portbuild::add_automatic_buildsystem_dependencies
1399:debug:main Finished running callback portbuild::add_automatic_buildsystem_dependencies
1400:debug:main No need to upgrade! pslib 0.4.5_4 >= pslib 0.4.5_4
1401:debug:main epoch: in tree: 0 installed: 0
1402:debug:main giflib 4.2.3_0 exists in the ports tree
1403:debug:main giflib 4.2.3_0 +x11 is the latest installed
1404:debug:main giflib 4.2.3_0 +x11 is active
1405:debug:main Merging existing variants '+x11' into variants
1406:debug:main new fully merged portvariants: x11 + python27 +
1407:debug:main Changing to port directory: /opt/local/var/macports/sources/rsync.macports.org/release/tarballs/ports/graphics/giflib
1408:debug:main OS darwin/13.0.0 (Mac OS X 10.9) arch i386
1409:debug:main Reading variant descriptions from /opt/local/var/macports/sources/rsync.macports.org/release/tarballs/ports/_resources/port1.0/variant_descriptions.conf
1410:debug:main adding the default universal variant
1411:debug:main Requested variant +python27 is not provided by port giflib.
1412:debug:main Executing variant x11 provides x11
1413:debug:main Running callback portconfigure::add_automatic_compiler_dependencies
1414:debug:main Finished running callback portconfigure::add_automatic_compiler_dependencies
1415:debug:main Running callback portbuild::add_automatic_buildsystem_dependencies
1416:debug:main Finished running callback portbuild::add_automatic_buildsystem_dependencies
1417:debug:main No need to upgrade! giflib 4.2.3_0 >= giflib 4.2.3_0
1418:debug:main epoch: in tree: 0 installed: 0
1419:debug:main xorg-libsm 1.2.1_0 exists in the ports tree
1420:debug:main xorg-libsm 1.2.1_0 +docs is the latest installed
1421:debug:main xorg-libsm 1.2.1_0 +docs is active
1422:debug:main Merging existing variants '+docs' into variants
1423:debug:main new fully merged portvariants: docs + python27 +
1424:debug:main Changing to port directory: /opt/local/var/macports/sources/rsync.macports.org/release/tarballs/ports/x11/xorg-libsm
1425:debug:main OS darwin/13.0.0 (Mac OS X 10.9) arch i386
1426:debug:main adding the default universal variant
1427:debug:main Reading variant descriptions from /opt/local/var/macports/sources/rsync.macports.org/release/tarballs/ports/_resources/port1.0/variant_descriptions.conf
1428:debug:main Requested variant +python27 is not provided by port xorg-libsm.
1429:debug:main Executing variant docs provides docs
1430:debug:main Running callback portconfigure::add_automatic_compiler_dependencies
1431:debug:main Finished running callback portconfigure::add_automatic_compiler_dependencies
1432:debug:main Running callback portbuild::add_automatic_buildsystem_dependencies
1433:debug:main Finished running callback portbuild::add_automatic_buildsystem_dependencies
1434:debug:main No need to upgrade! xorg-libsm 1.2.1_0 >= xorg-libsm 1.2.1_0
1435:debug:main epoch: in tree: 0 installed: 0
1436:debug:main xorg-libice 1.0.8_0 exists in the ports tree
1437:debug:main xorg-libice 1.0.8_0 +docs is the latest installed
1438:debug:main xorg-libice 1.0.8_0 +docs is active
1439:debug:main Merging existing variants '+docs' into variants
1440:debug:main new fully merged portvariants: docs + python27 +
1441:debug:main Changing to port directory: /opt/local/var/macports/sources/rsync.macports.org/release/tarballs/ports/x11/xorg-libice
1442:debug:main OS darwin/13.0.0 (Mac OS X 10.9) arch i386
1443:debug:main adding the default universal variant
1444:debug:main Reading variant descriptions from /opt/local/var/macports/sources/rsync.macports.org/release/tarballs/ports/_resources/port1.0/variant_descriptions.conf
1445:debug:main Requested variant +python27 is not provided by port xorg-libice.
1446:debug:main Executing variant docs provides docs
1447:debug:main Running callback portconfigure::add_automatic_compiler_dependencies
1448:debug:main Finished running callback portconfigure::add_automatic_compiler_dependencies
1449:debug:main Running callback portbuild::add_automatic_buildsystem_dependencies
1450:debug:main Finished running callback portbuild::add_automatic_buildsystem_dependencies
1451:debug:main No need to upgrade! xorg-libice 1.0.8_0 >= xorg-libice 1.0.8_0
1452:debug:main epoch: in tree: 0 installed: 0
1453:debug:main eigen3 3.2.0_0 exists in the ports tree
1454:debug:main eigen3 3.2.0_0 +cmake is the latest installed
1455:debug:main eigen3 3.2.0_0 +cmake is active
1456:debug:main Merging existing variants '+cmake' into variants
1457:debug:main new fully merged portvariants: cmake + python27 +
1458:debug:main Changing to port directory: /opt/local/var/macports/sources/rsync.macports.org/release/tarballs/ports/math/eigen3
1459:debug:main OS darwin/13.0.0 (Mac OS X 10.9) arch i386
1460:debug:main only one arch supported, so not adding the default universal variant
1461:debug:main Requested variant +python27 is not provided by port eigen3.
1462:debug:main Executing variant cmake provides cmake
1463:debug:main Running callback portconfigure::add_automatic_compiler_dependencies
1464:debug:main Finished running callback portconfigure::add_automatic_compiler_dependencies
1465:debug:main Running callback portbuild::add_automatic_buildsystem_dependencies
1466:debug:main Finished running callback portbuild::add_automatic_buildsystem_dependencies
1467:debug:main No need to upgrade! eigen3 3.2.0_0 >= eigen3 3.2.0_0
1468:msg:main --->  Computing dependencies for gnudatalanguage:info:main .:debug:main gnudatalanguage has no conflicts
1469:debug:main Searching for dependency: cmake
1470:debug:main Found Dependency: receipt exists for cmake
1471:debug:main Searching for dependency: pkgconfig
1472:debug:main Found Dependency: receipt exists for pkgconfig
1473:debug:main Searching for dependency: zlib
1474:debug:main Found Dependency: receipt exists for zlib
1475:debug:main Searching for dependency: gsl
1476:debug:main Found Dependency: receipt exists for gsl
1477:debug:main Searching for dependency: ncurses
1478:debug:main Found Dependency: receipt exists for ncurses
1479:debug:main Searching for dependency: readline
1480:debug:main Found Dependency: receipt exists for readline
1481:debug:main Searching for dependency: plplot
1482:debug:main Found Dependency: receipt exists for plplot
1483:debug:main Searching for dependency: netcdf-cxx
1484:debug:main Found Dependency: receipt exists for netcdf-cxx
1485:debug:main Searching for dependency: hdf4
1486:debug:main Found Dependency: receipt exists for hdf4
1487:debug:main Searching for dependency: hdf5-18
1488:debug:main Found Dependency: receipt exists for hdf5-18
1489:debug:main Searching for dependency: grib_api
1490:debug:main Found Dependency: receipt exists for grib_api
1491:debug:main Searching for dependency: libproj4
1492:debug:main Found Dependency: receipt exists for libproj4
1493:debug:main Searching for dependency: GraphicsMagick
1494:debug:main Found Dependency: receipt exists for GraphicsMagick
1495:debug:main Searching for dependency: xorg-libX11
1496:debug:main Found Dependency: receipt exists for xorg-libX11
1497:debug:main Searching for dependency: udunits2
1498:debug:main Found Dependency: receipt exists for udunits2
1499:debug:main Searching for dependency: fftw-3
1500:debug:main Found Dependency: receipt exists for fftw-3
1501:debug:main Searching for dependency: fftw-3-single
1502:debug:main Found Dependency: receipt exists for fftw-3-single
1503:debug:main Searching for dependency: cmsvlib
1504:debug:main Found Dependency: receipt exists for cmsvlib
1505:debug:main Searching for dependency: pslib
1506:debug:main Found Dependency: receipt exists for pslib
1507:debug:main Searching for dependency: eigen3
1508:debug:main Found Dependency: receipt exists for eigen3
1509:debug:main Searching for dependency: py27-numpy
1510:debug:main Found Dependency: receipt exists for py27-numpy
1511:msg:main
1512:debug:main Executing org.macports.main (gnudatalanguage)
1513:debug:main changing euid/egid - current euid: 0 - current egid: 0
1514:debug:main egid changed to: 504
1515:debug:main euid changed to: 20000
1516:debug:main Skipping completed org.macports.archivefetch (gnudatalanguage)
1517:debug:main Privilege de-escalation not attempted as not running as root.
1518:debug:main Skipping completed org.macports.fetch (gnudatalanguage)
1519:debug:main Privilege de-escalation not attempted as not running as root.
1520:debug:main Skipping completed org.macports.checksum (gnudatalanguage)
1521:debug:main Privilege de-escalation not attempted as not running as root.
1522:debug:main Skipping completed org.macports.extract (gnudatalanguage)
1523:debug:main Privilege de-escalation not attempted as not running as root.
1524:debug:main Skipping completed org.macports.patch (gnudatalanguage)
1525:debug:main Privilege de-escalation not attempted as not running as root.
1526:debug:main Skipping completed org.macports.configure (gnudatalanguage)
1527:debug:main Privilege de-escalation not attempted as not running as root.
1528:debug:build build phase started at Fri Dec  6 18:29:42 CST 2013
1529:notice:build --->  Building gnudatalanguage
1530:debug:build Executing proc-pre-org.macports.build-build-0
1531:debug:build Executing org.macports.build (gnudatalanguage)
1532:debug:build Environment: CPATH='/opt/local/include' CC_PRINT_OPTIONS_FILE='/opt/local/var/macports/build/_opt_local_var_macports_sources_rsync.macports.org_release_tarballs_ports_math_gnudatalanguage/gnudatalanguage/work/.CC_PRINT_OPTIONS' LIBRARY_PATH='/opt/local/lib' CC_PRINT_OPTIONS='YES' MACOSX_DEPLOYMENT_TARGET='10.9'
1533:debug:build Assembled command: 'cd "/opt/local/var/macports/build/_opt_local_var_macports_sources_rsync.macports.org_release_tarballs_ports_math_gnudatalanguage/gnudatalanguage/work/gdl-0.9.4" && /usr/bin/make -j4 -w all'
1534:debug:build Executing command line:  cd "/opt/local/var/macports/build/_opt_local_var_macports_sources_rsync.macports.org_release_tarballs_ports_math_gnudatalanguage/gnudatalanguage/work/gdl-0.9.4" && /usr/bin/make -j4 -w all
1535:info:build make: Entering directory `/opt/local/var/macports/build/_opt_local_var_macports_sources_rsync.macports.org_release_tarballs_ports_math_gnudatalanguage/gnudatalanguage/work/gdl-0.9.4'
1536:info:build /opt/local/bin/cmake -H/opt/local/var/macports/build/_opt_local_var_macports_sources_rsync.macports.org_release_tarballs_ports_math_gnudatalanguage/gnudatalanguage/work/gdl-0.9.4 -B/opt/local/var/macports/build/_opt_local_var_macports_sources_rsync.macports.org_release_tarballs_ports_math_gnudatalanguage/gnudatalanguage/work/gdl-0.9.4 --check-build-system CMakeFiles/Makefile.cmake 0
1537:info:build /opt/local/bin/cmake -E cmake_progress_start /opt/local/var/macports/build/_opt_local_var_macports_sources_rsync.macports.org_release_tarballs_ports_math_gnudatalanguage/gnudatalanguage/work/gdl-0.9.4/CMakeFiles /opt/local/var/macports/build/_opt_local_var_macports_sources_rsync.macports.org_release_tarballs_ports_math_gnudatalanguage/gnudatalanguage/work/gdl-0.9.4/CMakeFiles/progress.marks
1538:info:build /Applications/Xcode.app/Contents/Developer/usr/bin/make -f CMakeFiles/Makefile2 all
1539:info:build make[1]: Entering directory `/opt/local/var/macports/build/_opt_local_var_macports_sources_rsync.macports.org_release_tarballs_ports_math_gnudatalanguage/gnudatalanguage/work/gdl-0.9.4'
1540:info:build /Applications/Xcode.app/Contents/Developer/usr/bin/make -f src/antlr/CMakeFiles/antlr.dir/build.make src/antlr/CMakeFiles/antlr.dir/depend
1541:info:build make[2]: Entering directory `/opt/local/var/macports/build/_opt_local_var_macports_sources_rsync.macports.org_release_tarballs_ports_math_gnudatalanguage/gnudatalanguage/work/gdl-0.9.4'
1542:info:build cd /opt/local/var/macports/build/_opt_local_var_macports_sources_rsync.macports.org_release_tarballs_ports_math_gnudatalanguage/gnudatalanguage/work/gdl-0.9.4 && /opt/local/bin/cmake -E cmake_depends "Unix Makefiles" /opt/local/var/macports/build/_opt_local_var_macports_sources_rsync.macports.org_release_tarballs_ports_math_gnudatalanguage/gnudatalanguage/work/gdl-0.9.4 /opt/local/var/macports/build/_opt_local_var_macports_sources_rsync.macports.org_release_tarballs_ports_math_gnudatalanguage/gnudatalanguage/work/gdl-0.9.4/src/antlr /opt/local/var/macports/build/_opt_local_var_macports_sources_rsync.macports.org_release_tarballs_ports_math_gnudatalanguage/gnudatalanguage/work/gdl-0.9.4 /opt/local/var/macports/build/_opt_local_var_macports_sources_rsync.macports.org_release_tarballs_ports_math_gnudatalanguage/gnudatalanguage/work/gdl-0.9.4/src/antlr /opt/local/var/macports/build/_opt_local_var_macports_sources_rsync.macports.org_release_tarballs_ports_math_gnudatalanguage/gnudatalanguage/work/gdl-0.9.4/src/antlr/CMakeFiles/antlr.dir/DependInfo.cmake --color=
1543:info:build make[2]: Leaving directory `/opt/local/var/macports/build/_opt_local_var_macports_sources_rsync.macports.org_release_tarballs_ports_math_gnudatalanguage/gnudatalanguage/work/gdl-0.9.4'
1544:info:build /Applications/Xcode.app/Contents/Developer/usr/bin/make -f src/antlr/CMakeFiles/antlr.dir/build.make src/antlr/CMakeFiles/antlr.dir/build
1545:info:build make[2]: Entering directory `/opt/local/var/macports/build/_opt_local_var_macports_sources_rsync.macports.org_release_tarballs_ports_math_gnudatalanguage/gnudatalanguage/work/gdl-0.9.4'
1546:info:build make[2]: Nothing to be done for `src/antlr/CMakeFiles/antlr.dir/build'.
1547:info:build make[2]: Leaving directory `/opt/local/var/macports/build/_opt_local_var_macports_sources_rsync.macports.org_release_tarballs_ports_math_gnudatalanguage/gnudatalanguage/work/gdl-0.9.4'
1548:info:build /opt/local/bin/cmake -E cmake_progress_report /opt/local/var/macports/build/_opt_local_var_macports_sources_rsync.macports.org_release_tarballs_ports_math_gnudatalanguage/gnudatalanguage/work/gdl-0.9.4/CMakeFiles  1 2 3 4 5 6 7 8 9 10 11 12 13 14 15 16 17
1549:info:build [ 17%] Built target antlr
1550:info:build /Applications/Xcode.app/Contents/Developer/usr/bin/make -f src/CMakeFiles/gdl.dir/build.make src/CMakeFiles/gdl.dir/depend
1551:info:build make[2]: Entering directory `/opt/local/var/macports/build/_opt_local_var_macports_sources_rsync.macports.org_release_tarballs_ports_math_gnudatalanguage/gnudatalanguage/work/gdl-0.9.4'
1552:info:build cd /opt/local/var/macports/build/_opt_local_var_macports_sources_rsync.macports.org_release_tarballs_ports_math_gnudatalanguage/gnudatalanguage/work/gdl-0.9.4 && /opt/local/bin/cmake -E cmake_depends "Unix Makefiles" /opt/local/var/macports/build/_opt_local_var_macports_sources_rsync.macports.org_release_tarballs_ports_math_gnudatalanguage/gnudatalanguage/work/gdl-0.9.4 /opt/local/var/macports/build/_opt_local_var_macports_sources_rsync.macports.org_release_tarballs_ports_math_gnudatalanguage/gnudatalanguage/work/gdl-0.9.4/src /opt/local/var/macports/build/_opt_local_var_macports_sources_rsync.macports.org_release_tarballs_ports_math_gnudatalanguage/gnudatalanguage/work/gdl-0.9.4 /opt/local/var/macports/build/_opt_local_var_macports_sources_rsync.macports.org_release_tarballs_ports_math_gnudatalanguage/gnudatalanguage/work/gdl-0.9.4/src /opt/local/var/macports/build/_opt_local_var_macports_sources_rsync.macports.org_release_tarballs_ports_math_gnudatalanguage/gnudatalanguage/work/gdl-0.9.4/src/CMakeFiles/gdl.dir/DependInfo.cmake --color=
1553:info:build make[2]: Leaving directory `/opt/local/var/macports/build/_opt_local_var_macports_sources_rsync.macports.org_release_tarballs_ports_math_gnudatalanguage/gnudatalanguage/work/gdl-0.9.4'
1554:info:build /Applications/Xcode.app/Contents/Developer/usr/bin/make -f src/CMakeFiles/gdl.dir/build.make src/CMakeFiles/gdl.dir/build
1555:info:build make[2]: Entering directory `/opt/local/var/macports/build/_opt_local_var_macports_sources_rsync.macports.org_release_tarballs_ports_math_gnudatalanguage/gnudatalanguage/work/gdl-0.9.4'
1556:info:build /opt/local/bin/cmake -E cmake_progress_report /opt/local/var/macports/build/_opt_local_var_macports_sources_rsync.macports.org_release_tarballs_ports_math_gnudatalanguage/gnudatalanguage/work/gdl-0.9.4/CMakeFiles 26
1557:info:build /opt/local/bin/cmake -E cmake_progress_report /opt/local/var/macports/build/_opt_local_var_macports_sources_rsync.macports.org_release_tarballs_ports_math_gnudatalanguage/gnudatalanguage/work/gdl-0.9.4/CMakeFiles
1558:info:build [ 18%] /opt/local/bin/cmake -E cmake_progress_report /opt/local/var/macports/build/_opt_local_var_macports_sources_rsync.macports.org_release_tarballs_ports_math_gnudatalanguage/gnudatalanguage/work/gdl-0.9.4/CMakeFiles 39
1559:info:build [ 18%] /opt/local/bin/cmake -E cmake_progress_report /opt/local/var/macports/build/_opt_local_var_macports_sources_rsync.macports.org_release_tarballs_ports_math_gnudatalanguage/gnudatalanguage/work/gdl-0.9.4/CMakeFiles 40
1560:info:build [ 19%] Building CXX object src/CMakeFiles/gdl.dir/basic_fun.cpp.o
1561:info:build cd /opt/local/var/macports/build/_opt_local_var_macports_sources_rsync.macports.org_release_tarballs_ports_math_gnudatalanguage/gnudatalanguage/work/gdl-0.9.4/src && /usr/bin/clang++   -DHAVE_CONFIG_H -pipe -Os -I/opt/local/include -arch x86_64  -DNDEBUG -arch x86_64 -I/opt/local/var/macports/build/_opt_local_var_macports_sources_rsync.macports.org_release_tarballs_ports_math_gnudatalanguage/gnudatalanguage/work/gdl-0.9.4/src -I/opt/local/include -I/opt/local/include/GraphicsMagick -I/opt/local/Library/Frameworks/Python.framework/Versions/2.7/include/python2.7 -I/opt/local/Library/Frameworks/Python.framework/Versions/2.7/lib/python2.7/site-packages/numpy/core/include -I/opt/local/include/udunits2 -I/opt/local/include/eigen3 -I/usr/X11R6/include -I/opt/local/var/macports/build/_opt_local_var_macports_sources_rsync.macports.org_release_tarballs_ports_math_gnudatalanguage/gnudatalanguage/work/gdl-0.9.4 -I/opt/local/var/macports/build/_opt_local_var_macports_sources_rsync.macports.org_release_tarballs_ports_math_gnudatalanguage/gnudatalanguage/work/gdl-0.9.4/src/antlr    -o CMakeFiles/gdl.dir/basic_fun.cpp.o -c /opt/local/var/macports/build/_opt_local_var_macports_sources_rsync.macports.org_release_tarballs_ports_math_gnudatalanguage/gnudatalanguage/work/gdl-0.9.4/src/basic_fun.cpp
1562:info:build Building CXX object src/CMakeFiles/gdl.dir/dpro.cpp.o
1563:info:build cd /opt/local/var/macports/build/_opt_local_var_macports_sources_rsync.macports.org_release_tarballs_ports_math_gnudatalanguage/gnudatalanguage/work/gdl-0.9.4/src && /usr/bin/clang++   -DHAVE_CONFIG_H -pipe -Os -I/opt/local/include -arch x86_64  -DNDEBUG -arch x86_64 -I/opt/local/var/macports/build/_opt_local_var_macports_sources_rsync.macports.org_release_tarballs_ports_math_gnudatalanguage/gnudatalanguage/work/gdl-0.9.4/src -I/opt/local/include -I/opt/local/include/GraphicsMagick -I/opt/local/Library/Frameworks/Python.framework/Versions/2.7/include/python2.7 -I/opt/local/Library/Frameworks/Python.framework/Versions/2.7/lib/python2.7/site-packages/numpy/core/include -I/opt/local/include/udunits2 -I/opt/local/include/eigen3 -I/usr/X11R6/include -I/opt/local/var/macports/build/_opt_local_var_macports_sources_rsync.macports.org_release_tarballs_ports_math_gnudatalanguage/gnudatalanguage/work/gdl-0.9.4 -I/opt/local/var/macports/build/_opt_local_var_macports_sources_rsync.macports.org_release_tarballs_ports_math_gnudatalanguage/gnudatalanguage/work/gdl-0.9.4/src/antlr    -o CMakeFiles/gdl.dir/dpro.cpp.o -c /opt/local/var/macports/build/_opt_local_var_macports_sources_rsync.macports.org_release_tarballs_ports_math_gnudatalanguage/gnudatalanguage/work/gdl-0.9.4/src/dpro.cpp
1564:info:build [ 20%] Building CXX object src/CMakeFiles/gdl.dir/dstructdesc.cpp.o
1565:info:build cd /opt/local/var/macports/build/_opt_local_var_macports_sources_rsync.macports.org_release_tarballs_ports_math_gnudatalanguage/gnudatalanguage/work/gdl-0.9.4/src && /usr/bin/clang++   -DHAVE_CONFIG_H -pipe -Os -I/opt/local/include -arch x86_64  -DNDEBUG -arch x86_64 -I/opt/local/var/macports/build/_opt_local_var_macports_sources_rsync.macports.org_release_tarballs_ports_math_gnudatalanguage/gnudatalanguage/work/gdl-0.9.4/src -I/opt/local/include -I/opt/local/include/GraphicsMagick -I/opt/local/Library/Frameworks/Python.framework/Versions/2.7/include/python2.7 -I/opt/local/Library/Frameworks/Python.framework/Versions/2.7/lib/python2.7/site-packages/numpy/core/include -I/opt/local/include/udunits2 -I/opt/local/include/eigen3 -I/usr/X11R6/include -I/opt/local/var/macports/build/_opt_local_var_macports_sources_rsync.macports.org_release_tarballs_ports_math_gnudatalanguage/gnudatalanguage/work/gdl-0.9.4 -I/opt/local/var/macports/build/_opt_local_var_macports_sources_rsync.macports.org_release_tarballs_ports_math_gnudatalanguage/gnudatalanguage/work/gdl-0.9.4/src/antlr    -o CMakeFiles/gdl.dir/dstructdesc.cpp.o -c /opt/local/var/macports/build/_opt_local_var_macports_sources_rsync.macports.org_release_tarballs_ports_math_gnudatalanguage/gnudatalanguage/work/gdl-0.9.4/src/dstructdesc.cpp
1566:info:build Building CXX object src/CMakeFiles/gdl.dir/dstructgdl.cpp.o
1567:info:build cd /opt/local/var/macports/build/_opt_local_var_macports_sources_rsync.macports.org_release_tarballs_ports_math_gnudatalanguage/gnudatalanguage/work/gdl-0.9.4/src && /usr/bin/clang++   -DHAVE_CONFIG_H -pipe -Os -I/opt/local/include -arch x86_64  -DNDEBUG -arch x86_64 -I/opt/local/var/macports/build/_opt_local_var_macports_sources_rsync.macports.org_release_tarballs_ports_math_gnudatalanguage/gnudatalanguage/work/gdl-0.9.4/src -I/opt/local/include -I/opt/local/include/GraphicsMagick -I/opt/local/Library/Frameworks/Python.framework/Versions/2.7/include/python2.7 -I/opt/local/Library/Frameworks/Python.framework/Versions/2.7/lib/python2.7/site-packages/numpy/core/include -I/opt/local/include/udunits2 -I/opt/local/include/eigen3 -I/usr/X11R6/include -I/opt/local/var/macports/build/_opt_local_var_macports_sources_rsync.macports.org_release_tarballs_ports_math_gnudatalanguage/gnudatalanguage/work/gdl-0.9.4 -I/opt/local/var/macports/build/_opt_local_var_macports_sources_rsync.macports.org_release_tarballs_ports_math_gnudatalanguage/gnudatalanguage/work/gdl-0.9.4/src/antlr    -o CMakeFiles/gdl.dir/dstructgdl.cpp.o -c /opt/local/var/macports/build/_opt_local_var_macports_sources_rsync.macports.org_release_tarballs_ports_math_gnudatalanguage/gnudatalanguage/work/gdl-0.9.4/src/dstructgdl.cpp
1568:info:build In file included from /opt/local/var/macports/build/_opt_local_var_macports_sources_rsync.macports.org_release_tarballs_ports_math_gnudatalanguage/gnudatalanguage/work/gdl-0.9.4/src/basic_fun.cpp:49:
1569:info:build In file included from /opt/local/var/macports/build/_opt_local_var_macports_sources_rsync.macports.org_release_tarballs_ports_math_gnudatalanguage/gnudatalanguage/work/gdl-0.9.4/src/dinterpreter.hpp:57:
1570:info:build /opt/local/var/macports/build/_opt_local_var_macports_sources_rsync.macports.org_release_tarballs_ports_math_gnudatalanguage/gnudatalanguage/work/gdl-0.9.4/src/GDLInterpreter.hpp:651:9: warning: add explicit braces to avoid dangling else [-Wdangling-else]
1571:info:build         else
1572:info:build         ^
1573:info:build In file included from /opt/local/var/macports/build/_opt_local_var_macports_sources_rsync.macports.org_release_tarballs_ports_math_gnudatalanguage/gnudatalanguage/work/gdl-0.9.4/src/dstructdesc.cpp:24:
1574:info:build /opt/local/var/macports/build/_opt_local_var_macports_sources_rsync.macports.org_release_tarballs_ports_math_gnudatalanguage/gnudatalanguage/work/gdl-0.9.4/src/GDLInterpreter.hpp:651:9: warning: add explicit braces to avoid dangling else [-Wdangling-else]
1575:info:build         else
1576:info:build         ^
1577:info:build In file included from /opt/local/var/macports/build/_opt_local_var_macports_sources_rsync.macports.org_release_tarballs_ports_math_gnudatalanguage/gnudatalanguage/work/gdl-0.9.4/src/basic_fun.cpp:53:
1578:info:build /opt/local/var/macports/build/_opt_local_var_macports_sources_rsync.macports.org_release_tarballs_ports_math_gnudatalanguage/gnudatalanguage/work/gdl-0.9.4/src/base64.hpp:150:10: error: call to 'isspace' is ambiguous
1579:info:build                                         if(!isspace(data[i-1])) {
1580:info:build                                             ^~~~~~~
1581:info:build /usr/include/ctype.h:267:1: note: candidate function
1582:info:build isspace(int _c)
1583:info:build ^
1584:info:build /Applications/Xcode.app/Contents/Developer/Toolchains/XcodeDefault.xctoolchain/usr/bin/../lib/c++/v1/cctype:124:38: note: candidate function
1585:info:build inline _LIBCPP_INLINE_VISIBILITY int isspace(int __c) {return __libcpp_isspace(__c);}
1586:info:build                                      ^
1587:info:build In file included from /opt/local/var/macports/build/_opt_local_var_macports_sources_rsync.macports.org_release_tarballs_ports_math_gnudatalanguage/gnudatalanguage/work/gdl-0.9.4/src/basic_fun.cpp:53:
1588:info:build /opt/local/var/macports/build/_opt_local_var_macports_sources_rsync.macports.org_release_tarballs_ports_math_gnudatalanguage/gnudatalanguage/work/gdl-0.9.4/src/base64.hpp:168:10: error: call to 'isspace' is ambiguous
1589:info:build                                         if(!isspace(data[i-1])) {
1590:info:build                                             ^~~~~~~
1591:info:build /usr/include/ctype.h:267:1: note: candidate function
1592:info:build isspace(int _c)
1593:info:build ^
1594:info:build /Applications/Xcode.app/Contents/Developer/Toolchains/XcodeDefault.xctoolchain/usr/bin/../lib/c++/v1/cctype:124:38: note: candidate function
1595:info:build inline _LIBCPP_INLINE_VISIBILITY int isspace(int __c) {return __libcpp_isspace(__c);}
1596:info:build                                      ^
1597:info:build In file included from /opt/local/var/macports/build/_opt_local_var_macports_sources_rsync.macports.org_release_tarballs_ports_math_gnudatalanguage/gnudatalanguage/work/gdl-0.9.4/src/basic_fun.cpp:53:
1598:info:build /opt/local/var/macports/build/_opt_local_var_macports_sources_rsync.macports.org_release_tarballs_ports_math_gnudatalanguage/gnudatalanguage/work/gdl-0.9.4/src/base64.hpp:193:10: error: call to 'isspace' is ambiguous
1599:info:build                                         if(!isspace(data[i-1])) {
1600:info:build                                             ^~~~~~~
1601:info:build /usr/include/ctype.h:267:1: note: candidate function
1602:info:build isspace(int _c)
1603:info:build ^
1604:info:build /Applications/Xcode.app/Contents/Developer/Toolchains/XcodeDefault.xctoolchain/usr/bin/../lib/c++/v1/cctype:124:38: note: candidate function
1605:info:build inline _LIBCPP_INLINE_VISIBILITY int isspace(int __c) {return __libcpp_isspace(__c);}
1606:info:build                                      ^
1607:info:build In file included from /opt/local/var/macports/build/_opt_local_var_macports_sources_rsync.macports.org_release_tarballs_ports_math_gnudatalanguage/gnudatalanguage/work/gdl-0.9.4/src/basic_fun.cpp:53:
1608:info:build /opt/local/var/macports/build/_opt_local_var_macports_sources_rsync.macports.org_release_tarballs_ports_math_gnudatalanguage/gnudatalanguage/work/gdl-0.9.4/src/base64.hpp:218:10: error: call to 'isspace' is ambiguous
1609:info:build                                         if(!isspace(data[i-1])) {
1610:info:build                                             ^~~~~~~
1611:info:build /usr/include/ctype.h:267:1: note: candidate function
1612:info:build isspace(int _c)
1613:info:build ^
1614:info:build /Applications/Xcode.app/Contents/Developer/Toolchains/XcodeDefault.xctoolchain/usr/bin/../lib/c++/v1/cctype:124:38: note: candidate function
1615:info:build inline _LIBCPP_INLINE_VISIBILITY int isspace(int __c) {return __libcpp_isspace(__c);}
1616:info:build                                      ^
1617:info:build /opt/local/var/macports/build/_opt_local_var_macports_sources_rsync.macports.org_release_tarballs_ports_math_gnudatalanguage/gnudatalanguage/work/gdl-0.9.4/src/basic_fun.cpp:6415:14: error: call to 'isalpha' is ambiguous
1618:info:build         if (!isalpha(*p) && !isdigit(*p) && *p != '+' && *p != '.' && *p != '-')
1619:info:build              ^~~~~~~
1620:info:build /usr/include/ctype.h:218:1: note: candidate function
1621:info:build isalpha(int _c)
1622:info:build ^
1623:info:build /Applications/Xcode.app/Contents/Developer/Toolchains/XcodeDefault.xctoolchain/usr/bin/../lib/c++/v1/cctype:60:38: note: candidate function
1624:info:build inline _LIBCPP_INLINE_VISIBILITY int isalpha(int __c) {return __libcpp_isalpha(__c);}
1625:info:build                                      ^
1626:info:build 1 warning and 5 errors generated.
1627:info:build make[2]: *** [src/CMakeFiles/gdl.dir/basic_fun.cpp.o] Error 1
1628:info:build make[2]: *** Waiting for unfinished jobs....
1629:info:build 1 warning generated.
1630:info:build make[2]: Leaving directory `/opt/local/var/macports/build/_opt_local_var_macports_sources_rsync.macports.org_release_tarballs_ports_math_gnudatalanguage/gnudatalanguage/work/gdl-0.9.4'
1631:info:build make[1]: *** [src/CMakeFiles/gdl.dir/all] Error 2
1632:info:build make[1]: Leaving directory `/opt/local/var/macports/build/_opt_local_var_macports_sources_rsync.macports.org_release_tarballs_ports_math_gnudatalanguage/gnudatalanguage/work/gdl-0.9.4'
1633:info:build make: *** [all] Error 2
1634:info:build make: Leaving directory `/opt/local/var/macports/build/_opt_local_var_macports_sources_rsync.macports.org_release_tarballs_ports_math_gnudatalanguage/gnudatalanguage/work/gdl-0.9.4'
1635:info:build Command failed:  cd "/opt/local/var/macports/build/_opt_local_var_macports_sources_rsync.macports.org_release_tarballs_ports_math_gnudatalanguage/gnudatalanguage/work/gdl-0.9.4" && /usr/bin/make -j4 -w all
1636:info:build Exit code: 2
1637:error:build org.macports.build for port gnudatalanguage returned: command execution failed
1638:debug:build Error code: CHILDSTATUS 25619 2
1639:debug:build Backtrace: command execution failed
1640    while executing
1641"system -nice 0 $fullcmdstring"
1642    ("eval" body line 1)
1643    invoked from within
1644"eval system $notty $nice \$fullcmdstring"
1645    invoked from within
1646"command_exec build"
1647    (procedure "portbuild::build_main" line 8)
1648    invoked from within
1649"$procedure $targetname"
1650:info:build Warning: targets not executed for gnudatalanguage: org.macports.activate org.macports.build org.macports.destroot org.macports.install
1651:notice:build Please see the log file for port gnudatalanguage for details:
1652    /opt/local/var/macports/logs/_opt_local_var_macports_sources_rsync.macports.org_release_tarballs_ports_math_gnudatalanguage/gnudatalanguage/main.log