Ticket #41760: main.log

File main.log, 91.8 KB (added by hal.dace@…, 7 years ago)
Line 
1version:1
2:debug:main epoch: in tree: 0 installed: 0
3:debug:main pkgconfig 0.28_0 exists in the ports tree
4:debug:main pkgconfig 0.28_0  is the latest installed
5:debug:main pkgconfig 0.28_0  is active
6:debug:main Merging existing variants '' into variants
7:debug:main new fully merged portvariants:
8:debug:main Changing to port directory: /opt/local/var/macports/sources/rsync.macports.org/release/ports/devel/pkgconfig
9:debug:main OS darwin/13.0.0 (Mac OS X 10.9) arch i386
10:debug:main adding the default universal variant
11:debug:main Reading variant descriptions from /opt/local/var/macports/sources/rsync.macports.org/release/ports/_resources/port1.0/variant_descriptions.conf
12:debug:main Running callback portconfigure::add_automatic_compiler_dependencies
13:debug:main Finished running callback portconfigure::add_automatic_compiler_dependencies
14:debug:main Running callback portbuild::add_automatic_buildsystem_dependencies
15:debug:main Finished running callback portbuild::add_automatic_buildsystem_dependencies
16:debug:main No need to upgrade! pkgconfig 0.28_0 >= pkgconfig 0.28_0
17:debug:main epoch: in tree: 0 installed: 0
18:debug:main libiconv 1.14_0 exists in the ports tree
19:debug:main libiconv 1.14_0  is the latest installed
20:debug:main libiconv 1.14_0  is active
21:debug:main Merging existing variants '' into variants
22:debug:main new fully merged portvariants:
23:debug:main Changing to port directory: /opt/local/var/macports/sources/rsync.macports.org/release/ports/textproc/libiconv
24:debug:main OS darwin/13.0.0 (Mac OS X 10.9) arch i386
25:debug:main Reading variant descriptions from /opt/local/var/macports/sources/rsync.macports.org/release/ports/_resources/port1.0/variant_descriptions.conf
26:debug:main universal variant already exists, so not adding the default one
27:debug:main Running callback portconfigure::add_automatic_compiler_dependencies
28:debug:main Finished running callback portconfigure::add_automatic_compiler_dependencies
29:debug:main Running callback portbuild::add_automatic_buildsystem_dependencies
30:debug:main Finished running callback portbuild::add_automatic_buildsystem_dependencies
31:debug:main No need to upgrade! libiconv 1.14_0 >= libiconv 1.14_0
32:debug:main epoch: in tree: 0 installed: 0
33:debug:main cairo 1.12.16_1 exists in the ports tree
34:debug:main cairo 1.12.16_1 +x11 is the latest installed
35:debug:main cairo 1.12.16_1 +x11 is active
36:debug:main Merging existing variants '+x11' into variants
37:debug:main new fully merged portvariants: x11 +
38:debug:main Changing to port directory: /opt/local/var/macports/sources/rsync.macports.org/release/ports/graphics/cairo
39:debug:main OS darwin/13.0.0 (Mac OS X 10.9) arch i386
40:debug:main Reading variant descriptions from /opt/local/var/macports/sources/rsync.macports.org/release/ports/_resources/port1.0/variant_descriptions.conf
41:debug:main compiler clang 500.2.79 not blacklisted because it doesn't match {clang < 318.0.61}
42:debug:main universal variant already exists, so not adding the default one
43:debug:main Executing variant x11 provides x11
44:debug:main Running callback portconfigure::add_automatic_compiler_dependencies
45:debug:main Finished running callback portconfigure::add_automatic_compiler_dependencies
46:debug:main Running callback portbuild::add_automatic_buildsystem_dependencies
47:debug:main Finished running callback portbuild::add_automatic_buildsystem_dependencies
48:debug:main No need to upgrade! cairo 1.12.16_1 >= cairo 1.12.16_1
49:debug:main epoch: in tree: 0 installed: 0
50:debug:main libpixman 0.32.4_0 exists in the ports tree
51:debug:main libpixman 0.32.4_0  is the latest installed
52:debug:main libpixman 0.32.4_0  is active
53:debug:main Merging existing variants '' into variants
54:debug:main new fully merged portvariants:
55:debug:main Changing to port directory: /opt/local/var/macports/sources/rsync.macports.org/release/ports/graphics/libpixman
56:debug:main OS darwin/13.0.0 (Mac OS X 10.9) arch i386
57:debug:main Reading variant descriptions from /opt/local/var/macports/sources/rsync.macports.org/release/ports/_resources/port1.0/variant_descriptions.conf
58:debug:main compiler clang 500.2.79 not blacklisted because it doesn't match {clang < 211.10.1}
59:debug:main universal variant already exists, so not adding the default one
60:debug:main Running callback portconfigure::add_automatic_compiler_dependencies
61:debug:main Finished running callback portconfigure::add_automatic_compiler_dependencies
62:debug:main Running callback portbuild::add_automatic_buildsystem_dependencies
63:debug:main Finished running callback portbuild::add_automatic_buildsystem_dependencies
64:debug:main No need to upgrade! libpixman 0.32.4_0 >= libpixman 0.32.4_0
65:debug:main epoch: in tree: 0 installed: 0
66:debug:main glib2 2.38.2_0 exists in the ports tree
67:debug:main glib2 2.38.2_0  is the latest installed
68:debug:main glib2 2.38.2_0  is active
69:debug:main Merging existing variants '' into variants
70:debug:main new fully merged portvariants:
71:debug:main Changing to port directory: /opt/local/var/macports/sources/rsync.macports.org/release/ports/devel/glib2
72:debug:main OS darwin/13.0.0 (Mac OS X 10.9) arch i386
73:debug:main compiler clang 500.2.79 not blacklisted because it doesn't match {clang < 318}
74:debug:main adding the default universal variant
75:debug:main Reading variant descriptions from /opt/local/var/macports/sources/rsync.macports.org/release/ports/_resources/port1.0/variant_descriptions.conf
76:debug:main Running callback portconfigure::add_automatic_compiler_dependencies
77:debug:main Finished running callback portconfigure::add_automatic_compiler_dependencies
78:debug:main Running callback portbuild::add_automatic_buildsystem_dependencies
79:debug:main Finished running callback portbuild::add_automatic_buildsystem_dependencies
80:debug:main No need to upgrade! glib2 2.38.2_0 >= glib2 2.38.2_0
81:debug:main epoch: in tree: 0 installed: 0
82:debug:main gettext 0.18.3.1_1 exists in the ports tree
83:debug:main gettext 0.18.3.1_1  is the latest installed
84:debug:main gettext 0.18.3.1_1  is active
85:debug:main Merging existing variants '' into variants
86:debug:main new fully merged portvariants:
87:debug:main Changing to port directory: /opt/local/var/macports/sources/rsync.macports.org/release/ports/devel/gettext
88:debug:main OS darwin/13.0.0 (Mac OS X 10.9) arch i386
89:debug:main Reading variant descriptions from /opt/local/var/macports/sources/rsync.macports.org/release/ports/_resources/port1.0/variant_descriptions.conf
90:debug:main compiler clang 500.2.79 not blacklisted because it doesn't match {clang < 211.10.1}
91:debug:main universal variant already exists, so not adding the default one
92:debug:main Running callback portconfigure::add_automatic_compiler_dependencies
93:debug:main Finished running callback portconfigure::add_automatic_compiler_dependencies
94:debug:main Running callback portbuild::add_automatic_buildsystem_dependencies
95:debug:main Finished running callback portbuild::add_automatic_buildsystem_dependencies
96:debug:main No need to upgrade! gettext 0.18.3.1_1 >= gettext 0.18.3.1_1
97:debug:main epoch: in tree: 0 installed: 0
98:debug:main expat 2.1.0_0 exists in the ports tree
99:debug:main expat 2.1.0_0  is the latest installed
100:debug:main expat 2.1.0_0  is active
101:debug:main Merging existing variants '' into variants
102:debug:main new fully merged portvariants:
103:debug:main Changing to port directory: /opt/local/var/macports/sources/rsync.macports.org/release/ports/textproc/expat
104:debug:main OS darwin/13.0.0 (Mac OS X 10.9) arch i386
105:debug:main adding the default universal variant
106:debug:main Reading variant descriptions from /opt/local/var/macports/sources/rsync.macports.org/release/ports/_resources/port1.0/variant_descriptions.conf
107:debug:main Running callback portconfigure::add_automatic_compiler_dependencies
108:debug:main Finished running callback portconfigure::add_automatic_compiler_dependencies
109:debug:main Running callback portbuild::add_automatic_buildsystem_dependencies
110:debug:main Finished running callback portbuild::add_automatic_buildsystem_dependencies
111:debug:main No need to upgrade! expat 2.1.0_0 >= expat 2.1.0_0
112:debug:main epoch: in tree: 0 installed: 0
113:debug:main ncurses 5.9_2 exists in the ports tree
114:debug:main ncurses 5.9_2  is the latest installed
115:debug:main ncurses 5.9_2  is active
116:debug:main Merging existing variants '' into variants
117:debug:main new fully merged portvariants:
118:debug:main Changing to port directory: /opt/local/var/macports/sources/rsync.macports.org/release/ports/devel/ncurses
119:debug:main OS darwin/13.0.0 (Mac OS X 10.9) arch i386
120:debug:main adding the default universal variant
121:debug:main Reading variant descriptions from /opt/local/var/macports/sources/rsync.macports.org/release/ports/_resources/port1.0/variant_descriptions.conf
122:debug:main Running callback portconfigure::add_automatic_compiler_dependencies
123:debug:main Finished running callback portconfigure::add_automatic_compiler_dependencies
124:debug:main Running callback portbuild::add_automatic_buildsystem_dependencies
125:debug:main Finished running callback portbuild::add_automatic_buildsystem_dependencies
126:debug:main No need to upgrade! ncurses 5.9_2 >= ncurses 5.9_2
127:debug:main epoch: in tree: 0 installed: 0
128:debug:main zlib 1.2.8_0 exists in the ports tree
129:debug:main zlib 1.2.8_0  is the latest installed
130:debug:main zlib 1.2.8_0  is active
131:debug:main Merging existing variants '' into variants
132:debug:main new fully merged portvariants:
133:debug:main Changing to port directory: /opt/local/var/macports/sources/rsync.macports.org/release/ports/archivers/zlib
134:debug:main OS darwin/13.0.0 (Mac OS X 10.9) arch i386
135:debug:main adding the default universal variant
136:debug:main Reading variant descriptions from /opt/local/var/macports/sources/rsync.macports.org/release/ports/_resources/port1.0/variant_descriptions.conf
137:debug:main Running callback portconfigure::add_automatic_compiler_dependencies
138:debug:main Finished running callback portconfigure::add_automatic_compiler_dependencies
139:debug:main Running callback portbuild::add_automatic_buildsystem_dependencies
140:debug:main Finished running callback portbuild::add_automatic_buildsystem_dependencies
141:debug:main No need to upgrade! zlib 1.2.8_0 >= zlib 1.2.8_0
142:debug:main epoch: in tree: 0 installed: 0
143:debug:main libffi 3.0.13_0 exists in the ports tree
144:debug:main libffi 3.0.13_0  is the latest installed
145:debug:main libffi 3.0.13_0  is active
146:debug:main Merging existing variants '' into variants
147:debug:main new fully merged portvariants:
148:debug:main Changing to port directory: /opt/local/var/macports/sources/rsync.macports.org/release/ports/devel/libffi
149:debug:main OS darwin/13.0.0 (Mac OS X 10.9) arch i386
150:debug:main Reading variant descriptions from /opt/local/var/macports/sources/rsync.macports.org/release/ports/_resources/port1.0/variant_descriptions.conf
151:debug:main universal variant already exists, so not adding the default one
152:debug:main Running callback portconfigure::add_automatic_compiler_dependencies
153:debug:main Finished running callback portconfigure::add_automatic_compiler_dependencies
154:debug:main Running callback portbuild::add_automatic_buildsystem_dependencies
155:debug:main Finished running callback portbuild::add_automatic_buildsystem_dependencies
156:debug:main No need to upgrade! libffi 3.0.13_0 >= libffi 3.0.13_0
157:debug:main epoch: in tree: 0 installed: 0
158:debug:main perl5 5.12.4_0 exists in the ports tree
159:debug:main perl5 5.12.4_0 +perl5_12 is the latest installed
160:debug:main perl5 5.12.4_0 +perl5_12 is active
161:debug:main Merging existing variants '+perl5_12' into variants
162:debug:main new fully merged portvariants: perl5_12 +
163:debug:main Changing to port directory: /opt/local/var/macports/sources/rsync.macports.org/release/ports/lang/perl5
164:debug:main OS darwin/13.0.0 (Mac OS X 10.9) arch i386
165:debug:main universal_variant is false, so not adding the default universal variant
166:debug:main Executing variant perl5_12 provides perl5_12
167:debug:main Running callback portconfigure::add_automatic_compiler_dependencies
168:debug:main Finished running callback portconfigure::add_automatic_compiler_dependencies
169:debug:main Running callback portbuild::add_automatic_buildsystem_dependencies
170:debug:main Finished running callback portbuild::add_automatic_buildsystem_dependencies
171:debug:main No need to upgrade! perl5 5.12.4_0 >= perl5 5.12.4_0
172:debug:main epoch: in tree: 0 installed: 0
173:debug:main perl5.12 5.12.4_3 exists in the ports tree
174:debug:main perl5.12 5.12.4_3  is the latest installed
175:debug:main perl5.12 5.12.4_3  is active
176:debug:main Merging existing variants '' into variants
177:debug:main new fully merged portvariants:
178:debug:main Changing to port directory: /opt/local/var/macports/sources/rsync.macports.org/release/ports/lang/perl5.12
179:debug:main OS darwin/13.0.0 (Mac OS X 10.9) arch i386
180:debug:main adding the default universal variant
181:debug:main Reading variant descriptions from /opt/local/var/macports/sources/rsync.macports.org/release/ports/_resources/port1.0/variant_descriptions.conf
182:debug:main Running callback portconfigure::add_automatic_compiler_dependencies
183:debug:main Finished running callback portconfigure::add_automatic_compiler_dependencies
184:debug:main Running callback portbuild::add_automatic_buildsystem_dependencies
185:debug:main Finished running callback portbuild::add_automatic_buildsystem_dependencies
186:debug:main No need to upgrade! perl5.12 5.12.4_3 >= perl5.12 5.12.4_3
187:debug:main epoch: in tree: 0 installed: 0
188:debug:main gdbm 1.10_2 exists in the ports tree
189:debug:main gdbm 1.10_2  is the latest installed
190:debug:main gdbm 1.10_2  is active
191:debug:main Merging existing variants '' into variants
192:debug:main new fully merged portvariants:
193:debug:main Changing to port directory: /opt/local/var/macports/sources/rsync.macports.org/release/ports/databases/gdbm
194:debug:main OS darwin/13.0.0 (Mac OS X 10.9) arch i386
195:debug:main adding the default universal variant
196:debug:main Reading variant descriptions from /opt/local/var/macports/sources/rsync.macports.org/release/ports/_resources/port1.0/variant_descriptions.conf
197:debug:main Running callback portconfigure::add_automatic_compiler_dependencies
198:debug:main Finished running callback portconfigure::add_automatic_compiler_dependencies
199:debug:main Running callback portbuild::add_automatic_buildsystem_dependencies
200:debug:main Finished running callback portbuild::add_automatic_buildsystem_dependencies
201:debug:main No need to upgrade! gdbm 1.10_2 >= gdbm 1.10_2
202:debug:main epoch: in tree: 0 installed: 0
203:debug:main fontconfig 2.11.0_0 exists in the ports tree
204:debug:main fontconfig 2.11.0_0  is the latest installed
205:debug:main fontconfig 2.11.0_0  is active
206:debug:main Merging existing variants '' into variants
207:debug:main new fully merged portvariants:
208:debug:main Changing to port directory: /opt/local/var/macports/sources/rsync.macports.org/release/ports/graphics/fontconfig
209:debug:main OS darwin/13.0.0 (Mac OS X 10.9) arch i386
210:debug:main Reading variant descriptions from /opt/local/var/macports/sources/rsync.macports.org/release/ports/_resources/port1.0/variant_descriptions.conf
211:debug:main universal variant already exists, so not adding the default one
212:debug:main Running callback portconfigure::add_automatic_compiler_dependencies
213:debug:main Finished running callback portconfigure::add_automatic_compiler_dependencies
214:debug:main Running callback portbuild::add_automatic_buildsystem_dependencies
215:debug:main Finished running callback portbuild::add_automatic_buildsystem_dependencies
216:debug:main No need to upgrade! fontconfig 2.11.0_0 >= fontconfig 2.11.0_0
217:debug:main epoch: in tree: 0 installed: 0
218:debug:main freetype 2.5.2_0 exists in the ports tree
219:debug:main freetype 2.5.2_0  is the latest installed
220:debug:main freetype 2.5.2_0  is active
221:debug:main Merging existing variants '' into variants
222:debug:main new fully merged portvariants:
223:debug:main Changing to port directory: /opt/local/var/macports/sources/rsync.macports.org/release/ports/print/freetype
224:debug:main OS darwin/13.0.0 (Mac OS X 10.9) arch i386
225:debug:main Reading variant descriptions from /opt/local/var/macports/sources/rsync.macports.org/release/ports/_resources/port1.0/variant_descriptions.conf
226:debug:main universal variant already exists, so not adding the default one
227:debug:main Running callback portconfigure::add_automatic_compiler_dependencies
228:debug:main Finished running callback portconfigure::add_automatic_compiler_dependencies
229:debug:main Running callback portbuild::add_automatic_buildsystem_dependencies
230:debug:main Finished running callback portbuild::add_automatic_buildsystem_dependencies
231:debug:main No need to upgrade! freetype 2.5.2_0 >= freetype 2.5.2_0
232:debug:main epoch: in tree: 0 installed: 0
233:debug:main bzip2 1.0.6_0 exists in the ports tree
234:debug:main bzip2 1.0.6_0  is the latest installed
235:debug:main bzip2 1.0.6_0  is active
236:debug:main Merging existing variants '' into variants
237:debug:main new fully merged portvariants:
238:debug:main Changing to port directory: /opt/local/var/macports/sources/rsync.macports.org/release/ports/archivers/bzip2
239:debug:main OS darwin/13.0.0 (Mac OS X 10.9) arch i386
240:debug:main Reading variant descriptions from /opt/local/var/macports/sources/rsync.macports.org/release/ports/_resources/port1.0/variant_descriptions.conf
241:debug:main universal variant already exists, so not adding the default one
242:debug:main Running callback portconfigure::add_automatic_compiler_dependencies
243:debug:main Finished running callback portconfigure::add_automatic_compiler_dependencies
244:debug:main Running callback portbuild::add_automatic_buildsystem_dependencies
245:debug:main Finished running callback portbuild::add_automatic_buildsystem_dependencies
246:debug:main No need to upgrade! bzip2 1.0.6_0 >= bzip2 1.0.6_0
247:debug:main epoch: in tree: 0 installed: 0
248:debug:main libpng 1.5.17_0 exists in the ports tree
249:debug:main libpng 1.5.17_0  is the latest installed
250:debug:main libpng 1.5.17_0  is active
251:debug:main Merging existing variants '' into variants
252:debug:main new fully merged portvariants:
253:debug:main Changing to port directory: /opt/local/var/macports/sources/rsync.macports.org/release/ports/graphics/libpng
254:debug:main OS darwin/13.0.0 (Mac OS X 10.9) arch i386
255:debug:main adding the default universal variant
256:debug:main Reading variant descriptions from /opt/local/var/macports/sources/rsync.macports.org/release/ports/_resources/port1.0/variant_descriptions.conf
257:debug:main Running callback portconfigure::add_automatic_compiler_dependencies
258:debug:main Finished running callback portconfigure::add_automatic_compiler_dependencies
259:debug:main Running callback portbuild::add_automatic_buildsystem_dependencies
260:debug:main Finished running callback portbuild::add_automatic_buildsystem_dependencies
261:debug:main No need to upgrade! libpng 1.5.17_0 >= libpng 1.5.17_0
262:debug:main epoch: in tree: 0 installed: 0
263:debug:main xrender 0.9.8_0 exists in the ports tree
264:debug:main xrender 0.9.8_0  is the latest installed
265:debug:main xrender 0.9.8_0  is active
266:debug:main Merging existing variants '' into variants
267:debug:main new fully merged portvariants:
268:debug:main Changing to port directory: /opt/local/var/macports/sources/rsync.macports.org/release/ports/x11/xrender
269:debug:main OS darwin/13.0.0 (Mac OS X 10.9) arch i386
270:debug:main adding the default universal variant
271:debug:main Reading variant descriptions from /opt/local/var/macports/sources/rsync.macports.org/release/ports/_resources/port1.0/variant_descriptions.conf
272:debug:main Running callback portconfigure::add_automatic_compiler_dependencies
273:debug:main Finished running callback portconfigure::add_automatic_compiler_dependencies
274:debug:main Running callback portbuild::add_automatic_buildsystem_dependencies
275:debug:main Finished running callback portbuild::add_automatic_buildsystem_dependencies
276:debug:main No need to upgrade! xrender 0.9.8_0 >= xrender 0.9.8_0
277:debug:main epoch: in tree: 0 installed: 0
278:debug:main xorg-libX11 1.6.2_0 exists in the ports tree
279:debug:main xorg-libX11 1.6.2_0  is the latest installed
280:debug:main xorg-libX11 1.6.2_0  is active
281:debug:main Merging existing variants '' into variants
282:debug:main new fully merged portvariants:
283:debug:main Changing to port directory: /opt/local/var/macports/sources/rsync.macports.org/release/ports/x11/xorg-libX11
284:debug:main OS darwin/13.0.0 (Mac OS X 10.9) arch i386
285:debug:main adding the default universal variant
286:debug:main Reading variant descriptions from /opt/local/var/macports/sources/rsync.macports.org/release/ports/_resources/port1.0/variant_descriptions.conf
287:debug:main Running callback portconfigure::add_automatic_compiler_dependencies
288:debug:main Finished running callback portconfigure::add_automatic_compiler_dependencies
289:debug:main Running callback portbuild::add_automatic_buildsystem_dependencies
290:debug:main Finished running callback portbuild::add_automatic_buildsystem_dependencies
291:debug:main No need to upgrade! xorg-libX11 1.6.2_0 >= xorg-libX11 1.6.2_0
292:debug:main epoch: in tree: 0 installed: 0
293:debug:main xorg-libXdmcp 1.1.1_0 exists in the ports tree
294:debug:main xorg-libXdmcp 1.1.1_0  is the latest installed
295:debug:main xorg-libXdmcp 1.1.1_0  is active
296:debug:main Merging existing variants '' into variants
297:debug:main new fully merged portvariants:
298:debug:main Changing to port directory: /opt/local/var/macports/sources/rsync.macports.org/release/ports/x11/xorg-libXdmcp
299:debug:main OS darwin/13.0.0 (Mac OS X 10.9) arch i386
300:debug:main adding the default universal variant
301:debug:main Reading variant descriptions from /opt/local/var/macports/sources/rsync.macports.org/release/ports/_resources/port1.0/variant_descriptions.conf
302:debug:main Running callback portconfigure::add_automatic_compiler_dependencies
303:debug:main Finished running callback portconfigure::add_automatic_compiler_dependencies
304:debug:main Running callback portbuild::add_automatic_buildsystem_dependencies
305:debug:main Finished running callback portbuild::add_automatic_buildsystem_dependencies
306:debug:main No need to upgrade! xorg-libXdmcp 1.1.1_0 >= xorg-libXdmcp 1.1.1_0
307:debug:main epoch: in tree: 0 installed: 0
308:debug:main xorg-libXau 1.0.8_0 exists in the ports tree
309:debug:main xorg-libXau 1.0.8_0  is the latest installed
310:debug:main xorg-libXau 1.0.8_0  is active
311:debug:main Merging existing variants '' into variants
312:debug:main new fully merged portvariants:
313:debug:main Changing to port directory: /opt/local/var/macports/sources/rsync.macports.org/release/ports/x11/xorg-libXau
314:debug:main OS darwin/13.0.0 (Mac OS X 10.9) arch i386
315:debug:main adding the default universal variant
316:debug:main Reading variant descriptions from /opt/local/var/macports/sources/rsync.macports.org/release/ports/_resources/port1.0/variant_descriptions.conf
317:debug:main Running callback portconfigure::add_automatic_compiler_dependencies
318:debug:main Finished running callback portconfigure::add_automatic_compiler_dependencies
319:debug:main Running callback portbuild::add_automatic_buildsystem_dependencies
320:debug:main Finished running callback portbuild::add_automatic_buildsystem_dependencies
321:debug:main No need to upgrade! xorg-libXau 1.0.8_0 >= xorg-libXau 1.0.8_0
322:debug:main epoch: in tree: 0 installed: 0
323:debug:main xorg-xproto 7.0.24_0 exists in the ports tree
324:debug:main xorg-xproto 7.0.24_0  is the latest installed
325:debug:main xorg-xproto 7.0.24_0  is active
326:debug:main Merging existing variants '' into variants
327:debug:main new fully merged portvariants:
328:debug:main Changing to port directory: /opt/local/var/macports/sources/rsync.macports.org/release/ports/x11/xorg-xproto
329:debug:main OS darwin/13.0.0 (Mac OS X 10.9) arch i386
330:debug:main only one arch supported, so not adding the default universal variant
331:debug:main Running callback portconfigure::add_automatic_compiler_dependencies
332:debug:main Finished running callback portconfigure::add_automatic_compiler_dependencies
333:debug:main Running callback portbuild::add_automatic_buildsystem_dependencies
334:debug:main Finished running callback portbuild::add_automatic_buildsystem_dependencies
335:debug:main No need to upgrade! xorg-xproto 7.0.24_0 >= xorg-xproto 7.0.24_0
336:debug:main epoch: in tree: 0 installed: 0
337:debug:main xorg-libxcb 1.9.1_0 exists in the ports tree
338:debug:main xorg-libxcb 1.9.1_0 +python27 is the latest installed
339:debug:main xorg-libxcb 1.9.1_0 +python27 is active
340:debug:main Merging existing variants '+python27' into variants
341:debug:main new fully merged portvariants: python27 +
342:debug:main Changing to port directory: /opt/local/var/macports/sources/rsync.macports.org/release/ports/x11/xorg-libxcb
343:debug:main OS darwin/13.0.0 (Mac OS X 10.9) arch i386
344:debug:main adding the default universal variant
345:debug:main Reading variant descriptions from /opt/local/var/macports/sources/rsync.macports.org/release/ports/_resources/port1.0/variant_descriptions.conf
346:debug:main Executing variant python27 provides python27
347:debug:main Running callback portconfigure::add_automatic_compiler_dependencies
348:debug:main Finished running callback portconfigure::add_automatic_compiler_dependencies
349:debug:main Running callback portbuild::add_automatic_buildsystem_dependencies
350:debug:main Finished running callback portbuild::add_automatic_buildsystem_dependencies
351:debug:main No need to upgrade! xorg-libxcb 1.9.1_0 >= xorg-libxcb 1.9.1_0
352:debug:main epoch: in tree: 0 installed: 0
353:debug:main xorg-xcb-proto 1.8_0 exists in the ports tree
354:debug:main xorg-xcb-proto 1.8_0 +python27 is the latest installed
355:debug:main xorg-xcb-proto 1.8_0 +python27 is active
356:debug:main Merging existing variants '+python27' into variants
357:debug:main new fully merged portvariants: python27 +
358:debug:main Changing to port directory: /opt/local/var/macports/sources/rsync.macports.org/release/ports/x11/xorg-xcb-proto
359:debug:main OS darwin/13.0.0 (Mac OS X 10.9) arch i386
360:debug:main only one arch supported, so not adding the default universal variant
361:debug:main Executing variant python27 provides python27
362:debug:main Running callback portconfigure::add_automatic_compiler_dependencies
363:debug:main Finished running callback portconfigure::add_automatic_compiler_dependencies
364:debug:main Running callback portbuild::add_automatic_buildsystem_dependencies
365:debug:main Finished running callback portbuild::add_automatic_buildsystem_dependencies
366:debug:main No need to upgrade! xorg-xcb-proto 1.8_0 >= xorg-xcb-proto 1.8_0
367:debug:main epoch: in tree: 0 installed: 0
368:debug:main libxml2 2.9.1_0 exists in the ports tree
369:debug:main libxml2 2.9.1_0  is the latest installed
370:debug:main libxml2 2.9.1_0  is active
371:debug:main Merging existing variants '' into variants
372:debug:main new fully merged portvariants:
373:debug:main Changing to port directory: /opt/local/var/macports/sources/rsync.macports.org/release/ports/textproc/libxml2
374:debug:main OS darwin/13.0.0 (Mac OS X 10.9) arch i386
375:debug:main adding the default universal variant
376:debug:main Reading variant descriptions from /opt/local/var/macports/sources/rsync.macports.org/release/ports/_resources/port1.0/variant_descriptions.conf
377:debug:main Running callback portconfigure::add_automatic_compiler_dependencies
378:debug:main Finished running callback portconfigure::add_automatic_compiler_dependencies
379:debug:main Running callback portbuild::add_automatic_buildsystem_dependencies
380:debug:main Finished running callback portbuild::add_automatic_buildsystem_dependencies
381:debug:main No need to upgrade! libxml2 2.9.1_0 >= libxml2 2.9.1_0
382:debug:main epoch: in tree: 0 installed: 0
383:debug:main xz 5.0.5_0 exists in the ports tree
384:debug:main xz 5.0.5_0  is the latest installed
385:debug:main xz 5.0.5_0  is active
386:debug:main Merging existing variants '' into variants
387:debug:main new fully merged portvariants:
388:debug:main Changing to port directory: /opt/local/var/macports/sources/rsync.macports.org/release/ports/archivers/xz
389:debug:main OS darwin/13.0.0 (Mac OS X 10.9) arch i386
390:debug:main adding the default universal variant
391:debug:main Reading variant descriptions from /opt/local/var/macports/sources/rsync.macports.org/release/ports/_resources/port1.0/variant_descriptions.conf
392:debug:main Running callback portconfigure::add_automatic_compiler_dependencies
393:debug:main Finished running callback portconfigure::add_automatic_compiler_dependencies
394:debug:main Running callback portbuild::add_automatic_buildsystem_dependencies
395:debug:main Finished running callback portbuild::add_automatic_buildsystem_dependencies
396:debug:main No need to upgrade! xz 5.0.5_0 >= xz 5.0.5_0
397:debug:main epoch: in tree: 2 installed: 2
398:debug:main python27 2.7.6_0 exists in the ports tree
399:debug:main python27 2.7.6_0  is the latest installed
400:debug:main python27 2.7.6_0  is active
401:debug:main Merging existing variants '' into variants
402:debug:main new fully merged portvariants:
403:debug:main Changing to port directory: /opt/local/var/macports/sources/rsync.macports.org/release/ports/lang/python27
404:debug:main OS darwin/13.0.0 (Mac OS X 10.9) arch i386
405:debug:main Reading variant descriptions from /opt/local/var/macports/sources/rsync.macports.org/release/ports/_resources/port1.0/variant_descriptions.conf
406:debug:main universal variant already exists, so not adding the default one
407:debug:main Running callback portconfigure::add_automatic_compiler_dependencies
408:debug:main Finished running callback portconfigure::add_automatic_compiler_dependencies
409:debug:main Running callback portbuild::add_automatic_buildsystem_dependencies
410:debug:main Finished running callback portbuild::add_automatic_buildsystem_dependencies
411:debug:main No need to upgrade! python27 2.7.6_0 >= python27 2.7.6_0
412:debug:main epoch: in tree: 1 installed: 1
413:debug:main openssl 1.0.1e_1 exists in the ports tree
414:debug:main openssl 1.0.1e_1  is the latest installed
415:debug:main openssl 1.0.1e_1  is active
416:debug:main Merging existing variants '' into variants
417:debug:main new fully merged portvariants:
418:debug:main Changing to port directory: /opt/local/var/macports/sources/rsync.macports.org/release/ports/devel/openssl
419:debug:main OS darwin/13.0.0 (Mac OS X 10.9) arch i386
420:debug:main Reading variant descriptions from /opt/local/var/macports/sources/rsync.macports.org/release/ports/_resources/port1.0/variant_descriptions.conf
421:debug:main universal variant already exists, so not adding the default one
422:debug:main Running callback portconfigure::add_automatic_compiler_dependencies
423:debug:main Finished running callback portconfigure::add_automatic_compiler_dependencies
424:debug:main Running callback portbuild::add_automatic_buildsystem_dependencies
425:debug:main Finished running callback portbuild::add_automatic_buildsystem_dependencies
426:debug:main No need to upgrade! openssl 1.0.1e_1 >= openssl 1.0.1e_1
427:debug:main epoch: in tree: 0 installed: 0
428:debug:main sqlite3 3.8.2_0 exists in the ports tree
429:debug:main sqlite3 3.8.2_0  is the latest installed
430:debug:main sqlite3 3.8.2_0  is active
431:debug:main Merging existing variants '' into variants
432:debug:main new fully merged portvariants:
433:debug:main Changing to port directory: /opt/local/var/macports/sources/rsync.macports.org/release/ports/databases/sqlite3
434:debug:main OS darwin/13.0.0 (Mac OS X 10.9) arch i386
435:debug:main adding the default universal variant
436:debug:main Reading variant descriptions from /opt/local/var/macports/sources/rsync.macports.org/release/ports/_resources/port1.0/variant_descriptions.conf
437:debug:main Running callback portconfigure::add_automatic_compiler_dependencies
438:debug:main Finished running callback portconfigure::add_automatic_compiler_dependencies
439:debug:main Running callback portbuild::add_automatic_buildsystem_dependencies
440:debug:main Finished running callback portbuild::add_automatic_buildsystem_dependencies
441:debug:main No need to upgrade! sqlite3 3.8.2_0 >= sqlite3 3.8.2_0
442:debug:main epoch: in tree: 20090923 installed: 20090923
443:debug:main libedit 20121213-3.0_0 exists in the ports tree
444:debug:main libedit 20121213-3.0_0  is the latest installed
445:debug:main libedit 20121213-3.0_0  is active
446:debug:main Merging existing variants '' into variants
447:debug:main new fully merged portvariants:
448:debug:main Changing to port directory: /opt/local/var/macports/sources/rsync.macports.org/release/ports/devel/libedit
449:debug:main OS darwin/13.0.0 (Mac OS X 10.9) arch i386
450:debug:main Reading variant descriptions from /opt/local/var/macports/sources/rsync.macports.org/release/ports/_resources/port1.0/variant_descriptions.conf
451:debug:main universal variant already exists, so not adding the default one
452:debug:main Running callback portconfigure::add_automatic_compiler_dependencies
453:debug:main Finished running callback portconfigure::add_automatic_compiler_dependencies
454:debug:main Running callback portbuild::add_automatic_buildsystem_dependencies
455:debug:main Finished running callback portbuild::add_automatic_buildsystem_dependencies
456:debug:main No need to upgrade! libedit 20121213-3.0_0 >= libedit 20121213-3.0_0
457:debug:main epoch: in tree: 0 installed: 0
458:debug:main db46 4.6.21_8 exists in the ports tree
459:debug:main db46 4.6.21_8  is the latest installed
460:debug:main db46 4.6.21_8  is active
461:debug:main Merging existing variants '' into variants
462:debug:main new fully merged portvariants:
463:debug:main Changing to port directory: /opt/local/var/macports/sources/rsync.macports.org/release/ports/databases/db46
464:debug:main OS darwin/13.0.0 (Mac OS X 10.9) arch i386
465:debug:main Reading variant descriptions from /opt/local/var/macports/sources/rsync.macports.org/release/ports/_resources/port1.0/variant_descriptions.conf
466:debug:main universal variant already exists, so not adding the default one
467:debug:main Running callback portconfigure::add_automatic_compiler_dependencies
468:debug:main Finished running callback portconfigure::add_automatic_compiler_dependencies
469:debug:main Running callback portbuild::add_automatic_buildsystem_dependencies
470:debug:main Finished running callback portbuild::add_automatic_buildsystem_dependencies
471:debug:main No need to upgrade! db46 4.6.21_8 >= db46 4.6.21_8
472:debug:main epoch: in tree: 0 installed: 0
473:debug:main db_select 0.1_2 exists in the ports tree
474:debug:main db_select 0.1_2  is the latest installed
475:debug:main db_select 0.1_2  is active
476:debug:main Merging existing variants '' into variants
477:debug:main new fully merged portvariants:
478:debug:main Changing to port directory: /opt/local/var/macports/sources/rsync.macports.org/release/ports/sysutils/db_select
479:debug:main OS darwin/13.0.0 (Mac OS X 10.9) arch i386
480:debug:main universal_variant is false, so not adding the default universal variant
481:debug:main Running callback portconfigure::add_automatic_compiler_dependencies
482:debug:main Finished running callback portconfigure::add_automatic_compiler_dependencies
483:debug:main Running callback portbuild::add_automatic_buildsystem_dependencies
484:debug:main Finished running callback portbuild::add_automatic_buildsystem_dependencies
485:debug:main No need to upgrade! db_select 0.1_2 >= db_select 0.1_2
486:debug:main epoch: in tree: 0 installed: 0
487:debug:main python_select 0.3_3 exists in the ports tree
488:debug:main python_select 0.3_3  is the latest installed
489:debug:main python_select 0.3_3  is active
490:debug:main Merging existing variants '' into variants
491:debug:main new fully merged portvariants:
492:debug:main Changing to port directory: /opt/local/var/macports/sources/rsync.macports.org/release/ports/sysutils/python_select
493:debug:main OS darwin/13.0.0 (Mac OS X 10.9) arch i386
494:debug:main universal_variant is false, so not adding the default universal variant
495:debug:main Running callback portconfigure::add_automatic_compiler_dependencies
496:debug:main Finished running callback portconfigure::add_automatic_compiler_dependencies
497:debug:main Running callback portbuild::add_automatic_buildsystem_dependencies
498:debug:main Finished running callback portbuild::add_automatic_buildsystem_dependencies
499:debug:main No need to upgrade! python_select 0.3_3 >= python_select 0.3_3
500:debug:main epoch: in tree: 0 installed: 0
501:debug:main xorg-libpthread-stubs 0.3_0 exists in the ports tree
502:debug:main xorg-libpthread-stubs 0.3_0  is the latest installed
503:debug:main xorg-libpthread-stubs 0.3_0  is active
504:debug:main Merging existing variants '' into variants
505:debug:main new fully merged portvariants:
506:debug:main Changing to port directory: /opt/local/var/macports/sources/rsync.macports.org/release/ports/x11/xorg-libpthread-stubs
507:debug:main OS darwin/13.0.0 (Mac OS X 10.9) arch i386
508:debug:main only one arch supported, so not adding the default universal variant
509:debug:main Running callback portconfigure::add_automatic_compiler_dependencies
510:debug:main Finished running callback portconfigure::add_automatic_compiler_dependencies
511:debug:main Running callback portbuild::add_automatic_buildsystem_dependencies
512:debug:main Finished running callback portbuild::add_automatic_buildsystem_dependencies
513:debug:main No need to upgrade! xorg-libpthread-stubs 0.3_0 >= xorg-libpthread-stubs 0.3_0
514:debug:main epoch: in tree: 0 installed: 0
515:debug:main xorg-kbproto 1.0.6_0 exists in the ports tree
516:debug:main xorg-kbproto 1.0.6_0  is the latest installed
517:debug:main xorg-kbproto 1.0.6_0  is active
518:debug:main Merging existing variants '' into variants
519:debug:main new fully merged portvariants:
520:debug:main Changing to port directory: /opt/local/var/macports/sources/rsync.macports.org/release/ports/x11/xorg-kbproto
521:debug:main OS darwin/13.0.0 (Mac OS X 10.9) arch i386
522:debug:main only one arch supported, so not adding the default universal variant
523:debug:main Running callback portconfigure::add_automatic_compiler_dependencies
524:debug:main Finished running callback portconfigure::add_automatic_compiler_dependencies
525:debug:main Running callback portbuild::add_automatic_buildsystem_dependencies
526:debug:main Finished running callback portbuild::add_automatic_buildsystem_dependencies
527:debug:main No need to upgrade! xorg-kbproto 1.0.6_0 >= xorg-kbproto 1.0.6_0
528:debug:main epoch: in tree: 0 installed: 0
529:debug:main xorg-renderproto 0.11.1_0 exists in the ports tree
530:debug:main xorg-renderproto 0.11.1_0  is the latest installed
531:debug:main xorg-renderproto 0.11.1_0  is active
532:debug:main Merging existing variants '' into variants
533:debug:main new fully merged portvariants:
534:debug:main Changing to port directory: /opt/local/var/macports/sources/rsync.macports.org/release/ports/x11/xorg-renderproto
535:debug:main OS darwin/13.0.0 (Mac OS X 10.9) arch i386
536:debug:main only one arch supported, so not adding the default universal variant
537:debug:main Running callback portconfigure::add_automatic_compiler_dependencies
538:debug:main Finished running callback portconfigure::add_automatic_compiler_dependencies
539:debug:main Running callback portbuild::add_automatic_buildsystem_dependencies
540:debug:main Finished running callback portbuild::add_automatic_buildsystem_dependencies
541:debug:main No need to upgrade! xorg-renderproto 0.11.1_0 >= xorg-renderproto 0.11.1_0
542:debug:main epoch: in tree: 0 installed: 0
543:debug:main xorg-libXext 1.3.2_0 exists in the ports tree
544:debug:main xorg-libXext 1.3.2_0  is the latest installed
545:debug:main xorg-libXext 1.3.2_0  is active
546:debug:main Merging existing variants '' into variants
547:debug:main new fully merged portvariants:
548:debug:main Changing to port directory: /opt/local/var/macports/sources/rsync.macports.org/release/ports/x11/xorg-libXext
549:debug:main OS darwin/13.0.0 (Mac OS X 10.9) arch i386
550:debug:main adding the default universal variant
551:debug:main Reading variant descriptions from /opt/local/var/macports/sources/rsync.macports.org/release/ports/_resources/port1.0/variant_descriptions.conf
552:debug:main Running callback portconfigure::add_automatic_compiler_dependencies
553:debug:main Finished running callback portconfigure::add_automatic_compiler_dependencies
554:debug:main Running callback portbuild::add_automatic_buildsystem_dependencies
555:debug:main Finished running callback portbuild::add_automatic_buildsystem_dependencies
556:debug:main No need to upgrade! xorg-libXext 1.3.2_0 >= xorg-libXext 1.3.2_0
557:debug:main epoch: in tree: 0 installed: 0
558:debug:main xorg-xextproto 7.2.99.901_0 exists in the ports tree
559:debug:main xorg-xextproto 7.2.99.901_0  is the latest installed
560:debug:main xorg-xextproto 7.2.99.901_0  is active
561:debug:main Merging existing variants '' into variants
562:debug:main new fully merged portvariants:
563:debug:main Changing to port directory: /opt/local/var/macports/sources/rsync.macports.org/release/ports/x11/xorg-xextproto
564:debug:main OS darwin/13.0.0 (Mac OS X 10.9) arch i386
565:debug:main only one arch supported, so not adding the default universal variant
566:debug:main Running callback portconfigure::add_automatic_compiler_dependencies
567:debug:main Finished running callback portconfigure::add_automatic_compiler_dependencies
568:debug:main Running callback portbuild::add_automatic_buildsystem_dependencies
569:debug:main Finished running callback portbuild::add_automatic_buildsystem_dependencies
570:debug:main No need to upgrade! xorg-xextproto 7.2.99.901_0 >= xorg-xextproto 7.2.99.901_0
571:debug:main epoch: in tree: 0 installed: 0
572:debug:main xorg-xcb-util 0.3.9_0 exists in the ports tree
573:debug:main xorg-xcb-util 0.3.9_0  is the latest installed
574:debug:main xorg-xcb-util 0.3.9_0  is active
575:debug:main Merging existing variants '' into variants
576:debug:main new fully merged portvariants:
577:debug:main Changing to port directory: /opt/local/var/macports/sources/rsync.macports.org/release/ports/x11/xorg-xcb-util
578:debug:main OS darwin/13.0.0 (Mac OS X 10.9) arch i386
579:debug:main adding the default universal variant
580:debug:main Reading variant descriptions from /opt/local/var/macports/sources/rsync.macports.org/release/ports/_resources/port1.0/variant_descriptions.conf
581:debug:main Running callback portconfigure::add_automatic_compiler_dependencies
582:debug:main Finished running callback portconfigure::add_automatic_compiler_dependencies
583:debug:main Running callback portbuild::add_automatic_buildsystem_dependencies
584:debug:main Finished running callback portbuild::add_automatic_buildsystem_dependencies
585:debug:main No need to upgrade! xorg-xcb-util 0.3.9_0 >= xorg-xcb-util 0.3.9_0
586:debug:main epoch: in tree: 0 installed: 0
587:debug:main jpeg 9_1 exists in the ports tree
588:debug:main jpeg 9_1  is the latest installed
589:debug:main jpeg 9_1  is active
590:debug:main Merging existing variants '' into variants
591:debug:main new fully merged portvariants:
592:debug:main Changing to port directory: /opt/local/var/macports/sources/rsync.macports.org/release/ports/graphics/jpeg
593:debug:main OS darwin/13.0.0 (Mac OS X 10.9) arch i386
594:debug:main adding the default universal variant
595:debug:main Reading variant descriptions from /opt/local/var/macports/sources/rsync.macports.org/release/ports/_resources/port1.0/variant_descriptions.conf
596:debug:main Running callback portconfigure::add_automatic_compiler_dependencies
597:debug:main Finished running callback portconfigure::add_automatic_compiler_dependencies
598:debug:main Running callback portbuild::add_automatic_buildsystem_dependencies
599:debug:main Finished running callback portbuild::add_automatic_buildsystem_dependencies
600:debug:main No need to upgrade! jpeg 9_1 >= jpeg 9_1
601:debug:main epoch: in tree: 0 installed: 0
602:debug:main poppler 0.24.4_0 exists in the ports tree
603:debug:main poppler 0.24.4_0  is the latest installed
604:debug:main poppler 0.24.4_0  is active
605:debug:main Merging existing variants '' into variants
606:debug:main new fully merged portvariants:
607:debug:main Changing to port directory: /opt/local/var/macports/sources/rsync.macports.org/release/ports/graphics/poppler
608:debug:main OS darwin/13.0.0 (Mac OS X 10.9) arch i386
609:debug:main Reading variant descriptions from /opt/local/var/macports/sources/rsync.macports.org/release/ports/_resources/port1.0/variant_descriptions.conf
610:debug:main compiler gcc-4.0 blacklisted because it's not installed or it doesn't work
611:debug:main universal variant already exists, so not adding the default one
612:debug:main Running callback portconfigure::add_automatic_compiler_dependencies
613:debug:main Finished running callback portconfigure::add_automatic_compiler_dependencies
614:debug:main Running callback portbuild::add_automatic_buildsystem_dependencies
615:debug:main Finished running callback portbuild::add_automatic_buildsystem_dependencies
616:debug:main No need to upgrade! poppler 0.24.4_0 >= poppler 0.24.4_0
617:debug:main epoch: in tree: 0 installed: 0
618:debug:main curl 7.33.0_0 exists in the ports tree
619:debug:main curl 7.33.0_0 +ssl is the latest installed
620:debug:main curl 7.33.0_0 +ssl is active
621:debug:main Merging existing variants '+ssl' into variants
622:debug:main new fully merged portvariants: ssl +
623:debug:main Changing to port directory: /opt/local/var/macports/sources/rsync.macports.org/release/ports/net/curl
624:debug:main OS darwin/13.0.0 (Mac OS X 10.9) arch i386
625:debug:main Reading variant descriptions from /opt/local/var/macports/sources/rsync.macports.org/release/ports/_resources/port1.0/variant_descriptions.conf
626:debug:main universal variant already exists, so not adding the default one
627:debug:main Executing variant ssl provides ssl
628:debug:main Running callback portconfigure::add_automatic_compiler_dependencies
629:debug:main Finished running callback portconfigure::add_automatic_compiler_dependencies
630:debug:main Running callback portbuild::add_automatic_buildsystem_dependencies
631:debug:main Finished running callback portbuild::add_automatic_buildsystem_dependencies
632:debug:main No need to upgrade! curl 7.33.0_0 >= curl 7.33.0_0
633:debug:main epoch: in tree: 0 installed: 0
634:debug:main libidn 1.26_0 exists in the ports tree
635:debug:main libidn 1.26_0  is the latest installed
636:debug:main libidn 1.26_0  is active
637:debug:main Merging existing variants '' into variants
638:debug:main new fully merged portvariants:
639:debug:main Changing to port directory: /opt/local/var/macports/sources/rsync.macports.org/release/ports/mail/libidn
640:debug:main OS darwin/13.0.0 (Mac OS X 10.9) arch i386
641:debug:main adding the default universal variant
642:debug:main Reading variant descriptions from /opt/local/var/macports/sources/rsync.macports.org/release/ports/_resources/port1.0/variant_descriptions.conf
643:debug:main Running callback portconfigure::add_automatic_compiler_dependencies
644:debug:main Finished running callback portconfigure::add_automatic_compiler_dependencies
645:debug:main Running callback portbuild::add_automatic_buildsystem_dependencies
646:debug:main Finished running callback portbuild::add_automatic_buildsystem_dependencies
647:debug:main No need to upgrade! libidn 1.26_0 >= libidn 1.26_0
648:debug:main epoch: in tree: 0 installed: 0
649:debug:main curl-ca-bundle 7.33.0_0 exists in the ports tree
650:debug:main curl-ca-bundle 7.33.0_0  is the latest installed
651:debug:main curl-ca-bundle 7.33.0_0  is active
652:debug:main Merging existing variants '' into variants
653:debug:main new fully merged portvariants:
654:debug:main Changing to port directory: /opt/local/var/macports/sources/rsync.macports.org/release/ports/net/curl
655:debug:main OS darwin/13.0.0 (Mac OS X 10.9) arch i386
656:debug:main universal_variant is false, so not adding the default universal variant
657:debug:main Running callback portconfigure::add_automatic_compiler_dependencies
658:debug:main Finished running callback portconfigure::add_automatic_compiler_dependencies
659:debug:main Running callback portbuild::add_automatic_buildsystem_dependencies
660:debug:main Finished running callback portbuild::add_automatic_buildsystem_dependencies
661:debug:main No need to upgrade! curl-ca-bundle 7.33.0_0 >= curl-ca-bundle 7.33.0_0
662:debug:main epoch: in tree: 0 installed: 0
663:debug:main gobject-introspection 1.38.0_1 exists in the ports tree
664:debug:main gobject-introspection 1.38.0_1  is the latest installed
665:debug:main gobject-introspection 1.38.0_1  is active
666:debug:main Merging existing variants '' into variants
667:debug:main new fully merged portvariants:
668:debug:main Changing to port directory: /opt/local/var/macports/sources/rsync.macports.org/release/ports/gnome/gobject-introspection
669:debug:main OS darwin/13.0.0 (Mac OS X 10.9) arch i386
670:debug:main python27 is installed with the following variants:
671:debug:main   required: ucs4, forbidden:
672:debug:main   rejected, because required variant ucs4 is missing
673:debug:main adding the default universal variant
674:debug:main Reading variant descriptions from /opt/local/var/macports/sources/rsync.macports.org/release/ports/_resources/port1.0/variant_descriptions.conf
675:debug:main Running callback portconfigure::add_automatic_compiler_dependencies
676:debug:main Finished running callback portconfigure::add_automatic_compiler_dependencies
677:debug:main Running callback portbuild::add_automatic_buildsystem_dependencies
678:debug:main Finished running callback portbuild::add_automatic_buildsystem_dependencies
679:debug:main No need to upgrade! gobject-introspection 1.38.0_1 >= gobject-introspection 1.38.0_1
680:debug:main epoch: in tree: 0 installed: 0
681:debug:main libtool 2.4.2_3 exists in the ports tree
682:debug:main libtool 2.4.2_3  is the latest installed
683:debug:main libtool 2.4.2_3  is active
684:debug:main Merging existing variants '' into variants
685:debug:main new fully merged portvariants:
686:debug:main Changing to port directory: /opt/local/var/macports/sources/rsync.macports.org/release/ports/devel/libtool
687:debug:main OS darwin/13.0.0 (Mac OS X 10.9) arch i386
688:debug:main adding the default universal variant
689:debug:main Reading variant descriptions from /opt/local/var/macports/sources/rsync.macports.org/release/ports/_resources/port1.0/variant_descriptions.conf
690:debug:main Running callback portconfigure::add_automatic_compiler_dependencies
691:debug:main Finished running callback portconfigure::add_automatic_compiler_dependencies
692:debug:main Running callback portbuild::add_automatic_buildsystem_dependencies
693:debug:main Finished running callback portbuild::add_automatic_buildsystem_dependencies
694:debug:main No need to upgrade! libtool 2.4.2_3 >= libtool 2.4.2_3
695:debug:main epoch: in tree: 0 installed: 0
696:debug:main lcms2 2.4_2 exists in the ports tree
697:debug:main lcms2 2.4_2  is the latest installed
698:debug:main lcms2 2.4_2  is active
699:debug:main Merging existing variants '' into variants
700:debug:main new fully merged portvariants:
701:debug:main Changing to port directory: /opt/local/var/macports/sources/rsync.macports.org/release/ports/graphics/lcms2
702:debug:main OS darwin/13.0.0 (Mac OS X 10.9) arch i386
703:debug:main Reading variant descriptions from /opt/local/var/macports/sources/rsync.macports.org/release/ports/_resources/port1.0/variant_descriptions.conf
704:debug:main universal variant already exists, so not adding the default one
705:debug:main Running callback portconfigure::add_automatic_compiler_dependencies
706:debug:main Finished running callback portconfigure::add_automatic_compiler_dependencies
707:debug:main Running callback portbuild::add_automatic_buildsystem_dependencies
708:debug:main Finished running callback portbuild::add_automatic_buildsystem_dependencies
709:debug:main No need to upgrade! lcms2 2.4_2 >= lcms2 2.4_2
710:debug:main epoch: in tree: 0 installed: 0
711:debug:main tiff 4.0.3_2 exists in the ports tree
712:debug:main tiff 4.0.3_2  is the latest installed
713:debug:main tiff 4.0.3_2  is active
714:debug:main Merging existing variants '' into variants
715:debug:main new fully merged portvariants:
716:debug:main Changing to port directory: /opt/local/var/macports/sources/rsync.macports.org/release/ports/graphics/tiff
717:debug:main OS darwin/13.0.0 (Mac OS X 10.9) arch i386
718:debug:main Reading variant descriptions from /opt/local/var/macports/sources/rsync.macports.org/release/ports/_resources/port1.0/variant_descriptions.conf
719:debug:main universal variant already exists, so not adding the default one
720:debug:main Running callback portconfigure::add_automatic_compiler_dependencies
721:debug:main Finished running callback portconfigure::add_automatic_compiler_dependencies
722:debug:main Running callback portbuild::add_automatic_buildsystem_dependencies
723:debug:main Finished running callback portbuild::add_automatic_buildsystem_dependencies
724:debug:main No need to upgrade! tiff 4.0.3_2 >= tiff 4.0.3_2
725:debug:main epoch: in tree: 0 installed: 0
726:debug:main openjpeg15 1.5.0_0 exists in the ports tree
727:debug:main openjpeg15 1.5.0_0  is the latest installed
728:debug:main openjpeg15 1.5.0_0  is active
729:debug:main Merging existing variants '' into variants
730:debug:main new fully merged portvariants:
731:debug:main Changing to port directory: /opt/local/var/macports/sources/rsync.macports.org/release/ports/graphics/openjpeg15
732:debug:main OS darwin/13.0.0 (Mac OS X 10.9) arch i386
733:debug:main adding the default universal variant
734:debug:main Reading variant descriptions from /opt/local/var/macports/sources/rsync.macports.org/release/ports/_resources/port1.0/variant_descriptions.conf
735:debug:main Running callback portconfigure::add_automatic_compiler_dependencies
736:debug:main Finished running callback portconfigure::add_automatic_compiler_dependencies
737:debug:main Running callback portbuild::add_automatic_buildsystem_dependencies
738:debug:main Finished running callback portbuild::add_automatic_buildsystem_dependencies
739:debug:main No need to upgrade! openjpeg15 1.5.0_0 >= openjpeg15 1.5.0_0
740:debug:main epoch: in tree: 0 installed: 0
741:debug:main jbigkit 2.0_2 exists in the ports tree
742:debug:main jbigkit 2.0_2  is the latest installed
743:debug:main jbigkit 2.0_2  is active
744:debug:main Merging existing variants '' into variants
745:debug:main new fully merged portvariants:
746:debug:main Changing to port directory: /opt/local/var/macports/sources/rsync.macports.org/release/ports/graphics/jbigkit
747:debug:main OS darwin/13.0.0 (Mac OS X 10.9) arch i386
748:debug:main adding the default universal variant
749:debug:main Reading variant descriptions from /opt/local/var/macports/sources/rsync.macports.org/release/ports/_resources/port1.0/variant_descriptions.conf
750:debug:main Running callback portconfigure::add_automatic_compiler_dependencies
751:debug:main Finished running callback portconfigure::add_automatic_compiler_dependencies
752:debug:main Running callback portbuild::add_automatic_buildsystem_dependencies
753:debug:main Finished running callback portbuild::add_automatic_buildsystem_dependencies
754:debug:main No need to upgrade! jbigkit 2.0_2 >= jbigkit 2.0_2
755:debug:main epoch: in tree: 0 installed: 0
756:debug:main poppler-data 0.4.6_0 exists in the ports tree
757:debug:main poppler-data 0.4.6_0  is the latest installed
758:debug:main poppler-data 0.4.6_0  is active
759:debug:main Merging existing variants '' into variants
760:debug:main new fully merged portvariants:
761:debug:main Changing to port directory: /opt/local/var/macports/sources/rsync.macports.org/release/ports/graphics/poppler-data
762:debug:main OS darwin/13.0.0 (Mac OS X 10.9) arch i386
763:debug:main universal_variant is false, so not adding the default universal variant
764:debug:main Running callback portconfigure::add_automatic_compiler_dependencies
765:debug:main Finished running callback portconfigure::add_automatic_compiler_dependencies
766:debug:main Running callback portbuild::add_automatic_buildsystem_dependencies
767:debug:main Finished running callback portbuild::add_automatic_buildsystem_dependencies
768:debug:main No need to upgrade! poppler-data 0.4.6_0 >= poppler-data 0.4.6_0
769:msg:main --->  Computing dependencies for gle-graphics:info:main .:debug:main gle-graphics has no conflicts
770:debug:main Searching for dependency: pkgconfig
771:debug:main Found Dependency: receipt exists for pkgconfig
772:debug:main Searching for dependency: cairo
773:debug:main Found Dependency: receipt exists for cairo
774:debug:main Searching for dependency: jpeg
775:debug:main Found Dependency: receipt exists for jpeg
776:debug:main Searching for dependency: libpng
777:debug:main Found Dependency: receipt exists for libpng
778:debug:main Searching for dependency: poppler
779:debug:main Found Dependency: receipt exists for poppler
780:debug:main Searching for dependency: tiff
781:debug:main Found Dependency: receipt exists for tiff
782:debug:main Searching for dependency: zlib
783:debug:main Found Dependency: receipt exists for zlib
784:msg:main
785:debug:main Executing org.macports.main (gle-graphics)
786:debug:main changing euid/egid - current euid: 0 - current egid: 0
787:debug:main egid changed to: 503
788:debug:main euid changed to: 505
789:debug:archivefetch archivefetch phase started at Wed Dec 11 08:30:40 SAST 2013
790:msg:archivefetch --->  Fetching archive for gle-graphics
791:debug:archivefetch Executing org.macports.archivefetch (gle-graphics)
792:debug:archivefetch euid/egid changed to: 0/0
793:debug:archivefetch chowned /opt/local/var/macports/incoming to macports
794:debug:archivefetch euid/egid changed to: 505/503
795:info:archivefetch --->  gle-graphics-4.2.4c_3.darwin_13.x86_64.tbz2 doesn't seem to exist in /opt/local/var/macports/incoming/verified
796:msg:archivefetch --->  Attempting to fetch gle-graphics-4.2.4c_3.darwin_13.x86_64.tbz2 from http://mse.uk.packages.macports.org/sites/packages.macports.org/gle-graphics
797:debug:archivefetch Fetching archive failed:: The requested URL returned error: 404 Not Found
798:msg:archivefetch --->  Attempting to fetch gle-graphics-4.2.4c_3.darwin_13.x86_64.tbz2 from http://lil.fr.packages.macports.org/gle-graphics
799:debug:archivefetch Fetching archive failed:: The requested URL returned error: 404 Not Found
800:msg:archivefetch --->  Attempting to fetch gle-graphics-4.2.4c_3.darwin_13.x86_64.tbz2 from http://packages.macports.org/gle-graphics
801:debug:archivefetch Fetching archive failed:: The requested URL returned error: 404 Not Found
802:debug:archivefetch Privilege de-escalation not attempted as not running as root.
803:debug:fetch fetch phase started at Wed Dec 11 08:30:43 SAST 2013
804:notice:fetch --->  Fetching distfiles for gle-graphics
805:debug:fetch Executing org.macports.fetch (gle-graphics)
806:debug:fetch Privilege de-escalation not attempted as not running as root.
807:debug:checksum checksum phase started at Wed Dec 11 08:30:43 SAST 2013
808:notice:checksum --->  Verifying checksums for gle-graphics
809:debug:checksum Executing org.macports.checksum (gle-graphics)
810:info:checksum --->  Checksumming gle-graphics-4.2.4cf-src.tar.gz
811:debug:checksum Correct (rmd160) checksum for gle-graphics-4.2.4cf-src.tar.gz
812:debug:checksum Correct (sha256) checksum for gle-graphics-4.2.4cf-src.tar.gz
813:debug:checksum Privilege de-escalation not attempted as not running as root.
814:debug:extract extract phase started at Wed Dec 11 08:30:43 SAST 2013
815:notice:extract --->  Extracting gle-graphics
816:debug:extract Executing org.macports.extract (gle-graphics)
817:info:extract --->  Extracting gle-graphics-4.2.4cf-src.tar.gz
818:debug:extract setting option extract.args to '/opt/local/var/macports/distfiles/gle-graphics/gle-graphics-4.2.4cf-src.tar.gz'
819:debug:extract Environment: CPATH='/opt/local/include' CC_PRINT_OPTIONS_FILE='/opt/local/var/macports/build/_opt_local_var_macports_sources_rsync.macports.org_release_ports_graphics_gle-graphics/gle-graphics/work/.CC_PRINT_OPTIONS' LIBRARY_PATH='/opt/local/lib' CC_PRINT_OPTIONS='YES' MACOSX_DEPLOYMENT_TARGET='10.9'
820:debug:extract Assembled command: 'cd "/opt/local/var/macports/build/_opt_local_var_macports_sources_rsync.macports.org_release_ports_graphics_gle-graphics/gle-graphics/work" && /usr/bin/gzip -dc '/opt/local/var/macports/distfiles/gle-graphics/gle-graphics-4.2.4cf-src.tar.gz' | /usr/bin/tar -xf -'
821:debug:extract Executing command line:  cd "/opt/local/var/macports/build/_opt_local_var_macports_sources_rsync.macports.org_release_ports_graphics_gle-graphics/gle-graphics/work" && /usr/bin/gzip -dc '/opt/local/var/macports/distfiles/gle-graphics/gle-graphics-4.2.4cf-src.tar.gz' | /usr/bin/tar -xf -
822:debug:extract euid/egid changed to: 0/0
823:debug:extract chowned /opt/local/var/macports/build/_opt_local_var_macports_sources_rsync.macports.org_release_ports_graphics_gle-graphics/gle-graphics/work to macports
824:debug:extract euid/egid changed to: 505/503
825:debug:extract Privilege de-escalation not attempted as not running as root.
826:debug:patch patch phase started at Wed Dec 11 08:30:43 SAST 2013
827:debug:patch Executing org.macports.patch (gle-graphics)
828:notice:patch --->  Applying patches to gle-graphics
829:info:patch --->  Applying patch-install_name.diff
830:debug:patch Environment: CPATH='/opt/local/include' CC_PRINT_OPTIONS_FILE='/opt/local/var/macports/build/_opt_local_var_macports_sources_rsync.macports.org_release_ports_graphics_gle-graphics/gle-graphics/work/.CC_PRINT_OPTIONS' LIBRARY_PATH='/opt/local/lib' CC_PRINT_OPTIONS='YES' MACOSX_DEPLOYMENT_TARGET='10.9'
831:debug:patch Assembled command: 'cd "/opt/local/var/macports/build/_opt_local_var_macports_sources_rsync.macports.org_release_ports_graphics_gle-graphics/gle-graphics/work/gle-graphics-4.2.4c" && /usr/bin/patch -p0'
832:debug:patch Executing command line:  cd "/opt/local/var/macports/build/_opt_local_var_macports_sources_rsync.macports.org_release_ports_graphics_gle-graphics/gle-graphics/work/gle-graphics-4.2.4c" && /usr/bin/patch -p0 < '/opt/local/var/macports/sources/rsync.macports.org/release/ports/graphics/gle-graphics/files/patch-install_name.diff'
833:info:patch patching file src/gle/Makefile.in
834:info:patch --->  Applying patch-qgle-carbon.diff
835:debug:patch Environment: CPATH='/opt/local/include' CC_PRINT_OPTIONS_FILE='/opt/local/var/macports/build/_opt_local_var_macports_sources_rsync.macports.org_release_ports_graphics_gle-graphics/gle-graphics/work/.CC_PRINT_OPTIONS' LIBRARY_PATH='/opt/local/lib' CC_PRINT_OPTIONS='YES' MACOSX_DEPLOYMENT_TARGET='10.9'
836:debug:patch Assembled command: 'cd "/opt/local/var/macports/build/_opt_local_var_macports_sources_rsync.macports.org_release_ports_graphics_gle-graphics/gle-graphics/work/gle-graphics-4.2.4c" && /usr/bin/patch -p0'
837:debug:patch Executing command line:  cd "/opt/local/var/macports/build/_opt_local_var_macports_sources_rsync.macports.org_release_ports_graphics_gle-graphics/gle-graphics/work/gle-graphics-4.2.4c" && /usr/bin/patch -p0 < '/opt/local/var/macports/sources/rsync.macports.org/release/ports/graphics/gle-graphics/files/patch-qgle-carbon.diff'
838:info:patch patching file src/gui/qgle.pro.in
839:info:patch --->  Applying patch-qgle-libgs.diff
840:debug:patch Environment: CPATH='/opt/local/include' CC_PRINT_OPTIONS_FILE='/opt/local/var/macports/build/_opt_local_var_macports_sources_rsync.macports.org_release_ports_graphics_gle-graphics/gle-graphics/work/.CC_PRINT_OPTIONS' LIBRARY_PATH='/opt/local/lib' CC_PRINT_OPTIONS='YES' MACOSX_DEPLOYMENT_TARGET='10.9'
841:debug:patch Assembled command: 'cd "/opt/local/var/macports/build/_opt_local_var_macports_sources_rsync.macports.org_release_ports_graphics_gle-graphics/gle-graphics/work/gle-graphics-4.2.4c" && /usr/bin/patch -p0'
842:debug:patch Executing command line:  cd "/opt/local/var/macports/build/_opt_local_var_macports_sources_rsync.macports.org_release_ports_graphics_gle-graphics/gle-graphics/work/gle-graphics-4.2.4c" && /usr/bin/patch -p0 < '/opt/local/var/macports/sources/rsync.macports.org/release/ports/graphics/gle-graphics/files/patch-qgle-libgs.diff'
843:info:patch patching file src/gui/qgslibloader.cpp
844:info:patch --->  Applying patch-qgle-glu.diff
845:debug:patch Environment: CPATH='/opt/local/include' CC_PRINT_OPTIONS_FILE='/opt/local/var/macports/build/_opt_local_var_macports_sources_rsync.macports.org_release_ports_graphics_gle-graphics/gle-graphics/work/.CC_PRINT_OPTIONS' LIBRARY_PATH='/opt/local/lib' CC_PRINT_OPTIONS='YES' MACOSX_DEPLOYMENT_TARGET='10.9'
846:debug:patch Assembled command: 'cd "/opt/local/var/macports/build/_opt_local_var_macports_sources_rsync.macports.org_release_ports_graphics_gle-graphics/gle-graphics/work/gle-graphics-4.2.4c" && /usr/bin/patch -p0'
847:debug:patch Executing command line:  cd "/opt/local/var/macports/build/_opt_local_var_macports_sources_rsync.macports.org_release_ports_graphics_gle-graphics/gle-graphics/work/gle-graphics-4.2.4c" && /usr/bin/patch -p0 < '/opt/local/var/macports/sources/rsync.macports.org/release/ports/graphics/gle-graphics/files/patch-qgle-glu.diff'
848:info:patch patching file src/gui/3dviewer.cpp
849:info:patch patching file src/gui/qgle.pro.in
850:debug:patch Executing proc-post-org.macports.patch-patch-0
851:debug:patch Executing reinplace: /usr/bin/sed s|@@PREFIX@@|/opt/local|g < /opt/local/var/macports/build/_opt_local_var_macports_sources_rsync.macports.org_release_ports_graphics_gle-graphics/gle-graphics/work/gle-graphics-4.2.4c/src/gui/qgslibloader.cpp >@ file10
852:debug:patch euid/egid changed to: 0/0
853:debug:patch chowned /opt/local/var/macports/build/_opt_local_var_macports_sources_rsync.macports.org_release_ports_graphics_gle-graphics/gle-graphics/work/gle-graphics-4.2.4c/src/gui/qgslibloader.cpp to macports
854:debug:patch euid/egid changed to: 505/503
855:debug:patch euid/egid changed to: 0/0
856:debug:patch setting attributes on /opt/local/var/macports/build/_opt_local_var_macports_sources_rsync.macports.org_release_ports_graphics_gle-graphics/gle-graphics/work/gle-graphics-4.2.4c/src/gui/qgslibloader.cpp
857:debug:patch euid/egid changed to: 505/503
858:debug:patch Privilege de-escalation not attempted as not running as root.
859:debug:configure configure phase started at Wed Dec 11 08:30:43 SAST 2013
860:notice:configure --->  Configuring gle-graphics
861:debug:configure Using compiler 'Xcode Clang'
862:debug:configure Executing org.macports.configure (gle-graphics)
863:debug:configure Environment: CPATH='/opt/local/include' CFLAGS='-pipe -Os -arch x86_64' CPPFLAGS='-I/opt/local/include' CXXFLAGS='-pipe -Os -arch x86_64' LIBRARY_PATH='/opt/local/lib' MACOSX_DEPLOYMENT_TARGET='10.9' CXX='/usr/bin/clang++' CC_PRINT_OPTIONS_FILE='/opt/local/var/macports/build/_opt_local_var_macports_sources_rsync.macports.org_release_ports_graphics_gle-graphics/gle-graphics/work/.CC_PRINT_OPTIONS' F90FLAGS='-pipe -Os -m64' LDFLAGS='-L/opt/local/lib -Wl,-headerpad_max_install_names -arch x86_64' FCFLAGS='-pipe -Os -m64' OBJC='/usr/bin/clang' OBJCXX='/usr/bin/clang++' INSTALL='/usr/bin/install -c' OBJCFLAGS='-pipe -Os -arch x86_64' OBJCXXFLAGS='-pipe -Os -arch x86_64' FFLAGS='-pipe -Os -m64' CC_PRINT_OPTIONS='YES' CC='/usr/bin/clang'
864:debug:configure Assembled command: 'cd "/opt/local/var/macports/build/_opt_local_var_macports_sources_rsync.macports.org_release_ports_graphics_gle-graphics/gle-graphics/work/gle-graphics-4.2.4c" && ./configure --prefix=/opt/local --with-jpeg=/opt/local --with-png=/opt/local --with-poppler --with-tiff=/opt/local --with-z=/opt/local --with-qt=no --with-libgle=yes --with-manip=yes --with-debug=no --with-extrafonts=yes --with-arch=no --with-staticlink=no'
865:debug:configure Executing command line:  cd "/opt/local/var/macports/build/_opt_local_var_macports_sources_rsync.macports.org_release_ports_graphics_gle-graphics/gle-graphics/work/gle-graphics-4.2.4c" && ./configure --prefix=/opt/local --with-jpeg=/opt/local --with-png=/opt/local --with-poppler --with-tiff=/opt/local --with-z=/opt/local --with-qt=no --with-libgle=yes --with-manip=yes --with-debug=no --with-extrafonts=yes --with-arch=no --with-staticlink=no
866:info:configure checking whether the C++ compiler works... yes
867:info:configure checking for C++ compiler default output file name... a.out
868:info:configure checking for suffix of executables...
869:info:configure checking whether we are cross compiling... no
870:info:configure checking for suffix of object files... o
871:info:configure checking whether we are using the GNU C++ compiler... yes
872:info:configure checking whether /usr/bin/clang++ accepts -g... yes
873:info:configure checking for a BSD-compatible install... /usr/bin/install -c
874:info:configure checking for a thread-safe mkdir -p... /opt/local/bin/gmkdir -p
875:info:configure checking build system type... x86_64-apple-darwin13.0.0
876:info:configure checking host system type... x86_64-apple-darwin13.0.0
877:info:configure checking how to run the C++ preprocessor... /usr/bin/clang++ -E
878:info:configure checking for grep that handles long lines and -e... /usr/bin/grep
879:info:configure checking for egrep... /usr/bin/grep -E
880:info:configure checking for ANSI C header files... yes
881:info:configure checking for sys/types.h... yes
882:info:configure checking for sys/stat.h... yes
883:info:configure checking for stdlib.h... yes
884:info:configure checking for string.h... yes
885:info:configure checking for memory.h... yes
886:info:configure checking for strings.h... yes
887:info:configure checking for inttypes.h... yes
888:info:configure checking for stdint.h... yes
889:info:configure checking for unistd.h... yes
890:info:configure checking sys/param.h usability... yes
891:info:configure checking sys/param.h presence... yes
892:info:configure checking for sys/param.h... yes
893:info:configure checking whether byte ordering is bigendian... no
894:info:configure checking for uint16_t... yes
895:info:configure checking for pkg-config... /opt/local/bin/pkg-config
896:info:configure checking pkg-config is at least version 0.9.0... yes
897:info:configure checking for X... libraries , headers
898:info:configure checking for XOpenDisplay in -lX11... yes
899:info:configure checking for deflate in -lz... yes
900:info:configure checking for library containing socket... none required
901:info:configure checking for library containing gethostbyname... none required
902:info:configure checking for jpeg_destroy_decompress in -ljpeg... yes
903:info:configure checking jpeglib.h usability... yes
904:info:configure checking jpeglib.h presence... yes
905:info:configure checking for jpeglib.h... yes
906:info:configure checking for TIFFReadScanline in -ltiff... yes
907:info:configure checking tiffio.h usability... yes
908:info:configure checking tiffio.h presence... yes
909:info:configure checking for tiffio.h... yes
910:info:configure checking for cairo... yes
911:info:configure    cairo CFLAGS: -I/opt/local/include/cairo -I/opt/local/include/glib-2.0 -I/opt/local/lib/glib-2.0/include -I/opt/local/include -I/opt/local/include/pixman-1 -I/opt/local/include -I/opt/local/include/freetype2 -I/opt/local/include -I/opt/local/include/freetype2 -I/opt/local/include/libpng15 -I/opt/local/include
912:info:configure    cairo LIBS: -L/opt/local/lib -lcairo
913:info:configure checking for POPPLER... yes
914:info:configure    poppler CFLAGS: -D_REENTRANT -I/opt/local/include/poppler/glib -I/opt/local/include/poppler -I/opt/local/include/cairo -I/opt/local/include/glib-2.0 -I/opt/local/lib/glib-2.0/include -I/opt/local/include -I/opt/local/include/pixman-1 -I/opt/local/include -I/opt/local/include/freetype2 -I/opt/local/include -I/opt/local/include/freetype2 -I/opt/local/include/libpng15 -I/opt/local/include
915:info:configure    poppler LIBS: -L/opt/local/lib -lpoppler-glib -lgio-2.0 -lgobject-2.0 -lglib-2.0 -lintl -lcairo
916:info:configure checking for library containing dlopen... none required
917:info:configure checking for tgetent in -ltinfo... no
918:info:configure checking for library containing wbkgdset... -lncurses
919:info:configure checking ncurses.h usability... yes
920:info:configure checking ncurses.h presence... yes
921:info:configure checking for ncurses.h... yes
922:info:configure configure: creating ./config.status
923:info:configure config.status: creating Makefile
924:info:configure config.status: creating src/gle/Makefile
925:info:configure config.status: creating src/gle/bitmap/Makefile
926:info:configure config.status: creating src/gle/letzfitz/Makefile
927:info:configure config.status: creating src/gle/surface/Makefile
928:info:configure config.status: creating src/gle/tokens/Makefile
929:info:configure config.status: creating src/fbuild/Makefile
930:info:configure config.status: creating src/makefmt/Makefile
931:info:configure config.status: creating src/manip/Makefile
932:info:configure config.status: creating src/TeX/Makefile
933:info:configure config.status: creating src/gui/MakefileAC
934:info:configure config.status: creating src/gui/qgle.pro
935:info:configure config.status: creating src/doc/gle.1
936:info:configure config.status: creating platform/autoconf/gle-graphics.pc
937:info:configure config.status: creating platform/autopackage/gle4.apspec
938:info:configure config.status: creating src/config.h
939:info:configure
940:info:configure CPPFLAGS: -DHAVE_CONFIG_H $(VERSION_INFO) -Wno-write-strings -D_REENTRANT -I/opt/local/include/poppler/glib -I/opt/local/include/poppler -I/opt/local/include/cairo -I/opt/local/include/glib-2.0 -I/opt/local/lib/glib-2.0/include -I/opt/local/include -I/opt/local/include/pixman-1 -I/opt/local/include -I/opt/local/include/freetype2 -I/opt/local/include -I/opt/local/include/freetype2 -I/opt/local/include/libpng15 -I/opt/local/include  -I/opt/local/include/cairo -I/opt/local/include/glib-2.0 -I/opt/local/lib/glib-2.0/include -I/opt/local/include -I/opt/local/include/pixman-1 -I/opt/local/include -I/opt/local/include/freetype2 -I/opt/local/include -I/opt/local/include/freetype2 -I/opt/local/include/libpng15 -I/opt/local/include  -I/opt/local/include -I/opt/local/include -I/opt/local/include -I/opt/local/include
941:info:configure LDFLAGS:   -L/opt/local/lib -Wl,-headerpad_max_install_names -arch x86_64 -L. -L/opt/local/lib -L/opt/local/lib -L/opt/local/lib
942:info:configure LIBS: -L/opt/local/lib -lpoppler-glib -lgio-2.0 -lgobject-2.0 -lglib-2.0 -lintl -lcairo  -L/opt/local/lib -lcairo  -lpng -ltiff -ljpeg -lz -lX11 
943:info:configure SIMPLE_LIBS:
944:info:configure SIMPLE_LIBS_DL:
945:info:configure SIMPLE_LDFLAGS: -L/opt/local/lib -Wl,-headerpad_max_install_names -arch x86_64
946:info:configure
947:info:configure ** Configuration summary for GLE 4.2.4c (x86_64-apple-darwin13.0.0):
948:info:configure
949:info:configure    ** Bitmap support:
950:info:configure       PNG support: yes
951:info:configure       TIFF support: yes
952:info:configure       JPEG support: yes
953:info:configure       Statically link: no
954:info:configure
955:info:configure    ** X11 preview support: yes
956:info:configure    ** Cairo graphics support: yes
957:info:configure    ** Poppler PDF support: yes
958:info:configure    ** Socket support: yes
959:info:configure    ** Include 'manip' utility: yes
960:info:configure    ** Debug mode: off
961:info:configure
962:info:configure    ** GLE GUI support: no
963:info:configure       (make sure you have Qt >= 4.1.1 devel and use ./configure --with-qt=/path/to/qt.)
964:info:configure
965:info:configure ** Install data into: /opt/local/share/gle-graphics/4.2.4c
966:info:configure ** Install binary into: /opt/local/bin
967:info:configure    (use ./configure --prefix=dir to change the installation directory.)
968:info:configure
969:info:configure GLE 4.2.4c has been configured. The next step is to run "make". After "make" completes, run "make install" to install GLE.
970:debug:configure Privilege de-escalation not attempted as not running as root.
971:debug:build build phase started at Wed Dec 11 08:30:46 SAST 2013
972:notice:build --->  Building gle-graphics
973:debug:build Executing org.macports.build (gle-graphics)
974:debug:build Environment: CPATH='/opt/local/include' CC_PRINT_OPTIONS_FILE='/opt/local/var/macports/build/_opt_local_var_macports_sources_rsync.macports.org_release_ports_graphics_gle-graphics/gle-graphics/work/.CC_PRINT_OPTIONS' LIBRARY_PATH='/opt/local/lib' CC_PRINT_OPTIONS='YES' MACOSX_DEPLOYMENT_TARGET='10.9'
975:debug:build Assembled command: 'cd "/opt/local/var/macports/build/_opt_local_var_macports_sources_rsync.macports.org_release_ports_graphics_gle-graphics/gle-graphics/work/gle-graphics-4.2.4c" && /usr/bin/make -j8 -w all'
976:debug:build Executing command line:  cd "/opt/local/var/macports/build/_opt_local_var_macports_sources_rsync.macports.org_release_ports_graphics_gle-graphics/gle-graphics/work/gle-graphics-4.2.4c" && /usr/bin/make -j8 -w all
977:info:build make: Entering directory `/opt/local/var/macports/build/_opt_local_var_macports_sources_rsync.macports.org_release_ports_graphics_gle-graphics/gle-graphics/work/gle-graphics-4.2.4c'
978:info:build /opt/local/bin/gmkdir -p build
979:info:build /opt/local/bin/gmkdir -p build/bin
980:info:build /opt/local/bin/gmkdir -p build/lib
981:info:build /opt/local/bin/gmkdir -p build/doc
982:info:build /opt/local/bin/gmkdir -p build/gleinc
983:info:build /Applications/Xcode.app/Contents/Developer/usr/bin/make -C src/gle make_glebtool
984:info:build make[1]: Entering directory `/opt/local/var/macports/build/_opt_local_var_macports_sources_rsync.macports.org_release_ports_graphics_gle-graphics/gle-graphics/work/gle-graphics-4.2.4c/src/gle'
985:info:build /usr/bin/clang++ -DHAVE_CONFIG_H -DGLEVN="\"4.2.4c\"" -Wno-write-strings -D_REENTRANT -I/opt/local/include/poppler/glib -I/opt/local/include/poppler -I/opt/local/include/cairo -I/opt/local/include/glib-2.0 -I/opt/local/lib/glib-2.0/include -I/opt/local/include -I/opt/local/include/pixman-1 -I/opt/local/include -I/opt/local/include/freetype2 -I/opt/local/include -I/opt/local/include/freetype2 -I/opt/local/include/libpng15 -I/opt/local/include -I/opt/local/include/cairo -I/opt/local/include/glib-2.0 -I/opt/local/lib/glib-2.0/include -I/opt/local/include -I/opt/local/include/pixman-1 -I/opt/local/include -I/opt/local/include/freetype2 -I/opt/local/include -I/opt/local/include/freetype2 -I/opt/local/include/libpng15 -I/opt/local/include -I/opt/local/include -I/opt/local/include -I/opt/local/include -I/opt/local/include -c cutils.cpp -o cutils.o
986:info:build /usr/bin/clang++ -DHAVE_CONFIG_H -DGLEVN="\"4.2.4c\"" -Wno-write-strings -D_REENTRANT -I/opt/local/include/poppler/glib -I/opt/local/include/poppler -I/opt/local/include/cairo -I/opt/local/include/glib-2.0 -I/opt/local/lib/glib-2.0/include -I/opt/local/include -I/opt/local/include/pixman-1 -I/opt/local/include -I/opt/local/include/freetype2 -I/opt/local/include -I/opt/local/include/freetype2 -I/opt/local/include/libpng15 -I/opt/local/include -I/opt/local/include/cairo -I/opt/local/include/glib-2.0 -I/opt/local/lib/glib-2.0/include -I/opt/local/include -I/opt/local/include/pixman-1 -I/opt/local/include -I/opt/local/include/freetype2 -I/opt/local/include -I/opt/local/include/freetype2 -I/opt/local/include/libpng15 -I/opt/local/include -I/opt/local/include -I/opt/local/include -I/opt/local/include -I/opt/local/include -c file_io.cpp -o file_io.o
987:info:build echo "begin config gle" > ../../build/glerc
988:info:build echo "   current = 4.2.4c" >> ../../build/glerc
989:info:build echo "end config" >> ../../build/glerc
990:info:build /usr/bin/clang++ -DHAVE_CONFIG_H -DGLEVN="\"4.2.4c\"" -Wno-write-strings -D_REENTRANT -I/opt/local/include/poppler/glib -I/opt/local/include/poppler -I/opt/local/include/cairo -I/opt/local/include/glib-2.0 -I/opt/local/lib/glib-2.0/include -I/opt/local/include -I/opt/local/include/pixman-1 -I/opt/local/include -I/opt/local/include/freetype2 -I/opt/local/include -I/opt/local/include/freetype2 -I/opt/local/include/libpng15 -I/opt/local/include -I/opt/local/include/cairo -I/opt/local/include/glib-2.0 -I/opt/local/lib/glib-2.0/include -I/opt/local/include -I/opt/local/include/pixman-1 -I/opt/local/include -I/opt/local/include/freetype2 -I/opt/local/include -I/opt/local/include/freetype2 -I/opt/local/include/libpng15 -I/opt/local/include -I/opt/local/include -I/opt/local/include -I/opt/local/include -I/opt/local/include -L/opt/local/lib -Wl,-headerpad_max_install_names -arch x86_64 glebtool.cpp cutils.o file_io.o   -o ../../build/bin/glebtool
991:info:build ../../build/bin/glebtool -setrelpath /opt/local/bin /opt/local/lib /opt/local/share/gle-graphics/4.2.4c /opt/local/share/doc/gle-graphics ../config.h
992:info:build GLE will be installed as follows:
993:info:build Binary:   "/opt/local/bin"
994:info:build Library:  "/opt/local/lib"
995:info:build           (Up: 1, Relative: "lib")
996:info:build GLE_TOP:  "/opt/local/share/gle-graphics/4.2.4c"
997:info:build           (Up: 1, Relative: "share/gle-graphics/4.2.4c")
998:info:build DOC:      "/opt/local/share/doc/gle-graphics"
999:info:build           (Up: 2, Relative: "doc/gle-graphics")
1000:info:build make[1]: Leaving directory `/opt/local/var/macports/build/_opt_local_var_macports_sources_rsync.macports.org_release_ports_graphics_gle-graphics/gle-graphics/work/gle-graphics-4.2.4c/src/gle'
1001:info:build /Applications/Xcode.app/Contents/Developer/usr/bin/make -C src/gle/bitmap
1002:info:build make[1]: Entering directory `/opt/local/var/macports/build/_opt_local_var_macports_sources_rsync.macports.org_release_ports_graphics_gle-graphics/gle-graphics/work/gle-graphics-4.2.4c/src/gle/bitmap'
1003:info:build /usr/bin/clang++ -DHAVE_CONFIG_H -DGLEVN="\"4.2.4c\"" -Wno-write-strings -D_REENTRANT -I/opt/local/include/poppler/glib -I/opt/local/include/poppler -I/opt/local/include/cairo -I/opt/local/include/glib-2.0 -I/opt/local/lib/glib-2.0/include -I/opt/local/include -I/opt/local/include/pixman-1 -I/opt/local/include -I/opt/local/include/freetype2 -I/opt/local/include -I/opt/local/include/freetype2 -I/opt/local/include/libpng15 -I/opt/local/include -I/opt/local/include/cairo -I/opt/local/include/glib-2.0 -I/opt/local/lib/glib-2.0/include -I/opt/local/include -I/opt/local/include/pixman-1 -I/opt/local/include -I/opt/local/include/freetype2 -I/opt/local/include -I/opt/local/include/freetype2 -I/opt/local/include/libpng15 -I/opt/local/include -I/opt/local/include -I/opt/local/include -I/opt/local/include -I/opt/local/include -c img2ps.cpp -o img2ps.o
1004:info:build /usr/bin/clang++ -DHAVE_CONFIG_H -DGLEVN="\"4.2.4c\"" -Wno-write-strings -D_REENTRANT -I/opt/local/include/poppler/glib -I/opt/local/include/poppler -I/opt/local/include/cairo -I/opt/local/include/glib-2.0 -I/opt/local/lib/glib-2.0/include -I/opt/local/include -I/opt/local/include/pixman-1 -I/opt/local/include -I/opt/local/include/freetype2 -I/opt/local/include -I/opt/local/include/freetype2 -I/opt/local/include/libpng15 -I/opt/local/include -I/opt/local/include/cairo -I/opt/local/include/glib-2.0 -I/opt/local/lib/glib-2.0/include -I/opt/local/include -I/opt/local/include/pixman-1 -I/opt/local/include -I/opt/local/include/freetype2 -I/opt/local/include -I/opt/local/include/freetype2 -I/opt/local/include/libpng15 -I/opt/local/include -I/opt/local/include -I/opt/local/include -I/opt/local/include -I/opt/local/include -c lzwencode.cpp -o lzwencode.o
1005:info:build /usr/bin/clang++ -DHAVE_CONFIG_H -DGLEVN="\"4.2.4c\"" -Wno-write-strings -D_REENTRANT -I/opt/local/include/poppler/glib -I/opt/local/include/poppler -I/opt/local/include/cairo -I/opt/local/include/glib-2.0 -I/opt/local/lib/glib-2.0/include -I/opt/local/include -I/opt/local/include/pixman-1 -I/opt/local/include -I/opt/local/include/freetype2 -I/opt/local/include -I/opt/local/include/freetype2 -I/opt/local/include/libpng15 -I/opt/local/include -I/opt/local/include/cairo -I/opt/local/include/glib-2.0 -I/opt/local/lib/glib-2.0/include -I/opt/local/include -I/opt/local/include/pixman-1 -I/opt/local/include -I/opt/local/include/freetype2 -I/opt/local/include -I/opt/local/include/freetype2 -I/opt/local/include/libpng15 -I/opt/local/include -I/opt/local/include -I/opt/local/include -I/opt/local/include -I/opt/local/include -c glegif.cpp -o glegif.o
1006:info:build /usr/bin/clang++ -DHAVE_CONFIG_H -DGLEVN="\"4.2.4c\"" -Wno-write-strings -D_REENTRANT -I/opt/local/include/poppler/glib -I/opt/local/include/poppler -I/opt/local/include/cairo -I/opt/local/include/glib-2.0 -I/opt/local/lib/glib-2.0/include -I/opt/local/include -I/opt/local/include/pixman-1 -I/opt/local/include -I/opt/local/include/freetype2 -I/opt/local/include -I/opt/local/include/freetype2 -I/opt/local/include/libpng15 -I/opt/local/include -I/opt/local/include/cairo -I/opt/local/include/glib-2.0 -I/opt/local/lib/glib-2.0/include -I/opt/local/include -I/opt/local/include/pixman-1 -I/opt/local/include -I/opt/local/include/freetype2 -I/opt/local/include -I/opt/local/include/freetype2 -I/opt/local/include/libpng15 -I/opt/local/include -I/opt/local/include -I/opt/local/include -I/opt/local/include -I/opt/local/include -c glejpeg.cpp -o glejpeg.o
1007:info:build /usr/bin/clang++ -DHAVE_CONFIG_H -DGLEVN="\"4.2.4c\"" -Wno-write-strings -D_REENTRANT -I/opt/local/include/poppler/glib -I/opt/local/include/poppler -I/opt/local/include/cairo -I/opt/local/include/glib-2.0 -I/opt/local/lib/glib-2.0/include -I/opt/local/include -I/opt/local/include/pixman-1 -I/opt/local/include -I/opt/local/include/freetype2 -I/opt/local/include -I/opt/local/include/freetype2 -I/opt/local/include/libpng15 -I/opt/local/include -I/opt/local/include/cairo -I/opt/local/include/glib-2.0 -I/opt/local/lib/glib-2.0/include -I/opt/local/include -I/opt/local/include/pixman-1 -I/opt/local/include -I/opt/local/include/freetype2 -I/opt/local/include -I/opt/local/include/freetype2 -I/opt/local/include/libpng15 -I/opt/local/include -I/opt/local/include -I/opt/local/include -I/opt/local/include -I/opt/local/include -c gletiff.cpp -o gletiff.o
1008:info:build /usr/bin/clang++ -DHAVE_CONFIG_H -DGLEVN="\"4.2.4c\"" -Wno-write-strings -D_REENTRANT -I/opt/local/include/poppler/glib -I/opt/local/include/poppler -I/opt/local/include/cairo -I/opt/local/include/glib-2.0 -I/opt/local/lib/glib-2.0/include -I/opt/local/include -I/opt/local/include/pixman-1 -I/opt/local/include -I/opt/local/include/freetype2 -I/opt/local/include -I/opt/local/include/freetype2 -I/opt/local/include/libpng15 -I/opt/local/include -I/opt/local/include/cairo -I/opt/local/include/glib-2.0 -I/opt/local/lib/glib-2.0/include -I/opt/local/include -I/opt/local/include/pixman-1 -I/opt/local/include -I/opt/local/include/freetype2 -I/opt/local/include -I/opt/local/include/freetype2 -I/opt/local/include/libpng15 -I/opt/local/include -I/opt/local/include -I/opt/local/include -I/opt/local/include -I/opt/local/include -c glepng.cpp -o glepng.o
1009:info:build /usr/bin/clang++ -DHAVE_CONFIG_H -DGLEVN="\"4.2.4c\"" -Wno-write-strings -D_REENTRANT -I/opt/local/include/poppler/glib -I/opt/local/include/poppler -I/opt/local/include/cairo -I/opt/local/include/glib-2.0 -I/opt/local/lib/glib-2.0/include -I/opt/local/include -I/opt/local/include/pixman-1 -I/opt/local/include -I/opt/local/include/freetype2 -I/opt/local/include -I/opt/local/include/freetype2 -I/opt/local/include/libpng15 -I/opt/local/include -I/opt/local/include/cairo -I/opt/local/include/glib-2.0 -I/opt/local/lib/glib-2.0/include -I/opt/local/include -I/opt/local/include/pixman-1 -I/opt/local/include -I/opt/local/include/freetype2 -I/opt/local/include -I/opt/local/include/freetype2 -I/opt/local/include/libpng15 -I/opt/local/include -I/opt/local/include -I/opt/local/include -I/opt/local/include -I/opt/local/include -c ascii85.cpp -o ascii85.o
1010:info:build make[1]: Leaving directory `/opt/local/var/macports/build/_opt_local_var_macports_sources_rsync.macports.org_release_ports_graphics_gle-graphics/gle-graphics/work/gle-graphics-4.2.4c/src/gle/bitmap'
1011:info:build /Applications/Xcode.app/Contents/Developer/usr/bin/make -C src/gle/surface
1012:info:build make[1]: Entering directory `/opt/local/var/macports/build/_opt_local_var_macports_sources_rsync.macports.org_release_ports_graphics_gle-graphics/gle-graphics/work/gle-graphics-4.2.4c/src/gle/surface'
1013:info:build /usr/bin/clang++ -DHAVE_CONFIG_H -DGLEVN="\"4.2.4c\"" -Wno-write-strings -D_REENTRANT -I/opt/local/include/poppler/glib -I/opt/local/include/poppler -I/opt/local/include/cairo -I/opt/local/include/glib-2.0 -I/opt/local/lib/glib-2.0/include -I/opt/local/include -I/opt/local/include/pixman-1 -I/opt/local/include -I/opt/local/include/freetype2 -I/opt/local/include -I/opt/local/include/freetype2 -I/opt/local/include/libpng15 -I/opt/local/include -I/opt/local/include/cairo -I/opt/local/include/glib-2.0 -I/opt/local/lib/glib-2.0/include -I/opt/local/include -I/opt/local/include/pixman-1 -I/opt/local/include -I/opt/local/include/freetype2 -I/opt/local/include -I/opt/local/include/freetype2 -I/opt/local/include/libpng15 -I/opt/local/include -I/opt/local/include -I/opt/local/include -I/opt/local/include -I/opt/local/include -c gsurface.cpp -o gsurface.o
1014:info:build /usr/bin/clang++ -DHAVE_CONFIG_H -DGLEVN="\"4.2.4c\"" -Wno-write-strings -D_REENTRANT -I/opt/local/include/poppler/glib -I/opt/local/include/poppler -I/opt/local/include/cairo -I/opt/local/include/glib-2.0 -I/opt/local/lib/glib-2.0/include -I/opt/local/include -I/opt/local/include/pixman-1 -I/opt/local/include -I/opt/local/include/freetype2 -I/opt/local/include -I/opt/local/include/freetype2 -I/opt/local/include/libpng15 -I/opt/local/include -I/opt/local/include/cairo -I/opt/local/include/glib-2.0 -I/opt/local/lib/glib-2.0/include -I/opt/local/include -I/opt/local/include/pixman-1 -I/opt/local/include -I/opt/local/include/freetype2 -I/opt/local/include -I/opt/local/include/freetype2 -I/opt/local/include/libpng15 -I/opt/local/include -I/opt/local/include -I/opt/local/include -I/opt/local/include -I/opt/local/include -c hide.cpp -o hide.o
1015:info:build /usr/bin/clang++ -DHAVE_CONFIG_H -DGLEVN="\"4.2.4c\"" -Wno-write-strings -D_REENTRANT -I/opt/local/include/poppler/glib -I/opt/local/include/poppler -I/opt/local/include/cairo -I/opt/local/include/glib-2.0 -I/opt/local/lib/glib-2.0/include -I/opt/local/include -I/opt/local/include/pixman-1 -I/opt/local/include -I/opt/local/include/freetype2 -I/opt/local/include -I/opt/local/include/freetype2 -I/opt/local/include/libpng15 -I/opt/local/include -I/opt/local/include/cairo -I/opt/local/include/glib-2.0 -I/opt/local/lib/glib-2.0/include -I/opt/local/include -I/opt/local/include/pixman-1 -I/opt/local/include -I/opt/local/include/freetype2 -I/opt/local/include -I/opt/local/include/freetype2 -I/opt/local/include/libpng15 -I/opt/local/include -I/opt/local/include -I/opt/local/include -I/opt/local/include -I/opt/local/include -c fcontour.cpp -o fcontour.o
1016:info:build /usr/bin/clang++ -DHAVE_CONFIG_H -DGLEVN="\"4.2.4c\"" -Wno-write-strings -D_REENTRANT -I/opt/local/include/poppler/glib -I/opt/local/include/poppler -I/opt/local/include/cairo -I/opt/local/include/glib-2.0 -I/opt/local/lib/glib-2.0/include -I/opt/local/include -I/opt/local/include/pixman-1 -I/opt/local/include -I/opt/local/include/freetype2 -I/opt/local/include -I/opt/local/include/freetype2 -I/opt/local/include/libpng15 -I/opt/local/include -I/opt/local/include/cairo -I/opt/local/include/glib-2.0 -I/opt/local/lib/glib-2.0/include -I/opt/local/include -I/opt/local/include/pixman-1 -I/opt/local/include -I/opt/local/include/freetype2 -I/opt/local/include -I/opt/local/include/freetype2 -I/opt/local/include/libpng15 -I/opt/local/include -I/opt/local/include -I/opt/local/include -I/opt/local/include -I/opt/local/include -c ffitcontour.cpp -o ffitcontour.o
1017:info:build /usr/bin/clang++ -DHAVE_CONFIG_H -DGLEVN="\"4.2.4c\"" -Wno-write-strings -D_REENTRANT -I/opt/local/include/poppler/glib -I/opt/local/include/poppler -I/opt/local/include/cairo -I/opt/local/include/glib-2.0 -I/opt/local/lib/glib-2.0/include -I/opt/local/include -I/opt/local/include/pixman-1 -I/opt/local/include -I/opt/local/include/freetype2 -I/opt/local/include -I/opt/local/include/freetype2 -I/opt/local/include/libpng15 -I/opt/local/include -I/opt/local/include/cairo -I/opt/local/include/glib-2.0 -I/opt/local/lib/glib-2.0/include -I/opt/local/include -I/opt/local/include/pixman-1 -I/opt/local/include -I/opt/local/include/freetype2 -I/opt/local/include -I/opt/local/include/freetype2 -I/opt/local/include/libpng15 -I/opt/local/include -I/opt/local/include -I/opt/local/include -I/opt/local/include -I/opt/local/include -c gcontour.cpp -o gcontour.o
1018:info:build In file included from gcontour.cpp:43:
1019:info:build In file included from ./../all.h:73:
1020:info:build In file included from ./../glepro.h:42:
1021:info:build In file included from ./../tokens/Tokenizer.h:51:
1022:info:build ./../tokens/StringKeyHash.h:79:18: error: expected namespace name
1023:info:build         using namespace __gnu_cxx;  // using gnu extensions such as "hash"
1024:info:build                         ^
1025:info:build In file included from hide.cpp:43:
1026:info:build In file included from ./../all.h:73:
1027:info:build In file included from ./../glepro.h:42:
1028:info:build In file included from ./../tokens/Tokenizer.h:51:
1029:info:build ./../tokens/StringKeyHash.h:79:18: error: expected namespace name
1030:info:build         using namespace __gnu_cxx;  // using gnu extensions such as "hash"
1031:info:build                         ^
1032:info:build In file included from gsurface.cpp:44:
1033:info:build In file included from ./../all.h:73:
1034:info:build In file included from ./../glepro.h:42:
1035:info:build In file included from ./../tokens/Tokenizer.h:51:
1036:info:build ./../tokens/StringKeyHash.h:79:18: error: expected namespace name
1037:info:build         using namespace __gnu_cxx;  // using gnu extensions such as "hash"
1038:info:build                         ^
1039:info:build 1 error generated.
1040:info:build make[1]: *** [hide.o] Error 1
1041:info:build make[1]: *** Waiting for unfinished jobs....
1042:info:build 1 error generated.
1043:info:build make[1]: *** [gcontour.o] Error 1
1044:info:build 1 error generated.
1045:info:build make[1]: *** [gsurface.o] Error 1
1046:info:build make[1]: Leaving directory `/opt/local/var/macports/build/_opt_local_var_macports_sources_rsync.macports.org_release_ports_graphics_gle-graphics/gle-graphics/work/gle-graphics-4.2.4c/src/gle/surface'
1047:info:build make: *** [make_all] Error 2
1048:info:build make: Leaving directory `/opt/local/var/macports/build/_opt_local_var_macports_sources_rsync.macports.org_release_ports_graphics_gle-graphics/gle-graphics/work/gle-graphics-4.2.4c'
1049:info:build Command failed:  cd "/opt/local/var/macports/build/_opt_local_var_macports_sources_rsync.macports.org_release_ports_graphics_gle-graphics/gle-graphics/work/gle-graphics-4.2.4c" && /usr/bin/make -j8 -w all
1050:info:build Exit code: 2
1051:error:build org.macports.build for port gle-graphics returned: command execution failed
1052:debug:build Error code: CHILDSTATUS 6084 2
1053:debug:build Backtrace: command execution failed
1054    while executing
1055"system -nice 0 $fullcmdstring"
1056    ("eval" body line 1)
1057    invoked from within
1058"eval system $notty $nice \$fullcmdstring"
1059    invoked from within
1060"command_exec build"
1061    (procedure "portbuild::build_main" line 8)
1062    invoked from within
1063"$procedure $targetname"
1064:info:build Warning: targets not executed for gle-graphics: org.macports.activate org.macports.build org.macports.destroot org.macports.install
1065:notice:build Please see the log file for port gle-graphics for details:
1066    /opt/local/var/macports/logs/_opt_local_var_macports_sources_rsync.macports.org_release_ports_graphics_gle-graphics/gle-graphics/main.log