Ticket #42704: meld.log

File meld.log, 100.4 KB (added by rcobbe, 7 years ago)
Line 
1version:1
2:debug:main epoch: in tree: 0 installed: 0
3:debug:main xz 5.0.5_0 exists in the ports tree
4:debug:main xz 5.0.5_0  is the latest installed
5:debug:main xz 5.0.5_0  is active
6:debug:main Merging existing variants '' into variants
7:debug:main new fully merged portvariants:
8:debug:main Changing to port directory: /opt/local/var/macports/sources/rsync.macports.org/release/tarballs/ports/archivers/xz
9:debug:main OS darwin/13.1.0 (Mac OS X 10.9) arch i386
10:debug:main adding the default universal variant
11:debug:main Reading variant descriptions from /opt/local/var/macports/sources/rsync.macports.org/release/tarballs/ports/_resources/port1.0/variant_descriptions.conf
12:debug:main Running callback portconfigure::add_automatic_compiler_dependencies
13:debug:main Finished running callback portconfigure::add_automatic_compiler_dependencies
14:debug:main Running callback portbuild::add_automatic_buildsystem_dependencies
15:debug:main Finished running callback portbuild::add_automatic_buildsystem_dependencies
16:debug:main No need to upgrade! xz 5.0.5_0 >= xz 5.0.5_0
17:debug:main epoch: in tree: 0 installed: 0
18:debug:main libiconv 1.14_0 exists in the ports tree
19:debug:main libiconv 1.14_0  is the latest installed
20:debug:main libiconv 1.14_0  is active
21:debug:main Merging existing variants '' into variants
22:debug:main new fully merged portvariants:
23:debug:main Changing to port directory: /opt/local/var/macports/sources/rsync.macports.org/release/tarballs/ports/textproc/libiconv
24:debug:main OS darwin/13.1.0 (Mac OS X 10.9) arch i386
25:debug:main Reading variant descriptions from /opt/local/var/macports/sources/rsync.macports.org/release/tarballs/ports/_resources/port1.0/variant_descriptions.conf
26:debug:main universal variant already exists, so not adding the default one
27:debug:main Running callback portconfigure::add_automatic_compiler_dependencies
28:debug:main Finished running callback portconfigure::add_automatic_compiler_dependencies
29:debug:main Running callback portbuild::add_automatic_buildsystem_dependencies
30:debug:main Finished running callback portbuild::add_automatic_buildsystem_dependencies
31:debug:main No need to upgrade! libiconv 1.14_0 >= libiconv 1.14_0
32:debug:main epoch: in tree: 0 installed: 0
33:debug:main gettext 0.18.3.2_0 exists in the ports tree
34:debug:main gettext 0.18.3.2_0  is the latest installed
35:debug:main gettext 0.18.3.2_0  is active
36:debug:main Merging existing variants '' into variants
37:debug:main new fully merged portvariants:
38:debug:main Changing to port directory: /opt/local/var/macports/sources/rsync.macports.org/release/tarballs/ports/devel/gettext
39:debug:main OS darwin/13.1.0 (Mac OS X 10.9) arch i386
40:debug:main Reading variant descriptions from /opt/local/var/macports/sources/rsync.macports.org/release/tarballs/ports/_resources/port1.0/variant_descriptions.conf
41:debug:main compiler clang 500.2.79 not blacklisted because it doesn't match {clang < 211.10.1}
42:debug:main universal variant already exists, so not adding the default one
43:debug:main Running callback portconfigure::add_automatic_compiler_dependencies
44:debug:main Finished running callback portconfigure::add_automatic_compiler_dependencies
45:debug:main Running callback portbuild::add_automatic_buildsystem_dependencies
46:debug:main Finished running callback portbuild::add_automatic_buildsystem_dependencies
47:debug:main No need to upgrade! gettext 0.18.3.2_0 >= gettext 0.18.3.2_0
48:debug:main epoch: in tree: 0 installed: 0
49:debug:main expat 2.1.0_0 exists in the ports tree
50:debug:main expat 2.1.0_0  is the latest installed
51:debug:main expat 2.1.0_0  is active
52:debug:main Merging existing variants '' into variants
53:debug:main new fully merged portvariants:
54:debug:main Changing to port directory: /opt/local/var/macports/sources/rsync.macports.org/release/tarballs/ports/textproc/expat
55:debug:main OS darwin/13.1.0 (Mac OS X 10.9) arch i386
56:debug:main adding the default universal variant
57:debug:main Reading variant descriptions from /opt/local/var/macports/sources/rsync.macports.org/release/tarballs/ports/_resources/port1.0/variant_descriptions.conf
58:debug:main Running callback portconfigure::add_automatic_compiler_dependencies
59:debug:main Finished running callback portconfigure::add_automatic_compiler_dependencies
60:debug:main Running callback portbuild::add_automatic_buildsystem_dependencies
61:debug:main Finished running callback portbuild::add_automatic_buildsystem_dependencies
62:debug:main No need to upgrade! expat 2.1.0_0 >= expat 2.1.0_0
63:debug:main epoch: in tree: 0 installed: 0
64:debug:main ncurses 5.9_2 exists in the ports tree
65:debug:main ncurses 5.9_2  is the latest installed
66:debug:main ncurses 5.9_2  is active
67:debug:main Merging existing variants '' into variants
68:debug:main new fully merged portvariants:
69:debug:main Changing to port directory: /opt/local/var/macports/sources/rsync.macports.org/release/tarballs/ports/devel/ncurses
70:debug:main OS darwin/13.1.0 (Mac OS X 10.9) arch i386
71:debug:main adding the default universal variant
72:debug:main Reading variant descriptions from /opt/local/var/macports/sources/rsync.macports.org/release/tarballs/ports/_resources/port1.0/variant_descriptions.conf
73:debug:main Running callback portconfigure::add_automatic_compiler_dependencies
74:debug:main Finished running callback portconfigure::add_automatic_compiler_dependencies
75:debug:main Running callback portbuild::add_automatic_buildsystem_dependencies
76:debug:main Finished running callback portbuild::add_automatic_buildsystem_dependencies
77:debug:main No need to upgrade! ncurses 5.9_2 >= ncurses 5.9_2
78:msg:main --->  Computing dependencies for meld:info:main .:debug:main meld has no conflicts
79:debug:main Searching for dependency: xz
80:debug:main Found Dependency: receipt exists for xz
81:debug:main Searching for dependency: intltool
82:debug:main Didn't find receipt, going to depspec regex for: intltool
83:debug:main Changing to port directory: /opt/local/var/macports/sources/rsync.macports.org/release/tarballs/ports/textproc/intltool
84:debug:main OS darwin/13.1.0 (Mac OS X 10.9) arch i386
85:debug:main only one arch supported, so not adding the default universal variant
86:debug:main Executing variant perl5_16 provides perl5_16
87:debug:main Running callback portconfigure::add_automatic_compiler_dependencies
88:debug:main Finished running callback portconfigure::add_automatic_compiler_dependencies
89:debug:main Running callback portbuild::add_automatic_buildsystem_dependencies
90:debug:main Finished running callback portbuild::add_automatic_buildsystem_dependencies
91:debug:main Searching for dependency: py27-gnome
92:debug:main Didn't find receipt, going to depspec regex for: py27-gnome
93:debug:main Changing to port directory: /opt/local/var/macports/sources/rsync.macports.org/release/tarballs/ports/python/py27-gnome
94:debug:main OS darwin/13.1.0 (Mac OS X 10.9) arch i386
95:debug:main Reading variant descriptions from /opt/local/var/macports/sources/rsync.macports.org/release/tarballs/ports/_resources/port1.0/variant_descriptions.conf
96:debug:main adding the default universal variant
97:debug:main Running callback portconfigure::add_automatic_compiler_dependencies
98:debug:main Finished running callback portconfigure::add_automatic_compiler_dependencies
99:debug:main Running callback portbuild::add_automatic_buildsystem_dependencies
100:debug:main Finished running callback portbuild::add_automatic_buildsystem_dependencies
101:info:main .:debug:main intltool has no conflicts
102:debug:main Searching for dependency: expat
103:debug:main Found Dependency: receipt exists for expat
104:debug:main Searching for dependency: perl5.16
105:debug:main Found Dependency: receipt exists for perl5.16
106:debug:main Searching for dependency: p5.16-xml-parser
107:debug:main Found Dependency: receipt exists for p5.16-xml-parser
108:debug:main Searching for dependency: p5.16-getopt-long
109:debug:main Didn't find receipt, going to depspec regex for: p5.16-getopt-long
110:debug:main Changing to port directory: /opt/local/var/macports/sources/rsync.macports.org/release/tarballs/ports/perl/p5-getopt-long
111:debug:main OS darwin/13.1.0 (Mac OS X 10.9) arch i386
112:debug:main Re-registering default for livecheck.version
113:debug:main Re-registering default for configure.universal_args
114:debug:main only one arch supported, so not adding the default universal variant
115:debug:main Running callback portconfigure::add_automatic_compiler_dependencies
116:debug:main Finished running callback portconfigure::add_automatic_compiler_dependencies
117:debug:main Running callback portbuild::add_automatic_buildsystem_dependencies
118:debug:main Finished running callback portbuild::add_automatic_buildsystem_dependencies
119:debug:main Searching for dependency: p5.16-pathtools
120:debug:main Didn't find receipt, going to depspec regex for: p5.16-pathtools
121:debug:main Changing to port directory: /opt/local/var/macports/sources/rsync.macports.org/release/tarballs/ports/perl/p5-pathtools
122:debug:main OS darwin/13.1.0 (Mac OS X 10.9) arch i386
123:debug:main Re-registering default for livecheck.version
124:debug:main Re-registering default for configure.universal_args
125:debug:main adding the default universal variant
126:debug:main Reading variant descriptions from /opt/local/var/macports/sources/rsync.macports.org/release/tarballs/ports/_resources/port1.0/variant_descriptions.conf
127:debug:main Running callback portconfigure::add_automatic_compiler_dependencies
128:debug:main Finished running callback portconfigure::add_automatic_compiler_dependencies
129:debug:main Running callback portbuild::add_automatic_buildsystem_dependencies
130:debug:main Finished running callback portbuild::add_automatic_buildsystem_dependencies
131:debug:main Searching for dependency: p5.16-scalar-list-utils
132:debug:main Didn't find receipt, going to depspec regex for: p5.16-scalar-list-utils
133:debug:main Changing to port directory: /opt/local/var/macports/sources/rsync.macports.org/release/tarballs/ports/perl/p5-scalar-list-utils
134:debug:main OS darwin/13.1.0 (Mac OS X 10.9) arch i386
135:debug:main Re-registering default for livecheck.version
136:debug:main Re-registering default for configure.universal_args
137:debug:main adding the default universal variant
138:debug:main Reading variant descriptions from /opt/local/var/macports/sources/rsync.macports.org/release/tarballs/ports/_resources/port1.0/variant_descriptions.conf
139:debug:main Running callback portconfigure::add_automatic_compiler_dependencies
140:debug:main Finished running callback portconfigure::add_automatic_compiler_dependencies
141:debug:main Running callback portbuild::add_automatic_buildsystem_dependencies
142:debug:main Finished running callback portbuild::add_automatic_buildsystem_dependencies
143:info:main .:debug:main p5.16-getopt-long has no conflicts
144:info:main .:debug:main p5.16-pathtools has no conflicts
145:info:main .:debug:main p5.16-scalar-list-utils has no conflicts
146:info:main .:debug:main py27-gnome has no conflicts
147:debug:main Searching for dependency: libgnomeui
148:debug:main Didn't find receipt, going to depspec regex for: libgnomeui
149:debug:main Changing to port directory: /opt/local/var/macports/sources/rsync.macports.org/release/tarballs/ports/gnome/libgnomeui
150:debug:main OS darwin/13.1.0 (Mac OS X 10.9) arch i386
151:debug:main Reading variant descriptions from /opt/local/var/macports/sources/rsync.macports.org/release/tarballs/ports/_resources/port1.0/variant_descriptions.conf
152:debug:main adding the default universal variant
153:debug:main Executing variant x11 provides x11
154:debug:main Running callback portconfigure::add_automatic_compiler_dependencies
155:debug:main Finished running callback portconfigure::add_automatic_compiler_dependencies
156:debug:main Running callback portbuild::add_automatic_buildsystem_dependencies
157:debug:main Finished running callback portbuild::add_automatic_buildsystem_dependencies
158:debug:main Searching for dependency: py27-pygtk
159:debug:main Didn't find receipt, going to depspec regex for: py27-pygtk
160:debug:main Changing to port directory: /opt/local/var/macports/sources/rsync.macports.org/release/tarballs/ports/python/py-pygtk
161:debug:main OS darwin/13.1.0 (Mac OS X 10.9) arch i386
162:debug:main Re-registering default for build.cmd
163:debug:main Re-registering default for destroot.cmd
164:debug:main Re-registering default for destroot.destdir
165:debug:main Reading variant descriptions from /opt/local/var/macports/sources/rsync.macports.org/release/tarballs/ports/_resources/port1.0/variant_descriptions.conf
166:debug:main adding the default universal variant
167:debug:main Executing variant x11 provides x11
168:debug:main Running callback portconfigure::add_automatic_compiler_dependencies
169:debug:main Finished running callback portconfigure::add_automatic_compiler_dependencies
170:debug:main Running callback portbuild::add_automatic_buildsystem_dependencies
171:debug:main Finished running callback portbuild::add_automatic_buildsystem_dependencies
172:debug:main Searching for dependency: py27-orbit
173:debug:main Didn't find receipt, going to depspec regex for: py27-orbit
174:debug:main Changing to port directory: /opt/local/var/macports/sources/rsync.macports.org/release/tarballs/ports/python/py27-orbit
175:debug:main OS darwin/13.1.0 (Mac OS X 10.9) arch i386
176:debug:main adding the default universal variant
177:debug:main Reading variant descriptions from /opt/local/var/macports/sources/rsync.macports.org/release/tarballs/ports/_resources/port1.0/variant_descriptions.conf
178:debug:main Running callback portconfigure::add_automatic_compiler_dependencies
179:debug:main Finished running callback portconfigure::add_automatic_compiler_dependencies
180:debug:main Running callback portbuild::add_automatic_buildsystem_dependencies
181:debug:main Finished running callback portbuild::add_automatic_buildsystem_dependencies
182:debug:main Searching for dependency: libgnome
183:debug:main Didn't find receipt, going to depspec regex for: libgnome
184:debug:main Changing to port directory: /opt/local/var/macports/sources/rsync.macports.org/release/tarballs/ports/gnome/libgnome
185:debug:main OS darwin/13.1.0 (Mac OS X 10.9) arch i386
186:debug:main adding the default universal variant
187:debug:main Reading variant descriptions from /opt/local/var/macports/sources/rsync.macports.org/release/tarballs/ports/_resources/port1.0/variant_descriptions.conf
188:debug:main Running callback portconfigure::add_automatic_compiler_dependencies
189:debug:main Finished running callback portconfigure::add_automatic_compiler_dependencies
190:debug:main Running callback portbuild::add_automatic_buildsystem_dependencies
191:debug:main Finished running callback portbuild::add_automatic_buildsystem_dependencies
192:debug:main Searching for dependency: python27
193:debug:main Found Dependency: receipt exists for python27
194:debug:main Searching for dependency: libgnomecanvas
195:debug:main Didn't find receipt, going to depspec regex for: libgnomecanvas
196:debug:main Changing to port directory: /opt/local/var/macports/sources/rsync.macports.org/release/tarballs/ports/gnome/libgnomecanvas
197:debug:main OS darwin/13.1.0 (Mac OS X 10.9) arch i386
198:debug:main Reading variant descriptions from /opt/local/var/macports/sources/rsync.macports.org/release/tarballs/ports/_resources/port1.0/variant_descriptions.conf
199:debug:main adding the default universal variant
200:debug:main Running callback portconfigure::add_automatic_compiler_dependencies
201:debug:main Finished running callback portconfigure::add_automatic_compiler_dependencies
202:debug:main Running callback portbuild::add_automatic_buildsystem_dependencies
203:debug:main Finished running callback portbuild::add_automatic_buildsystem_dependencies
204:debug:main Searching for dependency: gnome-vfs
205:debug:main Didn't find receipt, going to depspec regex for: gnome-vfs
206:debug:main Changing to port directory: /opt/local/var/macports/sources/rsync.macports.org/release/tarballs/ports/gnome/gnome-vfs
207:debug:main OS darwin/13.1.0 (Mac OS X 10.9) arch i386
208:debug:main Reading variant descriptions from /opt/local/var/macports/sources/rsync.macports.org/release/tarballs/ports/_resources/port1.0/variant_descriptions.conf
209:debug:main universal variant already exists, so not adding the default one
210:debug:main Running callback portconfigure::add_automatic_compiler_dependencies
211:debug:main Finished running callback portconfigure::add_automatic_compiler_dependencies
212:debug:main Running callback portbuild::add_automatic_buildsystem_dependencies
213:debug:main Finished running callback portbuild::add_automatic_buildsystem_dependencies
214:debug:main Searching for dependency: gconf
215:debug:main Didn't find receipt, going to depspec regex for: gconf
216:debug:main Changing to port directory: /opt/local/var/macports/sources/rsync.macports.org/release/tarballs/ports/gnome/gconf
217:debug:main OS darwin/13.1.0 (Mac OS X 10.9) arch i386
218:debug:main Reading variant descriptions from /opt/local/var/macports/sources/rsync.macports.org/release/tarballs/ports/_resources/port1.0/variant_descriptions.conf
219:debug:main universal variant already exists, so not adding the default one
220:debug:main Executing variant x11 provides x11
221:debug:main Running callback portconfigure::add_automatic_compiler_dependencies
222:debug:main Finished running callback portconfigure::add_automatic_compiler_dependencies
223:debug:main Running callback portbuild::add_automatic_buildsystem_dependencies
224:debug:main Finished running callback portbuild::add_automatic_buildsystem_dependencies
225:debug:main Searching for dependency: libbonobo
226:debug:main Didn't find receipt, going to depspec regex for: libbonobo
227:debug:main Changing to port directory: /opt/local/var/macports/sources/rsync.macports.org/release/tarballs/ports/gnome/libbonobo
228:debug:main OS darwin/13.1.0 (Mac OS X 10.9) arch i386
229:debug:main Reading variant descriptions from /opt/local/var/macports/sources/rsync.macports.org/release/tarballs/ports/_resources/port1.0/variant_descriptions.conf
230:debug:main universal variant already exists, so not adding the default one
231:debug:main Running callback portconfigure::add_automatic_compiler_dependencies
232:debug:main Finished running callback portconfigure::add_automatic_compiler_dependencies
233:debug:main Running callback portbuild::add_automatic_buildsystem_dependencies
234:debug:main Finished running callback portbuild::add_automatic_buildsystem_dependencies
235:debug:main Searching for dependency: libbonoboui
236:debug:main Didn't find receipt, going to depspec regex for: libbonoboui
237:debug:main Changing to port directory: /opt/local/var/macports/sources/rsync.macports.org/release/tarballs/ports/gnome/libbonoboui
238:debug:main OS darwin/13.1.0 (Mac OS X 10.9) arch i386
239:debug:main Reading variant descriptions from /opt/local/var/macports/sources/rsync.macports.org/release/tarballs/ports/_resources/port1.0/variant_descriptions.conf
240:debug:main adding the default universal variant
241:debug:main Executing variant x11 provides x11
242:debug:main Running callback portconfigure::add_automatic_compiler_dependencies
243:debug:main Finished running callback portconfigure::add_automatic_compiler_dependencies
244:debug:main Running callback portbuild::add_automatic_buildsystem_dependencies
245:debug:main Finished running callback portbuild::add_automatic_buildsystem_dependencies
246:info:main .:debug:main libgnomeui has no conflicts
247:debug:main Searching for dependency: libffi
248:debug:main Found Dependency: receipt exists for libffi
249:debug:main Searching for dependency: libgnome-keyring
250:debug:main Didn't find receipt, going to depspec regex for: libgnome-keyring
251:debug:main Changing to port directory: /opt/local/var/macports/sources/rsync.macports.org/release/tarballs/ports/gnome/libgnome-keyring
252:debug:main OS darwin/13.1.0 (Mac OS X 10.9) arch i386
253:debug:main adding the default universal variant
254:debug:main Reading variant descriptions from /opt/local/var/macports/sources/rsync.macports.org/release/tarballs/ports/_resources/port1.0/variant_descriptions.conf
255:debug:main Running callback portconfigure::add_automatic_compiler_dependencies
256:debug:main Finished running callback portconfigure::add_automatic_compiler_dependencies
257:debug:main Running callback portbuild::add_automatic_buildsystem_dependencies
258:debug:main Finished running callback portbuild::add_automatic_buildsystem_dependencies
259:debug:main Searching for dependency: xorg-libsm
260:debug:main Found Dependency: receipt exists for xorg-libsm
261:debug:main Searching for dependency: xorg-libice
262:debug:main Found Dependency: receipt exists for xorg-libice
263:debug:main Searching for dependency: xorg-libX11
264:debug:main Found Dependency: receipt exists for xorg-libX11
265:info:main .:debug:main libgnome-keyring has no conflicts
266:debug:main Searching for dependency: pkgconfig
267:debug:main Found Dependency: receipt exists for pkgconfig
268:debug:main Searching for dependency: autoconf
269:debug:main Found Dependency: receipt exists for autoconf
270:debug:main Searching for dependency: automake
271:debug:main Found Dependency: receipt exists for automake
272:debug:main Searching for dependency: libtool
273:debug:main Found Dependency: receipt exists for libtool
274:debug:main Searching for dependency: glib2
275:debug:main Found Dependency: receipt exists for glib2
276:debug:main Searching for dependency: gobject-introspection
277:debug:main Found Dependency: receipt exists for gobject-introspection
278:debug:main Searching for dependency: vala
279:debug:main Didn't find receipt, going to depspec regex for: vala
280:debug:main Changing to port directory: /opt/local/var/macports/sources/rsync.macports.org/release/tarballs/ports/lang/vala
281:debug:main OS darwin/13.1.0 (Mac OS X 10.9) arch i386
282:debug:main adding the default universal variant
283:debug:main Reading variant descriptions from /opt/local/var/macports/sources/rsync.macports.org/release/tarballs/ports/_resources/port1.0/variant_descriptions.conf
284:debug:main Running callback portconfigure::add_automatic_compiler_dependencies
285:debug:main Finished running callback portconfigure::add_automatic_compiler_dependencies
286:debug:main Running callback portbuild::add_automatic_buildsystem_dependencies
287:debug:main Finished running callback portbuild::add_automatic_buildsystem_dependencies
288:debug:main Searching for dependency: dbus
289:debug:main Didn't find receipt, going to depspec regex for: dbus
290:debug:main Changing to port directory: /opt/local/var/macports/sources/rsync.macports.org/release/tarballs/ports/devel/dbus
291:debug:main OS darwin/13.1.0 (Mac OS X 10.9) arch i386
292:debug:main Reading variant descriptions from /opt/local/var/macports/sources/rsync.macports.org/release/tarballs/ports/_resources/port1.0/variant_descriptions.conf
293:debug:main universal variant already exists, so not adding the default one
294:debug:main Executing variant startupitem provides startupitem
295:debug:main Running callback portconfigure::add_automatic_compiler_dependencies
296:debug:main Finished running callback portconfigure::add_automatic_compiler_dependencies
297:debug:main Running callback portbuild::add_automatic_buildsystem_dependencies
298:debug:main Finished running callback portbuild::add_automatic_buildsystem_dependencies
299:debug:main Searching for dependency: libgcrypt
300:debug:main Found Dependency: receipt exists for libgcrypt
301:info:main .:debug:main vala has no conflicts
302:info:main .:debug:main Checking for conflicts against dbus
303:debug:main Searching for dependency: dbus-devel
304:debug:main Didn't find receipt, going to depspec regex for: dbus-devel
305:info:main .:debug:main py27-pygtk has no conflicts
306:debug:main Searching for dependency: atk
307:debug:main Didn't find receipt, going to depspec regex for: atk
308:debug:main Changing to port directory: /opt/local/var/macports/sources/rsync.macports.org/release/tarballs/ports/devel/atk
309:debug:main OS darwin/13.1.0 (Mac OS X 10.9) arch i386
310:debug:main adding the default universal variant
311:debug:main Reading variant descriptions from /opt/local/var/macports/sources/rsync.macports.org/release/tarballs/ports/_resources/port1.0/variant_descriptions.conf
312:debug:main Running callback portconfigure::add_automatic_compiler_dependencies
313:debug:main Finished running callback portconfigure::add_automatic_compiler_dependencies
314:debug:main Running callback portbuild::add_automatic_buildsystem_dependencies
315:debug:main Finished running callback portbuild::add_automatic_buildsystem_dependencies
316:debug:main Searching for dependency: gtk2
317:debug:main Didn't find receipt, going to depspec regex for: gtk2
318:debug:main Changing to port directory: /opt/local/var/macports/sources/rsync.macports.org/release/tarballs/ports/gnome/gtk2
319:debug:main OS darwin/13.1.0 (Mac OS X 10.9) arch i386
320:debug:main Reading variant descriptions from /opt/local/var/macports/sources/rsync.macports.org/release/tarballs/ports/_resources/port1.0/variant_descriptions.conf
321:debug:main universal variant already exists, so not adding the default one
322:debug:main Executing variant x11 provides x11
323:debug:main Running callback portconfigure::add_automatic_compiler_dependencies
324:debug:main Finished running callback portconfigure::add_automatic_compiler_dependencies
325:debug:main Running callback portbuild::add_automatic_buildsystem_dependencies
326:debug:main Finished running callback portbuild::add_automatic_buildsystem_dependencies
327:debug:main Searching for dependency: libglade2
328:debug:main Didn't find receipt, going to depspec regex for: libglade2
329:debug:main Changing to port directory: /opt/local/var/macports/sources/rsync.macports.org/release/tarballs/ports/gnome/libglade2
330:debug:main OS darwin/13.1.0 (Mac OS X 10.9) arch i386
331:debug:main Reading variant descriptions from /opt/local/var/macports/sources/rsync.macports.org/release/tarballs/ports/_resources/port1.0/variant_descriptions.conf
332:debug:main adding the default universal variant
333:debug:main Running callback portconfigure::add_automatic_compiler_dependencies
334:debug:main Finished running callback portconfigure::add_automatic_compiler_dependencies
335:debug:main Running callback portbuild::add_automatic_buildsystem_dependencies
336:debug:main Finished running callback portbuild::add_automatic_buildsystem_dependencies
337:debug:main Searching for dependency: py27-cairo
338:debug:main Didn't find receipt, going to depspec regex for: py27-cairo
339:debug:main Changing to port directory: /opt/local/var/macports/sources/rsync.macports.org/release/tarballs/ports/python/py-cairo
340:debug:main OS darwin/13.1.0 (Mac OS X 10.9) arch i386
341:debug:main Re-registering default for build.cmd
342:debug:main Re-registering default for destroot.cmd
343:debug:main Re-registering default for destroot.destdir
344:debug:main Reading variant descriptions from /opt/local/var/macports/sources/rsync.macports.org/release/tarballs/ports/_resources/port1.0/variant_descriptions.conf
345:debug:main Checking cairo for active variants for depspec 'path:lib/pkgconfig/cairo.pc:cairo'
346:debug:main cairo is installed with the following variants: +x11
347:debug:main   required: x11, forbidden: quartz
348:debug:main   accepted
349:debug:main adding the default universal variant
350:debug:main Executing variant x11 provides x11
351:debug:main Running callback portconfigure::add_automatic_compiler_dependencies
352:debug:main Finished running callback portconfigure::add_automatic_compiler_dependencies
353:debug:main Running callback portbuild::add_automatic_buildsystem_dependencies
354:debug:main Finished running callback portbuild::add_automatic_buildsystem_dependencies
355:debug:main Searching for dependency: py27-gobject
356:debug:main Didn't find receipt, going to depspec regex for: py27-gobject
357:debug:main Changing to port directory: /opt/local/var/macports/sources/rsync.macports.org/release/tarballs/ports/python/py-gobject
358:debug:main OS darwin/13.1.0 (Mac OS X 10.9) arch i386
359:debug:main Re-registering default for build.cmd
360:debug:main Re-registering default for destroot.cmd
361:debug:main Re-registering default for destroot.destdir
362:debug:main adding the default universal variant
363:debug:main Reading variant descriptions from /opt/local/var/macports/sources/rsync.macports.org/release/tarballs/ports/_resources/port1.0/variant_descriptions.conf
364:debug:main Running callback portconfigure::add_automatic_compiler_dependencies
365:debug:main Finished running callback portconfigure::add_automatic_compiler_dependencies
366:debug:main Running callback portbuild::add_automatic_buildsystem_dependencies
367:debug:main Finished running callback portbuild::add_automatic_buildsystem_dependencies
368:debug:main Searching for dependency: py27-numpy
369:debug:main Didn't find receipt, going to depspec regex for: py27-numpy
370:debug:main Changing to port directory: /opt/local/var/macports/sources/rsync.macports.org/release/tarballs/ports/python/py-numpy
371:debug:main OS darwin/13.1.0 (Mac OS X 10.9) arch i386
372:debug:main Re-registering default for build.cmd
373:debug:main Re-registering default for destroot.cmd
374:debug:main Re-registering default for destroot.destdir
375:debug:main adding the default universal variant
376:debug:main Reading variant descriptions from /opt/local/var/macports/sources/rsync.macports.org/release/tarballs/ports/_resources/port1.0/variant_descriptions.conf
377:debug:main Running callback portconfigure::add_automatic_compiler_dependencies
378:debug:main Finished running callback portconfigure::add_automatic_compiler_dependencies
379:debug:main Running callback portbuild::add_automatic_buildsystem_dependencies
380:debug:main Finished running callback portbuild::add_automatic_buildsystem_dependencies
381:info:main .:debug:main atk has no conflicts
382:debug:main Searching for dependency: gettext
383:debug:main Found Dependency: receipt exists for gettext
384:debug:main Searching for dependency: libiconv
385:debug:main Found Dependency: receipt exists for libiconv
386:info:main .:debug:main gtk2 has no conflicts
387:debug:main Searching for dependency: pango
388:debug:main Found Dependency: receipt exists for pango
389:debug:main Searching for dependency: gdk-pixbuf2
390:debug:main Didn't find receipt, going to depspec regex for: gdk-pixbuf2
391:debug:main Changing to port directory: /opt/local/var/macports/sources/rsync.macports.org/release/tarballs/ports/graphics/gdk-pixbuf2
392:debug:main OS darwin/13.1.0 (Mac OS X 10.9) arch i386
393:debug:main Reading variant descriptions from /opt/local/var/macports/sources/rsync.macports.org/release/tarballs/ports/_resources/port1.0/variant_descriptions.conf
394:debug:main adding the default universal variant
395:debug:main Executing variant x11 provides x11
396:debug:main Running callback portconfigure::add_automatic_compiler_dependencies
397:debug:main Finished running callback portconfigure::add_automatic_compiler_dependencies
398:debug:main Running callback portbuild::add_automatic_buildsystem_dependencies
399:debug:main Finished running callback portbuild::add_automatic_buildsystem_dependencies
400:debug:main Searching for dependency: xorg-libXi
401:debug:main Didn't find receipt, going to depspec regex for: xorg-libXi
402:debug:main Changing to port directory: /opt/local/var/macports/sources/rsync.macports.org/release/tarballs/ports/x11/xorg-libXi
403:debug:main OS darwin/13.1.0 (Mac OS X 10.9) arch i386
404:debug:main adding the default universal variant
405:debug:main Reading variant descriptions from /opt/local/var/macports/sources/rsync.macports.org/release/tarballs/ports/_resources/port1.0/variant_descriptions.conf
406:debug:main Running callback portconfigure::add_automatic_compiler_dependencies
407:debug:main Finished running callback portconfigure::add_automatic_compiler_dependencies
408:debug:main Running callback portbuild::add_automatic_buildsystem_dependencies
409:debug:main Finished running callback portbuild::add_automatic_buildsystem_dependencies
410:debug:main Searching for dependency: xorg-libXrandr
411:debug:main Didn't find receipt, going to depspec regex for: xorg-libXrandr
412:debug:main Changing to port directory: /opt/local/var/macports/sources/rsync.macports.org/release/tarballs/ports/x11/xorg-libXrandr
413:debug:main OS darwin/13.1.0 (Mac OS X 10.9) arch i386
414:debug:main adding the default universal variant
415:debug:main Reading variant descriptions from /opt/local/var/macports/sources/rsync.macports.org/release/tarballs/ports/_resources/port1.0/variant_descriptions.conf
416:debug:main Running callback portconfigure::add_automatic_compiler_dependencies
417:debug:main Finished running callback portconfigure::add_automatic_compiler_dependencies
418:debug:main Running callback portbuild::add_automatic_buildsystem_dependencies
419:debug:main Finished running callback portbuild::add_automatic_buildsystem_dependencies
420:debug:main Searching for dependency: xorg-libXcursor
421:debug:main Didn't find receipt, going to depspec regex for: xorg-libXcursor
422:debug:main Changing to port directory: /opt/local/var/macports/sources/rsync.macports.org/release/tarballs/ports/x11/xorg-libXcursor
423:debug:main OS darwin/13.1.0 (Mac OS X 10.9) arch i386
424:debug:main adding the default universal variant
425:debug:main Reading variant descriptions from /opt/local/var/macports/sources/rsync.macports.org/release/tarballs/ports/_resources/port1.0/variant_descriptions.conf
426:debug:main Running callback portconfigure::add_automatic_compiler_dependencies
427:debug:main Finished running callback portconfigure::add_automatic_compiler_dependencies
428:debug:main Running callback portbuild::add_automatic_buildsystem_dependencies
429:debug:main Finished running callback portbuild::add_automatic_buildsystem_dependencies
430:debug:main Searching for dependency: xorg-libXinerama
431:debug:main Didn't find receipt, going to depspec regex for: xorg-libXinerama
432:debug:main Changing to port directory: /opt/local/var/macports/sources/rsync.macports.org/release/tarballs/ports/x11/xorg-libXinerama
433:debug:main OS darwin/13.1.0 (Mac OS X 10.9) arch i386
434:debug:main adding the default universal variant
435:debug:main Reading variant descriptions from /opt/local/var/macports/sources/rsync.macports.org/release/tarballs/ports/_resources/port1.0/variant_descriptions.conf
436:debug:main Running callback portconfigure::add_automatic_compiler_dependencies
437:debug:main Finished running callback portconfigure::add_automatic_compiler_dependencies
438:debug:main Running callback portbuild::add_automatic_buildsystem_dependencies
439:debug:main Finished running callback portbuild::add_automatic_buildsystem_dependencies
440:debug:main Searching for dependency: xorg-libXdamage
441:debug:main Didn't find receipt, going to depspec regex for: xorg-libXdamage
442:debug:main Changing to port directory: /opt/local/var/macports/sources/rsync.macports.org/release/tarballs/ports/x11/xorg-libXdamage
443:debug:main OS darwin/13.1.0 (Mac OS X 10.9) arch i386
444:debug:main adding the default universal variant
445:debug:main Reading variant descriptions from /opt/local/var/macports/sources/rsync.macports.org/release/tarballs/ports/_resources/port1.0/variant_descriptions.conf
446:debug:main Running callback portconfigure::add_automatic_compiler_dependencies
447:debug:main Finished running callback portconfigure::add_automatic_compiler_dependencies
448:debug:main Running callback portbuild::add_automatic_buildsystem_dependencies
449:debug:main Finished running callback portbuild::add_automatic_buildsystem_dependencies
450:debug:main Searching for dependency: xorg-libXcomposite
451:debug:main Didn't find receipt, going to depspec regex for: xorg-libXcomposite
452:debug:main Changing to port directory: /opt/local/var/macports/sources/rsync.macports.org/release/tarballs/ports/x11/xorg-libXcomposite
453:debug:main OS darwin/13.1.0 (Mac OS X 10.9) arch i386
454:debug:main adding the default universal variant
455:debug:main Reading variant descriptions from /opt/local/var/macports/sources/rsync.macports.org/release/tarballs/ports/_resources/port1.0/variant_descriptions.conf
456:debug:main Running callback portconfigure::add_automatic_compiler_dependencies
457:debug:main Finished running callback portconfigure::add_automatic_compiler_dependencies
458:debug:main Running callback portbuild::add_automatic_buildsystem_dependencies
459:debug:main Finished running callback portbuild::add_automatic_buildsystem_dependencies
460:debug:main Searching for dependency: xorg-libXfixes
461:debug:main Didn't find receipt, going to depspec regex for: xorg-libXfixes
462:debug:main Changing to port directory: /opt/local/var/macports/sources/rsync.macports.org/release/tarballs/ports/x11/xorg-libXfixes
463:debug:main OS darwin/13.1.0 (Mac OS X 10.9) arch i386
464:debug:main adding the default universal variant
465:debug:main Reading variant descriptions from /opt/local/var/macports/sources/rsync.macports.org/release/tarballs/ports/_resources/port1.0/variant_descriptions.conf
466:debug:main Running callback portconfigure::add_automatic_compiler_dependencies
467:debug:main Finished running callback portconfigure::add_automatic_compiler_dependencies
468:debug:main Running callback portbuild::add_automatic_buildsystem_dependencies
469:debug:main Finished running callback portbuild::add_automatic_buildsystem_dependencies
470:debug:main Searching for dependency: shared-mime-info
471:debug:main Didn't find receipt, going to depspec regex for: shared-mime-info
472:debug:main Changing to port directory: /opt/local/var/macports/sources/rsync.macports.org/release/tarballs/ports/devel/shared-mime-info
473:debug:main OS darwin/13.1.0 (Mac OS X 10.9) arch i386
474:debug:main adding the default universal variant
475:debug:main Reading variant descriptions from /opt/local/var/macports/sources/rsync.macports.org/release/tarballs/ports/_resources/port1.0/variant_descriptions.conf
476:debug:main Running callback portconfigure::add_automatic_compiler_dependencies
477:debug:main Finished running callback portconfigure::add_automatic_compiler_dependencies
478:debug:main Running callback portbuild::add_automatic_buildsystem_dependencies
479:debug:main Finished running callback portbuild::add_automatic_buildsystem_dependencies
480:debug:main Searching for dependency: hicolor-icon-theme
481:debug:main Didn't find receipt, going to depspec regex for: hicolor-icon-theme
482:debug:main Changing to port directory: /opt/local/var/macports/sources/rsync.macports.org/release/tarballs/ports/gnome/hicolor-icon-theme
483:debug:main OS darwin/13.1.0 (Mac OS X 10.9) arch i386
484:debug:main only one arch supported, so not adding the default universal variant
485:debug:main Running callback portconfigure::add_automatic_compiler_dependencies
486:debug:main Finished running callback portconfigure::add_automatic_compiler_dependencies
487:debug:main Running callback portbuild::add_automatic_buildsystem_dependencies
488:debug:main Finished running callback portbuild::add_automatic_buildsystem_dependencies
489:info:main .:debug:main gdk-pixbuf2 has no conflicts
490:debug:main Searching for dependency: libpng
491:debug:main Found Dependency: receipt exists for libpng
492:debug:main Searching for dependency: jasper
493:debug:main Found Dependency: receipt exists for jasper
494:debug:main Searching for dependency: jpeg
495:debug:main Found Dependency: receipt exists for jpeg
496:debug:main Searching for dependency: tiff
497:debug:main Found Dependency: receipt exists for tiff
498:info:main .:debug:main xorg-libXi has no conflicts
499:debug:main Searching for dependency: xorg-libXext
500:debug:main Found Dependency: receipt exists for xorg-libXext
501:debug:main Searching for dependency: xorg-inputproto
502:debug:main Didn't find receipt, going to depspec regex for: xorg-inputproto
503:debug:main Changing to port directory: /opt/local/var/macports/sources/rsync.macports.org/release/tarballs/ports/x11/xorg-inputproto
504:debug:main OS darwin/13.1.0 (Mac OS X 10.9) arch i386
505:debug:main only one arch supported, so not adding the default universal variant
506:debug:main Running callback portconfigure::add_automatic_compiler_dependencies
507:debug:main Finished running callback portconfigure::add_automatic_compiler_dependencies
508:debug:main Running callback portbuild::add_automatic_buildsystem_dependencies
509:debug:main Finished running callback portbuild::add_automatic_buildsystem_dependencies
510:info:main .:debug:main xorg-inputproto has no conflicts
511:info:main .:debug:main xorg-libXrandr has no conflicts
512:debug:main Searching for dependency: xrender
513:debug:main Found Dependency: receipt exists for xrender
514:debug:main Searching for dependency: xorg-randrproto
515:debug:main Didn't find receipt, going to depspec regex for: xorg-randrproto
516:debug:main Changing to port directory: /opt/local/var/macports/sources/rsync.macports.org/release/tarballs/ports/x11/xorg-randrproto
517:debug:main OS darwin/13.1.0 (Mac OS X 10.9) arch i386
518:debug:main only one arch supported, so not adding the default universal variant
519:debug:main Running callback portconfigure::add_automatic_compiler_dependencies
520:debug:main Finished running callback portconfigure::add_automatic_compiler_dependencies
521:debug:main Running callback portbuild::add_automatic_buildsystem_dependencies
522:debug:main Finished running callback portbuild::add_automatic_buildsystem_dependencies
523:info:main .:debug:main xorg-randrproto has no conflicts
524:info:main .:debug:main xorg-libXcursor has no conflicts
525:info:main .:debug:main xorg-libXinerama has no conflicts
526:debug:main Searching for dependency: xorg-xineramaproto
527:debug:main Didn't find receipt, going to depspec regex for: xorg-xineramaproto
528:debug:main Changing to port directory: /opt/local/var/macports/sources/rsync.macports.org/release/tarballs/ports/x11/xorg-xineramaproto
529:debug:main OS darwin/13.1.0 (Mac OS X 10.9) arch i386
530:debug:main only one arch supported, so not adding the default universal variant
531:debug:main Running callback portconfigure::add_automatic_compiler_dependencies
532:debug:main Finished running callback portconfigure::add_automatic_compiler_dependencies
533:debug:main Running callback portbuild::add_automatic_buildsystem_dependencies
534:debug:main Finished running callback portbuild::add_automatic_buildsystem_dependencies
535:info:main .:debug:main xorg-xineramaproto has no conflicts
536:info:main .:debug:main xorg-libXdamage has no conflicts
537:debug:main Searching for dependency: xorg-damageproto
538:debug:main Didn't find receipt, going to depspec regex for: xorg-damageproto
539:debug:main Changing to port directory: /opt/local/var/macports/sources/rsync.macports.org/release/tarballs/ports/x11/xorg-damageproto
540:debug:main OS darwin/13.1.0 (Mac OS X 10.9) arch i386
541:debug:main only one arch supported, so not adding the default universal variant
542:debug:main Running callback portconfigure::add_automatic_compiler_dependencies
543:debug:main Finished running callback portconfigure::add_automatic_compiler_dependencies
544:debug:main Running callback portbuild::add_automatic_buildsystem_dependencies
545:debug:main Finished running callback portbuild::add_automatic_buildsystem_dependencies
546:info:main .:debug:main xorg-damageproto has no conflicts
547:info:main .:debug:main xorg-libXcomposite has no conflicts
548:debug:main Searching for dependency: xorg-compositeproto
549:debug:main Didn't find receipt, going to depspec regex for: xorg-compositeproto
550:debug:main Changing to port directory: /opt/local/var/macports/sources/rsync.macports.org/release/tarballs/ports/x11/xorg-compositeproto
551:debug:main OS darwin/13.1.0 (Mac OS X 10.9) arch i386
552:debug:main only one arch supported, so not adding the default universal variant
553:debug:main Running callback portconfigure::add_automatic_compiler_dependencies
554:debug:main Finished running callback portconfigure::add_automatic_compiler_dependencies
555:debug:main Running callback portbuild::add_automatic_buildsystem_dependencies
556:debug:main Finished running callback portbuild::add_automatic_buildsystem_dependencies
557:info:main .:debug:main xorg-compositeproto has no conflicts
558:info:main .:debug:main xorg-libXfixes has no conflicts
559:debug:main Searching for dependency: xorg-fixesproto
560:debug:main Didn't find receipt, going to depspec regex for: xorg-fixesproto
561:debug:main Changing to port directory: /opt/local/var/macports/sources/rsync.macports.org/release/tarballs/ports/x11/xorg-fixesproto
562:debug:main OS darwin/13.1.0 (Mac OS X 10.9) arch i386
563:debug:main only one arch supported, so not adding the default universal variant
564:debug:main Running callback portconfigure::add_automatic_compiler_dependencies
565:debug:main Finished running callback portconfigure::add_automatic_compiler_dependencies
566:debug:main Running callback portbuild::add_automatic_buildsystem_dependencies
567:debug:main Finished running callback portbuild::add_automatic_buildsystem_dependencies
568:info:main .:debug:main xorg-fixesproto has no conflicts
569:debug:main Searching for dependency: xorg-xextproto
570:debug:main Found Dependency: receipt exists for xorg-xextproto
571:info:main .:debug:main shared-mime-info has no conflicts
572:debug:main Searching for dependency: libxml2
573:debug:main Found Dependency: receipt exists for libxml2
574:info:main .:debug:main hicolor-icon-theme has no conflicts
575:info:main .:debug:main libglade2 has no conflicts
576:debug:main Searching for dependency: fontconfig
577:debug:main Found Dependency: receipt exists for fontconfig
578:info:main .:debug:main py27-cairo has no conflicts
579:debug:main Searching for dependency: cairo
580:debug:main Found Dependency: receipt exists for cairo
581:info:main .:debug:main py27-gobject has no conflicts
582:info:main .:debug:main py27-numpy has no conflicts
583:debug:main Searching for dependency: fftw-3
584:debug:main Didn't find receipt, going to depspec regex for: fftw-3
585:debug:main Changing to port directory: /opt/local/var/macports/sources/rsync.macports.org/release/tarballs/ports/math/fftw-3
586:debug:main OS darwin/13.1.0 (Mac OS X 10.9) arch i386
587:debug:main Reading variant descriptions from /opt/local/var/macports/sources/rsync.macports.org/release/tarballs/ports/_resources/port1.0/variant_descriptions.conf
588:debug:main compiler clang 500.2.79 not blacklisted because it doesn't match {clang <= 211.10.1}
589:debug:main universal variant already exists, so not adding the default one
590:debug:main Running callback portconfigure::add_automatic_compiler_dependencies
591:debug:main Finished running callback portconfigure::add_automatic_compiler_dependencies
592:debug:main Running callback portbuild::add_automatic_buildsystem_dependencies
593:debug:main Finished running callback portbuild::add_automatic_buildsystem_dependencies
594:debug:main Searching for dependency: py27-nose
595:debug:main Didn't find receipt, going to depspec regex for: py27-nose
596:debug:main Changing to port directory: /opt/local/var/macports/sources/rsync.macports.org/release/tarballs/ports/python/py-nose
597:debug:main OS darwin/13.1.0 (Mac OS X 10.9) arch i386
598:debug:main Re-registering default for build.cmd
599:debug:main Re-registering default for destroot.cmd
600:debug:main Re-registering default for destroot.destdir
601:debug:main only one arch supported, so not adding the default universal variant
602:debug:main Running callback portconfigure::add_automatic_compiler_dependencies
603:debug:main Finished running callback portconfigure::add_automatic_compiler_dependencies
604:debug:main Running callback portbuild::add_automatic_buildsystem_dependencies
605:debug:main Finished running callback portbuild::add_automatic_buildsystem_dependencies
606:info:main .:debug:main fftw-3 has no conflicts
607:info:main .:debug:main py27-nose has no conflicts
608:debug:main Searching for dependency: py27-setuptools
609:debug:main Found Dependency: receipt exists for py27-setuptools
610:debug:main Searching for dependency: nosetests_select
611:debug:main Didn't find receipt, going to depspec regex for: nosetests_select
612:debug:main Changing to port directory: /opt/local/var/macports/sources/rsync.macports.org/release/tarballs/ports/python/nosetests_select
613:debug:main OS darwin/13.1.0 (Mac OS X 10.9) arch i386
614:debug:main universal_variant is false, so not adding the default universal variant
615:debug:main Running callback portconfigure::add_automatic_compiler_dependencies
616:debug:main Finished running callback portconfigure::add_automatic_compiler_dependencies
617:debug:main Running callback portbuild::add_automatic_buildsystem_dependencies
618:debug:main Finished running callback portbuild::add_automatic_buildsystem_dependencies
619:info:main .:debug:main nosetests_select has no conflicts
620:info:main .:debug:main py27-orbit has no conflicts
621:debug:main Searching for dependency: orbit2
622:debug:main Didn't find receipt, going to depspec regex for: orbit2
623:debug:main Changing to port directory: /opt/local/var/macports/sources/rsync.macports.org/release/tarballs/ports/devel/orbit2
624:debug:main OS darwin/13.1.0 (Mac OS X 10.9) arch i386
625:debug:main Reading variant descriptions from /opt/local/var/macports/sources/rsync.macports.org/release/tarballs/ports/_resources/port1.0/variant_descriptions.conf
626:debug:main universal variant already exists, so not adding the default one
627:debug:main Running callback portconfigure::add_automatic_compiler_dependencies
628:debug:main Finished running callback portconfigure::add_automatic_compiler_dependencies
629:debug:main Running callback portbuild::add_automatic_buildsystem_dependencies
630:debug:main Finished running callback portbuild::add_automatic_buildsystem_dependencies
631:info:main .:debug:main orbit2 has no conflicts
632:debug:main Searching for dependency: libidl
633:debug:main Didn't find receipt, going to depspec regex for: libidl
634:debug:main Changing to port directory: /opt/local/var/macports/sources/rsync.macports.org/release/tarballs/ports/devel/libidl
635:debug:main OS darwin/13.1.0 (Mac OS X 10.9) arch i386
636:debug:main Reading variant descriptions from /opt/local/var/macports/sources/rsync.macports.org/release/tarballs/ports/_resources/port1.0/variant_descriptions.conf
637:debug:main universal variant already exists, so not adding the default one
638:debug:main Running callback portconfigure::add_automatic_compiler_dependencies
639:debug:main Finished running callback portconfigure::add_automatic_compiler_dependencies
640:debug:main Running callback portbuild::add_automatic_buildsystem_dependencies
641:debug:main Finished running callback portbuild::add_automatic_buildsystem_dependencies
642:info:main .:debug:main libidl has no conflicts
643:info:main .:debug:main libgnome has no conflicts
644:debug:main Searching for dependency: libcanberra
645:debug:main Didn't find receipt, going to depspec regex for: libcanberra
646:debug:main Changing to port directory: /opt/local/var/macports/sources/rsync.macports.org/release/tarballs/ports/audio/libcanberra
647:debug:main OS darwin/13.1.0 (Mac OS X 10.9) arch i386
648:debug:main Reading variant descriptions from /opt/local/var/macports/sources/rsync.macports.org/release/tarballs/ports/_resources/port1.0/variant_descriptions.conf
649:debug:main adding the default universal variant
650:debug:main Executing variant x11 provides x11
651:debug:main Running callback portconfigure::add_automatic_compiler_dependencies
652:debug:main Finished running callback portconfigure::add_automatic_compiler_dependencies
653:debug:main Running callback portbuild::add_automatic_buildsystem_dependencies
654:debug:main Finished running callback portbuild::add_automatic_buildsystem_dependencies
655:info:main .:debug:main libcanberra has no conflicts
656:debug:main Searching for dependency: gstreamer1
657:debug:main Didn't find receipt, going to depspec regex for: gstreamer1
658:debug:main Changing to port directory: /opt/local/var/macports/sources/rsync.macports.org/release/tarballs/ports/gnome/gstreamer1
659:debug:main OS darwin/13.1.0 (Mac OS X 10.9) arch i386
660:debug:main Reading variant descriptions from /opt/local/var/macports/sources/rsync.macports.org/release/tarballs/ports/_resources/port1.0/variant_descriptions.conf
661:debug:main universal variant already exists, so not adding the default one
662:debug:main Running callback portconfigure::add_automatic_compiler_dependencies
663:debug:main Finished running callback portconfigure::add_automatic_compiler_dependencies
664:debug:main Running callback portbuild::add_automatic_buildsystem_dependencies
665:debug:main Finished running callback portbuild::add_automatic_buildsystem_dependencies
666:debug:main Searching for dependency: libvorbis
667:debug:main Didn't find receipt, going to depspec regex for: libvorbis
668:debug:main Changing to port directory: /opt/local/var/macports/sources/rsync.macports.org/release/tarballs/ports/audio/libvorbis
669:debug:main OS darwin/13.1.0 (Mac OS X 10.9) arch i386
670:debug:main Reading variant descriptions from /opt/local/var/macports/sources/rsync.macports.org/release/tarballs/ports/_resources/port1.0/variant_descriptions.conf
671:debug:main universal variant already exists, so not adding the default one
672:debug:main Running callback portconfigure::add_automatic_compiler_dependencies
673:debug:main Finished running callback portconfigure::add_automatic_compiler_dependencies
674:debug:main Running callback portbuild::add_automatic_buildsystem_dependencies
675:debug:main Finished running callback portbuild::add_automatic_buildsystem_dependencies
676:debug:main Searching for dependency: gtk3
677:debug:main Didn't find receipt, going to depspec regex for: gtk3
678:debug:main Changing to port directory: /opt/local/var/macports/sources/rsync.macports.org/release/tarballs/ports/gnome/gtk3
679:debug:main OS darwin/13.1.0 (Mac OS X 10.9) arch i386
680:debug:main Reading variant descriptions from /opt/local/var/macports/sources/rsync.macports.org/release/tarballs/ports/_resources/port1.0/variant_descriptions.conf
681:debug:main universal variant already exists, so not adding the default one
682:debug:main Executing variant x11 provides x11
683:debug:main Running callback portconfigure::add_automatic_compiler_dependencies
684:debug:main Finished running callback portconfigure::add_automatic_compiler_dependencies
685:debug:main Running callback portbuild::add_automatic_buildsystem_dependencies
686:debug:main Finished running callback portbuild::add_automatic_buildsystem_dependencies
687:info:main .:debug:main gstreamer1 has no conflicts
688:debug:main Searching for dependency: bison
689:debug:main Found Dependency: receipt exists for bison
690:debug:main Searching for dependency: flex
691:debug:main Didn't find receipt, going to depspec regex for: flex
692:debug:main Changing to port directory: /opt/local/var/macports/sources/rsync.macports.org/release/tarballs/ports/devel/flex
693:debug:main OS darwin/13.1.0 (Mac OS X 10.9) arch i386
694:debug:main adding the default universal variant
695:debug:main Reading variant descriptions from /opt/local/var/macports/sources/rsync.macports.org/release/tarballs/ports/_resources/port1.0/variant_descriptions.conf
696:debug:main Running callback portconfigure::add_automatic_compiler_dependencies
697:debug:main Finished running callback portconfigure::add_automatic_compiler_dependencies
698:debug:main Running callback portbuild::add_automatic_buildsystem_dependencies
699:debug:main Finished running callback portbuild::add_automatic_buildsystem_dependencies
700:info:main .:debug:main flex has no conflicts
701:debug:main Searching for dependency: m4
702:debug:main Found Dependency: receipt exists for m4
703:info:main .:debug:main libvorbis has no conflicts
704:debug:main Searching for dependency: libogg
705:debug:main Didn't find receipt, going to depspec regex for: libogg
706:debug:main Changing to port directory: /opt/local/var/macports/sources/rsync.macports.org/release/tarballs/ports/multimedia/libogg
707:debug:main OS darwin/13.1.0 (Mac OS X 10.9) arch i386
708:debug:main adding the default universal variant
709:debug:main Reading variant descriptions from /opt/local/var/macports/sources/rsync.macports.org/release/tarballs/ports/_resources/port1.0/variant_descriptions.conf
710:debug:main Running callback portconfigure::add_automatic_compiler_dependencies
711:debug:main Finished running callback portconfigure::add_automatic_compiler_dependencies
712:debug:main Running callback portbuild::add_automatic_buildsystem_dependencies
713:debug:main Finished running callback portbuild::add_automatic_buildsystem_dependencies
714:info:main .:debug:main libogg has no conflicts
715:info:main .:debug:main gtk3 has no conflicts
716:debug:main Searching for dependency: at-spi2-atk
717:debug:main Didn't find receipt, going to depspec regex for: at-spi2-atk
718:debug:main Changing to port directory: /opt/local/var/macports/sources/rsync.macports.org/release/tarballs/ports/gnome/at-spi2-atk
719:debug:main OS darwin/13.1.0 (Mac OS X 10.9) arch i386
720:debug:main adding the default universal variant
721:debug:main Reading variant descriptions from /opt/local/var/macports/sources/rsync.macports.org/release/tarballs/ports/_resources/port1.0/variant_descriptions.conf
722:debug:main Running callback portconfigure::add_automatic_compiler_dependencies
723:debug:main Finished running callback portconfigure::add_automatic_compiler_dependencies
724:debug:main Running callback portbuild::add_automatic_buildsystem_dependencies
725:debug:main Finished running callback portbuild::add_automatic_buildsystem_dependencies
726:info:main .:debug:main Checking for conflicts against at-spi2-atk
727:debug:main Searching for dependency: at-spi
728:debug:main Didn't find receipt, going to depspec regex for: at-spi
729:debug:main Searching for dependency: dbus-glib
730:debug:main Didn't find receipt, going to depspec regex for: dbus-glib
731:debug:main Changing to port directory: /opt/local/var/macports/sources/rsync.macports.org/release/tarballs/ports/devel/dbus-glib
732:debug:main OS darwin/13.1.0 (Mac OS X 10.9) arch i386
733:debug:main adding the default universal variant
734:debug:main Reading variant descriptions from /opt/local/var/macports/sources/rsync.macports.org/release/tarballs/ports/_resources/port1.0/variant_descriptions.conf
735:debug:main Running callback portconfigure::add_automatic_compiler_dependencies
736:debug:main Finished running callback portconfigure::add_automatic_compiler_dependencies
737:debug:main Running callback portbuild::add_automatic_buildsystem_dependencies
738:debug:main Finished running callback portbuild::add_automatic_buildsystem_dependencies
739:debug:main Searching for dependency: dbus-python27
740:debug:main Didn't find receipt, going to depspec regex for: dbus-python27
741:debug:main Changing to port directory: /opt/local/var/macports/sources/rsync.macports.org/release/tarballs/ports/devel/dbus-python27
742:debug:main OS darwin/13.1.0 (Mac OS X 10.9) arch i386
743:debug:main adding the default universal variant
744:debug:main Reading variant descriptions from /opt/local/var/macports/sources/rsync.macports.org/release/tarballs/ports/_resources/port1.0/variant_descriptions.conf
745:debug:main Running callback portconfigure::add_automatic_compiler_dependencies
746:debug:main Finished running callback portconfigure::add_automatic_compiler_dependencies
747:debug:main Running callback portbuild::add_automatic_buildsystem_dependencies
748:debug:main Finished running callback portbuild::add_automatic_buildsystem_dependencies
749:debug:main Searching for dependency: at-spi2-core
750:debug:main Didn't find receipt, going to depspec regex for: at-spi2-core
751:debug:main Changing to port directory: /opt/local/var/macports/sources/rsync.macports.org/release/tarballs/ports/gnome/at-spi2-core
752:debug:main OS darwin/13.1.0 (Mac OS X 10.9) arch i386
753:debug:main adding the default universal variant
754:debug:main Reading variant descriptions from /opt/local/var/macports/sources/rsync.macports.org/release/tarballs/ports/_resources/port1.0/variant_descriptions.conf
755:debug:main Running callback portconfigure::add_automatic_compiler_dependencies
756:debug:main Finished running callback portconfigure::add_automatic_compiler_dependencies
757:debug:main Running callback portbuild::add_automatic_buildsystem_dependencies
758:debug:main Finished running callback portbuild::add_automatic_buildsystem_dependencies
759:info:main .:debug:main dbus-glib has no conflicts
760:info:main .:debug:main dbus-python27 has no conflicts
761:info:main .:debug:main at-spi2-core has no conflicts
762:debug:main Searching for dependency: xorg-libXtst
763:debug:main Didn't find receipt, going to depspec regex for: xorg-libXtst
764:debug:main Changing to port directory: /opt/local/var/macports/sources/rsync.macports.org/release/tarballs/ports/x11/xorg-libXtst
765:debug:main OS darwin/13.1.0 (Mac OS X 10.9) arch i386
766:debug:main adding the default universal variant
767:debug:main Reading variant descriptions from /opt/local/var/macports/sources/rsync.macports.org/release/tarballs/ports/_resources/port1.0/variant_descriptions.conf
768:debug:main Running callback portconfigure::add_automatic_compiler_dependencies
769:debug:main Finished running callback portconfigure::add_automatic_compiler_dependencies
770:debug:main Running callback portbuild::add_automatic_buildsystem_dependencies
771:debug:main Finished running callback portbuild::add_automatic_buildsystem_dependencies
772:debug:main Searching for dependency: xorg-libXevie
773:debug:main Didn't find receipt, going to depspec regex for: xorg-libXevie
774:debug:main Changing to port directory: /opt/local/var/macports/sources/rsync.macports.org/release/tarballs/ports/x11/xorg-libXevie
775:debug:main OS darwin/13.1.0 (Mac OS X 10.9) arch i386
776:debug:main adding the default universal variant
777:debug:main Reading variant descriptions from /opt/local/var/macports/sources/rsync.macports.org/release/tarballs/ports/_resources/port1.0/variant_descriptions.conf
778:debug:main Running callback portconfigure::add_automatic_compiler_dependencies
779:debug:main Finished running callback portconfigure::add_automatic_compiler_dependencies
780:debug:main Running callback portbuild::add_automatic_buildsystem_dependencies
781:debug:main Finished running callback portbuild::add_automatic_buildsystem_dependencies
782:info:main .:debug:main xorg-libXtst has no conflicts
783:debug:main Searching for dependency: xorg-recordproto
784:debug:main Didn't find receipt, going to depspec regex for: xorg-recordproto
785:debug:main Changing to port directory: /opt/local/var/macports/sources/rsync.macports.org/release/tarballs/ports/x11/xorg-recordproto
786:debug:main OS darwin/13.1.0 (Mac OS X 10.9) arch i386
787:debug:main only one arch supported, so not adding the default universal variant
788:debug:main Running callback portconfigure::add_automatic_compiler_dependencies
789:debug:main Finished running callback portconfigure::add_automatic_compiler_dependencies
790:debug:main Running callback portbuild::add_automatic_buildsystem_dependencies
791:debug:main Finished running callback portbuild::add_automatic_buildsystem_dependencies
792:info:main .:debug:main xorg-recordproto has no conflicts
793:info:main .:debug:main xorg-libXevie has no conflicts
794:debug:main Searching for dependency: xorg-evieproto
795:debug:main Didn't find receipt, going to depspec regex for: xorg-evieproto
796:debug:main Changing to port directory: /opt/local/var/macports/sources/rsync.macports.org/release/tarballs/ports/x11/xorg-evieproto
797:debug:main OS darwin/13.1.0 (Mac OS X 10.9) arch i386
798:debug:main only one arch supported, so not adding the default universal variant
799:debug:main Running callback portconfigure::add_automatic_compiler_dependencies
800:debug:main Finished running callback portconfigure::add_automatic_compiler_dependencies
801:debug:main Running callback portbuild::add_automatic_buildsystem_dependencies
802:debug:main Finished running callback portbuild::add_automatic_buildsystem_dependencies
803:info:main .:debug:main xorg-evieproto has no conflicts
804:info:main .:debug:main libgnomecanvas has no conflicts
805:debug:main Searching for dependency: libart_lgpl
806:debug:main Didn't find receipt, going to depspec regex for: libart_lgpl
807:debug:main Changing to port directory: /opt/local/var/macports/sources/rsync.macports.org/release/tarballs/ports/graphics/libart_lgpl
808:debug:main OS darwin/13.1.0 (Mac OS X 10.9) arch i386
809:debug:main adding the default universal variant
810:debug:main Reading variant descriptions from /opt/local/var/macports/sources/rsync.macports.org/release/tarballs/ports/_resources/port1.0/variant_descriptions.conf
811:debug:main Running callback portconfigure::add_automatic_compiler_dependencies
812:debug:main Finished running callback portconfigure::add_automatic_compiler_dependencies
813:debug:main Running callback portbuild::add_automatic_buildsystem_dependencies
814:debug:main Finished running callback portbuild::add_automatic_buildsystem_dependencies
815:info:main .:debug:main libart_lgpl has no conflicts
816:info:main .:debug:main gnome-vfs has no conflicts
817:debug:main Searching for dependency: desktop-file-utils
818:debug:main Found Dependency: receipt exists for desktop-file-utils
819:debug:main Searching for dependency: openssl
820:debug:main Found Dependency: receipt exists for openssl
821:debug:main Searching for dependency: gnome-mime-data
822:debug:main Didn't find receipt, going to depspec regex for: gnome-mime-data
823:debug:main Changing to port directory: /opt/local/var/macports/sources/rsync.macports.org/release/tarballs/ports/gnome/gnome-mime-data
824:debug:main OS darwin/13.1.0 (Mac OS X 10.9) arch i386
825:debug:main only one arch supported, so not adding the default universal variant
826:debug:main Running callback portconfigure::add_automatic_compiler_dependencies
827:debug:main Finished running callback portconfigure::add_automatic_compiler_dependencies
828:debug:main Running callback portbuild::add_automatic_buildsystem_dependencies
829:debug:main Finished running callback portbuild::add_automatic_buildsystem_dependencies
830:info:main .:debug:main gnome-mime-data has no conflicts
831:info:main .:debug:main gconf has no conflicts
832:debug:main Searching for dependency: gtk-doc
833:debug:main Didn't find receipt, going to depspec regex for: gtk-doc
834:debug:main Changing to port directory: /opt/local/var/macports/sources/rsync.macports.org/release/tarballs/ports/gnome/gtk-doc
835:debug:main OS darwin/13.1.0 (Mac OS X 10.9) arch i386
836:debug:main only one arch supported, so not adding the default universal variant
837:debug:main Executing variant python27 provides python27
838:debug:main Running callback portconfigure::add_automatic_compiler_dependencies
839:debug:main Finished running callback portconfigure::add_automatic_compiler_dependencies
840:debug:main Running callback portbuild::add_automatic_buildsystem_dependencies
841:debug:main Finished running callback portbuild::add_automatic_buildsystem_dependencies
842:debug:main Searching for dependency: policykit
843:debug:main Didn't find receipt, going to depspec regex for: policykit
844:debug:main Changing to port directory: /opt/local/var/macports/sources/rsync.macports.org/release/tarballs/ports/security/policykit
845:debug:main OS darwin/13.1.0 (Mac OS X 10.9) arch i386
846:debug:main adding the default universal variant
847:debug:main Reading variant descriptions from /opt/local/var/macports/sources/rsync.macports.org/release/tarballs/ports/_resources/port1.0/variant_descriptions.conf
848:debug:main Running callback portconfigure::add_automatic_compiler_dependencies
849:debug:main Finished running callback portconfigure::add_automatic_compiler_dependencies
850:debug:main Running callback portbuild::add_automatic_buildsystem_dependencies
851:debug:main Finished running callback portbuild::add_automatic_buildsystem_dependencies
852:info:main .:debug:main gtk-doc has no conflicts
853:debug:main Searching for dependency: perl5
854:debug:main Found Dependency: receipt exists for perl5
855:debug:main Searching for dependency: openjade
856:debug:main Didn't find receipt, going to depspec regex for: openjade
857:debug:main Changing to port directory: /opt/local/var/macports/sources/rsync.macports.org/release/tarballs/ports/textproc/openjade
858:debug:main OS darwin/13.1.0 (Mac OS X 10.9) arch i386
859:debug:main adding the default universal variant
860:debug:main Reading variant descriptions from /opt/local/var/macports/sources/rsync.macports.org/release/tarballs/ports/_resources/port1.0/variant_descriptions.conf
861:debug:main Running callback portconfigure::add_automatic_compiler_dependencies
862:debug:main Finished running callback portconfigure::add_automatic_compiler_dependencies
863:debug:main Running callback portbuild::add_automatic_buildsystem_dependencies
864:debug:main Finished running callback portbuild::add_automatic_buildsystem_dependencies
865:debug:main Searching for dependency: fop
866:debug:main Didn't find receipt, going to depspec regex for: fop
867:debug:main Changing to port directory: /opt/local/var/macports/sources/rsync.macports.org/release/tarballs/ports/textproc/fop
868:debug:main OS darwin/13.1.0 (Mac OS X 10.9) arch i386
869:debug:main universal_variant is false, so not adding the default universal variant
870:debug:main Running callback portconfigure::add_automatic_compiler_dependencies
871:debug:main Finished running callback portconfigure::add_automatic_compiler_dependencies
872:debug:main Running callback portbuild::add_automatic_buildsystem_dependencies
873:debug:main Finished running callback portbuild::add_automatic_buildsystem_dependencies
874:debug:main Searching for dependency: docbook-xml
875:debug:main Didn't find receipt, going to depspec regex for: docbook-xml
876:debug:main Changing to port directory: /opt/local/var/macports/sources/rsync.macports.org/release/tarballs/ports/textproc/docbook-xml
877:debug:main OS darwin/13.1.0 (Mac OS X 10.9) arch i386
878:debug:main universal_variant is false, so not adding the default universal variant
879:debug:main Running callback portconfigure::add_automatic_compiler_dependencies
880:debug:main Finished running callback portconfigure::add_automatic_compiler_dependencies
881:debug:main Running callback portbuild::add_automatic_buildsystem_dependencies
882:debug:main Finished running callback portbuild::add_automatic_buildsystem_dependencies
883:debug:main Searching for dependency: docbook-xsl
884:debug:main Didn't find receipt, going to depspec regex for: docbook-xsl
885:debug:main Changing to port directory: /opt/local/var/macports/sources/rsync.macports.org/release/tarballs/ports/textproc/docbook-xsl
886:debug:main OS darwin/13.1.0 (Mac OS X 10.9) arch i386
887:debug:main universal_variant is false, so not adding the default universal variant
888:debug:main Running callback portconfigure::add_automatic_compiler_dependencies
889:debug:main Finished running callback portconfigure::add_automatic_compiler_dependencies
890:debug:main Running callback portbuild::add_automatic_buildsystem_dependencies
891:debug:main Finished running callback portbuild::add_automatic_buildsystem_dependencies
892:debug:main Searching for dependency: itstool
893:debug:main Didn't find receipt, going to depspec regex for: itstool
894:debug:main Changing to port directory: /opt/local/var/macports/sources/rsync.macports.org/release/tarballs/ports/textproc/itstool
895:debug:main OS darwin/13.1.0 (Mac OS X 10.9) arch i386
896:debug:main only one arch supported, so not adding the default universal variant
897:debug:main Executing variant python27 provides python27
898:debug:main Running callback portconfigure::add_automatic_compiler_dependencies
899:debug:main Finished running callback portconfigure::add_automatic_compiler_dependencies
900:debug:main Running callback portbuild::add_automatic_buildsystem_dependencies
901:debug:main Finished running callback portbuild::add_automatic_buildsystem_dependencies
902:debug:main Searching for dependency: py27-libxml2
903:debug:main Didn't find receipt, going to depspec regex for: py27-libxml2
904:debug:main Changing to port directory: /opt/local/var/macports/sources/rsync.macports.org/release/tarballs/ports/python/py-libxml2
905:debug:main OS darwin/13.1.0 (Mac OS X 10.9) arch i386
906:debug:main Re-registering default for build.cmd
907:debug:main Re-registering default for destroot.cmd
908:debug:main Re-registering default for destroot.destdir
909:debug:main adding the default universal variant
910:debug:main Reading variant descriptions from /opt/local/var/macports/sources/rsync.macports.org/release/tarballs/ports/_resources/port1.0/variant_descriptions.conf
911:debug:main Running callback portconfigure::add_automatic_compiler_dependencies
912:debug:main Finished running callback portconfigure::add_automatic_compiler_dependencies
913:debug:main Running callback portbuild::add_automatic_buildsystem_dependencies
914:debug:main Finished running callback portbuild::add_automatic_buildsystem_dependencies
915:info:main .:debug:main openjade has no conflicts
916:debug:main Searching for dependency: opensp
917:debug:main Didn't find receipt, going to depspec regex for: opensp
918:debug:main Changing to port directory: /opt/local/var/macports/sources/rsync.macports.org/release/tarballs/ports/textproc/opensp
919:debug:main OS darwin/13.1.0 (Mac OS X 10.9) arch i386
920:debug:main adding the default universal variant
921:debug:main Reading variant descriptions from /opt/local/var/macports/sources/rsync.macports.org/release/tarballs/ports/_resources/port1.0/variant_descriptions.conf
922:debug:main Running callback portconfigure::add_automatic_compiler_dependencies
923:debug:main Finished running callback portconfigure::add_automatic_compiler_dependencies
924:debug:main Running callback portbuild::add_automatic_buildsystem_dependencies
925:debug:main Finished running callback portbuild::add_automatic_buildsystem_dependencies
926:debug:main Searching for dependency: xmlcatmgr
927:debug:main Didn't find receipt, going to depspec regex for: xmlcatmgr
928:debug:main Changing to port directory: /opt/local/var/macports/sources/rsync.macports.org/release/tarballs/ports/textproc/xmlcatmgr
929:debug:main OS darwin/13.1.0 (Mac OS X 10.9) arch i386
930:debug:main adding the default universal variant
931:debug:main Reading variant descriptions from /opt/local/var/macports/sources/rsync.macports.org/release/tarballs/ports/_resources/port1.0/variant_descriptions.conf
932:debug:main Running callback portconfigure::add_automatic_compiler_dependencies
933:debug:main Finished running callback portconfigure::add_automatic_compiler_dependencies
934:debug:main Running callback portbuild::add_automatic_buildsystem_dependencies
935:debug:main Finished running callback portbuild::add_automatic_buildsystem_dependencies
936:info:main .:debug:main opensp has no conflicts
937:info:main .:debug:main xmlcatmgr has no conflicts
938:info:main .:debug:main fop has no conflicts
939:info:main .:debug:main docbook-xml has no conflicts
940:debug:main Searching for dependency: docbook-xml-4.1.2
941:debug:main Didn't find receipt, going to depspec regex for: docbook-xml-4.1.2
942:debug:main Changing to port directory: /opt/local/var/macports/sources/rsync.macports.org/release/tarballs/ports/textproc/docbook-xml
943:debug:main OS darwin/13.1.0 (Mac OS X 10.9) arch i386
944:debug:main universal_variant is false, so not adding the default universal variant
945:debug:main Running callback portconfigure::add_automatic_compiler_dependencies
946:debug:main Finished running callback portconfigure::add_automatic_compiler_dependencies
947:debug:main Running callback portbuild::add_automatic_buildsystem_dependencies
948:debug:main Finished running callback portbuild::add_automatic_buildsystem_dependencies
949:debug:main Searching for dependency: docbook-xml-4.2
950:debug:main Didn't find receipt, going to depspec regex for: docbook-xml-4.2
951:debug:main Changing to port directory: /opt/local/var/macports/sources/rsync.macports.org/release/tarballs/ports/textproc/docbook-xml
952:debug:main OS darwin/13.1.0 (Mac OS X 10.9) arch i386
953:debug:main universal_variant is false, so not adding the default universal variant
954:debug:main Running callback portconfigure::add_automatic_compiler_dependencies
955:debug:main Finished running callback portconfigure::add_automatic_compiler_dependencies
956:debug:main Running callback portbuild::add_automatic_buildsystem_dependencies
957:debug:main Finished running callback portbuild::add_automatic_buildsystem_dependencies
958:debug:main Searching for dependency: docbook-xml-4.3
959:debug:main Didn't find receipt, going to depspec regex for: docbook-xml-4.3
960:debug:main Changing to port directory: /opt/local/var/macports/sources/rsync.macports.org/release/tarballs/ports/textproc/docbook-xml
961:debug:main OS darwin/13.1.0 (Mac OS X 10.9) arch i386
962:debug:main universal_variant is false, so not adding the default universal variant
963:debug:main Running callback portconfigure::add_automatic_compiler_dependencies
964:debug:main Finished running callback portconfigure::add_automatic_compiler_dependencies
965:debug:main Running callback portbuild::add_automatic_buildsystem_dependencies
966:debug:main Finished running callback portbuild::add_automatic_buildsystem_dependencies
967:debug:main Searching for dependency: docbook-xml-4.4
968:debug:main Didn't find receipt, going to depspec regex for: docbook-xml-4.4
969:debug:main Changing to port directory: /opt/local/var/macports/sources/rsync.macports.org/release/tarballs/ports/textproc/docbook-xml
970:debug:main OS darwin/13.1.0 (Mac OS X 10.9) arch i386
971:debug:main universal_variant is false, so not adding the default universal variant
972:debug:main Running callback portconfigure::add_automatic_compiler_dependencies
973:debug:main Finished running callback portconfigure::add_automatic_compiler_dependencies
974:debug:main Running callback portbuild::add_automatic_buildsystem_dependencies
975:debug:main Finished running callback portbuild::add_automatic_buildsystem_dependencies
976:debug:main Searching for dependency: docbook-xml-4.5
977:debug:main Didn't find receipt, going to depspec regex for: docbook-xml-4.5
978:debug:main Changing to port directory: /opt/local/var/macports/sources/rsync.macports.org/release/tarballs/ports/textproc/docbook-xml
979:debug:main OS darwin/13.1.0 (Mac OS X 10.9) arch i386
980:debug:main universal_variant is false, so not adding the default universal variant
981:debug:main Running callback portconfigure::add_automatic_compiler_dependencies
982:debug:main Finished running callback portconfigure::add_automatic_compiler_dependencies
983:debug:main Running callback portbuild::add_automatic_buildsystem_dependencies
984:debug:main Finished running callback portbuild::add_automatic_buildsystem_dependencies
985:debug:main Searching for dependency: docbook-xml-5.0
986:debug:main Didn't find receipt, going to depspec regex for: docbook-xml-5.0
987:debug:main Changing to port directory: /opt/local/var/macports/sources/rsync.macports.org/release/tarballs/ports/textproc/docbook-xml
988:debug:main OS darwin/13.1.0 (Mac OS X 10.9) arch i386
989:debug:main universal_variant is false, so not adding the default universal variant
990:debug:main Running callback portconfigure::add_automatic_compiler_dependencies
991:debug:main Finished running callback portconfigure::add_automatic_compiler_dependencies
992:debug:main Running callback portbuild::add_automatic_buildsystem_dependencies
993:debug:main Finished running callback portbuild::add_automatic_buildsystem_dependencies
994:info:main .:debug:main docbook-xml-4.1.2 has no conflicts
995:info:main .:debug:main docbook-xml-4.2 has no conflicts
996:info:main .:debug:main docbook-xml-4.3 has no conflicts
997:info:main .:debug:main docbook-xml-4.4 has no conflicts
998:info:main .:debug:main docbook-xml-4.5 has no conflicts
999:info:main .:debug:main docbook-xml-5.0 has no conflicts
1000:info:main .:debug:main docbook-xsl has no conflicts
1001:info:main .:debug:main itstool has no conflicts
1002:debug:main Searching for dependency: gawk
1003:debug:main Didn't find receipt, going to depspec regex for: gawk
1004:debug:main Changing to port directory: /opt/local/var/macports/sources/rsync.macports.org/release/tarballs/ports/lang/gawk
1005:debug:main OS darwin/13.1.0 (Mac OS X 10.9) arch i386
1006:debug:main adding the default universal variant
1007:debug:main Reading variant descriptions from /opt/local/var/macports/sources/rsync.macports.org/release/tarballs/ports/_resources/port1.0/variant_descriptions.conf
1008:debug:main Running callback portconfigure::add_automatic_compiler_dependencies
1009:debug:main Finished running callback portconfigure::add_automatic_compiler_dependencies
1010:debug:main Running callback portbuild::add_automatic_buildsystem_dependencies
1011:debug:main Finished running callback portbuild::add_automatic_buildsystem_dependencies
1012:info:main .:debug:main gawk has no conflicts
1013:debug:main Searching for dependency: readline
1014:debug:main Found Dependency: receipt exists for readline
1015:info:main .:debug:main py27-libxml2 has no conflicts
1016:info:main .:debug:main policykit has no conflicts
1017:info:main .:debug:main libbonobo has no conflicts
1018:debug:main Searching for dependency: popt
1019:debug:main Found Dependency: receipt exists for popt
1020:info:main .:debug:main libbonoboui has no conflicts
1021:debug:main Searching for dependency: pangox-compat
1022:debug:main Didn't find receipt, going to depspec regex for: pangox-compat
1023:debug:main Changing to port directory: /opt/local/var/macports/sources/rsync.macports.org/release/tarballs/ports/x11/pangox-compat
1024:debug:main OS darwin/13.1.0 (Mac OS X 10.9) arch i386
1025:debug:main adding the default universal variant
1026:debug:main Reading variant descriptions from /opt/local/var/macports/sources/rsync.macports.org/release/tarballs/ports/_resources/port1.0/variant_descriptions.conf
1027:debug:main Running callback portconfigure::add_automatic_compiler_dependencies
1028:debug:main Finished running callback portconfigure::add_automatic_compiler_dependencies
1029:debug:main Running callback portbuild::add_automatic_buildsystem_dependencies
1030:debug:main Finished running callback portbuild::add_automatic_buildsystem_dependencies
1031:info:main .:debug:main pangox-compat has no conflicts
1032:msg:main
1033:msg:main --->  Dependencies to be installed: intltool p5.16-getopt-long p5.16-pathtools p5.16-scalar-list-utils py27-gnome gconf dbus-glib dbus gtk-doc docbook-xml docbook-xml-4.1.2 docbook-xml-4.2 xmlcatmgr docbook-xml-4.3 docbook-xml-4.4 docbook-xml-4.5 docbook-xml-5.0 docbook-xsl fop itstool gawk py27-libxml2 openjade opensp gtk3 at-spi2-atk at-spi2-core xorg-libXevie xorg-evieproto xorg-libXi xorg-inputproto xorg-libXfixes xorg-fixesproto xorg-libXtst xorg-recordproto atk dbus-python27 py27-gobject py27-cairo gdk-pixbuf2 hicolor-icon-theme shared-mime-info xorg-libXcomposite xorg-compositeproto xorg-libXcursor xorg-libXdamage xorg-damageproto xorg-libXinerama xorg-xineramaproto xorg-libXrandr xorg-randrproto orbit2 libidl policykit gnome-vfs gnome-mime-data libbonobo libbonoboui libgnome libcanberra gstreamer1 flex gtk2 libvorbis libogg libgnomecanvas libart_lgpl libglade2 pangox-compat libgnomeui libgnome-keyring vala py27-orbit py27-pygtk py27-numpy fftw-3 py27-nose nosetests_select
1034:debug:main Starting logging for p5.16-getopt-long
1035:debug:clean Starting logging for p5.16-pathtools
1036:debug:clean Starting logging for p5.16-scalar-list-utils
1037:debug:clean Starting logging for intltool
1038:debug:clean Starting logging for dbus
1039:debug:clean Starting logging for dbus-glib
1040:debug:clean Starting logging for xmlcatmgr
1041:debug:clean Starting logging for docbook-xml-4.2
1042:debug:clean Starting logging for docbook-xml-4.1.2
1043:debug:clean Starting logging for docbook-xml-4.3
1044:debug:clean Starting logging for docbook-xml-4.4
1045:debug:clean Starting logging for docbook-xml-4.5
1046:debug:clean Starting logging for docbook-xml-5.0
1047:debug:clean Starting logging for docbook-xml
1048:debug:clean Starting logging for docbook-xsl
1049:debug:clean Starting logging for fop
1050:debug:clean Starting logging for gawk
1051:debug:clean Starting logging for py27-libxml2
1052:debug:clean Starting logging for itstool
1053:debug:clean Starting logging for opensp
1054:debug:clean Starting logging for openjade
1055:debug:clean Starting logging for gtk-doc
1056:debug:clean Starting logging for xorg-evieproto
1057:debug:clean Starting logging for xorg-libXevie
1058:debug:clean Starting logging for xorg-inputproto
1059:debug:clean Starting logging for xorg-fixesproto
1060:debug:clean Starting logging for xorg-libXfixes
1061:debug:clean Starting logging for xorg-libXi
1062:debug:clean Starting logging for xorg-recordproto
1063:debug:clean Starting logging for xorg-libXtst
1064:debug:clean Starting logging for at-spi2-core
1065:debug:clean Starting logging for atk
1066:debug:clean Starting logging for py27-cairo
1067:debug:clean Starting logging for py27-gobject
1068:debug:clean Starting logging for dbus-python27
1069:debug:clean Starting logging for at-spi2-atk
1070:debug:clean Starting logging for gdk-pixbuf2
1071:debug:clean Starting logging for hicolor-icon-theme
1072:debug:clean Starting logging for shared-mime-info
1073:debug:clean Starting logging for xorg-compositeproto
1074:debug:clean Starting logging for xorg-libXcomposite
1075:debug:clean Starting logging for xorg-libXcursor
1076:debug:clean Starting logging for xorg-damageproto
1077:debug:clean Starting logging for xorg-libXdamage
1078:debug:clean Starting logging for xorg-xineramaproto
1079:debug:clean Starting logging for xorg-libXinerama
1080:debug:clean Starting logging for xorg-randrproto
1081:debug:clean Starting logging for xorg-libXrandr
1082:debug:clean Starting logging for gtk3
1083:debug:clean Starting logging for libidl
1084:debug:clean Starting logging for orbit2
1085:debug:clean Starting logging for policykit
1086:debug:clean Starting logging for gconf
1087:debug:clean Starting logging for gnome-mime-data
1088:debug:clean Starting logging for gnome-vfs
1089:debug:clean Starting logging for libbonobo
1090:debug:clean Starting logging for flex
1091:debug:clean Starting logging for gstreamer1
1092:debug:clean Starting logging for gtk2
1093:debug:clean Starting logging for libogg
1094:debug:clean Starting logging for libvorbis
1095:debug:clean Starting logging for libcanberra
1096:debug:clean Starting logging for libgnome
1097:debug:clean Starting logging for libart_lgpl
1098:debug:clean Starting logging for libglade2
1099:debug:clean Starting logging for libgnomecanvas
1100:debug:clean Starting logging for pangox-compat
1101:debug:clean Starting logging for libbonoboui
1102:debug:clean Starting logging for vala
1103:debug:clean Starting logging for libgnome-keyring
1104:debug:clean Starting logging for libgnomeui
1105:debug:clean Starting logging for py27-orbit
1106:debug:clean Starting logging for fftw-3
1107:debug:clean Starting logging for nosetests_select
1108:debug:clean Starting logging for py27-nose
1109:debug:clean Starting logging for py27-numpy
1110:debug:clean Starting logging for py27-pygtk
1111:debug:clean Starting logging for py27-gnome
1112:debug:main Executing org.macports.main (meld)
1113:debug:main changing euid/egid - current euid: 0 - current egid: 0
1114:debug:main egid changed to: 501
1115:debug:main euid changed to: 502
1116:debug:archivefetch archivefetch phase started at Mon Mar  3 10:20:25 EST 2014
1117:msg:archivefetch --->  Fetching archive for meld
1118:debug:archivefetch Executing org.macports.archivefetch (meld)
1119:debug:archivefetch euid/egid changed to: 0/0
1120:debug:archivefetch chowned /opt/local/var/macports/incoming to macports
1121:debug:archivefetch euid/egid changed to: 502/501
1122:info:archivefetch --->  meld-1.8.4_0.darwin_13.noarch.tbz2 doesn't seem to exist in /opt/local/var/macports/incoming/verified
1123:msg:archivefetch --->  Attempting to fetch meld-1.8.4_0.darwin_13.noarch.tbz2 from http://packages.macports.org/meld
1124:debug:archivefetch Fetching archive failed:: The requested URL returned error: 404 Not Found
1125:msg:archivefetch --->  Attempting to fetch meld-1.8.4_0.darwin_13.noarch.tbz2 from http://mse.uk.packages.macports.org/sites/packages.macports.org/meld
1126:debug:archivefetch Fetching archive failed:: The requested URL returned error: 404 Not Found
1127:msg:archivefetch --->  Attempting to fetch meld-1.8.4_0.darwin_13.noarch.tbz2 from http://lil.fr.packages.macports.org/meld
1128:debug:archivefetch Fetching archive failed:: The requested URL returned error: 404 Not Found
1129:debug:archivefetch Privilege de-escalation not attempted as not running as root.
1130:debug:fetch fetch phase started at Mon Mar  3 10:20:26 EST 2014
1131:notice:fetch --->  Fetching distfiles for meld
1132:debug:fetch Can't run fetch on this port without elevated privileges. Escalating privileges back to root.
1133:debug:fetch euid changed to: 0. egid changed to: 0.
1134:debug:fetch changing euid/egid - current euid: 0 - current egid: 0
1135:debug:fetch egid changed to: 501
1136:debug:fetch euid changed to: 502
1137:debug:fetch Executing org.macports.fetch (meld)
1138:info:fetch --->  meld-1.8.4.tar.xz doesn't seem to exist in /opt/local/var/macports/distfiles/meld
1139:notice:fetch --->  Attempting to fetch meld-1.8.4.tar.xz from ftp://ftp.cse.buffalo.edu/pub/Gnome/sources/meld/1.8
1140:debug:fetch Privilege de-escalation not attempted as not running as root.
1141:debug:checksum checksum phase started at Mon Mar  3 10:20:27 EST 2014
1142:notice:checksum --->  Verifying checksums for meld
1143:debug:checksum Executing org.macports.checksum (meld)
1144:info:checksum --->  Checksumming meld-1.8.4.tar.xz
1145:debug:checksum Correct (rmd160) checksum for meld-1.8.4.tar.xz
1146:debug:checksum Correct (sha1) checksum for meld-1.8.4.tar.xz
1147:debug:checksum Correct (sha256) checksum for meld-1.8.4.tar.xz
1148:debug:checksum Privilege de-escalation not attempted as not running as root.
1149:debug:extract extract phase started at Mon Mar  3 10:20:27 EST 2014
1150:notice:extract --->  Extracting meld
1151:debug:extract setting option extract.cmd to /opt/local/bin/xz
1152:debug:extract Executing org.macports.extract (meld)
1153:info:extract --->  Extracting meld-1.8.4.tar.xz
1154:debug:extract setting option extract.args to '/opt/local/var/macports/distfiles/meld/meld-1.8.4.tar.xz'
1155:debug:extract Environment: CPATH='/opt/local/include' CC_PRINT_OPTIONS_FILE='/opt/local/var/macports/build/_opt_local_var_macports_sources_rsync.macports.org_release_tarballs_ports_textproc_meld/meld/work/.CC_PRINT_OPTIONS' LIBRARY_PATH='/opt/local/lib' CC_PRINT_OPTIONS='YES' MACOSX_DEPLOYMENT_TARGET='10.9'
1156:debug:extract Assembled command: 'cd "/opt/local/var/macports/build/_opt_local_var_macports_sources_rsync.macports.org_release_tarballs_ports_textproc_meld/meld/work" && /opt/local/bin/xz -dc '/opt/local/var/macports/distfiles/meld/meld-1.8.4.tar.xz' | /usr/bin/tar -xf -'
1157:debug:extract Executing command line:  cd "/opt/local/var/macports/build/_opt_local_var_macports_sources_rsync.macports.org_release_tarballs_ports_textproc_meld/meld/work" && /opt/local/bin/xz -dc '/opt/local/var/macports/distfiles/meld/meld-1.8.4.tar.xz' | /usr/bin/tar -xf -
1158:debug:extract euid/egid changed to: 0/0
1159:debug:extract chowned /opt/local/var/macports/build/_opt_local_var_macports_sources_rsync.macports.org_release_tarballs_ports_textproc_meld/meld/work to macports
1160:debug:extract euid/egid changed to: 502/501
1161:debug:extract Privilege de-escalation not attempted as not running as root.
1162:debug:patch patch phase started at Mon Mar  3 10:20:27 EST 2014
1163:debug:patch Executing org.macports.patch (meld)
1164:debug:patch Executing proc-post-org.macports.patch-patch-0
1165:debug:patch Executing reinplace: /usr/bin/sed s|/usr/local|/opt/local|g < /opt/local/var/macports/build/_opt_local_var_macports_sources_rsync.macports.org_release_tarballs_ports_textproc_meld/meld/work/meld-1.8.4/INSTALL >@ file12
1166:debug:patch euid/egid changed to: 0/0
1167:debug:patch chowned /opt/local/var/macports/build/_opt_local_var_macports_sources_rsync.macports.org_release_tarballs_ports_textproc_meld/meld/work/meld-1.8.4/INSTALL to macports
1168:debug:patch euid/egid changed to: 502/501
1169:debug:patch euid/egid changed to: 0/0
1170:debug:patch setting attributes on /opt/local/var/macports/build/_opt_local_var_macports_sources_rsync.macports.org_release_tarballs_ports_textproc_meld/meld/work/meld-1.8.4/INSTALL
1171:debug:patch euid/egid changed to: 502/501
1172:debug:patch Executing reinplace: /usr/bin/sed {s|#! /usr/bin/env python|#! /opt/local/bin/python2.7|} < /opt/local/var/macports/build/_opt_local_var_macports_sources_rsync.macports.org_release_tarballs_ports_textproc_meld/meld/work/meld-1.8.4/bin/meld >@ file12
1173:debug:patch euid/egid changed to: 0/0
1174:debug:patch chowned /opt/local/var/macports/build/_opt_local_var_macports_sources_rsync.macports.org_release_tarballs_ports_textproc_meld/meld/work/meld-1.8.4/bin/meld to macports
1175:debug:patch euid/egid changed to: 502/501
1176:debug:patch euid/egid changed to: 0/0
1177:debug:patch setting attributes on /opt/local/var/macports/build/_opt_local_var_macports_sources_rsync.macports.org_release_tarballs_ports_textproc_meld/meld/work/meld-1.8.4/bin/meld
1178:debug:patch euid/egid changed to: 502/501
1179:debug:patch Privilege de-escalation not attempted as not running as root.
1180:debug:configure configure phase started at Mon Mar  3 10:20:27 EST 2014
1181:notice:configure --->  Configuring meld
1182:debug:configure Using compiler 'Xcode Clang'
1183:debug:configure Executing org.macports.configure (meld)
1184:debug:configure Privilege de-escalation not attempted as not running as root.
1185:debug:build build phase started at Mon Mar  3 10:20:27 EST 2014
1186:notice:build --->  Building meld
1187:debug:build Executing org.macports.build (meld)
1188:debug:build Environment: CPATH='/opt/local/include' CC_PRINT_OPTIONS_FILE='/opt/local/var/macports/build/_opt_local_var_macports_sources_rsync.macports.org_release_tarballs_ports_textproc_meld/meld/work/.CC_PRINT_OPTIONS' LIBRARY_PATH='/opt/local/lib' CC_PRINT_OPTIONS='YES' MACOSX_DEPLOYMENT_TARGET='10.9'
1189:debug:build Assembled command: 'cd "/opt/local/var/macports/build/_opt_local_var_macports_sources_rsync.macports.org_release_tarballs_ports_textproc_meld/meld/work/meld-1.8.4" && /usr/bin/make -j5 -w all PYTHON=/opt/local/bin/python2.7'
1190:debug:build Executing command line:  cd "/opt/local/var/macports/build/_opt_local_var_macports_sources_rsync.macports.org_release_tarballs_ports_textproc_meld/meld/work/meld-1.8.4" && /usr/bin/make -j5 -w all PYTHON=/opt/local/bin/python2.7
1191:info:build make: Entering directory `/opt/local/var/macports/build/_opt_local_var_macports_sources_rsync.macports.org_release_tarballs_ports_textproc_meld/meld/work/meld-1.8.4'
1192:info:build /opt/local/bin/python2.7 tools/install_paths \
1193:info:build             libdir=/opt/local/lib/meld \
1194:info:build             localedir=/opt/local/share/locale \
1195:info:build             helpdir=/opt/local/share/gnome/help/meld \
1196:info:build             sharedir=/opt/local/share/meld \
1197:info:build             < bin/meld > bin/meld.install
1198:info:build /opt/local/bin/python2.7 tools/install_paths \
1199:info:build             libdir=/opt/local/lib/meld \
1200:info:build             localedir=/opt/local/share/locale \
1201:info:build             helpdir=/opt/local/share/gnome/help/meld \
1202:info:build             sharedir=/opt/local/share/meld \
1203:info:build             < meld/paths.py > meld/paths.py.install
1204:info:build intltool-merge -d po data/meld.desktop.in data/meld.desktop
1205:info:build intltool-merge -d po data/mime/meld.xml.in data/mime/meld.xml
1206:info:build Merging translations into data/mime/meld.xml.
1207:info:build Merging translations into data/meld.desktop.
1208:info:build /Applications/Xcode.app/Contents/Developer/usr/bin/make -C po
1209:info:build make[1]: Entering directory `/opt/local/var/macports/build/_opt_local_var_macports_sources_rsync.macports.org_release_tarballs_ports_textproc_meld/meld/work/meld-1.8.4/po'
1210:info:build mkdir -m 755 -p ar/LC_MESSAGES/ && msgfmt -c -o ar/LC_MESSAGES/meld.mo ar.po
1211:info:build mkdir -m 755 -p bg/LC_MESSAGES/ && msgfmt -c -o bg/LC_MESSAGES/meld.mo bg.po
1212:info:build mkdir -m 755 -p ca/LC_MESSAGES/ && msgfmt -c -o ca/LC_MESSAGES/meld.mo ca.po
1213:info:build mkdir -m 755 -p ca@valencia/LC_MESSAGES/ && msgfmt -c -o ca@valencia/LC_MESSAGES/meld.mo ca@valencia.po
1214:info:build mkdir -m 755 -p cs/LC_MESSAGES/ && msgfmt -c -o cs/LC_MESSAGES/meld.mo cs.po
1215:info:build ar.po:7: warning: ca@valencia.po:9: warning: header field 'Language' missing in header
1216:info:build mkdir -m 755 -p da/LC_MESSAGES/ && msgfmt -c -o da/LC_MESSAGES/meld.mo da.po
1217:info:build mkdir -m 755 -p de/LC_MESSAGES/ && msgfmt -c -o de/LC_MESSAGES/meld.mo de.po
1218:info:build mkdir -m 755 -p dz/LC_MESSAGES/ && msgfmt -c -o dz/LC_MESSAGES/meld.mo dz.po
1219:info:build mkdir -m 755 -p el/LC_MESSAGES/ && msgfmt -c -o el/LC_MESSAGES/meld.mo el.po
1220:info:build header field 'Language' missing in header
1221:info:build mkdir -m 755 -p en_CA/LC_MESSAGES/ && msgfmt -c -o en_CA/LC_MESSAGES/meld.mo en_CA.po
1222:info:build dz.po:7: warning: header field 'Language' missing in header
1223:info:build mkdir -m 755 -p en_GB/LC_MESSAGES/ && msgfmt -c -o en_GB/LC_MESSAGES/meld.mo en_GB.po
1224:info:build mkdir -m 755 -p eo/LC_MESSAGES/ && msgfmt -c -o eo/LC_MESSAGES/meld.mo eo.po
1225:info:build mkdir -m 755 -p es/LC_MESSAGES/ && msgfmt -c -o es/LC_MESSAGES/meld.mo es.po
1226:info:build mkdir -m 755 -p eu/LC_MESSAGES/ && msgfmt -c -o eu/LC_MESSAGES/meld.mo eu.po
1227:info:build en_CA.po:8: warning: header field 'Language' missing in header
1228:info:build mkdir -m 755 -p fi/LC_MESSAGES/ && msgfmt -c -o fi/LC_MESSAGES/meld.mo fi.po
1229:info:build en_GB.po:8: warning: header field 'Language' missing in header
1230:info:build eo.po:7: warning: header field 'Language' missing in header
1231:info:build mkdir -m 755 -p fr/LC_MESSAGES/ && msgfmt -c -o fr/LC_MESSAGES/meld.mo fr.po
1232:info:build mkdir -m 755 -p gl/LC_MESSAGES/ && msgfmt -c -o gl/LC_MESSAGES/meld.mo gl.po
1233:info:build mkdir -m 755 -p hu/LC_MESSAGES/ && msgfmt -c -o hu/LC_MESSAGES/meld.mo hu.po
1234:info:build es.po:12: warning: header field 'Language' still has the initial default value
1235:info:build mkdir -m 755 -p id/LC_MESSAGES/ && msgfmt -c -o id/LC_MESSAGES/meld.mo id.po
1236:info:build fi.po:7: warning: header field 'Language' missing in header
1237:info:build mkdir -m 755 -p it/LC_MESSAGES/ && msgfmt -c -o it/LC_MESSAGES/meld.mo it.po
1238:info:build fr.po:12: warning: header field 'Language' missing in header
1239:info:build mkdir -m 755 -p ja/LC_MESSAGES/ && msgfmt -c -o ja/LC_MESSAGES/meld.mo ja.po
1240:info:build mkdir -m 755 -p ko/LC_MESSAGES/ && msgfmt -c -o ko/LC_MESSAGES/meld.mo ko.po
1241:info:build mkdir -m 755 -p nb/LC_MESSAGES/ && msgfmt -c -o nb/LC_MESSAGES/meld.mo nb.po
1242:info:build mkdir -m 755 -p ne/LC_MESSAGES/ && msgfmt -c -o ne/LC_MESSAGES/meld.mo ne.po
1243:info:build mkdir -m 755 -p nl/LC_MESSAGES/ && msgfmt -c -o nl/LC_MESSAGES/meld.mo nl.po
1244:info:build ko.po:8: warning: header field 'Language' missing in header
1245:info:build mkdir -m 755 -p oc/LC_MESSAGES/ && msgfmt -c -o oc/LC_MESSAGES/meld.mo oc.po
1246:info:build nb.po:6: warning: header field 'Language' still has the initial default value
1247:info:build mkdir -m 755 -p pa/LC_MESSAGES/ && msgfmt -c -o pa/LC_MESSAGES/meld.mo pa.po
1248:info:build mkdir -m 755 -p pl/LC_MESSAGES/ && msgfmt -c -o pl/LC_MESSAGES/meld.mo pl.po
1249:info:build ne.po:12: warning: header field 'Language' missing in header
1250:info:build mkdir -m 755 -p pt/LC_MESSAGES/ && msgfmt -c -o pt/LC_MESSAGES/meld.mo pt.po
1251:info:build nl.po:7: warning: header field 'Language' missing in header
1252:info:build mkdir -m 755 -p pt_BR/LC_MESSAGES/ && msgfmt -c -o pt_BR/LC_MESSAGES/meld.mo pt_BR.po
1253:info:build oc.po:8: warning: header field 'Language' missing in header
1254:info:build mkdir -m 755 -p ro/LC_MESSAGES/ && msgfmt -c -o ro/LC_MESSAGES/meld.mo ro.po
1255:info:build pa.po:7: warning: header field 'Language' missing in header
1256:info:build mkdir -m 755 -p ru/LC_MESSAGES/ && msgfmt -c -o ru/LC_MESSAGES/meld.mo ru.po
1257:info:build mkdir -m 755 -p rw/LC_MESSAGES/ && msgfmt -c -o rw/LC_MESSAGES/meld.mo rw.po
1258:info:build pt.po:7: warning: header field 'Language' missing in header
1259:info:build mkdir -m 755 -p sl/LC_MESSAGES/ && msgfmt -c -o sl/LC_MESSAGES/meld.mo sl.po
1260:info:build mkdir -m 755 -p sq/LC_MESSAGES/ && msgfmt -c -o sq/LC_MESSAGES/meld.mo sq.po
1261:info:build ro.po:7: warning: header field 'Language' missing in header
1262:info:build mkdir -m 755 -p sr/LC_MESSAGES/ && msgfmt -c -o sr/LC_MESSAGES/meld.mo sr.po
1263:info:build rw.po:15: warning: header field 'Language' missing in header
1264:info:build mkdir -m 755 -p sr@latin/LC_MESSAGES/ && msgfmt -c -o sr@latin/LC_MESSAGES/meld.mo sr@latin.po
1265:info:build mkdir -m 755 -p sv/LC_MESSAGES/ && msgfmt -c -o sv/LC_MESSAGES/meld.mo sv.po
1266:info:build mkdir -m 755 -p vi/LC_MESSAGES/ && msgfmt -c -o vi/LC_MESSAGES/meld.mo vi.po
1267:info:build sq.po:10: warning: header field 'Language' missing in header
1268:info:build mkdir -m 755 -p zh_CN/LC_MESSAGES/ && msgfmt -c -o zh_CN/LC_MESSAGES/meld.mo zh_CN.po
1269:info:build mkdir -m 755 -p zh_TW/LC_MESSAGES/ && msgfmt -c -o zh_TW/LC_MESSAGES/meld.mo zh_TW.po
1270:info:build vi.po:7: warning: header field 'Language' missing in header
1271:info:build zh_TW.po:7: warning: header field 'Language' missing in header
1272:info:build make[1]: Leaving directory `/opt/local/var/macports/build/_opt_local_var_macports_sources_rsync.macports.org_release_tarballs_ports_textproc_meld/meld/work/meld-1.8.4/po'
1273:info:build /Applications/Xcode.app/Contents/Developer/usr/bin/make -C help
1274:info:build make[1]: Entering directory `/opt/local/var/macports/build/_opt_local_var_macports_sources_rsync.macports.org_release_tarballs_ports_textproc_meld/meld/work/meld-1.8.4/help'
1275:info:build for lang in C es fr; do \
1276:info:build             /Applications/Xcode.app/Contents/Developer/usr/bin/make -C $lang all ; \
1277:info:build     done
1278:info:build make[2]: Entering directory `/opt/local/var/macports/build/_opt_local_var_macports_sources_rsync.macports.org_release_tarballs_ports_textproc_meld/meld/work/meld-1.8.4/help/C'
1279:info:build scrollkeeper-preinstall /opt/local/share/gnome/help/meld/C/meld.xml meld-C.omf meld-C.omf.install
1280:info:build make[2]: scrollkeeper-preinstall: No such file or directory
1281:info:build make[2]: *** [all] Error 1
1282:info:build make[2]: Leaving directory `/opt/local/var/macports/build/_opt_local_var_macports_sources_rsync.macports.org_release_tarballs_ports_textproc_meld/meld/work/meld-1.8.4/help/C'
1283:info:build make[2]: Entering directory `/opt/local/var/macports/build/_opt_local_var_macports_sources_rsync.macports.org_release_tarballs_ports_textproc_meld/meld/work/meld-1.8.4/help/es'
1284:info:build scrollkeeper-preinstall /opt/local/share/gnome/help/meld/es/meld.xml meld-es.omf meld-es.omf.install
1285:info:build make[2]: scrollkeeper-preinstall: No such file or directory
1286:info:build make[2]: *** [all] Error 1
1287:info:build make[2]: Leaving directory `/opt/local/var/macports/build/_opt_local_var_macports_sources_rsync.macports.org_release_tarballs_ports_textproc_meld/meld/work/meld-1.8.4/help/es'
1288:info:build make[2]: Entering directory `/opt/local/var/macports/build/_opt_local_var_macports_sources_rsync.macports.org_release_tarballs_ports_textproc_meld/meld/work/meld-1.8.4/help/fr'
1289:info:build scrollkeeper-preinstall /opt/local/share/gnome/help/meld/fr/meld.xml meld-fr.omf meld-fr.omf.install
1290:info:build make[2]: scrollkeeper-preinstall: No such file or directory
1291:info:build make[2]: *** [all] Error 1
1292:info:build make[2]: Leaving directory `/opt/local/var/macports/build/_opt_local_var_macports_sources_rsync.macports.org_release_tarballs_ports_textproc_meld/meld/work/meld-1.8.4/help/fr'
1293:info:build make[1]: *** [all] Error 2
1294:info:build make[1]: Leaving directory `/opt/local/var/macports/build/_opt_local_var_macports_sources_rsync.macports.org_release_tarballs_ports_textproc_meld/meld/work/meld-1.8.4/help'
1295:info:build make: *** [all] Error 2
1296:info:build make: Leaving directory `/opt/local/var/macports/build/_opt_local_var_macports_sources_rsync.macports.org_release_tarballs_ports_textproc_meld/meld/work/meld-1.8.4'
1297:info:build Command failed:  cd "/opt/local/var/macports/build/_opt_local_var_macports_sources_rsync.macports.org_release_tarballs_ports_textproc_meld/meld/work/meld-1.8.4" && /usr/bin/make -j5 -w all PYTHON=/opt/local/bin/python2.7
1298:info:build Exit code: 2
1299:error:build org.macports.build for port meld returned: command execution failed
1300:debug:build Error code: CHILDSTATUS 25614 2
1301:debug:build Backtrace: command execution failed
1302    while executing
1303"system -nice 0 $fullcmdstring"
1304    ("eval" body line 1)
1305    invoked from within
1306"eval system $notty $nice \$fullcmdstring"
1307    invoked from within
1308"command_exec build"
1309    (procedure "portbuild::build_main" line 8)
1310    invoked from within
1311"$procedure $targetname"
1312:info:build Warning: targets not executed for meld: org.macports.activate org.macports.build org.macports.destroot org.macports.install
1313:notice:build Please see the log file for port meld for details:
1314    /opt/local/var/macports/logs/_opt_local_var_macports_sources_rsync.macports.org_release_tarballs_ports_textproc_meld/meld/main.log