Ticket #42864: main.log

File main.log, 13.5 KB (added by ats@…, 7 years ago)
Line 
1version:1
2:debug:main epoch: in tree: 0 installed: 0
3:debug:main ncurses 5.9_2 exists in the ports tree
4:debug:main ncurses 5.9_2  is the latest installed
5:debug:main ncurses 5.9_2  is active
6:debug:main Merging existing variants '' into variants
7:debug:main new fully merged portvariants:
8:debug:main Changing to port directory: /opt/local/var/macports/sources/rsync.macports.org/release/tarballs/ports/devel/ncurses
9:debug:main OS darwin/13.2.0 (Mac OS X 10.9) arch i386
10:debug:main adding the default universal variant
11:debug:main Reading variant descriptions from /opt/local/var/macports/sources/rsync.macports.org/release/tarballs/ports/_resources/port1.0/variant_descriptions.conf
12:debug:main Running callback portconfigure::add_automatic_compiler_dependencies
13:debug:main Finished running callback portconfigure::add_automatic_compiler_dependencies
14:debug:main Running callback portbuild::add_automatic_buildsystem_dependencies
15:debug:main Finished running callback portbuild::add_automatic_buildsystem_dependencies
16:debug:main No need to upgrade! ncurses 5.9_2 >= ncurses 5.9_2
17:msg:main --->  Computing dependencies for ocaml:info:main .:debug:main Searching for dependency: ncurses
18:debug:main Found Dependency: receipt exists for ncurses
19:msg:main
20:debug:main Executing org.macports.main (ocaml)
21:debug:main changing euid/egid - current euid: 0 - current egid: 0
22:debug:main egid changed to: 20
23:debug:main euid changed to: 502
24:debug:fetch fetch phase started at Sat Mar 15 12:35:23 CDT 2014
25:notice:fetch --->  Fetching distfiles for ocaml
26:debug:fetch Executing org.macports.fetch (ocaml)
27:debug:fetch Privilege de-escalation not attempted as not running as root.
28:debug:checksum checksum phase started at Sat Mar 15 12:35:23 CDT 2014
29:notice:checksum --->  Verifying checksums for ocaml
30:debug:checksum Executing org.macports.checksum (ocaml)
31:info:checksum --->  Checksumming ocaml-4.01.0.tar.bz2
32:debug:checksum Correct (rmd160) checksum for ocaml-4.01.0.tar.bz2
33:debug:checksum Correct (sha256) checksum for ocaml-4.01.0.tar.bz2
34:debug:checksum Privilege de-escalation not attempted as not running as root.
35:debug:extract extract phase started at Sat Mar 15 12:35:23 CDT 2014
36:notice:extract --->  Extracting ocaml
37:debug:extract setting option extract.cmd to /usr/bin/bzip2
38:debug:extract Executing org.macports.extract (ocaml)
39:info:extract --->  Extracting ocaml-4.01.0.tar.bz2
40:debug:extract setting option extract.args to '/opt/local/var/macports/distfiles/ocaml/ocaml-4.01.0.tar.bz2'
41:debug:extract Environment: CPATH='/opt/local/include' CC_PRINT_OPTIONS_FILE='/opt/local/var/macports/build/_opt_local_var_macports_sources_rsync.macports.org_release_tarballs_ports_lang_ocaml/ocaml/work/.CC_PRINT_OPTIONS' LIBRARY_PATH='/opt/local/lib' CC_PRINT_OPTIONS='YES' MACOSX_DEPLOYMENT_TARGET='10.9'
42:debug:extract Assembled command: 'cd "/opt/local/var/macports/build/_opt_local_var_macports_sources_rsync.macports.org_release_tarballs_ports_lang_ocaml/ocaml/work" && /usr/bin/bzip2 -dc '/opt/local/var/macports/distfiles/ocaml/ocaml-4.01.0.tar.bz2' | /usr/bin/tar -xf -'
43:debug:extract Executing command line:  cd "/opt/local/var/macports/build/_opt_local_var_macports_sources_rsync.macports.org_release_tarballs_ports_lang_ocaml/ocaml/work" && /usr/bin/bzip2 -dc '/opt/local/var/macports/distfiles/ocaml/ocaml-4.01.0.tar.bz2' | /usr/bin/tar -xf -
44:debug:extract euid/egid changed to: 0/0
45:debug:extract chowned /opt/local/var/macports/build/_opt_local_var_macports_sources_rsync.macports.org_release_tarballs_ports_lang_ocaml/ocaml/work to macports
46:debug:extract euid/egid changed to: 502/20
47:debug:extract Privilege de-escalation not attempted as not running as root.
48:debug:patch patch phase started at Sat Mar 15 12:35:25 CDT 2014
49:debug:patch Executing org.macports.patch (ocaml)
50:debug:patch Privilege de-escalation not attempted as not running as root.
51:debug:configure configure phase started at Sat Mar 15 12:35:25 CDT 2014
52:notice:configure --->  Configuring ocaml
53:debug:configure Using compiler 'Xcode Clang'
54:debug:configure Executing org.macports.configure (ocaml)
55:debug:configure Environment: CPATH='/opt/local/include' CFLAGS='-pipe -Os -arch x86_64' CPPFLAGS='-I/opt/local/include' CXXFLAGS='-pipe -Os -arch x86_64' LIBRARY_PATH='/opt/local/lib' MACOSX_DEPLOYMENT_TARGET='10.9' CXX='/usr/bin/clang++' CC_PRINT_OPTIONS_FILE='/opt/local/var/macports/build/_opt_local_var_macports_sources_rsync.macports.org_release_tarballs_ports_lang_ocaml/ocaml/work/.CC_PRINT_OPTIONS' F90FLAGS='-pipe -Os -m64' LDFLAGS='-L/opt/local/lib -Wl,-headerpad_max_install_names -arch x86_64' FCFLAGS='-pipe -Os -m64' OBJC='/usr/bin/clang' OBJCXX='/usr/bin/clang++' INSTALL='/usr/bin/install -c' OBJCFLAGS='-pipe -Os -arch x86_64' OBJCXXFLAGS='-pipe -Os -arch x86_64' FFLAGS='-pipe -Os -m64' CC_PRINT_OPTIONS='YES' CC='/usr/bin/clang'
56:debug:configure Assembled command: 'cd "/opt/local/var/macports/build/_opt_local_var_macports_sources_rsync.macports.org_release_tarballs_ports_lang_ocaml/ocaml/work/ocaml-4.01.0" && ./configure -prefix /opt/local -no-tk -cc /usr/bin/clang -aspp "/usr/bin/clang -c" -x11include "/opt/local/include" -x11lib "/opt/local/lib"'
57:debug:configure Executing command line:  cd "/opt/local/var/macports/build/_opt_local_var_macports_sources_rsync.macports.org_release_tarballs_ports_lang_ocaml/ocaml/work/ocaml-4.01.0" && ./configure -prefix /opt/local -no-tk -cc /usr/bin/clang -aspp "/usr/bin/clang -c" -x11include "/opt/local/include" -x11lib "/opt/local/lib"
58:info:configure Configuring for a x86_64-apple-darwin13.2.0 ...
59:info:configure The C compiler is ANSI-compliant.
60:info:configure Checking the sizes of integers and pointers...
61:info:configure Wow! A 64 bit architecture!
62:info:configure This is a little-endian architecture.
63:info:configure Doubles can be word-aligned.
64:info:configure 64-bit integers can be word-aligned.
65:info:configure Native division and modulus have round-towards-zero semantics,
66:info:configure will use them.
67:info:configure ranlib found
68:info:configure #! appears to work in shell scripts
69:info:configure POSIX signal handling found.
70:info:configure expm1(), log1p(), hypot(), copysign() found.
71:info:configure getrusage() found.
72:info:configure times() found.
73:info:configure termcap functions found (with libraries '-lcurses')
74:info:configure You have BSD sockets.
75:info:configure socklen_t is defined in <sys/socket.h>
76:info:configure inet_aton() found.
77:info:configure IPv6 is supported.
78:info:configure unistd.h found.
79:info:configure off_t is defined in <sys/types.h>
80:info:configure dirent.h found.
81:info:configure rewinddir() found.
82:info:configure lockf() found.
83:info:configure mkfifo() found.
84:info:configure getcwd() found.
85:info:configure getwd() found.
86:info:configure getpriority() found.
87:info:configure utime() found.
88:info:configure utimes() found.
89:info:configure dup2() found.
90:info:configure fchmod() found.
91:info:configure truncate() found.
92:info:configure sys/select.h found.
93:info:configure select() found.
94:info:configure symlink() found.
95:info:configure waitpid() found.
96:info:configure wait4() found.
97:info:configure getgroups() found.
98:info:configure setgroups() found.
99:info:configure initgroups() found.
100:info:configure POSIX termios found.
101:info:configure Asynchronous I/O are supported.
102:info:configure setitimer() found.
103:info:configure gethostname() found.
104:info:configure uname() found.
105:info:configure gettimeofday() found.
106:info:configure mktime() found.
107:info:configure setsid() found.
108:info:configure putenv() found.
109:info:configure setlocale() and <locale.h> found.
110:info:configure dlopen() found.
111:info:configure Dynamic loading of shared libraries is supported.
112:info:configure mmap() found.
113:info:configure pwrite() found
114:info:configure Replay debugger supported.
115:info:configure System stack overflow can be detected.
116:info:configure POSIX threads library supported.
117:info:configure Options for linking with POSIX threads: -lpthread
118:info:configure sigwait() found
119:info:configure Bytecode threads library supported.
120:info:configure X11 works
121:info:configure Options for compiling for X11: -I/usr/X11R6/include
122:info:configure Options for linking with X11: -L/usr/X11R6/lib -lX11
123:info:configure Configuring LablTk...
124:info:configure Configuration failed, LablTk will not be built.
125:info:configure BFD library not found, 'objinfo' will be unable to display info on .cmxs files
126:info:configure Assembler supports CFI
127:info:configure
128:info:configure ** Configuration summary **
129:info:configure
130:info:configure Directories where OCaml will be installed:
131:info:configure         binaries.................. /opt/local/bin
132:info:configure         standard library.......... /opt/local/lib/ocaml
133:info:configure         manual pages.............. /opt/local/man (with extension .1)
134:info:configure Configuration for the bytecode compiler:
135:info:configure         C compiler used........... /usr/bin/clang
136:info:configure         options for compiling.....  -fno-defer-pop -Wall -D_FILE_OFFSET_BITS=64 -D_REENTRANT
137:info:configure         options for linking.......     -lcurses -lpthread
138:info:configure         shared libraries are supported
139:info:configure         options for compiling.....   -fno-defer-pop -Wall -D_FILE_OFFSET_BITS=64 -D_REENTRANT
140:info:configure         command for building...... /usr/bin/clang -bundle -flat_namespace -undefined suppress -Wl,-no_compact_unwind -o lib.so /a/path objs
141:info:configure Configuration for the native-code compiler:
142:info:configure         hardware architecture..... amd64
143:info:configure         OS variant................ macosx
144:info:configure         C compiler used........... /usr/bin/clang
145:info:configure         options for compiling.....  -D_FILE_OFFSET_BITS=64 -D_REENTRANT
146:info:configure         options for linking.......   
147:info:configure         assembler ................ clang -arch x86_64 -c
148:info:configure         preprocessed assembler ... /usr/bin/clang -c
149:info:configure         assembler supports CFI ... yes
150:info:configure         with frame pointers....... no
151:info:configure         native dynlink ........... true
152:info:configure         profiling with gprof ..... supported
153:info:configure Source-level replay debugger: supported
154:info:configure Additional libraries supported:
155:info:configure         unix str num dynlink bigarray systhreads threads graph
156:info:configure Configuration for the "num" library:
157:info:configure         target architecture ...... amd64 (asm level 1)
158:info:configure Configuration for the "graph" library:
159:info:configure         options for compiling .... -I/usr/X11R6/include
160:info:configure         options for linking ...... -L/usr/X11R6/lib -lX11
161:info:configure The "labltk" library: not supported
162:info:configure
163:info:configure ** OCaml configuration completed successfully **
164:info:configure
165:info:configure WARNING: the environment variable MACOSX_DEPLOYMENT_TARGET is set.
166:info:configure This will probably prevent compiling the OCaml system.
167:debug:configure Privilege de-escalation not attempted as not running as root.
168:debug:build build phase started at Sat Mar 15 12:35:30 CDT 2014
169:notice:build --->  Building ocaml
170:debug:build Executing org.macports.build (ocaml)
171:debug:build port disallows a parallel build
172:debug:build Environment: CPATH='/opt/local/include' CC_PRINT_OPTIONS_FILE='/opt/local/var/macports/build/_opt_local_var_macports_sources_rsync.macports.org_release_tarballs_ports_lang_ocaml/ocaml/work/.CC_PRINT_OPTIONS' LIBRARY_PATH='/opt/local/lib' CC_PRINT_OPTIONS='YES' MACOSX_DEPLOYMENT_TARGET='10.9'
173:debug:build Assembled command: 'cd "/opt/local/var/macports/build/_opt_local_var_macports_sources_rsync.macports.org_release_tarballs_ports_lang_ocaml/ocaml/work/ocaml-4.01.0" && unset LD_PREBIND LD_PREBIND_ALLOW_OVERLAP && /usr/bin/make world.opt'
174:debug:build Executing command line:  cd "/opt/local/var/macports/build/_opt_local_var_macports_sources_rsync.macports.org_release_tarballs_ports_lang_ocaml/ocaml/work/ocaml-4.01.0" && unset LD_PREBIND LD_PREBIND_ALLOW_OVERLAP && /usr/bin/make world.opt
175:info:build /Applications/Xcode.app/Contents/Developer/usr/bin/make coldstart
176:info:build cd byterun; /Applications/Xcode.app/Contents/Developer/usr/bin/make all
177:info:build sed -n -e '/^  /s/ \([A-Z]\)/ \&\&lbl_\1/gp' \
178:info:build            -e '/^}/q' instruct.h > jumptbl.h
179:info:build /usr/bin/clang -DCAML_NAME_SPACE -O -fno-defer-pop -Wall -D_FILE_OFFSET_BITS=64 -D_REENTRANT    -c -o interp.o interp.c
180:info:build clang: error: unknown argument: '-fno-defer-pop' [-Wunused-command-line-argument-hard-error-in-future]
181:info:build clang: note: this will be a hard error (cannot be downgraded to a warning) in the future
182:info:build make[2]: *** [interp.o] Error 1
183:info:build make[1]: *** [coldstart] Error 2
184:info:build make: *** [world.opt] Error 2
185:info:build Command failed:  cd "/opt/local/var/macports/build/_opt_local_var_macports_sources_rsync.macports.org_release_tarballs_ports_lang_ocaml/ocaml/work/ocaml-4.01.0" && unset LD_PREBIND LD_PREBIND_ALLOW_OVERLAP && /usr/bin/make world.opt
186:info:build Exit code: 2
187:error:build org.macports.build for port ocaml returned: command execution failed
188:debug:build Error code: CHILDSTATUS 53896 2
189:debug:build Backtrace: command execution failed
190    while executing
191"system -nice 0 $fullcmdstring"
192    ("eval" body line 1)
193    invoked from within
194"eval system $notty $nice \$fullcmdstring"
195    invoked from within
196"command_exec build"
197    (procedure "portbuild::build_main" line 8)
198    invoked from within
199"$procedure $targetname"
200:info:build Warning: targets not executed for ocaml: org.macports.build
201:notice:build Please see the log file for port ocaml for details:
202    /opt/local/var/macports/logs/_opt_local_var_macports_sources_rsync.macports.org_release_tarballs_ports_lang_ocaml/ocaml/main.log