Ticket #42953: main.log

File main.log, 21.7 KB (added by basmac, 8 years ago)
Line 
1version:1
2:msg:main --->  Computing dependencies for gnutls:msg:main
3:debug:main gnutls has no conflicts
4:debug:main Searching for dependency: xz
5:debug:main Found Dependency: receipt exists for xz
6:debug:main Searching for dependency: pkgconfig
7:debug:main Found Dependency: receipt exists for pkgconfig
8:debug:main Searching for dependency: gettext
9:debug:main Found Dependency: receipt exists for gettext
10:debug:main Searching for dependency: autoconf
11:debug:main Found Dependency: receipt exists for autoconf
12:debug:main Searching for dependency: automake
13:debug:main Found Dependency: receipt exists for automake
14:debug:main Searching for dependency: libtool
15:debug:main Found Dependency: receipt exists for libtool
16:debug:main Searching for dependency: gmp
17:debug:main Found Dependency: receipt exists for gmp
18:debug:main Searching for dependency: libidn
19:debug:main Found Dependency: receipt exists for libidn
20:debug:main Searching for dependency: libtasn1
21:debug:main Found Dependency: receipt exists for libtasn1
22:debug:main Searching for dependency: p11-kit
23:debug:main Found Dependency: receipt exists for p11-kit
24:debug:main Searching for dependency: nettle
25:debug:main Found Dependency: receipt exists for nettle
26:debug:main Executing org.macports.main (gnutls)
27:debug:main changing euid/egid - current euid: 0 - current egid: 0
28:debug:main egid changed to: 501
29:debug:main euid changed to: 502
30:debug:main Skipping completed org.macports.archivefetch (gnutls)
31:debug:main Privilege de-escalation not attempted as not running as root.
32:debug:main Skipping completed org.macports.fetch (gnutls)
33:debug:main Privilege de-escalation not attempted as not running as root.
34:debug:main Skipping completed org.macports.checksum (gnutls)
35:debug:main Privilege de-escalation not attempted as not running as root.
36:debug:main Skipping completed org.macports.extract (gnutls)
37:debug:main Privilege de-escalation not attempted as not running as root.
38:debug:main Skipping completed org.macports.patch (gnutls)
39:debug:main Privilege de-escalation not attempted as not running as root.
40:debug:main Skipping completed org.macports.configure (gnutls)
41:debug:main Privilege de-escalation not attempted as not running as root.
42:debug:build build phase started at Thu Mar 20 10:48:55 MDT 2014
43:notice:build --->  Building gnutls
44:debug:build Executing org.macports.build (gnutls)
45:info:build --->  Building gnutls for architecture x86_64
46:debug:build Environment: CPATH='/opt/local/include' CC_PRINT_OPTIONS_FILE='/opt/local/var/macports/build/_opt_local_var_macports_sources_rsync.macports.org_release_tarballs_ports_devel_gnutls/gnutls/work/.CC_PRINT_OPTIONS' LIBRARY_PATH='/opt/local/lib' CC_PRINT_OPTIONS='YES' MACOSX_DEPLOYMENT_TARGET='10.8'
47:debug:build Assembled command: 'cd "/opt/local/var/macports/build/_opt_local_var_macports_sources_rsync.macports.org_release_tarballs_ports_devel_gnutls/gnutls/work/gnutls-3.1.22-x86_64" && /usr/bin/make -j8 -w all'
48:debug:build Executing command line:  cd "/opt/local/var/macports/build/_opt_local_var_macports_sources_rsync.macports.org_release_tarballs_ports_devel_gnutls/gnutls/work/gnutls-3.1.22-x86_64" && /usr/bin/make -j8 -w all
49:info:build make: Entering directory `/opt/local/var/macports/build/_opt_local_var_macports_sources_rsync.macports.org_release_tarballs_ports_devel_gnutls/gnutls/work/gnutls-3.1.22-x86_64'
50:info:build /usr/bin/make  all-recursive
51:info:build make[1]: Entering directory `/opt/local/var/macports/build/_opt_local_var_macports_sources_rsync.macports.org_release_tarballs_ports_devel_gnutls/gnutls/work/gnutls-3.1.22-x86_64'
52:info:build Making all in gl
53:info:build make[2]: Entering directory `/opt/local/var/macports/build/_opt_local_var_macports_sources_rsync.macports.org_release_tarballs_ports_devel_gnutls/gnutls/work/gnutls-3.1.22-x86_64/gl'
54:info:build /usr/bin/make  all-recursive
55:info:build make[3]: Entering directory `/opt/local/var/macports/build/_opt_local_var_macports_sources_rsync.macports.org_release_tarballs_ports_devel_gnutls/gnutls/work/gnutls-3.1.22-x86_64/gl'
56:info:build Making all in tests
57:info:build make[4]: Entering directory `/opt/local/var/macports/build/_opt_local_var_macports_sources_rsync.macports.org_release_tarballs_ports_devel_gnutls/gnutls/work/gnutls-3.1.22-x86_64/gl/tests'
58:info:build /usr/bin/make  all-recursive
59:info:build make[5]: Entering directory `/opt/local/var/macports/build/_opt_local_var_macports_sources_rsync.macports.org_release_tarballs_ports_devel_gnutls/gnutls/work/gnutls-3.1.22-x86_64/gl/tests'
60:info:build Making all in .
61:info:build make[6]: Entering directory `/opt/local/var/macports/build/_opt_local_var_macports_sources_rsync.macports.org_release_tarballs_ports_devel_gnutls/gnutls/work/gnutls-3.1.22-x86_64/gl/tests'
62:info:build make[6]: Nothing to be done for `all-am'.
63:info:build make[6]: Leaving directory `/opt/local/var/macports/build/_opt_local_var_macports_sources_rsync.macports.org_release_tarballs_ports_devel_gnutls/gnutls/work/gnutls-3.1.22-x86_64/gl/tests'
64:info:build make[5]: Leaving directory `/opt/local/var/macports/build/_opt_local_var_macports_sources_rsync.macports.org_release_tarballs_ports_devel_gnutls/gnutls/work/gnutls-3.1.22-x86_64/gl/tests'
65:info:build make[4]: Leaving directory `/opt/local/var/macports/build/_opt_local_var_macports_sources_rsync.macports.org_release_tarballs_ports_devel_gnutls/gnutls/work/gnutls-3.1.22-x86_64/gl/tests'
66:info:build make[4]: Entering directory `/opt/local/var/macports/build/_opt_local_var_macports_sources_rsync.macports.org_release_tarballs_ports_devel_gnutls/gnutls/work/gnutls-3.1.22-x86_64/gl'
67:info:build make[4]: Nothing to be done for `all-am'.
68:info:build make[4]: Leaving directory `/opt/local/var/macports/build/_opt_local_var_macports_sources_rsync.macports.org_release_tarballs_ports_devel_gnutls/gnutls/work/gnutls-3.1.22-x86_64/gl'
69:info:build make[3]: Leaving directory `/opt/local/var/macports/build/_opt_local_var_macports_sources_rsync.macports.org_release_tarballs_ports_devel_gnutls/gnutls/work/gnutls-3.1.22-x86_64/gl'
70:info:build make[2]: Leaving directory `/opt/local/var/macports/build/_opt_local_var_macports_sources_rsync.macports.org_release_tarballs_ports_devel_gnutls/gnutls/work/gnutls-3.1.22-x86_64/gl'
71:info:build Making all in lib
72:info:build make[2]: Entering directory `/opt/local/var/macports/build/_opt_local_var_macports_sources_rsync.macports.org_release_tarballs_ports_devel_gnutls/gnutls/work/gnutls-3.1.22-x86_64/lib'
73:info:build Making all in includes
74:info:build make[3]: Entering directory `/opt/local/var/macports/build/_opt_local_var_macports_sources_rsync.macports.org_release_tarballs_ports_devel_gnutls/gnutls/work/gnutls-3.1.22-x86_64/lib/includes'
75:info:build make[3]: Nothing to be done for `all'.
76:info:build make[3]: Leaving directory `/opt/local/var/macports/build/_opt_local_var_macports_sources_rsync.macports.org_release_tarballs_ports_devel_gnutls/gnutls/work/gnutls-3.1.22-x86_64/lib/includes'
77:info:build Making all in x509
78:info:build make[3]: Entering directory `/opt/local/var/macports/build/_opt_local_var_macports_sources_rsync.macports.org_release_tarballs_ports_devel_gnutls/gnutls/work/gnutls-3.1.22-x86_64/lib/x509'
79:info:build make[3]: Nothing to be done for `all'.
80:info:build make[3]: Leaving directory `/opt/local/var/macports/build/_opt_local_var_macports_sources_rsync.macports.org_release_tarballs_ports_devel_gnutls/gnutls/work/gnutls-3.1.22-x86_64/lib/x509'
81:info:build Making all in accelerated
82:info:build make[3]: Entering directory `/opt/local/var/macports/build/_opt_local_var_macports_sources_rsync.macports.org_release_tarballs_ports_devel_gnutls/gnutls/work/gnutls-3.1.22-x86_64/lib/accelerated'
83:info:build Making all in x86
84:info:build make[4]: Entering directory `/opt/local/var/macports/build/_opt_local_var_macports_sources_rsync.macports.org_release_tarballs_ports_devel_gnutls/gnutls/work/gnutls-3.1.22-x86_64/lib/accelerated/x86'
85:info:build make[4]: Nothing to be done for `all'.
86:info:build make[4]: Leaving directory `/opt/local/var/macports/build/_opt_local_var_macports_sources_rsync.macports.org_release_tarballs_ports_devel_gnutls/gnutls/work/gnutls-3.1.22-x86_64/lib/accelerated/x86'
87:info:build make[4]: Entering directory `/opt/local/var/macports/build/_opt_local_var_macports_sources_rsync.macports.org_release_tarballs_ports_devel_gnutls/gnutls/work/gnutls-3.1.22-x86_64/lib/accelerated'
88:info:build make[4]: Nothing to be done for `all-am'.
89:info:build make[4]: Leaving directory `/opt/local/var/macports/build/_opt_local_var_macports_sources_rsync.macports.org_release_tarballs_ports_devel_gnutls/gnutls/work/gnutls-3.1.22-x86_64/lib/accelerated'
90:info:build make[3]: Leaving directory `/opt/local/var/macports/build/_opt_local_var_macports_sources_rsync.macports.org_release_tarballs_ports_devel_gnutls/gnutls/work/gnutls-3.1.22-x86_64/lib/accelerated'
91:info:build Making all in auth
92:info:build make[3]: Entering directory `/opt/local/var/macports/build/_opt_local_var_macports_sources_rsync.macports.org_release_tarballs_ports_devel_gnutls/gnutls/work/gnutls-3.1.22-x86_64/lib/auth'
93:info:build make[3]: Nothing to be done for `all'.
94:info:build make[3]: Leaving directory `/opt/local/var/macports/build/_opt_local_var_macports_sources_rsync.macports.org_release_tarballs_ports_devel_gnutls/gnutls/work/gnutls-3.1.22-x86_64/lib/auth'
95:info:build Making all in ext
96:info:build make[3]: Entering directory `/opt/local/var/macports/build/_opt_local_var_macports_sources_rsync.macports.org_release_tarballs_ports_devel_gnutls/gnutls/work/gnutls-3.1.22-x86_64/lib/ext'
97:info:build make[3]: Nothing to be done for `all'.
98:info:build make[3]: Leaving directory `/opt/local/var/macports/build/_opt_local_var_macports_sources_rsync.macports.org_release_tarballs_ports_devel_gnutls/gnutls/work/gnutls-3.1.22-x86_64/lib/ext'
99:info:build Making all in algorithms
100:info:build make[3]: Entering directory `/opt/local/var/macports/build/_opt_local_var_macports_sources_rsync.macports.org_release_tarballs_ports_devel_gnutls/gnutls/work/gnutls-3.1.22-x86_64/lib/algorithms'
101:info:build make[3]: Nothing to be done for `all'.
102:info:build make[3]: Leaving directory `/opt/local/var/macports/build/_opt_local_var_macports_sources_rsync.macports.org_release_tarballs_ports_devel_gnutls/gnutls/work/gnutls-3.1.22-x86_64/lib/algorithms'
103:info:build Making all in extras
104:info:build make[3]: Entering directory `/opt/local/var/macports/build/_opt_local_var_macports_sources_rsync.macports.org_release_tarballs_ports_devel_gnutls/gnutls/work/gnutls-3.1.22-x86_64/lib/extras'
105:info:build make[3]: Nothing to be done for `all'.
106:info:build make[3]: Leaving directory `/opt/local/var/macports/build/_opt_local_var_macports_sources_rsync.macports.org_release_tarballs_ports_devel_gnutls/gnutls/work/gnutls-3.1.22-x86_64/lib/extras'
107:info:build Making all in minitasn1
108:info:build make[3]: Entering directory `/opt/local/var/macports/build/_opt_local_var_macports_sources_rsync.macports.org_release_tarballs_ports_devel_gnutls/gnutls/work/gnutls-3.1.22-x86_64/lib/minitasn1'
109:info:build make[3]: Nothing to be done for `all'.
110:info:build make[3]: Leaving directory `/opt/local/var/macports/build/_opt_local_var_macports_sources_rsync.macports.org_release_tarballs_ports_devel_gnutls/gnutls/work/gnutls-3.1.22-x86_64/lib/minitasn1'
111:info:build Making all in opencdk
112:info:build make[3]: Entering directory `/opt/local/var/macports/build/_opt_local_var_macports_sources_rsync.macports.org_release_tarballs_ports_devel_gnutls/gnutls/work/gnutls-3.1.22-x86_64/lib/opencdk'
113:info:build make[3]: Nothing to be done for `all'.
114:info:build make[3]: Leaving directory `/opt/local/var/macports/build/_opt_local_var_macports_sources_rsync.macports.org_release_tarballs_ports_devel_gnutls/gnutls/work/gnutls-3.1.22-x86_64/lib/opencdk'
115:info:build Making all in openpgp
116:info:build make[3]: Entering directory `/opt/local/var/macports/build/_opt_local_var_macports_sources_rsync.macports.org_release_tarballs_ports_devel_gnutls/gnutls/work/gnutls-3.1.22-x86_64/lib/openpgp'
117:info:build make[3]: Nothing to be done for `all'.
118:info:build make[3]: Leaving directory `/opt/local/var/macports/build/_opt_local_var_macports_sources_rsync.macports.org_release_tarballs_ports_devel_gnutls/gnutls/work/gnutls-3.1.22-x86_64/lib/openpgp'
119:info:build Making all in nettle
120:info:build make[3]: Entering directory `/opt/local/var/macports/build/_opt_local_var_macports_sources_rsync.macports.org_release_tarballs_ports_devel_gnutls/gnutls/work/gnutls-3.1.22-x86_64/lib/nettle'
121:info:build make[3]: Nothing to be done for `all'.
122:info:build make[3]: Leaving directory `/opt/local/var/macports/build/_opt_local_var_macports_sources_rsync.macports.org_release_tarballs_ports_devel_gnutls/gnutls/work/gnutls-3.1.22-x86_64/lib/nettle'
123:info:build make[3]: Entering directory `/opt/local/var/macports/build/_opt_local_var_macports_sources_rsync.macports.org_release_tarballs_ports_devel_gnutls/gnutls/work/gnutls-3.1.22-x86_64/lib'
124:info:build make[3]: Nothing to be done for `all-am'.
125:info:build make[3]: Leaving directory `/opt/local/var/macports/build/_opt_local_var_macports_sources_rsync.macports.org_release_tarballs_ports_devel_gnutls/gnutls/work/gnutls-3.1.22-x86_64/lib'
126:info:build make[2]: Leaving directory `/opt/local/var/macports/build/_opt_local_var_macports_sources_rsync.macports.org_release_tarballs_ports_devel_gnutls/gnutls/work/gnutls-3.1.22-x86_64/lib'
127:info:build Making all in extra
128:info:build make[2]: Entering directory `/opt/local/var/macports/build/_opt_local_var_macports_sources_rsync.macports.org_release_tarballs_ports_devel_gnutls/gnutls/work/gnutls-3.1.22-x86_64/extra'
129:info:build Making all in includes
130:info:build make[3]: Entering directory `/opt/local/var/macports/build/_opt_local_var_macports_sources_rsync.macports.org_release_tarballs_ports_devel_gnutls/gnutls/work/gnutls-3.1.22-x86_64/extra/includes'
131:info:build make[3]: Nothing to be done for `all'.
132:info:build make[3]: Leaving directory `/opt/local/var/macports/build/_opt_local_var_macports_sources_rsync.macports.org_release_tarballs_ports_devel_gnutls/gnutls/work/gnutls-3.1.22-x86_64/extra/includes'
133:info:build make[3]: Entering directory `/opt/local/var/macports/build/_opt_local_var_macports_sources_rsync.macports.org_release_tarballs_ports_devel_gnutls/gnutls/work/gnutls-3.1.22-x86_64/extra'
134:info:build make[3]: Nothing to be done for `all-am'.
135:info:build make[3]: Leaving directory `/opt/local/var/macports/build/_opt_local_var_macports_sources_rsync.macports.org_release_tarballs_ports_devel_gnutls/gnutls/work/gnutls-3.1.22-x86_64/extra'
136:info:build make[2]: Leaving directory `/opt/local/var/macports/build/_opt_local_var_macports_sources_rsync.macports.org_release_tarballs_ports_devel_gnutls/gnutls/work/gnutls-3.1.22-x86_64/extra'
137:info:build Making all in po
138:info:build make[2]: Entering directory `/opt/local/var/macports/build/_opt_local_var_macports_sources_rsync.macports.org_release_tarballs_ports_devel_gnutls/gnutls/work/gnutls-3.1.22-x86_64/po'
139:info:build make[2]: Leaving directory `/opt/local/var/macports/build/_opt_local_var_macports_sources_rsync.macports.org_release_tarballs_ports_devel_gnutls/gnutls/work/gnutls-3.1.22-x86_64/po'
140:info:build Making all in src
141:info:build make[2]: Entering directory `/opt/local/var/macports/build/_opt_local_var_macports_sources_rsync.macports.org_release_tarballs_ports_devel_gnutls/gnutls/work/gnutls-3.1.22-x86_64/src'
142:info:build /usr/bin/make  all-recursive
143:info:build make[3]: Entering directory `/opt/local/var/macports/build/_opt_local_var_macports_sources_rsync.macports.org_release_tarballs_ports_devel_gnutls/gnutls/work/gnutls-3.1.22-x86_64/src'
144:info:build Making all in crywrap
145:info:build make[4]: Entering directory `/opt/local/var/macports/build/_opt_local_var_macports_sources_rsync.macports.org_release_tarballs_ports_devel_gnutls/gnutls/work/gnutls-3.1.22-x86_64/src/crywrap'
146:info:build make[4]: Nothing to be done for `all'.
147:info:build make[4]: Leaving directory `/opt/local/var/macports/build/_opt_local_var_macports_sources_rsync.macports.org_release_tarballs_ports_devel_gnutls/gnutls/work/gnutls-3.1.22-x86_64/src/crywrap'
148:info:build make[4]: Entering directory `/opt/local/var/macports/build/_opt_local_var_macports_sources_rsync.macports.org_release_tarballs_ports_devel_gnutls/gnutls/work/gnutls-3.1.22-x86_64/src'
149:info:build /bin/sh ../libtool  --tag=CC   --mode=link /usr/bin/clang  -pipe -Os -arch x86_64  -L/opt/local/lib -Wl,-headerpad_max_install_names -arch x86_64 -o libcmd-certtool.la  libcmd_certtool_la-certtool-args.lo libcmd_certtool_la-certtool-cfg.lo ../gl/libgnu.la ../lib/libgnutls.la -R -L/opt/local/lib -lopts -L/opt/local/lib -lintl -R/opt/local/lib -Wl,-framework -Wl,CoreFoundation   -lintl
150:info:build /bin/sh ../libtool  --tag=CC   --mode=link /usr/bin/clang  -pipe -Os -arch x86_64  -L/opt/local/lib -Wl,-headerpad_max_install_names -arch x86_64 -o libcmd-danetool.la  libcmd_danetool_la-danetool-args.lo libcmd_danetool_la-certtool-cfg.lo ../gl/libgnu.la ../lib/libgnutls.la -R -L/opt/local/lib -lopts -L/opt/local/lib -lintl -R/opt/local/lib -Wl,-framework -Wl,CoreFoundation   -lintl
151:info:build /bin/sh ../libtool  --tag=CC   --mode=link /usr/bin/clang   -pipe -Os -arch x86_64  -L/opt/local/lib -Wl,-headerpad_max_install_names -arch x86_64 -o psktool psk.o ../lib/libgnutls.la libcmd-psk.la ../gl/libgnu.la -R -L/opt/local/lib -lopts -L/opt/local/lib -lintl -R/opt/local/lib -Wl,-framework -Wl,CoreFoundation -lintl
152:info:build /bin/sh ../libtool  --tag=CC   --mode=link /usr/bin/clang   -pipe -Os -arch x86_64  -L/opt/local/lib -Wl,-headerpad_max_install_names -arch x86_64 -o gnutls-cli-debug cli-debug.o tests.o socket.o common.o ../lib/libgnutls.la libcmd-cli-debug.la ../gl/libgnu.la -R -L/opt/local/lib -lopts -L/opt/local/lib -lintl -R/opt/local/lib -Wl,-framework -Wl,CoreFoundation   -lintl
153:info:build /bin/sh ../libtool  --tag=CC   --mode=link /usr/bin/clang   -pipe -Os -arch x86_64  -L/opt/local/lib -Wl,-headerpad_max_install_names -arch x86_64 -o ocsptool ocsptool.o ocsptool-common.o socket.o ../lib/libgnutls.la libcmd-ocsp.la ../gl/libgnu.la -R -L/opt/local/lib -lopts -L/opt/local/lib -lintl -R/opt/local/lib -Wl,-framework -Wl,CoreFoundation  -lintl
154:info:build /bin/sh ../libtool  --tag=CC   --mode=link /usr/bin/clang   -pipe -Os -arch x86_64  -L/opt/local/lib -Wl,-headerpad_max_install_names -arch x86_64 -o srptool srptool.o ../lib/libgnutls.la libcmd-srp.la ../gl/libgnu.la -R -L/opt/local/lib -lopts -L/opt/local/lib -lintl -R/opt/local/lib -Wl,-framework -Wl,CoreFoundation -lintl
155:info:build /bin/sh ../libtool  --tag=CC   --mode=link /usr/bin/clang   -pipe -Os -arch x86_64  -L/opt/local/lib -Wl,-headerpad_max_install_names -arch x86_64 -o gnutls-serv serv.o udp-serv.o socket.o common.o ../lib/libgnutls.la libcmd-serv.la ../gl/libgnu.la -R -L/opt/local/lib -lopts -L/opt/local/lib -lintl -R/opt/local/lib -Wl,-framework -Wl,CoreFoundation   -lintl
156:info:build /bin/sh ../libtool  --tag=CC   --mode=link /usr/bin/clang   -pipe -Os -arch x86_64  -L/opt/local/lib -Wl,-headerpad_max_install_names -arch x86_64 -o gnutls-cli cli.o common.o socket.o ocsptool-common.o benchmark-cipher.o benchmark.o benchmark-tls.o ../lib/libgnutls.la  libcmd-cli.la ../gl/libgnu.la -R -L/opt/local/lib -lopts -L/opt/local/lib -lintl -R/opt/local/lib -Wl,-framework -Wl,CoreFoundation     -lintl
157:info:build libtool: link: only absolute run-paths are allowed
158:info:build make[4]: *** [libcmd-danetool.la] Error 1
159:info:build make[4]: *** Waiting for unfinished jobs....
160:info:build libtool: link: only absolute run-paths are allowed
161:info:build libtool: link: only absolute run-paths are allowed
162:info:build make[4]: *** [libcmd-certtool.la] Error 1
163:info:build make[4]: *** [gnutls-cli-debug] Error 1
164:info:build libtool: link: only absolute run-paths are allowed
165:info:build make[4]: *** [psktool] Error 1
166:info:build libtool: link: only absolute run-paths are allowed
167:info:build libtool: link: only absolute run-paths are allowed
168:info:build make[4]: *** [gnutls-serv] Error 1
169:info:build make[4]: *** [ocsptool] Error 1
170:info:build libtool: link: only absolute run-paths are allowed
171:info:build make[4]: *** [gnutls-cli] Error 1
172:info:build libtool: link: only absolute run-paths are allowed
173:info:build make[4]: *** [srptool] Error 1
174:info:build make[4]: Leaving directory `/opt/local/var/macports/build/_opt_local_var_macports_sources_rsync.macports.org_release_tarballs_ports_devel_gnutls/gnutls/work/gnutls-3.1.22-x86_64/src'
175:info:build make[3]: *** [all-recursive] Error 1
176:info:build make[3]: Leaving directory `/opt/local/var/macports/build/_opt_local_var_macports_sources_rsync.macports.org_release_tarballs_ports_devel_gnutls/gnutls/work/gnutls-3.1.22-x86_64/src'
177:info:build make[2]: *** [all] Error 2
178:info:build make[2]: Leaving directory `/opt/local/var/macports/build/_opt_local_var_macports_sources_rsync.macports.org_release_tarballs_ports_devel_gnutls/gnutls/work/gnutls-3.1.22-x86_64/src'
179:info:build make[1]: *** [all-recursive] Error 1
180:info:build make[1]: Leaving directory `/opt/local/var/macports/build/_opt_local_var_macports_sources_rsync.macports.org_release_tarballs_ports_devel_gnutls/gnutls/work/gnutls-3.1.22-x86_64'
181:info:build make: *** [all] Error 2
182:info:build make: Leaving directory `/opt/local/var/macports/build/_opt_local_var_macports_sources_rsync.macports.org_release_tarballs_ports_devel_gnutls/gnutls/work/gnutls-3.1.22-x86_64'
183:info:build Command failed:  cd "/opt/local/var/macports/build/_opt_local_var_macports_sources_rsync.macports.org_release_tarballs_ports_devel_gnutls/gnutls/work/gnutls-3.1.22-x86_64" && /usr/bin/make -j8 -w all
184:info:build Exit code: 2
185:error:build org.macports.build for port gnutls returned: command execution failed
186:debug:build Error code: NONE
187:debug:build Backtrace: command execution failed
188    while executing
189"$procedure $targetname"
190:info:build Warning: targets not executed for gnutls: org.macports.install org.macports.build org.macports.destroot
191:notice:build Please see the log file for port gnutls for details:
192    /opt/local/var/macports/logs/_opt_local_var_macports_sources_rsync.macports.org_release_tarballs_ports_devel_gnutls/gnutls/main.log