| 1 | This file contains any messages produced by compilers while |
|---|
| 2 | running configure, to aid debugging if configure makes a mistake. |
|---|
| 3 | |
|---|
| 4 | It was created by R configure 3.1.0, which was |
|---|
| 5 | generated by GNU Autoconf 2.69. Invocation command line was |
|---|
| 6 | |
|---|
| 7 | $ ./configure --prefix=/opt/local/Library/Frameworks --enable-R-framework --enable-R-shlib --enable-BLAS-shlib --disable-openmp --with-readline --with-aqua --without-tcltk --with-libpng --with-ICU --with-included-gettext --without-internal-tzcode --with-blas=-framework vecLib --with-lapack=-framework vecLib --with-x --with-jpeglib --x-include=/opt/local/include/X11 --x-lib=/opt/local/lib --with-cairo --with-recommended-packages |
|---|
| 8 | |
|---|
| 9 | ## --------- ## |
|---|
| 10 | ## Platform. ## |
|---|
| 11 | ## --------- ## |
|---|
| 12 | |
|---|
| 13 | hostname = r1pp3r.messiah.net |
|---|
| 14 | uname -m = x86_64 |
|---|
| 15 | uname -r = 13.2.0 |
|---|
| 16 | uname -s = Darwin |
|---|
| 17 | uname -v = Darwin Kernel Version 13.2.0: Thu Apr 17 23:03:13 PDT 2014; root:xnu-2422.100.13~1/RELEASE_X86_64 |
|---|
| 18 | |
|---|
| 19 | /usr/bin/uname -p = i386 |
|---|
| 20 | /bin/uname -X = unknown |
|---|
| 21 | |
|---|
| 22 | /bin/arch = unknown |
|---|
| 23 | /usr/bin/arch -k = unknown |
|---|
| 24 | /usr/convex/getsysinfo = unknown |
|---|
| 25 | /usr/bin/hostinfo = Mach kernel version: |
|---|
| 26 | Darwin Kernel Version 13.2.0: Thu Apr 17 23:03:13 PDT 2014; root:xnu-2422.100.13~1/RELEASE_X86_64 |
|---|
| 27 | Kernel configured for up to 8 processors. |
|---|
| 28 | 4 processors are physically available. |
|---|
| 29 | 8 processors are logically available. |
|---|
| 30 | Processor type: i486 (Intel 80486) |
|---|
| 31 | Processors active: 0 1 2 3 4 5 6 7 |
|---|
| 32 | Primary memory available: 8.00 gigabytes |
|---|
| 33 | Default processor set: 395 tasks, 9540 threads, 8 processors |
|---|
| 34 | Load average: 2.27, Mach factor: 5.72 |
|---|
| 35 | /bin/machine = unknown |
|---|
| 36 | /usr/bin/oslevel = unknown |
|---|
| 37 | /bin/universe = unknown |
|---|
| 38 | |
|---|
| 39 | PATH: /opt/local/bin |
|---|
| 40 | PATH: /opt/local/sbin |
|---|
| 41 | PATH: /bin |
|---|
| 42 | PATH: /sbin |
|---|
| 43 | PATH: /usr/bin |
|---|
| 44 | PATH: /usr/sbin |
|---|
| 45 | |
|---|
| 46 | |
|---|
| 47 | ## ----------- ## |
|---|
| 48 | ## Core tests. ## |
|---|
| 49 | ## ----------- ## |
|---|
| 50 | |
|---|
| 51 | configure:3671: checking build system type |
|---|
| 52 | configure:3685: result: x86_64-apple-darwin13.2.0 |
|---|
| 53 | configure:3705: checking host system type |
|---|
| 54 | configure:3718: result: x86_64-apple-darwin13.2.0 |
|---|
| 55 | configure:4436: checking for pwd |
|---|
| 56 | configure:4454: found /bin/pwd |
|---|
| 57 | configure:4467: result: /bin/pwd |
|---|
| 58 | configure:4475: checking whether builddir is srcdir |
|---|
| 59 | configure:4483: result: yes |
|---|
| 60 | configure:4488: checking for working aclocal |
|---|
| 61 | configure:4492: result: found |
|---|
| 62 | configure:4501: checking for working autoconf |
|---|
| 63 | configure:4505: result: found |
|---|
| 64 | configure:4514: checking for working automake |
|---|
| 65 | configure:4518: result: found |
|---|
| 66 | configure:4527: checking for working autoheader |
|---|
| 67 | configure:4531: result: found |
|---|
| 68 | configure:4544: checking for gawk |
|---|
| 69 | configure:4560: found /opt/local/bin/gawk |
|---|
| 70 | configure:4571: result: gawk |
|---|
| 71 | configure:4582: checking whether ln -s works |
|---|
| 72 | configure:4586: result: yes |
|---|
| 73 | configure:4597: checking for bison |
|---|
| 74 | configure:4613: found /opt/local/bin/bison |
|---|
| 75 | configure:4624: result: bison -y |
|---|
| 76 | configure:4640: checking for ar |
|---|
| 77 | configure:4656: found /opt/local/bin/ar |
|---|
| 78 | configure:4667: result: ar |
|---|
| 79 | configure:4695: checking for a BSD-compatible install |
|---|
| 80 | configure:4763: result: /usr/bin/install -c |
|---|
| 81 | configure:4798: checking for sed |
|---|
| 82 | configure:4817: found /usr/bin/sed |
|---|
| 83 | configure:4829: result: /usr/bin/sed |
|---|
| 84 | configure:4847: checking for which |
|---|
| 85 | configure:4865: found /usr/bin/which |
|---|
| 86 | configure:4877: result: /usr/bin/which |
|---|
| 87 | configure:4897: checking for less |
|---|
| 88 | configure:4915: found /opt/local/bin/less |
|---|
| 89 | configure:4927: result: /opt/local/bin/less |
|---|
| 90 | configure:4950: checking for gtar |
|---|
| 91 | configure:4983: result: no |
|---|
| 92 | configure:4950: checking for gnutar |
|---|
| 93 | configure:4983: result: no |
|---|
| 94 | configure:4950: checking for tar |
|---|
| 95 | configure:4968: found /usr/bin/tar |
|---|
| 96 | configure:4980: result: /usr/bin/tar |
|---|
| 97 | configure:5002: checking for tex |
|---|
| 98 | configure:5020: found /opt/local/bin/tex |
|---|
| 99 | configure:5032: result: /opt/local/bin/tex |
|---|
| 100 | configure:5047: checking for pdftex |
|---|
| 101 | configure:5065: found /opt/local/bin/pdftex |
|---|
| 102 | configure:5077: result: /opt/local/bin/pdftex |
|---|
| 103 | configure:5097: checking for pdflatex |
|---|
| 104 | configure:5115: found /opt/local/bin/pdflatex |
|---|
| 105 | configure:5127: result: /opt/local/bin/pdflatex |
|---|
| 106 | configure:5147: checking for makeindex |
|---|
| 107 | configure:5165: found /opt/local/bin/makeindex |
|---|
| 108 | configure:5177: result: /opt/local/bin/makeindex |
|---|
| 109 | configure:5192: checking for makeinfo |
|---|
| 110 | configure:5210: found /opt/local/bin/makeinfo |
|---|
| 111 | configure:5222: result: /opt/local/bin/makeinfo |
|---|
| 112 | configure:5234: checking whether makeinfo version is at least 4.7 |
|---|
| 113 | configure:5256: result: yes |
|---|
| 114 | configure:5263: checking for ginstall-info |
|---|
| 115 | configure:5296: result: no |
|---|
| 116 | configure:5263: checking for install-info |
|---|
| 117 | configure:5281: found /opt/local/bin/install-info |
|---|
| 118 | configure:5293: result: /opt/local/bin/install-info |
|---|
| 119 | configure:5325: checking for texi2dvi |
|---|
| 120 | configure:5343: found /opt/local/bin/texi2dvi |
|---|
| 121 | configure:5355: result: /opt/local/bin/texi2dvi |
|---|
| 122 | configure:5375: checking for kpsewhich |
|---|
| 123 | configure:5393: found /opt/local/bin/kpsewhich |
|---|
| 124 | configure:5405: result: /opt/local/bin/kpsewhich |
|---|
| 125 | configure:5417: checking for latex inconsolata package |
|---|
| 126 | configure:5431: result: missing |
|---|
| 127 | configure:5434: WARNING: neither inconsolata.sty nor zi4.sty found: PDF vignettes and package manuals will not be rendered optimally |
|---|
| 128 | configure:5451: checking for unzip |
|---|
| 129 | configure:5469: found /usr/bin/unzip |
|---|
| 130 | configure:5481: result: /usr/bin/unzip |
|---|
| 131 | configure:5497: checking for zip |
|---|
| 132 | configure:5515: found /usr/bin/zip |
|---|
| 133 | configure:5527: result: /usr/bin/zip |
|---|
| 134 | configure:5543: checking for gzip |
|---|
| 135 | configure:5561: found /opt/local/bin/gzip |
|---|
| 136 | configure:5573: result: /opt/local/bin/gzip |
|---|
| 137 | configure:5589: checking for bzip2 |
|---|
| 138 | configure:5607: found /opt/local/bin/bzip2 |
|---|
| 139 | configure:5619: result: /opt/local/bin/bzip2 |
|---|
| 140 | configure:5637: checking for firefox |
|---|
| 141 | configure:5670: result: no |
|---|
| 142 | configure:5637: checking for mozilla |
|---|
| 143 | configure:5670: result: no |
|---|
| 144 | configure:5637: checking for galeon |
|---|
| 145 | configure:5670: result: no |
|---|
| 146 | configure:5637: checking for opera |
|---|
| 147 | configure:5670: result: no |
|---|
| 148 | configure:5637: checking for xdg-open |
|---|
| 149 | configure:5655: found /opt/local/bin/xdg-open |
|---|
| 150 | configure:5667: result: /opt/local/bin/xdg-open |
|---|
| 151 | configure:5684: result: using default browser ... /opt/local/bin/xdg-open |
|---|
| 152 | configure:5694: checking for acroread |
|---|
| 153 | configure:5727: result: no |
|---|
| 154 | configure:5694: checking for acroread4 |
|---|
| 155 | configure:5727: result: no |
|---|
| 156 | configure:5694: checking for xdg-open |
|---|
| 157 | configure:5712: found /opt/local/bin/xdg-open |
|---|
| 158 | configure:5724: result: /opt/local/bin/xdg-open |
|---|
| 159 | configure:5745: checking for notangle |
|---|
| 160 | configure:5776: result: false |
|---|
| 161 | configure:5787: checking for realpath |
|---|
| 162 | configure:5818: result: false |
|---|
| 163 | configure:5831: checking for pkg-config |
|---|
| 164 | configure:5850: found /opt/local/bin/pkg-config |
|---|
| 165 | configure:5862: result: /opt/local/bin/pkg-config |
|---|
| 166 | configure:5919: checking for gcc |
|---|
| 167 | configure:5946: result: /usr/bin/clang |
|---|
| 168 | configure:6175: checking for C compiler version |
|---|
| 169 | configure:6184: /usr/bin/clang --version >&5 |
|---|
| 170 | Apple LLVM version 5.1 (clang-503.0.40) (based on LLVM 3.4svn) |
|---|
| 171 | Target: x86_64-apple-darwin13.2.0 |
|---|
| 172 | Thread model: posix |
|---|
| 173 | configure:6195: $? = 0 |
|---|
| 174 | configure:6184: /usr/bin/clang -v >&5 |
|---|
| 175 | Apple LLVM version 5.1 (clang-503.0.40) (based on LLVM 3.4svn) |
|---|
| 176 | Target: x86_64-apple-darwin13.2.0 |
|---|
| 177 | Thread model: posix |
|---|
| 178 | configure:6195: $? = 0 |
|---|
| 179 | configure:6184: /usr/bin/clang -V >&5 |
|---|
| 180 | clang: error: argument to '-V' is missing (expected 1 value) |
|---|
| 181 | clang: error: no input files |
|---|
| 182 | configure:6195: $? = 1 |
|---|
| 183 | configure:6184: /usr/bin/clang -qversion >&5 |
|---|
| 184 | clang: error: unknown argument: '-qversion' [-Wunused-command-line-argument-hard-error-in-future] |
|---|
| 185 | clang: note: this will be a hard error (cannot be downgraded to a warning) in the future |
|---|
| 186 | clang: error: no input files |
|---|
| 187 | configure:6195: $? = 1 |
|---|
| 188 | configure:6215: checking whether the C compiler works |
|---|
| 189 | configure:6237: /usr/bin/clang -pipe -Os -flax-vector-conversions -arch x86_64 -I/opt/local/include -L/opt/local/lib -Wl,-headerpad_max_install_names -arch x86_64 conftest.c >&5 |
|---|
| 190 | configure:6241: $? = 0 |
|---|
| 191 | configure:6289: result: yes |
|---|
| 192 | configure:6292: checking for C compiler default output file name |
|---|
| 193 | configure:6294: result: a.out |
|---|
| 194 | configure:6300: checking for suffix of executables |
|---|
| 195 | configure:6307: /usr/bin/clang -o conftest -pipe -Os -flax-vector-conversions -arch x86_64 -I/opt/local/include -L/opt/local/lib -Wl,-headerpad_max_install_names -arch x86_64 conftest.c >&5 |
|---|
| 196 | configure:6311: $? = 0 |
|---|
| 197 | configure:6333: result: |
|---|
| 198 | configure:6355: checking whether we are cross compiling |
|---|
| 199 | configure:6363: /usr/bin/clang -o conftest -pipe -Os -flax-vector-conversions -arch x86_64 -I/opt/local/include -L/opt/local/lib -Wl,-headerpad_max_install_names -arch x86_64 conftest.c >&5 |
|---|
| 200 | configure:6367: $? = 0 |
|---|
| 201 | configure:6374: ./conftest |
|---|
| 202 | configure:6378: $? = 0 |
|---|
| 203 | configure:6393: result: no |
|---|
| 204 | configure:6398: checking for suffix of object files |
|---|
| 205 | configure:6420: /usr/bin/clang -c -pipe -Os -flax-vector-conversions -arch x86_64 -I/opt/local/include conftest.c >&5 |
|---|
| 206 | configure:6424: $? = 0 |
|---|
| 207 | configure:6445: result: o |
|---|
| 208 | configure:6449: checking whether we are using the GNU C compiler |
|---|
| 209 | configure:6468: /usr/bin/clang -c -pipe -Os -flax-vector-conversions -arch x86_64 -I/opt/local/include conftest.c >&5 |
|---|
| 210 | configure:6468: $? = 0 |
|---|
| 211 | configure:6477: result: yes |
|---|
| 212 | configure:6486: checking whether /usr/bin/clang accepts -g |
|---|
| 213 | configure:6506: /usr/bin/clang -c -g -I/opt/local/include conftest.c >&5 |
|---|
| 214 | configure:6506: $? = 0 |
|---|
| 215 | configure:6547: result: yes |
|---|
| 216 | configure:6564: checking for /usr/bin/clang option to accept ISO C89 |
|---|
| 217 | configure:6627: /usr/bin/clang -c -pipe -Os -flax-vector-conversions -arch x86_64 -I/opt/local/include conftest.c >&5 |
|---|
| 218 | configure:6627: $? = 0 |
|---|
| 219 | configure:6640: result: none needed |
|---|
| 220 | configure:6667: checking how to run the C preprocessor |
|---|
| 221 | configure:6698: /usr/bin/clang -E -I/opt/local/include conftest.c |
|---|
| 222 | configure:6698: $? = 0 |
|---|
| 223 | configure:6712: /usr/bin/clang -E -I/opt/local/include conftest.c |
|---|
| 224 | conftest.c:17:10: fatal error: 'ac_nonexistent.h' file not found |
|---|
| 225 | #include <ac_nonexistent.h> |
|---|
| 226 | ^ |
|---|
| 227 | 1 error generated. |
|---|
| 228 | configure:6712: $? = 1 |
|---|
| 229 | configure: failed program was: |
|---|
| 230 | | /* confdefs.h */ |
|---|
| 231 | | #define PACKAGE_NAME "R" |
|---|
| 232 | | #define PACKAGE_TARNAME "R" |
|---|
| 233 | | #define PACKAGE_VERSION "3.1.0" |
|---|
| 234 | | #define PACKAGE_STRING "R 3.1.0" |
|---|
| 235 | | #define PACKAGE_BUGREPORT "http://bugs.r-project.org" |
|---|
| 236 | | #define PACKAGE_URL "http://www.r-project.org" |
|---|
| 237 | | #define PACKAGE "R" |
|---|
| 238 | | #define VERSION "3.1.0" |
|---|
| 239 | | #define R_PLATFORM "x86_64-apple-darwin13.2.0" |
|---|
| 240 | | #define R_CPU "x86_64" |
|---|
| 241 | | #define R_VENDOR "apple" |
|---|
| 242 | | #define R_OS "darwin13.2.0" |
|---|
| 243 | | #define Unix 1 |
|---|
| 244 | | #define R_ARCH "" |
|---|
| 245 | | /* end confdefs.h. */ |
|---|
| 246 | | #include <ac_nonexistent.h> |
|---|
| 247 | configure:6737: result: /usr/bin/clang -E |
|---|
| 248 | configure:6757: /usr/bin/clang -E -I/opt/local/include conftest.c |
|---|
| 249 | configure:6757: $? = 0 |
|---|
| 250 | configure:6771: /usr/bin/clang -E -I/opt/local/include conftest.c |
|---|
| 251 | conftest.c:17:10: fatal error: 'ac_nonexistent.h' file not found |
|---|
| 252 | #include <ac_nonexistent.h> |
|---|
| 253 | ^ |
|---|
| 254 | 1 error generated. |
|---|
| 255 | configure:6771: $? = 1 |
|---|
| 256 | configure: failed program was: |
|---|
| 257 | | /* confdefs.h */ |
|---|
| 258 | | #define PACKAGE_NAME "R" |
|---|
| 259 | | #define PACKAGE_TARNAME "R" |
|---|
| 260 | | #define PACKAGE_VERSION "3.1.0" |
|---|
| 261 | | #define PACKAGE_STRING "R 3.1.0" |
|---|
| 262 | | #define PACKAGE_BUGREPORT "http://bugs.r-project.org" |
|---|
| 263 | | #define PACKAGE_URL "http://www.r-project.org" |
|---|
| 264 | | #define PACKAGE "R" |
|---|
| 265 | | #define VERSION "3.1.0" |
|---|
| 266 | | #define R_PLATFORM "x86_64-apple-darwin13.2.0" |
|---|
| 267 | | #define R_CPU "x86_64" |
|---|
| 268 | | #define R_VENDOR "apple" |
|---|
| 269 | | #define R_OS "darwin13.2.0" |
|---|
| 270 | | #define Unix 1 |
|---|
| 271 | | #define R_ARCH "" |
|---|
| 272 | | /* end confdefs.h. */ |
|---|
| 273 | | #include <ac_nonexistent.h> |
|---|
| 274 | configure:6800: checking for grep that handles long lines and -e |
|---|
| 275 | configure:6858: result: /opt/local/bin/grep |
|---|
| 276 | configure:6863: checking for egrep |
|---|
| 277 | configure:6925: result: /opt/local/bin/grep -E |
|---|
| 278 | configure:6931: checking whether /usr/bin/clang needs -traditional |
|---|
| 279 | conftest.c:17:10: fatal error: 'termio.h' file not found |
|---|
| 280 | #include <termio.h> |
|---|
| 281 | ^ |
|---|
| 282 | 1 error generated. |
|---|
| 283 | configure:6965: result: no |
|---|
| 284 | configure:6977: checking how to run the C preprocessor |
|---|
| 285 | configure:7047: result: /usr/bin/clang -E |
|---|
| 286 | configure:7067: /usr/bin/clang -E -I/opt/local/include conftest.c |
|---|
| 287 | configure:7067: $? = 0 |
|---|
| 288 | configure:7081: /usr/bin/clang -E -I/opt/local/include conftest.c |
|---|
| 289 | conftest.c:17:10: fatal error: 'ac_nonexistent.h' file not found |
|---|
| 290 | #include <ac_nonexistent.h> |
|---|
| 291 | ^ |
|---|
| 292 | 1 error generated. |
|---|
| 293 | configure:7081: $? = 1 |
|---|
| 294 | configure: failed program was: |
|---|
| 295 | | /* confdefs.h */ |
|---|
| 296 | | #define PACKAGE_NAME "R" |
|---|
| 297 | | #define PACKAGE_TARNAME "R" |
|---|
| 298 | | #define PACKAGE_VERSION "3.1.0" |
|---|
| 299 | | #define PACKAGE_STRING "R 3.1.0" |
|---|
| 300 | | #define PACKAGE_BUGREPORT "http://bugs.r-project.org" |
|---|
| 301 | | #define PACKAGE_URL "http://www.r-project.org" |
|---|
| 302 | | #define PACKAGE "R" |
|---|
| 303 | | #define VERSION "3.1.0" |
|---|
| 304 | | #define R_PLATFORM "x86_64-apple-darwin13.2.0" |
|---|
| 305 | | #define R_CPU "x86_64" |
|---|
| 306 | | #define R_VENDOR "apple" |
|---|
| 307 | | #define R_OS "darwin13.2.0" |
|---|
| 308 | | #define Unix 1 |
|---|
| 309 | | #define R_ARCH "" |
|---|
| 310 | | /* end confdefs.h. */ |
|---|
| 311 | | #include <ac_nonexistent.h> |
|---|
| 312 | configure:7153: result: defining F77 to be /opt/local/bin/gfortran-mp-4.8 |
|---|
| 313 | configure:7325: checking for Fortran 77 compiler version |
|---|
| 314 | configure:7334: /opt/local/bin/gfortran-mp-4.8 --version >&5 |
|---|
| 315 | GNU Fortran (MacPorts gcc48 4.8.2_2) 4.8.2 |
|---|
| 316 | Copyright (C) 2013 Free Software Foundation, Inc. |
|---|
| 317 | |
|---|
| 318 | GNU Fortran comes with NO WARRANTY, to the extent permitted by law. |
|---|
| 319 | You may redistribute copies of GNU Fortran |
|---|
| 320 | under the terms of the GNU General Public License. |
|---|
| 321 | For more information about these matters, see the file named COPYING |
|---|
| 322 | |
|---|
| 323 | configure:7345: $? = 0 |
|---|
| 324 | configure:7334: /opt/local/bin/gfortran-mp-4.8 -v >&5 |
|---|
| 325 | Using built-in specs. |
|---|
| 326 | COLLECT_GCC=/opt/local/bin/gfortran-mp-4.8 |
|---|
| 327 | COLLECT_LTO_WRAPPER=/opt/local/libexec/gcc/x86_64-apple-darwin13/4.8.2/lto-wrapper |
|---|
| 328 | Target: x86_64-apple-darwin13 |
|---|
| 329 | Configured with: /opt/local/var/macports/build/_opt_mports_dports_lang_gcc48/gcc48/work/gcc-4.8.2/configure --prefix=/opt/local --build=x86_64-apple-darwin13 --enable-languages=c,c++,objc,obj-c++,lto,fortran,java --libdir=/opt/local/lib/gcc48 --includedir=/opt/local/include/gcc48 --infodir=/opt/local/share/info --mandir=/opt/local/share/man --datarootdir=/opt/local/share/gcc-4.8 --with-local-prefix=/opt/local --with-system-zlib --disable-nls --program-suffix=-mp-4.8 --with-gxx-include-dir=/opt/local/include/gcc48/c++/ --with-gmp=/opt/local --with-mpfr=/opt/local --with-mpc=/opt/local --with-cloog=/opt/local --enable-cloog-backend=isl --disable-cloog-version-check --enable-stage1-checking --disable-multilib --enable-lto --enable-libstdcxx-time --with-as=/opt/local/bin/as --with-ld=/opt/local/bin/ld --with-ar=/opt/local/bin/ar --with-bugurl=https://trac.macports.org/newticket --with-pkgversion='MacPorts gcc48 4.8.2_2' |
|---|
| 330 | Thread model: posix |
|---|
| 331 | gcc version 4.8.2 (MacPorts gcc48 4.8.2_2) |
|---|
| 332 | configure:7345: $? = 0 |
|---|
| 333 | configure:7334: /opt/local/bin/gfortran-mp-4.8 -V >&5 |
|---|
| 334 | gfortran-mp-4.8: error: unrecognized command line option '-V' |
|---|
| 335 | gfortran-mp-4.8: fatal error: no input files |
|---|
| 336 | compilation terminated. |
|---|
| 337 | configure:7345: $? = 1 |
|---|
| 338 | configure:7334: /opt/local/bin/gfortran-mp-4.8 -qversion >&5 |
|---|
| 339 | gfortran-mp-4.8: error: unrecognized command line option '-qversion' |
|---|
| 340 | gfortran-mp-4.8: fatal error: no input files |
|---|
| 341 | compilation terminated. |
|---|
| 342 | configure:7345: $? = 1 |
|---|
| 343 | configure:7354: checking whether we are using the GNU Fortran 77 compiler |
|---|
| 344 | configure:7367: /opt/local/bin/gfortran-mp-4.8 -c -pipe -Os conftest.F >&5 |
|---|
| 345 | <built-in>:0:0: internal compiler error: Illegal instruction: 4 |
|---|
| 346 | |
|---|
| 347 | <built-in>:0:0: internal compiler error: Abort trap: 6 |
|---|
| 348 | gfortran-mp-4.8: internal compiler error: Abort trap: 6 (program f951) |
|---|
| 349 | ./configure: line 2204: 23952 Abort trap: 6 $F77 -c $FFLAGS conftest.$ac_ext 1>&5 |
|---|
| 350 | configure:7367: $? = 134 |
|---|
| 351 | configure: failed program was: |
|---|
| 352 | | program main |
|---|
| 353 | | #ifndef __GNUC__ |
|---|
| 354 | | choke me |
|---|
| 355 | | #endif |
|---|
| 356 | | |
|---|
| 357 | | end |
|---|
| 358 | configure:7376: result: no |
|---|
| 359 | configure:7382: checking whether /opt/local/bin/gfortran-mp-4.8 accepts -g |
|---|
| 360 | configure:7393: /opt/local/bin/gfortran-mp-4.8 -c -g conftest.f >&5 |
|---|
| 361 | <built-in>:0:0: internal compiler error: Illegal instruction: 4 |
|---|
| 362 | |
|---|
| 363 | <built-in>:0:0: internal compiler error: Abort trap: 6 |
|---|
| 364 | gfortran-mp-4.8: internal compiler error: Abort trap: 6 (program f951) |
|---|
| 365 | ./configure: line 2204: 23971 Abort trap: 6 $F77 -c $FFLAGS conftest.$ac_ext 1>&5 |
|---|
| 366 | configure:7393: $? = 134 |
|---|
| 367 | configure: failed program was: |
|---|
| 368 | | program main |
|---|
| 369 | | |
|---|
| 370 | | end |
|---|
| 371 | configure:7401: result: no |
|---|
| 372 | configure:7546: checking for C++ compiler version |
|---|
| 373 | configure:7555: /usr/bin/clang++ --version >&5 |
|---|
| 374 | Apple LLVM version 5.1 (clang-503.0.40) (based on LLVM 3.4svn) |
|---|
| 375 | Target: x86_64-apple-darwin13.2.0 |
|---|
| 376 | Thread model: posix |
|---|
| 377 | configure:7566: $? = 0 |
|---|
| 378 | configure:7555: /usr/bin/clang++ -v >&5 |
|---|
| 379 | Apple LLVM version 5.1 (clang-503.0.40) (based on LLVM 3.4svn) |
|---|
| 380 | Target: x86_64-apple-darwin13.2.0 |
|---|
| 381 | Thread model: posix |
|---|
| 382 | configure:7566: $? = 0 |
|---|
| 383 | configure:7555: /usr/bin/clang++ -V >&5 |
|---|
| 384 | clang: error: argument to '-V' is missing (expected 1 value) |
|---|
| 385 | clang: error: no input files |
|---|
| 386 | configure:7566: $? = 1 |
|---|
| 387 | configure:7555: /usr/bin/clang++ -qversion >&5 |
|---|
| 388 | clang: error: unknown argument: '-qversion' [-Wunused-command-line-argument-hard-error-in-future] |
|---|
| 389 | clang: note: this will be a hard error (cannot be downgraded to a warning) in the future |
|---|
| 390 | clang: error: no input files |
|---|
| 391 | configure:7566: $? = 1 |
|---|
| 392 | configure:7570: checking whether we are using the GNU C++ compiler |
|---|
| 393 | configure:7589: /usr/bin/clang++ -c -pipe -Os -arch x86_64 -stdlib=libc++ -I/opt/local/include conftest.cpp >&5 |
|---|
| 394 | configure:7589: $? = 0 |
|---|
| 395 | configure:7598: result: yes |
|---|
| 396 | configure:7607: checking whether /usr/bin/clang++ accepts -g |
|---|
| 397 | configure:7627: /usr/bin/clang++ -c -g -I/opt/local/include conftest.cpp >&5 |
|---|
| 398 | configure:7627: $? = 0 |
|---|
| 399 | configure:7668: result: yes |
|---|
| 400 | configure:7696: checking how to run the C++ preprocessor |
|---|
| 401 | configure:7723: /usr/bin/clang++ -E -I/opt/local/include conftest.cpp |
|---|
| 402 | configure:7723: $? = 0 |
|---|
| 403 | configure:7737: /usr/bin/clang++ -E -I/opt/local/include conftest.cpp |
|---|
| 404 | conftest.cpp:17:10: fatal error: 'ac_nonexistent.h' file not found |
|---|
| 405 | #include <ac_nonexistent.h> |
|---|
| 406 | ^ |
|---|
| 407 | 1 error generated. |
|---|
| 408 | configure:7737: $? = 1 |
|---|
| 409 | configure: failed program was: |
|---|
| 410 | | /* confdefs.h */ |
|---|
| 411 | | #define PACKAGE_NAME "R" |
|---|
| 412 | | #define PACKAGE_TARNAME "R" |
|---|
| 413 | | #define PACKAGE_VERSION "3.1.0" |
|---|
| 414 | | #define PACKAGE_STRING "R 3.1.0" |
|---|
| 415 | | #define PACKAGE_BUGREPORT "http://bugs.r-project.org" |
|---|
| 416 | | #define PACKAGE_URL "http://www.r-project.org" |
|---|
| 417 | | #define PACKAGE "R" |
|---|
| 418 | | #define VERSION "3.1.0" |
|---|
| 419 | | #define R_PLATFORM "x86_64-apple-darwin13.2.0" |
|---|
| 420 | | #define R_CPU "x86_64" |
|---|
| 421 | | #define R_VENDOR "apple" |
|---|
| 422 | | #define R_OS "darwin13.2.0" |
|---|
| 423 | | #define Unix 1 |
|---|
| 424 | | #define R_ARCH "" |
|---|
| 425 | | /* end confdefs.h. */ |
|---|
| 426 | | #include <ac_nonexistent.h> |
|---|
| 427 | configure:7762: result: /usr/bin/clang++ -E |
|---|
| 428 | configure:7782: /usr/bin/clang++ -E -I/opt/local/include conftest.cpp |
|---|
| 429 | configure:7782: $? = 0 |
|---|
| 430 | configure:7796: /usr/bin/clang++ -E -I/opt/local/include conftest.cpp |
|---|
| 431 | conftest.cpp:17:10: fatal error: 'ac_nonexistent.h' file not found |
|---|
| 432 | #include <ac_nonexistent.h> |
|---|
| 433 | ^ |
|---|
| 434 | 1 error generated. |
|---|
| 435 | configure:7796: $? = 1 |
|---|
| 436 | configure: failed program was: |
|---|
| 437 | | /* confdefs.h */ |
|---|
| 438 | | #define PACKAGE_NAME "R" |
|---|
| 439 | | #define PACKAGE_TARNAME "R" |
|---|
| 440 | | #define PACKAGE_VERSION "3.1.0" |
|---|
| 441 | | #define PACKAGE_STRING "R 3.1.0" |
|---|
| 442 | | #define PACKAGE_BUGREPORT "http://bugs.r-project.org" |
|---|
| 443 | | #define PACKAGE_URL "http://www.r-project.org" |
|---|
| 444 | | #define PACKAGE "R" |
|---|
| 445 | | #define VERSION "3.1.0" |
|---|
| 446 | | #define R_PLATFORM "x86_64-apple-darwin13.2.0" |
|---|
| 447 | | #define R_CPU "x86_64" |
|---|
| 448 | | #define R_VENDOR "apple" |
|---|
| 449 | | #define R_OS "darwin13.2.0" |
|---|
| 450 | | #define Unix 1 |
|---|
| 451 | | #define R_ARCH "" |
|---|
| 452 | | /* end confdefs.h. */ |
|---|
| 453 | | #include <ac_nonexistent.h> |
|---|
| 454 | configure:7830: checking whether __attribute__((visibility())) is supported |
|---|
| 455 | configure:7841: /usr/bin/clang -Werror -S conftest.c -o conftest.s 1>&5 |
|---|
| 456 | configure:7844: $? = 0 |
|---|
| 457 | configure:7853: result: no |
|---|
| 458 | configure:7864: checking whether /usr/bin/clang accepts -fvisibility |
|---|
| 459 | configure:7880: /usr/bin/clang -c -pipe -Os -flax-vector-conversions -arch x86_64 -fvisibility=hidden -I/opt/local/include conftest.c >&5 |
|---|
| 460 | configure:7880: $? = 0 |
|---|
| 461 | configure:7887: result: yes |
|---|
| 462 | configure:7912: checking whether /opt/local/bin/gfortran-mp-4.8 accepts -fvisibility |
|---|
| 463 | configure:7922: /opt/local/bin/gfortran-mp-4.8 -c -pipe -Os -fvisibility=hidden conftest.f >&5 |
|---|
| 464 | <built-in>:0:0: internal compiler error: Illegal instruction: 4 |
|---|
| 465 | |
|---|
| 466 | <built-in>:0:0: internal compiler error: Abort trap: 6 |
|---|
| 467 | gfortran-mp-4.8: internal compiler error: Abort trap: 6 (program f951) |
|---|
| 468 | ./configure: line 2204: 24052 Abort trap: 6 $F77 -c $FFLAGS conftest.$ac_ext 1>&5 |
|---|
| 469 | configure:7922: $? = 134 |
|---|
| 470 | configure: failed program was: |
|---|
| 471 | | program main |
|---|
| 472 | | |
|---|
| 473 | | end |
|---|
| 474 | configure:7929: result: no |
|---|
| 475 | configure:7952: checking for ANSI C header files |
|---|
| 476 | configure:7972: /usr/bin/clang -c -pipe -Os -flax-vector-conversions -arch x86_64 -I/opt/local/include conftest.c >&5 |
|---|
| 477 | configure:7972: $? = 0 |
|---|
| 478 | configure:8045: /usr/bin/clang -o conftest -pipe -Os -flax-vector-conversions -arch x86_64 -I/opt/local/include -L/opt/local/lib -Wl,-headerpad_max_install_names -arch x86_64 conftest.c >&5 |
|---|
| 479 | configure:8045: $? = 0 |
|---|
| 480 | configure:8045: ./conftest |
|---|
| 481 | configure:8045: $? = 0 |
|---|
| 482 | configure:8056: result: yes |
|---|
| 483 | configure:8069: checking for sys/types.h |
|---|
| 484 | configure:8069: /usr/bin/clang -c -pipe -Os -flax-vector-conversions -arch x86_64 -I/opt/local/include conftest.c >&5 |
|---|
| 485 | configure:8069: $? = 0 |
|---|
| 486 | configure:8069: result: yes |
|---|
| 487 | configure:8069: checking for sys/stat.h |
|---|
| 488 | configure:8069: /usr/bin/clang -c -pipe -Os -flax-vector-conversions -arch x86_64 -I/opt/local/include conftest.c >&5 |
|---|
| 489 | configure:8069: $? = 0 |
|---|
| 490 | configure:8069: result: yes |
|---|
| 491 | configure:8069: checking for stdlib.h |
|---|
| 492 | configure:8069: /usr/bin/clang -c -pipe -Os -flax-vector-conversions -arch x86_64 -I/opt/local/include conftest.c >&5 |
|---|
| 493 | configure:8069: $? = 0 |
|---|
| 494 | configure:8069: result: yes |
|---|
| 495 | configure:8069: checking for string.h |
|---|
| 496 | configure:8069: /usr/bin/clang -c -pipe -Os -flax-vector-conversions -arch x86_64 -I/opt/local/include conftest.c >&5 |
|---|
| 497 | configure:8069: $? = 0 |
|---|
| 498 | configure:8069: result: yes |
|---|
| 499 | configure:8069: checking for memory.h |
|---|
| 500 | configure:8069: /usr/bin/clang -c -pipe -Os -flax-vector-conversions -arch x86_64 -I/opt/local/include conftest.c >&5 |
|---|
| 501 | configure:8069: $? = 0 |
|---|
| 502 | configure:8069: result: yes |
|---|
| 503 | configure:8069: checking for strings.h |
|---|
| 504 | configure:8069: /usr/bin/clang -c -pipe -Os -flax-vector-conversions -arch x86_64 -I/opt/local/include conftest.c >&5 |
|---|
| 505 | configure:8069: $? = 0 |
|---|
| 506 | configure:8069: result: yes |
|---|
| 507 | configure:8069: checking for inttypes.h |
|---|
| 508 | configure:8069: /usr/bin/clang -c -pipe -Os -flax-vector-conversions -arch x86_64 -I/opt/local/include conftest.c >&5 |
|---|
| 509 | configure:8069: $? = 0 |
|---|
| 510 | configure:8069: result: yes |
|---|
| 511 | configure:8069: checking for stdint.h |
|---|
| 512 | configure:8069: /usr/bin/clang -c -pipe -Os -flax-vector-conversions -arch x86_64 -I/opt/local/include conftest.c >&5 |
|---|
| 513 | configure:8069: $? = 0 |
|---|
| 514 | configure:8069: result: yes |
|---|
| 515 | configure:8069: checking for unistd.h |
|---|
| 516 | configure:8069: /usr/bin/clang -c -pipe -Os -flax-vector-conversions -arch x86_64 -I/opt/local/include conftest.c >&5 |
|---|
| 517 | configure:8069: $? = 0 |
|---|
| 518 | configure:8069: result: yes |
|---|
| 519 | configure:8082: checking minix/config.h usability |
|---|
| 520 | configure:8082: /usr/bin/clang -c -pipe -Os -flax-vector-conversions -arch x86_64 -I/opt/local/include conftest.c >&5 |
|---|
| 521 | conftest.c:60:10: fatal error: 'minix/config.h' file not found |
|---|
| 522 | #include <minix/config.h> |
|---|
| 523 | ^ |
|---|
| 524 | 1 error generated. |
|---|
| 525 | configure:8082: $? = 1 |
|---|
| 526 | configure: failed program was: |
|---|
| 527 | | /* confdefs.h */ |
|---|
| 528 | | #define PACKAGE_NAME "R" |
|---|
| 529 | | #define PACKAGE_TARNAME "R" |
|---|
| 530 | | #define PACKAGE_VERSION "3.1.0" |
|---|
| 531 | | #define PACKAGE_STRING "R 3.1.0" |
|---|
| 532 | | #define PACKAGE_BUGREPORT "http://bugs.r-project.org" |
|---|
| 533 | | #define PACKAGE_URL "http://www.r-project.org" |
|---|
| 534 | | #define PACKAGE "R" |
|---|
| 535 | | #define VERSION "3.1.0" |
|---|
| 536 | | #define R_PLATFORM "x86_64-apple-darwin13.2.0" |
|---|
| 537 | | #define R_CPU "x86_64" |
|---|
| 538 | | #define R_VENDOR "apple" |
|---|
| 539 | | #define R_OS "darwin13.2.0" |
|---|
| 540 | | #define Unix 1 |
|---|
| 541 | | #define R_ARCH "" |
|---|
| 542 | | #define STDC_HEADERS 1 |
|---|
| 543 | | #define HAVE_SYS_TYPES_H 1 |
|---|
| 544 | | #define HAVE_SYS_STAT_H 1 |
|---|
| 545 | | #define HAVE_STDLIB_H 1 |
|---|
| 546 | | #define HAVE_STRING_H 1 |
|---|
| 547 | | #define HAVE_MEMORY_H 1 |
|---|
| 548 | | #define HAVE_STRINGS_H 1 |
|---|
| 549 | | #define HAVE_INTTYPES_H 1 |
|---|
| 550 | | #define HAVE_STDINT_H 1 |
|---|
| 551 | | #define HAVE_UNISTD_H 1 |
|---|
| 552 | | /* end confdefs.h. */ |
|---|
| 553 | | #include <stdio.h> |
|---|
| 554 | | #ifdef HAVE_SYS_TYPES_H |
|---|
| 555 | | # include <sys/types.h> |
|---|
| 556 | | #endif |
|---|
| 557 | | #ifdef HAVE_SYS_STAT_H |
|---|
| 558 | | # include <sys/stat.h> |
|---|
| 559 | | #endif |
|---|
| 560 | | #ifdef STDC_HEADERS |
|---|
| 561 | | # include <stdlib.h> |
|---|
| 562 | | # include <stddef.h> |
|---|
| 563 | | #else |
|---|
| 564 | | # ifdef HAVE_STDLIB_H |
|---|
| 565 | | # include <stdlib.h> |
|---|
| 566 | | # endif |
|---|
| 567 | | #endif |
|---|
| 568 | | #ifdef HAVE_STRING_H |
|---|
| 569 | | # if !defined STDC_HEADERS && defined HAVE_MEMORY_H |
|---|
| 570 | | # include <memory.h> |
|---|
| 571 | | # endif |
|---|
| 572 | | # include <string.h> |
|---|
| 573 | | #endif |
|---|
| 574 | | #ifdef HAVE_STRINGS_H |
|---|
| 575 | | # include <strings.h> |
|---|
| 576 | | #endif |
|---|
| 577 | | #ifdef HAVE_INTTYPES_H |
|---|
| 578 | | # include <inttypes.h> |
|---|
| 579 | | #endif |
|---|
| 580 | | #ifdef HAVE_STDINT_H |
|---|
| 581 | | # include <stdint.h> |
|---|
| 582 | | #endif |
|---|
| 583 | | #ifdef HAVE_UNISTD_H |
|---|
| 584 | | # include <unistd.h> |
|---|
| 585 | | #endif |
|---|
| 586 | | #include <minix/config.h> |
|---|
| 587 | configure:8082: result: no |
|---|
| 588 | configure:8082: checking minix/config.h presence |
|---|
| 589 | configure:8082: /usr/bin/clang -E -I/opt/local/include conftest.c |
|---|
| 590 | conftest.c:27:10: fatal error: 'minix/config.h' file not found |
|---|
| 591 | #include <minix/config.h> |
|---|
| 592 | ^ |
|---|
| 593 | 1 error generated. |
|---|
| 594 | configure:8082: $? = 1 |
|---|
| 595 | configure: failed program was: |
|---|
| 596 | | /* confdefs.h */ |
|---|
| 597 | | #define PACKAGE_NAME "R" |
|---|
| 598 | | #define PACKAGE_TARNAME "R" |
|---|
| 599 | | #define PACKAGE_VERSION "3.1.0" |
|---|
| 600 | | #define PACKAGE_STRING "R 3.1.0" |
|---|
| 601 | | #define PACKAGE_BUGREPORT "http://bugs.r-project.org" |
|---|
| 602 | | #define PACKAGE_URL "http://www.r-project.org" |
|---|
| 603 | | #define PACKAGE "R" |
|---|
| 604 | | #define VERSION "3.1.0" |
|---|
| 605 | | #define R_PLATFORM "x86_64-apple-darwin13.2.0" |
|---|
| 606 | | #define R_CPU "x86_64" |
|---|
| 607 | | #define R_VENDOR "apple" |
|---|
| 608 | | #define R_OS "darwin13.2.0" |
|---|
| 609 | | #define Unix 1 |
|---|
| 610 | | #define R_ARCH "" |
|---|
| 611 | | #define STDC_HEADERS 1 |
|---|
| 612 | | #define HAVE_SYS_TYPES_H 1 |
|---|
| 613 | | #define HAVE_SYS_STAT_H 1 |
|---|
| 614 | | #define HAVE_STDLIB_H 1 |
|---|
| 615 | | #define HAVE_STRING_H 1 |
|---|
| 616 | | #define HAVE_MEMORY_H 1 |
|---|
| 617 | | #define HAVE_STRINGS_H 1 |
|---|
| 618 | | #define HAVE_INTTYPES_H 1 |
|---|
| 619 | | #define HAVE_STDINT_H 1 |
|---|
| 620 | | #define HAVE_UNISTD_H 1 |
|---|
| 621 | | /* end confdefs.h. */ |
|---|
| 622 | | #include <minix/config.h> |
|---|
| 623 | configure:8082: result: no |
|---|
| 624 | configure:8082: checking for minix/config.h |
|---|
| 625 | configure:8082: result: no |
|---|
| 626 | configure:8103: checking whether it is safe to define __EXTENSIONS__ |
|---|
| 627 | configure:8121: /usr/bin/clang -c -pipe -Os -flax-vector-conversions -arch x86_64 -I/opt/local/include conftest.c >&5 |
|---|
| 628 | configure:8121: $? = 0 |
|---|
| 629 | configure:8128: result: yes |
|---|
| 630 | configure:8250: checking for Objective C compiler version |
|---|
| 631 | configure:8259: /usr/bin/clang --version >&5 |
|---|
| 632 | Apple LLVM version 5.1 (clang-503.0.40) (based on LLVM 3.4svn) |
|---|
| 633 | Target: x86_64-apple-darwin13.2.0 |
|---|
| 634 | Thread model: posix |
|---|
| 635 | configure:8270: $? = 0 |
|---|
| 636 | configure:8259: /usr/bin/clang -v >&5 |
|---|
| 637 | Apple LLVM version 5.1 (clang-503.0.40) (based on LLVM 3.4svn) |
|---|
| 638 | Target: x86_64-apple-darwin13.2.0 |
|---|
| 639 | Thread model: posix |
|---|
| 640 | configure:8270: $? = 0 |
|---|
| 641 | configure:8259: /usr/bin/clang -V >&5 |
|---|
| 642 | clang: error: argument to '-V' is missing (expected 1 value) |
|---|
| 643 | clang: error: no input files |
|---|
| 644 | configure:8270: $? = 1 |
|---|
| 645 | configure:8259: /usr/bin/clang -qversion >&5 |
|---|
| 646 | clang: error: unknown argument: '-qversion' [-Wunused-command-line-argument-hard-error-in-future] |
|---|
| 647 | clang: note: this will be a hard error (cannot be downgraded to a warning) in the future |
|---|
| 648 | clang: error: no input files |
|---|
| 649 | configure:8270: $? = 1 |
|---|
| 650 | configure:8274: checking whether we are using the GNU Objective C compiler |
|---|
| 651 | configure:8293: /usr/bin/clang -c -pipe -Os -arch x86_64 -I/opt/local/include conftest.m >&5 |
|---|
| 652 | configure:8293: $? = 0 |
|---|
| 653 | configure:8302: result: yes |
|---|
| 654 | configure:8311: checking whether /usr/bin/clang accepts -g |
|---|
| 655 | configure:8331: /usr/bin/clang -c -g -I/opt/local/include conftest.m >&5 |
|---|
| 656 | configure:8331: $? = 0 |
|---|
| 657 | configure:8372: result: yes |
|---|
| 658 | configure:8431: checking for Objective C++ compiler |
|---|
| 659 | configure:8437: result: trying some possibilities |
|---|
| 660 | configure:8440: checking whether /usr/bin/clang++ can compile ObjC++ |
|---|
| 661 | running: /usr/bin/clang++ -c conftest.mm -I/opt/local/include -pipe -Os -arch x86_64 -stdlib=libc++ |
|---|
| 662 | configure:8468: result: yes |
|---|
| 663 | configure:8572: result: /usr/bin/clang++ |
|---|
| 664 | configure:8641: checking for a sed that does not truncate output |
|---|
| 665 | configure:8705: result: /usr/bin/sed |
|---|
| 666 | configure:8723: checking for fgrep |
|---|
| 667 | configure:8785: result: /opt/local/bin/grep -F |
|---|
| 668 | configure:8813: checking for ld used by /usr/bin/clang |
|---|
| 669 | configure:8880: result: /Applications/Xcode.app/Contents/Developer/Toolchains/XcodeDefault.xctoolchain/usr/bin/ld |
|---|
| 670 | configure:8887: checking if the linker (/Applications/Xcode.app/Contents/Developer/Toolchains/XcodeDefault.xctoolchain/usr/bin/ld) is GNU ld |
|---|
| 671 | configure:8902: result: no |
|---|
| 672 | configure:8914: checking for BSD- or MS-compatible name lister (nm) |
|---|
| 673 | configure:8963: result: /opt/local/bin/nm |
|---|
| 674 | configure:9081: checking the name lister (/opt/local/bin/nm) interface |
|---|
| 675 | configure:9088: /usr/bin/clang -c -pipe -Os -flax-vector-conversions -arch x86_64 -I/opt/local/include conftest.c >&5 |
|---|
| 676 | configure:9091: /opt/local/bin/nm "conftest.o" |
|---|
| 677 | configure:9094: output |
|---|
| 678 | 0000000000000000 S _some_variable |
|---|
| 679 | configure:9101: result: BSD nm |
|---|
| 680 | configure:9105: checking the maximum length of command line arguments |
|---|
| 681 | configure:9225: result: 196608 |
|---|
| 682 | configure:9242: checking whether the shell understands some XSI constructs |
|---|
| 683 | configure:9252: result: yes |
|---|
| 684 | configure:9256: checking whether the shell understands "+=" |
|---|
| 685 | configure:9262: result: yes |
|---|
| 686 | configure:9297: checking for /Applications/Xcode.app/Contents/Developer/Toolchains/XcodeDefault.xctoolchain/usr/bin/ld option to reload object files |
|---|
| 687 | configure:9304: result: -r |
|---|
| 688 | configure:9373: checking for objdump |
|---|
| 689 | configure:9403: result: no |
|---|
| 690 | configure:9432: checking how to recognize dependent libraries |
|---|
| 691 | configure:9628: result: pass_all |
|---|
| 692 | configure:9793: checking for strip |
|---|
| 693 | configure:9809: found /opt/local/bin/strip |
|---|
| 694 | configure:9820: result: strip |
|---|
| 695 | configure:9892: checking for ranlib |
|---|
| 696 | configure:9908: found /opt/local/bin/ranlib |
|---|
| 697 | configure:9919: result: ranlib |
|---|
| 698 | configure:10009: checking command to parse /opt/local/bin/nm output from /usr/bin/clang object |
|---|
| 699 | configure:10127: /usr/bin/clang -c -pipe -Os -flax-vector-conversions -arch x86_64 -I/opt/local/include conftest.c >&5 |
|---|
| 700 | configure:10130: $? = 0 |
|---|
| 701 | configure:10134: /opt/local/bin/nm conftest.o \| sed -n -e 's/^.*[ ]\([BCDEGRST][BCDEGRST]*\)[ ][ ]*\([_A-Za-z][_A-Za-z0-9]*\)$/\1 \2 \2/p' \> conftest.nm |
|---|
| 702 | configure:10137: $? = 0 |
|---|
| 703 | cannot find nm_test_var in conftest.nm |
|---|
| 704 | configure:10127: /usr/bin/clang -c -pipe -Os -flax-vector-conversions -arch x86_64 -I/opt/local/include conftest.c >&5 |
|---|
| 705 | configure:10130: $? = 0 |
|---|
| 706 | configure:10134: /opt/local/bin/nm conftest.o \| sed -n -e 's/^.*[ ]\([BCDEGRST][BCDEGRST]*\)[ ][ ]*_\([_A-Za-z][_A-Za-z0-9]*\)$/\1 _\2 \2/p' \> conftest.nm |
|---|
| 707 | configure:10137: $? = 0 |
|---|
| 708 | configure:10191: /usr/bin/clang -o conftest -pipe -Os -flax-vector-conversions -arch x86_64 -I/opt/local/include -L/opt/local/lib -Wl,-headerpad_max_install_names -arch x86_64 conftest.c conftstm.o >&5 |
|---|
| 709 | configure:10194: $? = 0 |
|---|
| 710 | configure:10232: result: ok |
|---|
| 711 | configure:10303: checking for dsymutil |
|---|
| 712 | configure:10319: found /usr/bin/dsymutil |
|---|
| 713 | configure:10330: result: dsymutil |
|---|
| 714 | configure:10395: checking for nmedit |
|---|
| 715 | configure:10411: found /opt/local/bin/nmedit |
|---|
| 716 | configure:10422: result: nmedit |
|---|
| 717 | configure:10487: checking for lipo |
|---|
| 718 | configure:10503: found /opt/local/bin/lipo |
|---|
| 719 | configure:10514: result: lipo |
|---|
| 720 | configure:10579: checking for otool |
|---|
| 721 | configure:10595: found /opt/local/bin/otool |
|---|
| 722 | configure:10606: result: otool |
|---|
| 723 | configure:10671: checking for otool64 |
|---|
| 724 | configure:10701: result: no |
|---|
| 725 | configure:10746: checking for -single_module linker flag |
|---|
| 726 | /usr/bin/clang -pipe -Os -flax-vector-conversions -arch x86_64 -L/opt/local/lib -Wl,-headerpad_max_install_names -arch x86_64 -o libconftest.dylib -dynamiclib -Wl,-single_module conftest.c |
|---|
| 727 | configure:10773: result: yes |
|---|
| 728 | configure:10775: checking for -exported_symbols_list linker flag |
|---|
| 729 | configure:10795: /usr/bin/clang -o conftest -pipe -Os -flax-vector-conversions -arch x86_64 -I/opt/local/include -L/opt/local/lib -Wl,-headerpad_max_install_names -arch x86_64 -Wl,-exported_symbols_list,conftest.sym conftest.c >&5 |
|---|
| 730 | configure:10795: $? = 0 |
|---|
| 731 | configure:10805: result: yes |
|---|
| 732 | configure:10844: checking for dlfcn.h |
|---|
| 733 | configure:10844: /usr/bin/clang -c -pipe -Os -flax-vector-conversions -arch x86_64 -I/opt/local/include conftest.c >&5 |
|---|
| 734 | configure:10844: $? = 0 |
|---|
| 735 | configure:10844: result: yes |
|---|
| 736 | configure:10969: checking for C++ compiler version |
|---|
| 737 | configure:10978: /usr/bin/clang++ --version >&5 |
|---|
| 738 | Apple LLVM version 5.1 (clang-503.0.40) (based on LLVM 3.4svn) |
|---|
| 739 | Target: x86_64-apple-darwin13.2.0 |
|---|
| 740 | Thread model: posix |
|---|
| 741 | configure:10989: $? = 0 |
|---|
| 742 | configure:10978: /usr/bin/clang++ -v >&5 |
|---|
| 743 | Apple LLVM version 5.1 (clang-503.0.40) (based on LLVM 3.4svn) |
|---|
| 744 | Target: x86_64-apple-darwin13.2.0 |
|---|
| 745 | Thread model: posix |
|---|
| 746 | configure:10989: $? = 0 |
|---|
| 747 | configure:10978: /usr/bin/clang++ -V >&5 |
|---|
| 748 | clang: error: argument to '-V' is missing (expected 1 value) |
|---|
| 749 | clang: error: no input files |
|---|
| 750 | configure:10989: $? = 1 |
|---|
| 751 | configure:10978: /usr/bin/clang++ -qversion >&5 |
|---|
| 752 | clang: error: unknown argument: '-qversion' [-Wunused-command-line-argument-hard-error-in-future] |
|---|
| 753 | clang: note: this will be a hard error (cannot be downgraded to a warning) in the future |
|---|
| 754 | clang: error: no input files |
|---|
| 755 | configure:10989: $? = 1 |
|---|
| 756 | configure:10993: checking whether we are using the GNU C++ compiler |
|---|
| 757 | configure:11021: result: yes |
|---|
| 758 | configure:11030: checking whether /usr/bin/clang++ accepts -g |
|---|
| 759 | configure:11091: result: yes |
|---|
| 760 | configure:11122: checking how to run the C++ preprocessor |
|---|
| 761 | configure:11188: result: /usr/bin/clang++ -E |
|---|
| 762 | configure:11208: /usr/bin/clang++ -E -I/opt/local/include conftest.cpp |
|---|
| 763 | configure:11208: $? = 0 |
|---|
| 764 | configure:11222: /usr/bin/clang++ -E -I/opt/local/include conftest.cpp |
|---|
| 765 | conftest.cpp:33:10: fatal error: 'ac_nonexistent.h' file not found |
|---|
| 766 | #include <ac_nonexistent.h> |
|---|
| 767 | ^ |
|---|
| 768 | 1 error generated. |
|---|
| 769 | configure:11222: $? = 1 |
|---|
| 770 | configure: failed program was: |
|---|
| 771 | | /* confdefs.h */ |
|---|
| 772 | | #define PACKAGE_NAME "R" |
|---|
| 773 | | #define PACKAGE_TARNAME "R" |
|---|
| 774 | | #define PACKAGE_VERSION "3.1.0" |
|---|
| 775 | | #define PACKAGE_STRING "R 3.1.0" |
|---|
| 776 | | #define PACKAGE_BUGREPORT "http://bugs.r-project.org" |
|---|
| 777 | | #define PACKAGE_URL "http://www.r-project.org" |
|---|
| 778 | | #define PACKAGE "R" |
|---|
| 779 | | #define VERSION "3.1.0" |
|---|
| 780 | | #define R_PLATFORM "x86_64-apple-darwin13.2.0" |
|---|
| 781 | | #define R_CPU "x86_64" |
|---|
| 782 | | #define R_VENDOR "apple" |
|---|
| 783 | | #define R_OS "darwin13.2.0" |
|---|
| 784 | | #define Unix 1 |
|---|
| 785 | | #define R_ARCH "" |
|---|
| 786 | | #define STDC_HEADERS 1 |
|---|
| 787 | | #define HAVE_SYS_TYPES_H 1 |
|---|
| 788 | | #define HAVE_SYS_STAT_H 1 |
|---|
| 789 | | #define HAVE_STDLIB_H 1 |
|---|
| 790 | | #define HAVE_STRING_H 1 |
|---|
| 791 | | #define HAVE_MEMORY_H 1 |
|---|
| 792 | | #define HAVE_STRINGS_H 1 |
|---|
| 793 | | #define HAVE_INTTYPES_H 1 |
|---|
| 794 | | #define HAVE_STDINT_H 1 |
|---|
| 795 | | #define HAVE_UNISTD_H 1 |
|---|
| 796 | | #define __EXTENSIONS__ 1 |
|---|
| 797 | | #define _ALL_SOURCE 1 |
|---|
| 798 | | #define _GNU_SOURCE 1 |
|---|
| 799 | | #define _POSIX_PTHREAD_SEMANTICS 1 |
|---|
| 800 | | #define _TANDEM_SOURCE 1 |
|---|
| 801 | | #define HAVE_DLFCN_H 1 |
|---|
| 802 | | /* end confdefs.h. */ |
|---|
| 803 | | #include <ac_nonexistent.h> |
|---|
| 804 | configure:11363: checking for Fortran 77 compiler version |
|---|
| 805 | configure:11372: /opt/local/bin/gfortran-mp-4.8 --version >&5 |
|---|
| 806 | GNU Fortran (MacPorts gcc48 4.8.2_2) 4.8.2 |
|---|
| 807 | Copyright (C) 2013 Free Software Foundation, Inc. |
|---|
| 808 | |
|---|
| 809 | GNU Fortran comes with NO WARRANTY, to the extent permitted by law. |
|---|
| 810 | You may redistribute copies of GNU Fortran |
|---|
| 811 | under the terms of the GNU General Public License. |
|---|
| 812 | For more information about these matters, see the file named COPYING |
|---|
| 813 | |
|---|
| 814 | configure:11383: $? = 0 |
|---|
| 815 | configure:11372: /opt/local/bin/gfortran-mp-4.8 -v >&5 |
|---|
| 816 | Using built-in specs. |
|---|
| 817 | COLLECT_GCC=/opt/local/bin/gfortran-mp-4.8 |
|---|
| 818 | COLLECT_LTO_WRAPPER=/opt/local/libexec/gcc/x86_64-apple-darwin13/4.8.2/lto-wrapper |
|---|
| 819 | Target: x86_64-apple-darwin13 |
|---|
| 820 | Configured with: /opt/local/var/macports/build/_opt_mports_dports_lang_gcc48/gcc48/work/gcc-4.8.2/configure --prefix=/opt/local --build=x86_64-apple-darwin13 --enable-languages=c,c++,objc,obj-c++,lto,fortran,java --libdir=/opt/local/lib/gcc48 --includedir=/opt/local/include/gcc48 --infodir=/opt/local/share/info --mandir=/opt/local/share/man --datarootdir=/opt/local/share/gcc-4.8 --with-local-prefix=/opt/local --with-system-zlib --disable-nls --program-suffix=-mp-4.8 --with-gxx-include-dir=/opt/local/include/gcc48/c++/ --with-gmp=/opt/local --with-mpfr=/opt/local --with-mpc=/opt/local --with-cloog=/opt/local --enable-cloog-backend=isl --disable-cloog-version-check --enable-stage1-checking --disable-multilib --enable-lto --enable-libstdcxx-time --with-as=/opt/local/bin/as --with-ld=/opt/local/bin/ld --with-ar=/opt/local/bin/ar --with-bugurl=https://trac.macports.org/newticket --with-pkgversion='MacPorts gcc48 4.8.2_2' |
|---|
| 821 | Thread model: posix |
|---|
| 822 | gcc version 4.8.2 (MacPorts gcc48 4.8.2_2) |
|---|
| 823 | configure:11383: $? = 0 |
|---|
| 824 | configure:11372: /opt/local/bin/gfortran-mp-4.8 -V >&5 |
|---|
| 825 | gfortran-mp-4.8: error: unrecognized command line option '-V' |
|---|
| 826 | gfortran-mp-4.8: fatal error: no input files |
|---|
| 827 | compilation terminated. |
|---|
| 828 | configure:11383: $? = 1 |
|---|
| 829 | configure:11372: /opt/local/bin/gfortran-mp-4.8 -qversion >&5 |
|---|
| 830 | gfortran-mp-4.8: error: unrecognized command line option '-qversion' |
|---|
| 831 | gfortran-mp-4.8: fatal error: no input files |
|---|
| 832 | compilation terminated. |
|---|
| 833 | configure:11383: $? = 1 |
|---|
| 834 | configure:11392: checking whether we are using the GNU Fortran 77 compiler |
|---|
| 835 | configure:11414: result: no |
|---|
| 836 | configure:11420: checking whether /opt/local/bin/gfortran-mp-4.8 accepts -g |
|---|
| 837 | configure:11439: result: no |
|---|
| 838 | configure:11617: checking for objdir |
|---|
| 839 | configure:11632: result: .libs |
|---|
| 840 | configure:11928: checking if /usr/bin/clang supports -fno-rtti -fno-exceptions |
|---|
| 841 | configure:11946: /usr/bin/clang -c -pipe -Os -flax-vector-conversions -arch x86_64 -I/opt/local/include -fno-rtti -fno-exceptions conftest.c >&5 |
|---|
| 842 | configure:11950: $? = 0 |
|---|
| 843 | configure:11963: result: yes |
|---|
| 844 | configure:11983: checking for /usr/bin/clang option to produce PIC |
|---|
| 845 | configure:12255: result: -fno-common -DPIC |
|---|
| 846 | configure:12267: checking if /usr/bin/clang PIC flag -fno-common -DPIC works |
|---|
| 847 | configure:12285: /usr/bin/clang -c -pipe -Os -flax-vector-conversions -arch x86_64 -I/opt/local/include -fno-common -DPIC -DPIC conftest.c >&5 |
|---|
| 848 | configure:12289: $? = 0 |
|---|
| 849 | configure:12302: result: yes |
|---|
| 850 | configure:12326: checking if /usr/bin/clang static flag -static works |
|---|
| 851 | configure:12354: result: no |
|---|
| 852 | configure:12369: checking if /usr/bin/clang supports -c -o file.o |
|---|
| 853 | configure:12390: /usr/bin/clang -c -pipe -Os -flax-vector-conversions -arch x86_64 -I/opt/local/include -o out/conftest2.o conftest.c >&5 |
|---|
| 854 | configure:12394: $? = 0 |
|---|
| 855 | configure:12416: result: yes |
|---|
| 856 | configure:12424: checking if /usr/bin/clang supports -c -o file.o |
|---|
| 857 | configure:12471: result: yes |
|---|
| 858 | configure:12504: checking whether the /usr/bin/clang linker (/Applications/Xcode.app/Contents/Developer/Toolchains/XcodeDefault.xctoolchain/usr/bin/ld) supports shared libraries |
|---|
| 859 | configure:13490: result: yes |
|---|
| 860 | configure:13729: checking dynamic linker characteristics |
|---|
| 861 | configure:14380: result: darwin13.2.0 dyld |
|---|
| 862 | configure:14482: checking how to hardcode library paths into programs |
|---|
| 863 | configure:14507: result: immediate |
|---|
| 864 | configure:15027: checking whether stripping libraries is possible |
|---|
| 865 | configure:15041: result: yes |
|---|
| 866 | configure:15067: checking if libtool supports shared libraries |
|---|
| 867 | configure:15069: result: yes |
|---|
| 868 | configure:15072: checking whether to build shared libraries |
|---|
| 869 | configure:15093: result: yes |
|---|
| 870 | configure:15096: checking whether to build static libraries |
|---|
| 871 | configure:15100: result: no |
|---|
| 872 | configure:15243: checking for ld used by /usr/bin/clang++ |
|---|
| 873 | configure:15310: result: /Applications/Xcode.app/Contents/Developer/Toolchains/XcodeDefault.xctoolchain/usr/bin/ld |
|---|
| 874 | configure:15317: checking if the linker (/Applications/Xcode.app/Contents/Developer/Toolchains/XcodeDefault.xctoolchain/usr/bin/ld) is GNU ld |
|---|
| 875 | configure:15332: result: no |
|---|
| 876 | configure:15387: checking whether the /usr/bin/clang++ linker (/Applications/Xcode.app/Contents/Developer/Toolchains/XcodeDefault.xctoolchain/usr/bin/ld) supports shared libraries |
|---|
| 877 | configure:16300: result: yes |
|---|
| 878 | configure:16328: /usr/bin/clang++ -c -pipe -Os -arch x86_64 -stdlib=libc++ -I/opt/local/include conftest.cpp >&5 |
|---|
| 879 | configure:16331: $? = 0 |
|---|
| 880 | configure:16513: checking for /usr/bin/clang++ option to produce PIC |
|---|
| 881 | configure:16830: result: -fno-common -DPIC |
|---|
| 882 | configure:16839: checking if /usr/bin/clang++ PIC flag -fno-common -DPIC works |
|---|
| 883 | configure:16857: /usr/bin/clang++ -c -pipe -Os -arch x86_64 -stdlib=libc++ -I/opt/local/include -fno-common -DPIC -DPIC conftest.cpp >&5 |
|---|
| 884 | configure:16861: $? = 0 |
|---|
| 885 | configure:16874: result: yes |
|---|
| 886 | configure:16895: checking if /usr/bin/clang++ static flag -static works |
|---|
| 887 | configure:16923: result: no |
|---|
| 888 | configure:16935: checking if /usr/bin/clang++ supports -c -o file.o |
|---|
| 889 | configure:16956: /usr/bin/clang++ -c -pipe -Os -arch x86_64 -stdlib=libc++ -I/opt/local/include -o out/conftest2.o conftest.cpp >&5 |
|---|
| 890 | configure:16960: $? = 0 |
|---|
| 891 | configure:16982: result: yes |
|---|
| 892 | configure:16987: checking if /usr/bin/clang++ supports -c -o file.o |
|---|
| 893 | configure:17034: result: yes |
|---|
| 894 | configure:17064: checking whether the /usr/bin/clang++ linker (/Applications/Xcode.app/Contents/Developer/Toolchains/XcodeDefault.xctoolchain/usr/bin/ld) supports shared libraries |
|---|
| 895 | configure:17090: result: yes |
|---|
| 896 | configure:17227: checking dynamic linker characteristics |
|---|
| 897 | configure:17826: result: darwin13.2.0 dyld |
|---|
| 898 | configure:17877: checking how to hardcode library paths into programs |
|---|
| 899 | configure:17902: result: immediate |
|---|
| 900 | configure:18043: checking if libtool supports shared libraries |
|---|
| 901 | configure:18045: result: yes |
|---|
| 902 | configure:18048: checking whether to build shared libraries |
|---|
| 903 | configure:18068: result: yes |
|---|
| 904 | configure:18071: checking whether to build static libraries |
|---|
| 905 | configure:18075: result: no |
|---|
| 906 | configure:18089: checking for /opt/local/bin/gfortran-mp-4.8 option to produce PIC |
|---|
| 907 | configure:18361: result: |
|---|
| 908 | configure:18426: checking if /opt/local/bin/gfortran-mp-4.8 static flag works |
|---|
| 909 | configure:18454: result: no |
|---|
| 910 | configure:18466: checking if /opt/local/bin/gfortran-mp-4.8 supports -c -o file.o |
|---|
| 911 | configure:18487: /opt/local/bin/gfortran-mp-4.8 -c -pipe -Os -o out/conftest2.o conftest.f >&5 |
|---|
| 912 | <built-in>:0:0: internal compiler error: Illegal instruction: 4 |
|---|
| 913 | |
|---|
| 914 | <built-in>:0:0: internal compiler error: Abort trap: 6 |
|---|
| 915 | gfortran-mp-4.8: internal compiler error: Abort trap: 6 (program f951) |
|---|
| 916 | ./configure: line 18488: 24656 Abort trap: 6 $F77 -c $FFLAGS $lt_compiler_flag conftest.$ac_ext 1>&5 |
|---|
| 917 | configure:18491: $? = 134 |
|---|
| 918 | configure:18513: result: no |
|---|
| 919 | configure:18518: checking if /opt/local/bin/gfortran-mp-4.8 supports -c -o file.o |
|---|
| 920 | configure:18565: result: no |
|---|
| 921 | configure:18595: checking whether the /opt/local/bin/gfortran-mp-4.8 linker (/Applications/Xcode.app/Contents/Developer/Toolchains/XcodeDefault.xctoolchain/usr/bin/ld) supports shared libraries |
|---|
| 922 | configure:19568: result: no |
|---|
| 923 | configure:19705: checking dynamic linker characteristics |
|---|
| 924 | configure:20298: result: darwin13.2.0 dyld |
|---|
| 925 | configure:20349: checking how to hardcode library paths into programs |
|---|
| 926 | configure:20374: result: immediate |
|---|
| 927 | configure:20678: checking for sin in -lm |
|---|
| 928 | configure:20703: /usr/bin/clang -o conftest -pipe -Os -flax-vector-conversions -arch x86_64 -I/opt/local/include -L/opt/local/lib -Wl,-headerpad_max_install_names -arch x86_64 conftest.c -lm >&5 |
|---|
| 929 | conftest.c:41:6: warning: incompatible redeclaration of library function 'sin' [-Wincompatible-library-redeclaration] |
|---|
| 930 | char sin (); |
|---|
| 931 | ^ |
|---|
| 932 | conftest.c:41:6: note: 'sin' is a builtin with type 'double (double)' |
|---|
| 933 | 1 warning generated. |
|---|
| 934 | configure:20703: $? = 0 |
|---|
| 935 | configure:20712: result: yes |
|---|
| 936 | configure:20726: checking for library containing dlopen |
|---|
| 937 | configure:20757: /usr/bin/clang -o conftest -pipe -Os -flax-vector-conversions -arch x86_64 -I/opt/local/include -L/opt/local/lib -Wl,-headerpad_max_install_names -arch x86_64 conftest.c -lm >&5 |
|---|
| 938 | configure:20757: $? = 0 |
|---|
| 939 | configure:20774: result: none required |
|---|
| 940 | configure:20887: checking readline/history.h usability |
|---|
| 941 | configure:20887: /usr/bin/clang -c -pipe -Os -flax-vector-conversions -arch x86_64 -I/opt/local/include conftest.c >&5 |
|---|
| 942 | configure:20887: $? = 0 |
|---|
| 943 | configure:20887: result: yes |
|---|
| 944 | configure:20887: checking readline/history.h presence |
|---|
| 945 | configure:20887: /usr/bin/clang -E -I/opt/local/include conftest.c |
|---|
| 946 | configure:20887: $? = 0 |
|---|
| 947 | configure:20887: result: yes |
|---|
| 948 | configure:20887: checking for readline/history.h |
|---|
| 949 | configure:20887: result: yes |
|---|
| 950 | configure:20887: checking readline/readline.h usability |
|---|
| 951 | configure:20887: /usr/bin/clang -c -pipe -Os -flax-vector-conversions -arch x86_64 -I/opt/local/include conftest.c >&5 |
|---|
| 952 | configure:20887: $? = 0 |
|---|
| 953 | configure:20887: result: yes |
|---|
| 954 | configure:20887: checking readline/readline.h presence |
|---|
| 955 | configure:20887: /usr/bin/clang -E -I/opt/local/include conftest.c |
|---|
| 956 | configure:20887: $? = 0 |
|---|
| 957 | configure:20887: result: yes |
|---|
| 958 | configure:20887: checking for readline/readline.h |
|---|
| 959 | configure:20887: result: yes |
|---|
| 960 | configure:20901: checking for rl_callback_read_char in -lreadline |
|---|
| 961 | configure:20926: /usr/bin/clang -o conftest -pipe -Os -flax-vector-conversions -arch x86_64 -I/opt/local/include -L/opt/local/lib -Wl,-headerpad_max_install_names -arch x86_64 conftest.c -lreadline >&5 |
|---|
| 962 | configure:20926: $? = 0 |
|---|
| 963 | configure:20935: result: yes |
|---|
| 964 | configure:21119: checking for history_truncate_file |
|---|
| 965 | configure:21119: /usr/bin/clang -o conftest -pipe -Os -flax-vector-conversions -arch x86_64 -I/opt/local/include -L/opt/local/lib -Wl,-headerpad_max_install_names -arch x86_64 conftest.c -lreadline >&5 |
|---|
| 966 | configure:21119: $? = 0 |
|---|
| 967 | configure:21119: result: yes |
|---|
| 968 | configure:21134: checking whether rl_completion_matches exists and is declared |
|---|
| 969 | configure:21156: /usr/bin/clang -o conftest -pipe -Os -flax-vector-conversions -arch x86_64 -I/opt/local/include -L/opt/local/lib -Wl,-headerpad_max_install_names -arch x86_64 conftest.c -lreadline >&5 |
|---|
| 970 | configure:21156: $? = 0 |
|---|
| 971 | configure:21165: result: yes |
|---|
| 972 | configure:21183: checking for ANSI C header files |
|---|
| 973 | configure:21287: result: yes |
|---|
| 974 | configure:21298: checking for dirent.h that defines DIR |
|---|
| 975 | configure:21317: /usr/bin/clang -c -pipe -Os -flax-vector-conversions -arch x86_64 -I/opt/local/include conftest.c >&5 |
|---|
| 976 | configure:21317: $? = 0 |
|---|
| 977 | configure:21325: result: yes |
|---|
| 978 | configure:21338: checking for library containing opendir |
|---|
| 979 | configure:21369: /usr/bin/clang -o conftest -pipe -Os -flax-vector-conversions -arch x86_64 -I/opt/local/include -L/opt/local/lib -Wl,-headerpad_max_install_names -arch x86_64 conftest.c -lm >&5 |
|---|
| 980 | configure:21369: $? = 0 |
|---|
| 981 | configure:21386: result: none required |
|---|
| 982 | configure:21457: checking for sys/wait.h that is POSIX.1 compatible |
|---|
| 983 | configure:21483: /usr/bin/clang -c -pipe -Os -flax-vector-conversions -arch x86_64 -I/opt/local/include conftest.c >&5 |
|---|
| 984 | configure:21483: $? = 0 |
|---|
| 985 | configure:21490: result: yes |
|---|
| 986 | configure:21518: checking arpa/inet.h usability |
|---|
| 987 | configure:21518: /usr/bin/clang -c -pipe -Os -flax-vector-conversions -arch x86_64 -I/opt/local/include conftest.c >&5 |
|---|
| 988 | configure:21518: $? = 0 |
|---|
| 989 | configure:21518: result: yes |
|---|
| 990 | configure:21518: checking arpa/inet.h presence |
|---|
| 991 | configure:21518: /usr/bin/clang -E -I/opt/local/include conftest.c |
|---|
| 992 | configure:21518: $? = 0 |
|---|
| 993 | configure:21518: result: yes |
|---|
| 994 | configure:21518: checking for arpa/inet.h |
|---|
| 995 | configure:21518: result: yes |
|---|
| 996 | configure:21518: checking dl.h usability |
|---|
| 997 | configure:21518: /usr/bin/clang -c -pipe -Os -flax-vector-conversions -arch x86_64 -I/opt/local/include conftest.c >&5 |
|---|
| 998 | conftest.c:77:10: fatal error: 'dl.h' file not found |
|---|
| 999 | #include <dl.h> |
|---|
| 1000 | ^ |
|---|
| 1001 | 1 error generated. |
|---|
| 1002 | configure:21518: $? = 1 |
|---|
| 1003 | configure: failed program was: |
|---|
| 1004 | | /* confdefs.h */ |
|---|
| 1005 | | #define PACKAGE_NAME "R" |
|---|
| 1006 | | #define PACKAGE_TARNAME "R" |
|---|
| 1007 | | #define PACKAGE_VERSION "3.1.0" |
|---|
| 1008 | | #define PACKAGE_STRING "R 3.1.0" |
|---|
| 1009 | | #define PACKAGE_BUGREPORT "http://bugs.r-project.org" |
|---|
| 1010 | | #define PACKAGE_URL "http://www.r-project.org" |
|---|
| 1011 | | #define PACKAGE "R" |
|---|
| 1012 | | #define VERSION "3.1.0" |
|---|
| 1013 | | #define R_PLATFORM "x86_64-apple-darwin13.2.0" |
|---|
| 1014 | | #define R_CPU "x86_64" |
|---|
| 1015 | | #define R_VENDOR "apple" |
|---|
| 1016 | | #define R_OS "darwin13.2.0" |
|---|
| 1017 | | #define Unix 1 |
|---|
| 1018 | | #define R_ARCH "" |
|---|
| 1019 | | #define STDC_HEADERS 1 |
|---|
| 1020 | | #define HAVE_SYS_TYPES_H 1 |
|---|
| 1021 | | #define HAVE_SYS_STAT_H 1 |
|---|
| 1022 | | #define HAVE_STDLIB_H 1 |
|---|
| 1023 | | #define HAVE_STRING_H 1 |
|---|
| 1024 | | #define HAVE_MEMORY_H 1 |
|---|
| 1025 | | #define HAVE_STRINGS_H 1 |
|---|
| 1026 | | #define HAVE_INTTYPES_H 1 |
|---|
| 1027 | | #define HAVE_STDINT_H 1 |
|---|
| 1028 | | #define HAVE_UNISTD_H 1 |
|---|
| 1029 | | #define __EXTENSIONS__ 1 |
|---|
| 1030 | | #define _ALL_SOURCE 1 |
|---|
| 1031 | | #define _GNU_SOURCE 1 |
|---|
| 1032 | | #define _POSIX_PTHREAD_SEMANTICS 1 |
|---|
| 1033 | | #define _TANDEM_SOURCE 1 |
|---|
| 1034 | | #define HAVE_DLFCN_H 1 |
|---|
| 1035 | | #define LT_OBJDIR ".libs/" |
|---|
| 1036 | | #define HAVE_LIBM 1 |
|---|
| 1037 | | #define HAVE_READLINE_HISTORY_H 1 |
|---|
| 1038 | | #define HAVE_READLINE_READLINE_H 1 |
|---|
| 1039 | | #define HAVE_LIBREADLINE 1 |
|---|
| 1040 | | #define HAVE_HISTORY_TRUNCATE_FILE 1 |
|---|
| 1041 | | #define HAVE_RL_COMPLETION_MATCHES 1 |
|---|
| 1042 | | #define STDC_HEADERS 1 |
|---|
| 1043 | | #define HAVE_DIRENT_H 1 |
|---|
| 1044 | | #define HAVE_SYS_WAIT_H 1 |
|---|
| 1045 | | #define HAVE_ARPA_INET_H 1 |
|---|
| 1046 | | /* end confdefs.h. */ |
|---|
| 1047 | | #include <stdio.h> |
|---|
| 1048 | | #ifdef HAVE_SYS_TYPES_H |
|---|
| 1049 | | # include <sys/types.h> |
|---|
| 1050 | | #endif |
|---|
| 1051 | | #ifdef HAVE_SYS_STAT_H |
|---|
| 1052 | | # include <sys/stat.h> |
|---|
| 1053 | | #endif |
|---|
| 1054 | | #ifdef STDC_HEADERS |
|---|
| 1055 | | # include <stdlib.h> |
|---|
| 1056 | | # include <stddef.h> |
|---|
| 1057 | | #else |
|---|
| 1058 | | # ifdef HAVE_STDLIB_H |
|---|
| 1059 | | # include <stdlib.h> |
|---|
| 1060 | | # endif |
|---|
| 1061 | | #endif |
|---|
| 1062 | | #ifdef HAVE_STRING_H |
|---|
| 1063 | | # if !defined STDC_HEADERS && defined HAVE_MEMORY_H |
|---|
| 1064 | | # include <memory.h> |
|---|
| 1065 | | # endif |
|---|
| 1066 | | # include <string.h> |
|---|
| 1067 | | #endif |
|---|
| 1068 | | #ifdef HAVE_STRINGS_H |
|---|
| 1069 | | # include <strings.h> |
|---|
| 1070 | | #endif |
|---|
| 1071 | | #ifdef HAVE_INTTYPES_H |
|---|
| 1072 | | # include <inttypes.h> |
|---|
| 1073 | | #endif |
|---|
| 1074 | | #ifdef HAVE_STDINT_H |
|---|
| 1075 | | # include <stdint.h> |
|---|
| 1076 | | #endif |
|---|
| 1077 | | #ifdef HAVE_UNISTD_H |
|---|
| 1078 | | # include <unistd.h> |
|---|
| 1079 | | #endif |
|---|
| 1080 | | #include <dl.h> |
|---|
| 1081 | configure:21518: result: no |
|---|
| 1082 | configure:21518: checking dl.h presence |
|---|
| 1083 | configure:21518: /usr/bin/clang -E -I/opt/local/include conftest.c |
|---|
| 1084 | conftest.c:44:10: fatal error: 'dl.h' file not found |
|---|
| 1085 | #include <dl.h> |
|---|
| 1086 | ^ |
|---|
| 1087 | 1 error generated. |
|---|
| 1088 | configure:21518: $? = 1 |
|---|
| 1089 | configure: failed program was: |
|---|
| 1090 | | /* confdefs.h */ |
|---|
| 1091 | | #define PACKAGE_NAME "R" |
|---|
| 1092 | | #define PACKAGE_TARNAME "R" |
|---|
| 1093 | | #define PACKAGE_VERSION "3.1.0" |
|---|
| 1094 | | #define PACKAGE_STRING "R 3.1.0" |
|---|
| 1095 | | #define PACKAGE_BUGREPORT "http://bugs.r-project.org" |
|---|
| 1096 | | #define PACKAGE_URL "http://www.r-project.org" |
|---|
| 1097 | | #define PACKAGE "R" |
|---|
| 1098 | | #define VERSION "3.1.0" |
|---|
| 1099 | | #define R_PLATFORM "x86_64-apple-darwin13.2.0" |
|---|
| 1100 | | #define R_CPU "x86_64" |
|---|
| 1101 | | #define R_VENDOR "apple" |
|---|
| 1102 | | #define R_OS "darwin13.2.0" |
|---|
| 1103 | | #define Unix 1 |
|---|
| 1104 | | #define R_ARCH "" |
|---|
| 1105 | | #define STDC_HEADERS 1 |
|---|
| 1106 | | #define HAVE_SYS_TYPES_H 1 |
|---|
| 1107 | | #define HAVE_SYS_STAT_H 1 |
|---|
| 1108 | | #define HAVE_STDLIB_H 1 |
|---|
| 1109 | | #define HAVE_STRING_H 1 |
|---|
| 1110 | | #define HAVE_MEMORY_H 1 |
|---|
| 1111 | | #define HAVE_STRINGS_H 1 |
|---|
| 1112 | | #define HAVE_INTTYPES_H 1 |
|---|
| 1113 | | #define HAVE_STDINT_H 1 |
|---|
| 1114 | | #define HAVE_UNISTD_H 1 |
|---|
| 1115 | | #define __EXTENSIONS__ 1 |
|---|
| 1116 | | #define _ALL_SOURCE 1 |
|---|
| 1117 | | #define _GNU_SOURCE 1 |
|---|
| 1118 | | #define _POSIX_PTHREAD_SEMANTICS 1 |
|---|
| 1119 | | #define _TANDEM_SOURCE 1 |
|---|
| 1120 | | #define HAVE_DLFCN_H 1 |
|---|
| 1121 | | #define LT_OBJDIR ".libs/" |
|---|
| 1122 | | #define HAVE_LIBM 1 |
|---|
| 1123 | | #define HAVE_READLINE_HISTORY_H 1 |
|---|
| 1124 | | #define HAVE_READLINE_READLINE_H 1 |
|---|
| 1125 | | #define HAVE_LIBREADLINE 1 |
|---|
| 1126 | | #define HAVE_HISTORY_TRUNCATE_FILE 1 |
|---|
| 1127 | | #define HAVE_RL_COMPLETION_MATCHES 1 |
|---|
| 1128 | | #define STDC_HEADERS 1 |
|---|
| 1129 | | #define HAVE_DIRENT_H 1 |
|---|
| 1130 | | #define HAVE_SYS_WAIT_H 1 |
|---|
| 1131 | | #define HAVE_ARPA_INET_H 1 |
|---|
| 1132 | | /* end confdefs.h. */ |
|---|
| 1133 | | #include <dl.h> |
|---|
| 1134 | configure:21518: result: no |
|---|
| 1135 | configure:21518: checking for dl.h |
|---|
| 1136 | configure:21518: result: no |
|---|
| 1137 | configure:21518: checking for dlfcn.h |
|---|
| 1138 | configure:21518: result: yes |
|---|
| 1139 | configure:21518: checking elf.h usability |
|---|
| 1140 | configure:21518: /usr/bin/clang -c -pipe -Os -flax-vector-conversions -arch x86_64 -I/opt/local/include conftest.c >&5 |
|---|
| 1141 | conftest.c:78:10: fatal error: 'elf.h' file not found |
|---|
| 1142 | #include <elf.h> |
|---|
| 1143 | ^ |
|---|
| 1144 | 1 error generated. |
|---|
| 1145 | configure:21518: $? = 1 |
|---|
| 1146 | configure: failed program was: |
|---|
| 1147 | | /* confdefs.h */ |
|---|
| 1148 | | #define PACKAGE_NAME "R" |
|---|
| 1149 | | #define PACKAGE_TARNAME "R" |
|---|
| 1150 | | #define PACKAGE_VERSION "3.1.0" |
|---|
| 1151 | | #define PACKAGE_STRING "R 3.1.0" |
|---|
| 1152 | | #define PACKAGE_BUGREPORT "http://bugs.r-project.org" |
|---|
| 1153 | | #define PACKAGE_URL "http://www.r-project.org" |
|---|
| 1154 | | #define PACKAGE "R" |
|---|
| 1155 | | #define VERSION "3.1.0" |
|---|
| 1156 | | #define R_PLATFORM "x86_64-apple-darwin13.2.0" |
|---|
| 1157 | | #define R_CPU "x86_64" |
|---|
| 1158 | | #define R_VENDOR "apple" |
|---|
| 1159 | | #define R_OS "darwin13.2.0" |
|---|
| 1160 | | #define Unix 1 |
|---|
| 1161 | | #define R_ARCH "" |
|---|
| 1162 | | #define STDC_HEADERS 1 |
|---|
| 1163 | | #define HAVE_SYS_TYPES_H 1 |
|---|
| 1164 | | #define HAVE_SYS_STAT_H 1 |
|---|
| 1165 | | #define HAVE_STDLIB_H 1 |
|---|
| 1166 | | #define HAVE_STRING_H 1 |
|---|
| 1167 | | #define HAVE_MEMORY_H 1 |
|---|
| 1168 | | #define HAVE_STRINGS_H 1 |
|---|
| 1169 | | #define HAVE_INTTYPES_H 1 |
|---|
| 1170 | | #define HAVE_STDINT_H 1 |
|---|
| 1171 | | #define HAVE_UNISTD_H 1 |
|---|
| 1172 | | #define __EXTENSIONS__ 1 |
|---|
| 1173 | | #define _ALL_SOURCE 1 |
|---|
| 1174 | | #define _GNU_SOURCE 1 |
|---|
| 1175 | | #define _POSIX_PTHREAD_SEMANTICS 1 |
|---|
| 1176 | | #define _TANDEM_SOURCE 1 |
|---|
| 1177 | | #define HAVE_DLFCN_H 1 |
|---|
| 1178 | | #define LT_OBJDIR ".libs/" |
|---|
| 1179 | | #define HAVE_LIBM 1 |
|---|
| 1180 | | #define HAVE_READLINE_HISTORY_H 1 |
|---|
| 1181 | | #define HAVE_READLINE_READLINE_H 1 |
|---|
| 1182 | | #define HAVE_LIBREADLINE 1 |
|---|
| 1183 | | #define HAVE_HISTORY_TRUNCATE_FILE 1 |
|---|
| 1184 | | #define HAVE_RL_COMPLETION_MATCHES 1 |
|---|
| 1185 | | #define STDC_HEADERS 1 |
|---|
| 1186 | | #define HAVE_DIRENT_H 1 |
|---|
| 1187 | | #define HAVE_SYS_WAIT_H 1 |
|---|
| 1188 | | #define HAVE_ARPA_INET_H 1 |
|---|
| 1189 | | #define HAVE_DLFCN_H 1 |
|---|
| 1190 | | /* end confdefs.h. */ |
|---|
| 1191 | | #include <stdio.h> |
|---|
| 1192 | | #ifdef HAVE_SYS_TYPES_H |
|---|
| 1193 | | # include <sys/types.h> |
|---|
| 1194 | | #endif |
|---|
| 1195 | | #ifdef HAVE_SYS_STAT_H |
|---|
| 1196 | | # include <sys/stat.h> |
|---|
| 1197 | | #endif |
|---|
| 1198 | | #ifdef STDC_HEADERS |
|---|
| 1199 | | # include <stdlib.h> |
|---|
| 1200 | | # include <stddef.h> |
|---|
| 1201 | | #else |
|---|
| 1202 | | # ifdef HAVE_STDLIB_H |
|---|
| 1203 | | # include <stdlib.h> |
|---|
| 1204 | | # endif |
|---|
| 1205 | | #endif |
|---|
| 1206 | | #ifdef HAVE_STRING_H |
|---|
| 1207 | | # if !defined STDC_HEADERS && defined HAVE_MEMORY_H |
|---|
| 1208 | | # include <memory.h> |
|---|
| 1209 | | # endif |
|---|
| 1210 | | # include <string.h> |
|---|
| 1211 | | #endif |
|---|
| 1212 | | #ifdef HAVE_STRINGS_H |
|---|
| 1213 | | # include <strings.h> |
|---|
| 1214 | | #endif |
|---|
| 1215 | | #ifdef HAVE_INTTYPES_H |
|---|
| 1216 | | # include <inttypes.h> |
|---|
| 1217 | | #endif |
|---|
| 1218 | | #ifdef HAVE_STDINT_H |
|---|
| 1219 | | # include <stdint.h> |
|---|
| 1220 | | #endif |
|---|
| 1221 | | #ifdef HAVE_UNISTD_H |
|---|
| 1222 | | # include <unistd.h> |
|---|
| 1223 | | #endif |
|---|
| 1224 | | #include <elf.h> |
|---|
| 1225 | configure:21518: result: no |
|---|
| 1226 | configure:21518: checking elf.h presence |
|---|
| 1227 | configure:21518: /usr/bin/clang -E -I/opt/local/include conftest.c |
|---|
| 1228 | conftest.c:45:10: fatal error: 'elf.h' file not found |
|---|
| 1229 | #include <elf.h> |
|---|
| 1230 | ^ |
|---|
| 1231 | 1 error generated. |
|---|
| 1232 | configure:21518: $? = 1 |
|---|
| 1233 | configure: failed program was: |
|---|
| 1234 | | /* confdefs.h */ |
|---|
| 1235 | | #define PACKAGE_NAME "R" |
|---|
| 1236 | | #define PACKAGE_TARNAME "R" |
|---|
| 1237 | | #define PACKAGE_VERSION "3.1.0" |
|---|
| 1238 | | #define PACKAGE_STRING "R 3.1.0" |
|---|
| 1239 | | #define PACKAGE_BUGREPORT "http://bugs.r-project.org" |
|---|
| 1240 | | #define PACKAGE_URL "http://www.r-project.org" |
|---|
| 1241 | | #define PACKAGE "R" |
|---|
| 1242 | | #define VERSION "3.1.0" |
|---|
| 1243 | | #define R_PLATFORM "x86_64-apple-darwin13.2.0" |
|---|
| 1244 | | #define R_CPU "x86_64" |
|---|
| 1245 | | #define R_VENDOR "apple" |
|---|
| 1246 | | #define R_OS "darwin13.2.0" |
|---|
| 1247 | | #define Unix 1 |
|---|
| 1248 | | #define R_ARCH "" |
|---|
| 1249 | | #define STDC_HEADERS 1 |
|---|
| 1250 | | #define HAVE_SYS_TYPES_H 1 |
|---|
| 1251 | | #define HAVE_SYS_STAT_H 1 |
|---|
| 1252 | | #define HAVE_STDLIB_H 1 |
|---|
| 1253 | | #define HAVE_STRING_H 1 |
|---|
| 1254 | | #define HAVE_MEMORY_H 1 |
|---|
| 1255 | | #define HAVE_STRINGS_H 1 |
|---|
| 1256 | | #define HAVE_INTTYPES_H 1 |
|---|
| 1257 | | #define HAVE_STDINT_H 1 |
|---|
| 1258 | | #define HAVE_UNISTD_H 1 |
|---|
| 1259 | | #define __EXTENSIONS__ 1 |
|---|
| 1260 | | #define _ALL_SOURCE 1 |
|---|
| 1261 | | #define _GNU_SOURCE 1 |
|---|
| 1262 | | #define _POSIX_PTHREAD_SEMANTICS 1 |
|---|
| 1263 | | #define _TANDEM_SOURCE 1 |
|---|
| 1264 | | #define HAVE_DLFCN_H 1 |
|---|
| 1265 | | #define LT_OBJDIR ".libs/" |
|---|
| 1266 | | #define HAVE_LIBM 1 |
|---|
| 1267 | | #define HAVE_READLINE_HISTORY_H 1 |
|---|
| 1268 | | #define HAVE_READLINE_READLINE_H 1 |
|---|
| 1269 | | #define HAVE_LIBREADLINE 1 |
|---|
| 1270 | | #define HAVE_HISTORY_TRUNCATE_FILE 1 |
|---|
| 1271 | | #define HAVE_RL_COMPLETION_MATCHES 1 |
|---|
| 1272 | | #define STDC_HEADERS 1 |
|---|
| 1273 | | #define HAVE_DIRENT_H 1 |
|---|
| 1274 | | #define HAVE_SYS_WAIT_H 1 |
|---|
| 1275 | | #define HAVE_ARPA_INET_H 1 |
|---|
| 1276 | | #define HAVE_DLFCN_H 1 |
|---|
| 1277 | | /* end confdefs.h. */ |
|---|
| 1278 | | #include <elf.h> |
|---|
| 1279 | configure:21518: result: no |
|---|
| 1280 | configure:21518: checking for elf.h |
|---|
| 1281 | configure:21518: result: no |
|---|
| 1282 | configure:21518: checking fcntl.h usability |
|---|
| 1283 | configure:21518: /usr/bin/clang -c -pipe -Os -flax-vector-conversions -arch x86_64 -I/opt/local/include conftest.c >&5 |
|---|
| 1284 | configure:21518: $? = 0 |
|---|
| 1285 | configure:21518: result: yes |
|---|
| 1286 | configure:21518: checking fcntl.h presence |
|---|
| 1287 | configure:21518: /usr/bin/clang -E -I/opt/local/include conftest.c |
|---|
| 1288 | configure:21518: $? = 0 |
|---|
| 1289 | configure:21518: result: yes |
|---|
| 1290 | configure:21518: checking for fcntl.h |
|---|
| 1291 | configure:21518: result: yes |
|---|
| 1292 | configure:21518: checking floatingpoint.h usability |
|---|
| 1293 | configure:21518: /usr/bin/clang -c -pipe -Os -flax-vector-conversions -arch x86_64 -I/opt/local/include conftest.c >&5 |
|---|
| 1294 | conftest.c:79:10: fatal error: 'floatingpoint.h' file not found |
|---|
| 1295 | #include <floatingpoint.h> |
|---|
| 1296 | ^ |
|---|
| 1297 | 1 error generated. |
|---|
| 1298 | configure:21518: $? = 1 |
|---|
| 1299 | configure: failed program was: |
|---|
| 1300 | | /* confdefs.h */ |
|---|
| 1301 | | #define PACKAGE_NAME "R" |
|---|
| 1302 | | #define PACKAGE_TARNAME "R" |
|---|
| 1303 | | #define PACKAGE_VERSION "3.1.0" |
|---|
| 1304 | | #define PACKAGE_STRING "R 3.1.0" |
|---|
| 1305 | | #define PACKAGE_BUGREPORT "http://bugs.r-project.org" |
|---|
| 1306 | | #define PACKAGE_URL "http://www.r-project.org" |
|---|
| 1307 | | #define PACKAGE "R" |
|---|
| 1308 | | #define VERSION "3.1.0" |
|---|
| 1309 | | #define R_PLATFORM "x86_64-apple-darwin13.2.0" |
|---|
| 1310 | | #define R_CPU "x86_64" |
|---|
| 1311 | | #define R_VENDOR "apple" |
|---|
| 1312 | | #define R_OS "darwin13.2.0" |
|---|
| 1313 | | #define Unix 1 |
|---|
| 1314 | | #define R_ARCH "" |
|---|
| 1315 | | #define STDC_HEADERS 1 |
|---|
| 1316 | | #define HAVE_SYS_TYPES_H 1 |
|---|
| 1317 | | #define HAVE_SYS_STAT_H 1 |
|---|
| 1318 | | #define HAVE_STDLIB_H 1 |
|---|
| 1319 | | #define HAVE_STRING_H 1 |
|---|
| 1320 | | #define HAVE_MEMORY_H 1 |
|---|
| 1321 | | #define HAVE_STRINGS_H 1 |
|---|
| 1322 | | #define HAVE_INTTYPES_H 1 |
|---|
| 1323 | | #define HAVE_STDINT_H 1 |
|---|
| 1324 | | #define HAVE_UNISTD_H 1 |
|---|
| 1325 | | #define __EXTENSIONS__ 1 |
|---|
| 1326 | | #define _ALL_SOURCE 1 |
|---|
| 1327 | | #define _GNU_SOURCE 1 |
|---|
| 1328 | | #define _POSIX_PTHREAD_SEMANTICS 1 |
|---|
| 1329 | | #define _TANDEM_SOURCE 1 |
|---|
| 1330 | | #define HAVE_DLFCN_H 1 |
|---|
| 1331 | | #define LT_OBJDIR ".libs/" |
|---|
| 1332 | | #define HAVE_LIBM 1 |
|---|
| 1333 | | #define HAVE_READLINE_HISTORY_H 1 |
|---|
| 1334 | | #define HAVE_READLINE_READLINE_H 1 |
|---|
| 1335 | | #define HAVE_LIBREADLINE 1 |
|---|
| 1336 | | #define HAVE_HISTORY_TRUNCATE_FILE 1 |
|---|
| 1337 | | #define HAVE_RL_COMPLETION_MATCHES 1 |
|---|
| 1338 | | #define STDC_HEADERS 1 |
|---|
| 1339 | | #define HAVE_DIRENT_H 1 |
|---|
| 1340 | | #define HAVE_SYS_WAIT_H 1 |
|---|
| 1341 | | #define HAVE_ARPA_INET_H 1 |
|---|
| 1342 | | #define HAVE_DLFCN_H 1 |
|---|
| 1343 | | #define HAVE_FCNTL_H 1 |
|---|
| 1344 | | /* end confdefs.h. */ |
|---|
| 1345 | | #include <stdio.h> |
|---|
| 1346 | | #ifdef HAVE_SYS_TYPES_H |
|---|
| 1347 | | # include <sys/types.h> |
|---|
| 1348 | | #endif |
|---|
| 1349 | | #ifdef HAVE_SYS_STAT_H |
|---|
| 1350 | | # include <sys/stat.h> |
|---|
| 1351 | | #endif |
|---|
| 1352 | | #ifdef STDC_HEADERS |
|---|
| 1353 | | # include <stdlib.h> |
|---|
| 1354 | | # include <stddef.h> |
|---|
| 1355 | | #else |
|---|
| 1356 | | # ifdef HAVE_STDLIB_H |
|---|
| 1357 | | # include <stdlib.h> |
|---|
| 1358 | | # endif |
|---|
| 1359 | | #endif |
|---|
| 1360 | | #ifdef HAVE_STRING_H |
|---|
| 1361 | | # if !defined STDC_HEADERS && defined HAVE_MEMORY_H |
|---|
| 1362 | | # include <memory.h> |
|---|
| 1363 | | # endif |
|---|
| 1364 | | # include <string.h> |
|---|
| 1365 | | #endif |
|---|
| 1366 | | #ifdef HAVE_STRINGS_H |
|---|
| 1367 | | # include <strings.h> |
|---|
| 1368 | | #endif |
|---|
| 1369 | | #ifdef HAVE_INTTYPES_H |
|---|
| 1370 | | # include <inttypes.h> |
|---|
| 1371 | | #endif |
|---|
| 1372 | | #ifdef HAVE_STDINT_H |
|---|
| 1373 | | # include <stdint.h> |
|---|
| 1374 | | #endif |
|---|
| 1375 | | #ifdef HAVE_UNISTD_H |
|---|
| 1376 | | # include <unistd.h> |
|---|
| 1377 | | #endif |
|---|
| 1378 | | #include <floatingpoint.h> |
|---|
| 1379 | configure:21518: result: no |
|---|
| 1380 | configure:21518: checking floatingpoint.h presence |
|---|
| 1381 | configure:21518: /usr/bin/clang -E -I/opt/local/include conftest.c |
|---|
| 1382 | conftest.c:46:10: fatal error: 'floatingpoint.h' file not found |
|---|
| 1383 | #include <floatingpoint.h> |
|---|
| 1384 | ^ |
|---|
| 1385 | 1 error generated. |
|---|
| 1386 | configure:21518: $? = 1 |
|---|
| 1387 | configure: failed program was: |
|---|
| 1388 | | /* confdefs.h */ |
|---|
| 1389 | | #define PACKAGE_NAME "R" |
|---|
| 1390 | | #define PACKAGE_TARNAME "R" |
|---|
| 1391 | | #define PACKAGE_VERSION "3.1.0" |
|---|
| 1392 | | #define PACKAGE_STRING "R 3.1.0" |
|---|
| 1393 | | #define PACKAGE_BUGREPORT "http://bugs.r-project.org" |
|---|
| 1394 | | #define PACKAGE_URL "http://www.r-project.org" |
|---|
| 1395 | | #define PACKAGE "R" |
|---|
| 1396 | | #define VERSION "3.1.0" |
|---|
| 1397 | | #define R_PLATFORM "x86_64-apple-darwin13.2.0" |
|---|
| 1398 | | #define R_CPU "x86_64" |
|---|
| 1399 | | #define R_VENDOR "apple" |
|---|
| 1400 | | #define R_OS "darwin13.2.0" |
|---|
| 1401 | | #define Unix 1 |
|---|
| 1402 | | #define R_ARCH "" |
|---|
| 1403 | | #define STDC_HEADERS 1 |
|---|
| 1404 | | #define HAVE_SYS_TYPES_H 1 |
|---|
| 1405 | | #define HAVE_SYS_STAT_H 1 |
|---|
| 1406 | | #define HAVE_STDLIB_H 1 |
|---|
| 1407 | | #define HAVE_STRING_H 1 |
|---|
| 1408 | | #define HAVE_MEMORY_H 1 |
|---|
| 1409 | | #define HAVE_STRINGS_H 1 |
|---|
| 1410 | | #define HAVE_INTTYPES_H 1 |
|---|
| 1411 | | #define HAVE_STDINT_H 1 |
|---|
| 1412 | | #define HAVE_UNISTD_H 1 |
|---|
| 1413 | | #define __EXTENSIONS__ 1 |
|---|
| 1414 | | #define _ALL_SOURCE 1 |
|---|
| 1415 | | #define _GNU_SOURCE 1 |
|---|
| 1416 | | #define _POSIX_PTHREAD_SEMANTICS 1 |
|---|
| 1417 | | #define _TANDEM_SOURCE 1 |
|---|
| 1418 | | #define HAVE_DLFCN_H 1 |
|---|
| 1419 | | #define LT_OBJDIR ".libs/" |
|---|
| 1420 | | #define HAVE_LIBM 1 |
|---|
| 1421 | | #define HAVE_READLINE_HISTORY_H 1 |
|---|
| 1422 | | #define HAVE_READLINE_READLINE_H 1 |
|---|
| 1423 | | #define HAVE_LIBREADLINE 1 |
|---|
| 1424 | | #define HAVE_HISTORY_TRUNCATE_FILE 1 |
|---|
| 1425 | | #define HAVE_RL_COMPLETION_MATCHES 1 |
|---|
| 1426 | | #define STDC_HEADERS 1 |
|---|
| 1427 | | #define HAVE_DIRENT_H 1 |
|---|
| 1428 | | #define HAVE_SYS_WAIT_H 1 |
|---|
| 1429 | | #define HAVE_ARPA_INET_H 1 |
|---|
| 1430 | | #define HAVE_DLFCN_H 1 |
|---|
| 1431 | | #define HAVE_FCNTL_H 1 |
|---|
| 1432 | | /* end confdefs.h. */ |
|---|
| 1433 | | #include <floatingpoint.h> |
|---|
| 1434 | configure:21518: result: no |
|---|
| 1435 | configure:21518: checking for floatingpoint.h |
|---|
| 1436 | configure:21518: result: no |
|---|
| 1437 | configure:21518: checking fpu_control.h usability |
|---|
| 1438 | configure:21518: /usr/bin/clang -c -pipe -Os -flax-vector-conversions -arch x86_64 -I/opt/local/include conftest.c >&5 |
|---|
| 1439 | conftest.c:79:10: fatal error: 'fpu_control.h' file not found |
|---|
| 1440 | #include <fpu_control.h> |
|---|
| 1441 | ^ |
|---|
| 1442 | 1 error generated. |
|---|
| 1443 | configure:21518: $? = 1 |
|---|
| 1444 | configure: failed program was: |
|---|
| 1445 | | /* confdefs.h */ |
|---|
| 1446 | | #define PACKAGE_NAME "R" |
|---|
| 1447 | | #define PACKAGE_TARNAME "R" |
|---|
| 1448 | | #define PACKAGE_VERSION "3.1.0" |
|---|
| 1449 | | #define PACKAGE_STRING "R 3.1.0" |
|---|
| 1450 | | #define PACKAGE_BUGREPORT "http://bugs.r-project.org" |
|---|
| 1451 | | #define PACKAGE_URL "http://www.r-project.org" |
|---|
| 1452 | | #define PACKAGE "R" |
|---|
| 1453 | | #define VERSION "3.1.0" |
|---|
| 1454 | | #define R_PLATFORM "x86_64-apple-darwin13.2.0" |
|---|
| 1455 | | #define R_CPU "x86_64" |
|---|
| 1456 | | #define R_VENDOR "apple" |
|---|
| 1457 | | #define R_OS "darwin13.2.0" |
|---|
| 1458 | | #define Unix 1 |
|---|
| 1459 | | #define R_ARCH "" |
|---|
| 1460 | | #define STDC_HEADERS 1 |
|---|
| 1461 | | #define HAVE_SYS_TYPES_H 1 |
|---|
| 1462 | | #define HAVE_SYS_STAT_H 1 |
|---|
| 1463 | | #define HAVE_STDLIB_H 1 |
|---|
| 1464 | | #define HAVE_STRING_H 1 |
|---|
| 1465 | | #define HAVE_MEMORY_H 1 |
|---|
| 1466 | | #define HAVE_STRINGS_H 1 |
|---|
| 1467 | | #define HAVE_INTTYPES_H 1 |
|---|
| 1468 | | #define HAVE_STDINT_H 1 |
|---|
| 1469 | | #define HAVE_UNISTD_H 1 |
|---|
| 1470 | | #define __EXTENSIONS__ 1 |
|---|
| 1471 | | #define _ALL_SOURCE 1 |
|---|
| 1472 | | #define _GNU_SOURCE 1 |
|---|
| 1473 | | #define _POSIX_PTHREAD_SEMANTICS 1 |
|---|
| 1474 | | #define _TANDEM_SOURCE 1 |
|---|
| 1475 | | #define HAVE_DLFCN_H 1 |
|---|
| 1476 | | #define LT_OBJDIR ".libs/" |
|---|
| 1477 | | #define HAVE_LIBM 1 |
|---|
| 1478 | | #define HAVE_READLINE_HISTORY_H 1 |
|---|
| 1479 | | #define HAVE_READLINE_READLINE_H 1 |
|---|
| 1480 | | #define HAVE_LIBREADLINE 1 |
|---|
| 1481 | | #define HAVE_HISTORY_TRUNCATE_FILE 1 |
|---|
| 1482 | | #define HAVE_RL_COMPLETION_MATCHES 1 |
|---|
| 1483 | | #define STDC_HEADERS 1 |
|---|
| 1484 | | #define HAVE_DIRENT_H 1 |
|---|
| 1485 | | #define HAVE_SYS_WAIT_H 1 |
|---|
| 1486 | | #define HAVE_ARPA_INET_H 1 |
|---|
| 1487 | | #define HAVE_DLFCN_H 1 |
|---|
| 1488 | | #define HAVE_FCNTL_H 1 |
|---|
| 1489 | | /* end confdefs.h. */ |
|---|
| 1490 | | #include <stdio.h> |
|---|
| 1491 | | #ifdef HAVE_SYS_TYPES_H |
|---|
| 1492 | | # include <sys/types.h> |
|---|
| 1493 | | #endif |
|---|
| 1494 | | #ifdef HAVE_SYS_STAT_H |
|---|
| 1495 | | # include <sys/stat.h> |
|---|
| 1496 | | #endif |
|---|
| 1497 | | #ifdef STDC_HEADERS |
|---|
| 1498 | | # include <stdlib.h> |
|---|
| 1499 | | # include <stddef.h> |
|---|
| 1500 | | #else |
|---|
| 1501 | | # ifdef HAVE_STDLIB_H |
|---|
| 1502 | | # include <stdlib.h> |
|---|
| 1503 | | # endif |
|---|
| 1504 | | #endif |
|---|
| 1505 | | #ifdef HAVE_STRING_H |
|---|
| 1506 | | # if !defined STDC_HEADERS && defined HAVE_MEMORY_H |
|---|
| 1507 | | # include <memory.h> |
|---|
| 1508 | | # endif |
|---|
| 1509 | | # include <string.h> |
|---|
| 1510 | | #endif |
|---|
| 1511 | | #ifdef HAVE_STRINGS_H |
|---|
| 1512 | | # include <strings.h> |
|---|
| 1513 | | #endif |
|---|
| 1514 | | #ifdef HAVE_INTTYPES_H |
|---|
| 1515 | | # include <inttypes.h> |
|---|
| 1516 | | #endif |
|---|
| 1517 | | #ifdef HAVE_STDINT_H |
|---|
| 1518 | | # include <stdint.h> |
|---|
| 1519 | | #endif |
|---|
| 1520 | | #ifdef HAVE_UNISTD_H |
|---|
| 1521 | | # include <unistd.h> |
|---|
| 1522 | | #endif |
|---|
| 1523 | | #include <fpu_control.h> |
|---|
| 1524 | configure:21518: result: no |
|---|
| 1525 | configure:21518: checking fpu_control.h presence |
|---|
| 1526 | configure:21518: /usr/bin/clang -E -I/opt/local/include conftest.c |
|---|
| 1527 | conftest.c:46:10: fatal error: 'fpu_control.h' file not found |
|---|
| 1528 | #include <fpu_control.h> |
|---|
| 1529 | ^ |
|---|
| 1530 | 1 error generated. |
|---|
| 1531 | configure:21518: $? = 1 |
|---|
| 1532 | configure: failed program was: |
|---|
| 1533 | | /* confdefs.h */ |
|---|
| 1534 | | #define PACKAGE_NAME "R" |
|---|
| 1535 | | #define PACKAGE_TARNAME "R" |
|---|
| 1536 | | #define PACKAGE_VERSION "3.1.0" |
|---|
| 1537 | | #define PACKAGE_STRING "R 3.1.0" |
|---|
| 1538 | | #define PACKAGE_BUGREPORT "http://bugs.r-project.org" |
|---|
| 1539 | | #define PACKAGE_URL "http://www.r-project.org" |
|---|
| 1540 | | #define PACKAGE "R" |
|---|
| 1541 | | #define VERSION "3.1.0" |
|---|
| 1542 | | #define R_PLATFORM "x86_64-apple-darwin13.2.0" |
|---|
| 1543 | | #define R_CPU "x86_64" |
|---|
| 1544 | | #define R_VENDOR "apple" |
|---|
| 1545 | | #define R_OS "darwin13.2.0" |
|---|
| 1546 | | #define Unix 1 |
|---|
| 1547 | | #define R_ARCH "" |
|---|
| 1548 | | #define STDC_HEADERS 1 |
|---|
| 1549 | | #define HAVE_SYS_TYPES_H 1 |
|---|
| 1550 | | #define HAVE_SYS_STAT_H 1 |
|---|
| 1551 | | #define HAVE_STDLIB_H 1 |
|---|
| 1552 | | #define HAVE_STRING_H 1 |
|---|
| 1553 | | #define HAVE_MEMORY_H 1 |
|---|
| 1554 | | #define HAVE_STRINGS_H 1 |
|---|
| 1555 | | #define HAVE_INTTYPES_H 1 |
|---|
| 1556 | | #define HAVE_STDINT_H 1 |
|---|
| 1557 | | #define HAVE_UNISTD_H 1 |
|---|
| 1558 | | #define __EXTENSIONS__ 1 |
|---|
| 1559 | | #define _ALL_SOURCE 1 |
|---|
| 1560 | | #define _GNU_SOURCE 1 |
|---|
| 1561 | | #define _POSIX_PTHREAD_SEMANTICS 1 |
|---|
| 1562 | | #define _TANDEM_SOURCE 1 |
|---|
| 1563 | | #define HAVE_DLFCN_H 1 |
|---|
| 1564 | | #define LT_OBJDIR ".libs/" |
|---|
| 1565 | | #define HAVE_LIBM 1 |
|---|
| 1566 | | #define HAVE_READLINE_HISTORY_H 1 |
|---|
| 1567 | | #define HAVE_READLINE_READLINE_H 1 |
|---|
| 1568 | | #define HAVE_LIBREADLINE 1 |
|---|
| 1569 | | #define HAVE_HISTORY_TRUNCATE_FILE 1 |
|---|
| 1570 | | #define HAVE_RL_COMPLETION_MATCHES 1 |
|---|
| 1571 | | #define STDC_HEADERS 1 |
|---|
| 1572 | | #define HAVE_DIRENT_H 1 |
|---|
| 1573 | | #define HAVE_SYS_WAIT_H 1 |
|---|
| 1574 | | #define HAVE_ARPA_INET_H 1 |
|---|
| 1575 | | #define HAVE_DLFCN_H 1 |
|---|
| 1576 | | #define HAVE_FCNTL_H 1 |
|---|
| 1577 | | /* end confdefs.h. */ |
|---|
| 1578 | | #include <fpu_control.h> |
|---|
| 1579 | configure:21518: result: no |
|---|
| 1580 | configure:21518: checking for fpu_control.h |
|---|
| 1581 | configure:21518: result: no |
|---|
| 1582 | configure:21518: checking glob.h usability |
|---|
| 1583 | configure:21518: /usr/bin/clang -c -pipe -Os -flax-vector-conversions -arch x86_64 -I/opt/local/include conftest.c >&5 |
|---|
| 1584 | configure:21518: $? = 0 |
|---|
| 1585 | configure:21518: result: yes |
|---|
| 1586 | configure:21518: checking glob.h presence |
|---|
| 1587 | configure:21518: /usr/bin/clang -E -I/opt/local/include conftest.c |
|---|
| 1588 | configure:21518: $? = 0 |
|---|
| 1589 | configure:21518: result: yes |
|---|
| 1590 | configure:21518: checking for glob.h |
|---|
| 1591 | configure:21518: result: yes |
|---|
| 1592 | configure:21518: checking grp.h usability |
|---|
| 1593 | configure:21518: /usr/bin/clang -c -pipe -Os -flax-vector-conversions -arch x86_64 -I/opt/local/include conftest.c >&5 |
|---|
| 1594 | configure:21518: $? = 0 |
|---|
| 1595 | configure:21518: result: yes |
|---|
| 1596 | configure:21518: checking grp.h presence |
|---|
| 1597 | configure:21518: /usr/bin/clang -E -I/opt/local/include conftest.c |
|---|
| 1598 | configure:21518: $? = 0 |
|---|
| 1599 | configure:21518: result: yes |
|---|
| 1600 | configure:21518: checking for grp.h |
|---|
| 1601 | configure:21518: result: yes |
|---|
| 1602 | configure:21518: checking langinfo.h usability |
|---|
| 1603 | configure:21518: /usr/bin/clang -c -pipe -Os -flax-vector-conversions -arch x86_64 -I/opt/local/include conftest.c >&5 |
|---|
| 1604 | configure:21518: $? = 0 |
|---|
| 1605 | configure:21518: result: yes |
|---|
| 1606 | configure:21518: checking langinfo.h presence |
|---|
| 1607 | configure:21518: /usr/bin/clang -E -I/opt/local/include conftest.c |
|---|
| 1608 | configure:21518: $? = 0 |
|---|
| 1609 | configure:21518: result: yes |
|---|
| 1610 | configure:21518: checking for langinfo.h |
|---|
| 1611 | configure:21518: result: yes |
|---|
| 1612 | configure:21518: checking netdb.h usability |
|---|
| 1613 | configure:21518: /usr/bin/clang -c -pipe -Os -flax-vector-conversions -arch x86_64 -I/opt/local/include conftest.c >&5 |
|---|
| 1614 | configure:21518: $? = 0 |
|---|
| 1615 | configure:21518: result: yes |
|---|
| 1616 | configure:21518: checking netdb.h presence |
|---|
| 1617 | configure:21518: /usr/bin/clang -E -I/opt/local/include conftest.c |
|---|
| 1618 | configure:21518: $? = 0 |
|---|
| 1619 | configure:21518: result: yes |
|---|
| 1620 | configure:21518: checking for netdb.h |
|---|
| 1621 | configure:21518: result: yes |
|---|
| 1622 | configure:21518: checking netinet/in.h usability |
|---|
| 1623 | configure:21518: /usr/bin/clang -c -pipe -Os -flax-vector-conversions -arch x86_64 -I/opt/local/include conftest.c >&5 |
|---|
| 1624 | configure:21518: $? = 0 |
|---|
| 1625 | configure:21518: result: yes |
|---|
| 1626 | configure:21518: checking netinet/in.h presence |
|---|
| 1627 | configure:21518: /usr/bin/clang -E -I/opt/local/include conftest.c |
|---|
| 1628 | configure:21518: $? = 0 |
|---|
| 1629 | configure:21518: result: yes |
|---|
| 1630 | configure:21518: checking for netinet/in.h |
|---|
| 1631 | configure:21518: result: yes |
|---|
| 1632 | configure:21518: checking pwd.h usability |
|---|
| 1633 | configure:21518: /usr/bin/clang -c -pipe -Os -flax-vector-conversions -arch x86_64 -I/opt/local/include conftest.c >&5 |
|---|
| 1634 | configure:21518: $? = 0 |
|---|
| 1635 | configure:21518: result: yes |
|---|
| 1636 | configure:21518: checking pwd.h presence |
|---|
| 1637 | configure:21518: /usr/bin/clang -E -I/opt/local/include conftest.c |
|---|
| 1638 | configure:21518: $? = 0 |
|---|
| 1639 | configure:21518: result: yes |
|---|
| 1640 | configure:21518: checking for pwd.h |
|---|
| 1641 | configure:21518: result: yes |
|---|
| 1642 | configure:21518: checking sched.h usability |
|---|
| 1643 | configure:21518: /usr/bin/clang -c -pipe -Os -flax-vector-conversions -arch x86_64 -I/opt/local/include conftest.c >&5 |
|---|
| 1644 | configure:21518: $? = 0 |
|---|
| 1645 | configure:21518: result: yes |
|---|
| 1646 | configure:21518: checking sched.h presence |
|---|
| 1647 | configure:21518: /usr/bin/clang -E -I/opt/local/include conftest.c |
|---|
| 1648 | configure:21518: $? = 0 |
|---|
| 1649 | configure:21518: result: yes |
|---|
| 1650 | configure:21518: checking for sched.h |
|---|
| 1651 | configure:21518: result: yes |
|---|
| 1652 | configure:21518: checking for strings.h |
|---|
| 1653 | configure:21518: result: yes |
|---|
| 1654 | configure:21518: checking sys/param.h usability |
|---|
| 1655 | configure:21518: /usr/bin/clang -c -pipe -Os -flax-vector-conversions -arch x86_64 -I/opt/local/include conftest.c >&5 |
|---|
| 1656 | configure:21518: $? = 0 |
|---|
| 1657 | configure:21518: result: yes |
|---|
| 1658 | configure:21518: checking sys/param.h presence |
|---|
| 1659 | configure:21518: /usr/bin/clang -E -I/opt/local/include conftest.c |
|---|
| 1660 | configure:21518: $? = 0 |
|---|
| 1661 | configure:21518: result: yes |
|---|
| 1662 | configure:21518: checking for sys/param.h |
|---|
| 1663 | configure:21518: result: yes |
|---|
| 1664 | configure:21518: checking sys/resource.h usability |
|---|
| 1665 | configure:21518: /usr/bin/clang -c -pipe -Os -flax-vector-conversions -arch x86_64 -I/opt/local/include conftest.c >&5 |
|---|
| 1666 | configure:21518: $? = 0 |
|---|
| 1667 | configure:21518: result: yes |
|---|
| 1668 | configure:21518: checking sys/resource.h presence |
|---|
| 1669 | configure:21518: /usr/bin/clang -E -I/opt/local/include conftest.c |
|---|
| 1670 | configure:21518: $? = 0 |
|---|
| 1671 | configure:21518: result: yes |
|---|
| 1672 | configure:21518: checking for sys/resource.h |
|---|
| 1673 | configure:21518: result: yes |
|---|
| 1674 | configure:21518: checking sys/select.h usability |
|---|
| 1675 | configure:21518: /usr/bin/clang -c -pipe -Os -flax-vector-conversions -arch x86_64 -I/opt/local/include conftest.c >&5 |
|---|
| 1676 | configure:21518: $? = 0 |
|---|
| 1677 | configure:21518: result: yes |
|---|
| 1678 | configure:21518: checking sys/select.h presence |
|---|
| 1679 | configure:21518: /usr/bin/clang -E -I/opt/local/include conftest.c |
|---|
| 1680 | configure:21518: $? = 0 |
|---|
| 1681 | configure:21518: result: yes |
|---|
| 1682 | configure:21518: checking for sys/select.h |
|---|
| 1683 | configure:21518: result: yes |
|---|
| 1684 | configure:21518: checking sys/socket.h usability |
|---|
| 1685 | configure:21518: /usr/bin/clang -c -pipe -Os -flax-vector-conversions -arch x86_64 -I/opt/local/include conftest.c >&5 |
|---|
| 1686 | configure:21518: $? = 0 |
|---|
| 1687 | configure:21518: result: yes |
|---|
| 1688 | configure:21518: checking sys/socket.h presence |
|---|
| 1689 | configure:21518: /usr/bin/clang -E -I/opt/local/include conftest.c |
|---|
| 1690 | configure:21518: $? = 0 |
|---|
| 1691 | configure:21518: result: yes |
|---|
| 1692 | configure:21518: checking for sys/socket.h |
|---|
| 1693 | configure:21518: result: yes |
|---|
| 1694 | configure:21518: checking for sys/stat.h |
|---|
| 1695 | configure:21518: result: yes |
|---|
| 1696 | configure:21518: checking sys/time.h usability |
|---|
| 1697 | configure:21518: /usr/bin/clang -c -pipe -Os -flax-vector-conversions -arch x86_64 -I/opt/local/include conftest.c >&5 |
|---|
| 1698 | configure:21518: $? = 0 |
|---|
| 1699 | configure:21518: result: yes |
|---|
| 1700 | configure:21518: checking sys/time.h presence |
|---|
| 1701 | configure:21518: /usr/bin/clang -E -I/opt/local/include conftest.c |
|---|
| 1702 | configure:21518: $? = 0 |
|---|
| 1703 | configure:21518: result: yes |
|---|
| 1704 | configure:21518: checking for sys/time.h |
|---|
| 1705 | configure:21518: result: yes |
|---|
| 1706 | configure:21518: checking sys/times.h usability |
|---|
| 1707 | configure:21518: /usr/bin/clang -c -pipe -Os -flax-vector-conversions -arch x86_64 -I/opt/local/include conftest.c >&5 |
|---|
| 1708 | configure:21518: $? = 0 |
|---|
| 1709 | configure:21518: result: yes |
|---|
| 1710 | configure:21518: checking sys/times.h presence |
|---|
| 1711 | configure:21518: /usr/bin/clang -E -I/opt/local/include conftest.c |
|---|
| 1712 | configure:21518: $? = 0 |
|---|
| 1713 | configure:21518: result: yes |
|---|
| 1714 | configure:21518: checking for sys/times.h |
|---|
| 1715 | configure:21518: result: yes |
|---|
| 1716 | configure:21518: checking sys/utsname.h usability |
|---|
| 1717 | configure:21518: /usr/bin/clang -c -pipe -Os -flax-vector-conversions -arch x86_64 -I/opt/local/include conftest.c >&5 |
|---|
| 1718 | configure:21518: $? = 0 |
|---|
| 1719 | configure:21518: result: yes |
|---|
| 1720 | configure:21518: checking sys/utsname.h presence |
|---|
| 1721 | configure:21518: /usr/bin/clang -E -I/opt/local/include conftest.c |
|---|
| 1722 | configure:21518: $? = 0 |
|---|
| 1723 | configure:21518: result: yes |
|---|
| 1724 | configure:21518: checking for sys/utsname.h |
|---|
| 1725 | configure:21518: result: yes |
|---|
| 1726 | configure:21518: checking for unistd.h |
|---|
| 1727 | configure:21518: result: yes |
|---|
| 1728 | configure:21518: checking utime.h usability |
|---|
| 1729 | configure:21518: /usr/bin/clang -c -pipe -Os -flax-vector-conversions -arch x86_64 -I/opt/local/include conftest.c >&5 |
|---|
| 1730 | configure:21518: $? = 0 |
|---|
| 1731 | configure:21518: result: yes |
|---|
| 1732 | configure:21518: checking utime.h presence |
|---|
| 1733 | configure:21518: /usr/bin/clang -E -I/opt/local/include conftest.c |
|---|
| 1734 | configure:21518: $? = 0 |
|---|
| 1735 | configure:21518: result: yes |
|---|
| 1736 | configure:21518: checking for utime.h |
|---|
| 1737 | configure:21518: result: yes |
|---|
| 1738 | configure:21536: checking errno.h usability |
|---|
| 1739 | configure:21536: /usr/bin/clang -c -pipe -Os -flax-vector-conversions -arch x86_64 -I/opt/local/include conftest.c >&5 |
|---|
| 1740 | configure:21536: $? = 0 |
|---|
| 1741 | configure:21536: result: yes |
|---|
| 1742 | configure:21536: checking errno.h presence |
|---|
| 1743 | configure:21536: /usr/bin/clang -E -I/opt/local/include conftest.c |
|---|
| 1744 | configure:21536: $? = 0 |
|---|
| 1745 | configure:21536: result: yes |
|---|
| 1746 | configure:21536: checking for errno.h |
|---|
| 1747 | configure:21536: result: yes |
|---|
| 1748 | configure:21536: checking for inttypes.h |
|---|
| 1749 | configure:21536: result: yes |
|---|
| 1750 | configure:21536: checking limits.h usability |
|---|
| 1751 | configure:21536: /usr/bin/clang -c -pipe -Os -flax-vector-conversions -arch x86_64 -I/opt/local/include conftest.c >&5 |
|---|
| 1752 | configure:21536: $? = 0 |
|---|
| 1753 | configure:21536: result: yes |
|---|
| 1754 | configure:21536: checking limits.h presence |
|---|
| 1755 | configure:21536: /usr/bin/clang -E -I/opt/local/include conftest.c |
|---|
| 1756 | configure:21536: $? = 0 |
|---|
| 1757 | configure:21536: result: yes |
|---|
| 1758 | configure:21536: checking for limits.h |
|---|
| 1759 | configure:21536: result: yes |
|---|
| 1760 | configure:21536: checking locale.h usability |
|---|
| 1761 | configure:21536: /usr/bin/clang -c -pipe -Os -flax-vector-conversions -arch x86_64 -I/opt/local/include conftest.c >&5 |
|---|
| 1762 | configure:21536: $? = 0 |
|---|
| 1763 | configure:21536: result: yes |
|---|
| 1764 | configure:21536: checking locale.h presence |
|---|
| 1765 | configure:21536: /usr/bin/clang -E -I/opt/local/include conftest.c |
|---|
| 1766 | configure:21536: $? = 0 |
|---|
| 1767 | configure:21536: result: yes |
|---|
| 1768 | configure:21536: checking for locale.h |
|---|
| 1769 | configure:21536: result: yes |
|---|
| 1770 | configure:21536: checking stdarg.h usability |
|---|
| 1771 | configure:21536: /usr/bin/clang -c -pipe -Os -flax-vector-conversions -arch x86_64 -I/opt/local/include conftest.c >&5 |
|---|
| 1772 | configure:21536: $? = 0 |
|---|
| 1773 | configure:21536: result: yes |
|---|
| 1774 | configure:21536: checking stdarg.h presence |
|---|
| 1775 | configure:21536: /usr/bin/clang -E -I/opt/local/include conftest.c |
|---|
| 1776 | configure:21536: $? = 0 |
|---|
| 1777 | configure:21536: result: yes |
|---|
| 1778 | configure:21536: checking for stdarg.h |
|---|
| 1779 | configure:21536: result: yes |
|---|
| 1780 | configure:21536: checking stdbool.h usability |
|---|
| 1781 | configure:21536: /usr/bin/clang -c -pipe -Os -flax-vector-conversions -arch x86_64 -I/opt/local/include conftest.c >&5 |
|---|
| 1782 | configure:21536: $? = 0 |
|---|
| 1783 | configure:21536: result: yes |
|---|
| 1784 | configure:21536: checking stdbool.h presence |
|---|
| 1785 | configure:21536: /usr/bin/clang -E -I/opt/local/include conftest.c |
|---|
| 1786 | configure:21536: $? = 0 |
|---|
| 1787 | configure:21536: result: yes |
|---|
| 1788 | configure:21536: checking for stdbool.h |
|---|
| 1789 | configure:21536: result: yes |
|---|
| 1790 | configure:21536: checking for stdint.h |
|---|
| 1791 | configure:21536: result: yes |
|---|
| 1792 | configure:21536: checking for string.h |
|---|
| 1793 | configure:21536: result: yes |
|---|
| 1794 | configure:21549: checking whether setjmp.h is POSIX.1 compatible |
|---|
| 1795 | configure:21567: /usr/bin/clang -c -pipe -Os -flax-vector-conversions -arch x86_64 -I/opt/local/include conftest.c >&5 |
|---|
| 1796 | configure:21567: $? = 0 |
|---|
| 1797 | configure:21574: result: yes |
|---|
| 1798 | configure:21576: checking whether sigsetjmp is declared |
|---|
| 1799 | configure:21576: /usr/bin/clang -c -pipe -Os -flax-vector-conversions -arch x86_64 -I/opt/local/include conftest.c >&5 |
|---|
| 1800 | configure:21576: $? = 0 |
|---|
| 1801 | configure:21576: result: yes |
|---|
| 1802 | configure:21587: checking whether siglongjmp is declared |
|---|
| 1803 | configure:21587: /usr/bin/clang -c -pipe -Os -flax-vector-conversions -arch x86_64 -I/opt/local/include conftest.c >&5 |
|---|
| 1804 | configure:21587: $? = 0 |
|---|
| 1805 | configure:21587: result: yes |
|---|
| 1806 | configure:21611: checking for GNU C library with version >= 2 |
|---|
| 1807 | configure:21634: result: no |
|---|
| 1808 | configure:21645: checking return type of signal handlers |
|---|
| 1809 | configure:21663: /usr/bin/clang -c -pipe -Os -flax-vector-conversions -arch x86_64 -I/opt/local/include conftest.c >&5 |
|---|
| 1810 | conftest.c:81:8: error: indirection requires pointer operand ('void' invalid) |
|---|
| 1811 | return *(signal (0, 0)) (0) == 1; |
|---|
| 1812 | ^~~~~~~~~~~~~~~~~~~~ |
|---|
| 1813 | 1 error generated. |
|---|
| 1814 | configure:21663: $? = 1 |
|---|
| 1815 | configure: failed program was: |
|---|
| 1816 | | /* confdefs.h */ |
|---|
| 1817 | | #define PACKAGE_NAME "R" |
|---|
| 1818 | | #define PACKAGE_TARNAME "R" |
|---|
| 1819 | | #define PACKAGE_VERSION "3.1.0" |
|---|
| 1820 | | #define PACKAGE_STRING "R 3.1.0" |
|---|
| 1821 | | #define PACKAGE_BUGREPORT "http://bugs.r-project.org" |
|---|
| 1822 | | #define PACKAGE_URL "http://www.r-project.org" |
|---|
| 1823 | | #define PACKAGE "R" |
|---|
| 1824 | | #define VERSION "3.1.0" |
|---|
| 1825 | | #define R_PLATFORM "x86_64-apple-darwin13.2.0" |
|---|
| 1826 | | #define R_CPU "x86_64" |
|---|
| 1827 | | #define R_VENDOR "apple" |
|---|
| 1828 | | #define R_OS "darwin13.2.0" |
|---|
| 1829 | | #define Unix 1 |
|---|
| 1830 | | #define R_ARCH "" |
|---|
| 1831 | | #define STDC_HEADERS 1 |
|---|
| 1832 | | #define HAVE_SYS_TYPES_H 1 |
|---|
| 1833 | | #define HAVE_SYS_STAT_H 1 |
|---|
| 1834 | | #define HAVE_STDLIB_H 1 |
|---|
| 1835 | | #define HAVE_STRING_H 1 |
|---|
| 1836 | | #define HAVE_MEMORY_H 1 |
|---|
| 1837 | | #define HAVE_STRINGS_H 1 |
|---|
| 1838 | | #define HAVE_INTTYPES_H 1 |
|---|
| 1839 | | #define HAVE_STDINT_H 1 |
|---|
| 1840 | | #define HAVE_UNISTD_H 1 |
|---|
| 1841 | | #define __EXTENSIONS__ 1 |
|---|
| 1842 | | #define _ALL_SOURCE 1 |
|---|
| 1843 | | #define _GNU_SOURCE 1 |
|---|
| 1844 | | #define _POSIX_PTHREAD_SEMANTICS 1 |
|---|
| 1845 | | #define _TANDEM_SOURCE 1 |
|---|
| 1846 | | #define HAVE_DLFCN_H 1 |
|---|
| 1847 | | #define LT_OBJDIR ".libs/" |
|---|
| 1848 | | #define HAVE_LIBM 1 |
|---|
| 1849 | | #define HAVE_READLINE_HISTORY_H 1 |
|---|
| 1850 | | #define HAVE_READLINE_READLINE_H 1 |
|---|
| 1851 | | #define HAVE_LIBREADLINE 1 |
|---|
| 1852 | | #define HAVE_HISTORY_TRUNCATE_FILE 1 |
|---|
| 1853 | | #define HAVE_RL_COMPLETION_MATCHES 1 |
|---|
| 1854 | | #define STDC_HEADERS 1 |
|---|
| 1855 | | #define HAVE_DIRENT_H 1 |
|---|
| 1856 | | #define HAVE_SYS_WAIT_H 1 |
|---|
| 1857 | | #define HAVE_ARPA_INET_H 1 |
|---|
| 1858 | | #define HAVE_DLFCN_H 1 |
|---|
| 1859 | | #define HAVE_FCNTL_H 1 |
|---|
| 1860 | | #define HAVE_GLOB_H 1 |
|---|
| 1861 | | #define HAVE_GRP_H 1 |
|---|
| 1862 | | #define HAVE_LANGINFO_H 1 |
|---|
| 1863 | | #define HAVE_NETDB_H 1 |
|---|
| 1864 | | #define HAVE_NETINET_IN_H 1 |
|---|
| 1865 | | #define HAVE_PWD_H 1 |
|---|
| 1866 | | #define HAVE_SCHED_H 1 |
|---|
| 1867 | | #define HAVE_STRINGS_H 1 |
|---|
| 1868 | | #define HAVE_SYS_PARAM_H 1 |
|---|
| 1869 | | #define HAVE_SYS_RESOURCE_H 1 |
|---|
| 1870 | | #define HAVE_SYS_SELECT_H 1 |
|---|
| 1871 | | #define HAVE_SYS_SOCKET_H 1 |
|---|
| 1872 | | #define HAVE_SYS_STAT_H 1 |
|---|
| 1873 | | #define HAVE_SYS_TIME_H 1 |
|---|
| 1874 | | #define HAVE_SYS_TIMES_H 1 |
|---|
| 1875 | | #define HAVE_SYS_UTSNAME_H 1 |
|---|
| 1876 | | #define HAVE_UNISTD_H 1 |
|---|
| 1877 | | #define HAVE_UTIME_H 1 |
|---|
| 1878 | | #define HAVE_ERRNO_H 1 |
|---|
| 1879 | | #define HAVE_INTTYPES_H 1 |
|---|
| 1880 | | #define HAVE_LIMITS_H 1 |
|---|
| 1881 | | #define HAVE_LOCALE_H 1 |
|---|
| 1882 | | #define HAVE_STDARG_H 1 |
|---|
| 1883 | | #define HAVE_STDBOOL_H 1 |
|---|
| 1884 | | #define HAVE_STDINT_H 1 |
|---|
| 1885 | | #define HAVE_STRING_H 1 |
|---|
| 1886 | | #define HAVE_DECL_SIGSETJMP 1 |
|---|
| 1887 | | #define HAVE_DECL_SIGLONGJMP 1 |
|---|
| 1888 | | #define HAVE_POSIX_SETJMP 1 |
|---|
| 1889 | | /* end confdefs.h. */ |
|---|
| 1890 | | #include <sys/types.h> |
|---|
| 1891 | | #include <signal.h> |
|---|
| 1892 | | |
|---|
| 1893 | | int |
|---|
| 1894 | | main () |
|---|
| 1895 | | { |
|---|
| 1896 | | return *(signal (0, 0)) (0) == 1; |
|---|
| 1897 | | ; |
|---|
| 1898 | | return 0; |
|---|
| 1899 | | } |
|---|
| 1900 | configure:21670: result: void |
|---|
| 1901 | configure:21679: checking for uint64_t |
|---|
| 1902 | configure:21679: /usr/bin/clang -c -pipe -Os -flax-vector-conversions -arch x86_64 -I/opt/local/include conftest.c >&5 |
|---|
| 1903 | configure:21679: $? = 0 |
|---|
| 1904 | configure:21679: result: yes |
|---|
| 1905 | configure:21693: checking for int64_t |
|---|
| 1906 | configure:21693: /usr/bin/clang -c -pipe -Os -flax-vector-conversions -arch x86_64 -I/opt/local/include conftest.c >&5 |
|---|
| 1907 | configure:21693: $? = 0 |
|---|
| 1908 | configure:21693: /usr/bin/clang -c -pipe -Os -flax-vector-conversions -arch x86_64 -I/opt/local/include conftest.c >&5 |
|---|
| 1909 | conftest.c:112:22: error: expected expression |
|---|
| 1910 | if (sizeof ((int64_t))) |
|---|
| 1911 | ^ |
|---|
| 1912 | 1 error generated. |
|---|
| 1913 | configure:21693: $? = 1 |
|---|
| 1914 | configure: failed program was: |
|---|
| 1915 | | /* confdefs.h */ |
|---|
| 1916 | | #define PACKAGE_NAME "R" |
|---|
| 1917 | | #define PACKAGE_TARNAME "R" |
|---|
| 1918 | | #define PACKAGE_VERSION "3.1.0" |
|---|
| 1919 | | #define PACKAGE_STRING "R 3.1.0" |
|---|
| 1920 | | #define PACKAGE_BUGREPORT "http://bugs.r-project.org" |
|---|
| 1921 | | #define PACKAGE_URL "http://www.r-project.org" |
|---|
| 1922 | | #define PACKAGE "R" |
|---|
| 1923 | | #define VERSION "3.1.0" |
|---|
| 1924 | | #define R_PLATFORM "x86_64-apple-darwin13.2.0" |
|---|
| 1925 | | #define R_CPU "x86_64" |
|---|
| 1926 | | #define R_VENDOR "apple" |
|---|
| 1927 | | #define R_OS "darwin13.2.0" |
|---|
| 1928 | | #define Unix 1 |
|---|
| 1929 | | #define R_ARCH "" |
|---|
| 1930 | | #define STDC_HEADERS 1 |
|---|
| 1931 | | #define HAVE_SYS_TYPES_H 1 |
|---|
| 1932 | | #define HAVE_SYS_STAT_H 1 |
|---|
| 1933 | | #define HAVE_STDLIB_H 1 |
|---|
| 1934 | | #define HAVE_STRING_H 1 |
|---|
| 1935 | | #define HAVE_MEMORY_H 1 |
|---|
| 1936 | | #define HAVE_STRINGS_H 1 |
|---|
| 1937 | | #define HAVE_INTTYPES_H 1 |
|---|
| 1938 | | #define HAVE_STDINT_H 1 |
|---|
| 1939 | | #define HAVE_UNISTD_H 1 |
|---|
| 1940 | | #define __EXTENSIONS__ 1 |
|---|
| 1941 | | #define _ALL_SOURCE 1 |
|---|
| 1942 | | #define _GNU_SOURCE 1 |
|---|
| 1943 | | #define _POSIX_PTHREAD_SEMANTICS 1 |
|---|
| 1944 | | #define _TANDEM_SOURCE 1 |
|---|
| 1945 | | #define HAVE_DLFCN_H 1 |
|---|
| 1946 | | #define LT_OBJDIR ".libs/" |
|---|
| 1947 | | #define HAVE_LIBM 1 |
|---|
| 1948 | | #define HAVE_READLINE_HISTORY_H 1 |
|---|
| 1949 | | #define HAVE_READLINE_READLINE_H 1 |
|---|
| 1950 | | #define HAVE_LIBREADLINE 1 |
|---|
| 1951 | | #define HAVE_HISTORY_TRUNCATE_FILE 1 |
|---|
| 1952 | | #define HAVE_RL_COMPLETION_MATCHES 1 |
|---|
| 1953 | | #define STDC_HEADERS 1 |
|---|
| 1954 | | #define HAVE_DIRENT_H 1 |
|---|
| 1955 | | #define HAVE_SYS_WAIT_H 1 |
|---|
| 1956 | | #define HAVE_ARPA_INET_H 1 |
|---|
| 1957 | | #define HAVE_DLFCN_H 1 |
|---|
| 1958 | | #define HAVE_FCNTL_H 1 |
|---|
| 1959 | | #define HAVE_GLOB_H 1 |
|---|
| 1960 | | #define HAVE_GRP_H 1 |
|---|
| 1961 | | #define HAVE_LANGINFO_H 1 |
|---|
| 1962 | | #define HAVE_NETDB_H 1 |
|---|
| 1963 | | #define HAVE_NETINET_IN_H 1 |
|---|
| 1964 | | #define HAVE_PWD_H 1 |
|---|
| 1965 | | #define HAVE_SCHED_H 1 |
|---|
| 1966 | | #define HAVE_STRINGS_H 1 |
|---|
| 1967 | | #define HAVE_SYS_PARAM_H 1 |
|---|
| 1968 | | #define HAVE_SYS_RESOURCE_H 1 |
|---|
| 1969 | | #define HAVE_SYS_SELECT_H 1 |
|---|
| 1970 | | #define HAVE_SYS_SOCKET_H 1 |
|---|
| 1971 | | #define HAVE_SYS_STAT_H 1 |
|---|
| 1972 | | #define HAVE_SYS_TIME_H 1 |
|---|
| 1973 | | #define HAVE_SYS_TIMES_H 1 |
|---|
| 1974 | | #define HAVE_SYS_UTSNAME_H 1 |
|---|
| 1975 | | #define HAVE_UNISTD_H 1 |
|---|
| 1976 | | #define HAVE_UTIME_H 1 |
|---|
| 1977 | | #define HAVE_ERRNO_H 1 |
|---|
| 1978 | | #define HAVE_INTTYPES_H 1 |
|---|
| 1979 | | #define HAVE_LIMITS_H 1 |
|---|
| 1980 | | #define HAVE_LOCALE_H 1 |
|---|
| 1981 | | #define HAVE_STDARG_H 1 |
|---|
| 1982 | | #define HAVE_STDBOOL_H 1 |
|---|
| 1983 | | #define HAVE_STDINT_H 1 |
|---|
| 1984 | | #define HAVE_STRING_H 1 |
|---|
| 1985 | | #define HAVE_DECL_SIGSETJMP 1 |
|---|
| 1986 | | #define HAVE_DECL_SIGLONGJMP 1 |
|---|
| 1987 | | #define HAVE_POSIX_SETJMP 1 |
|---|
| 1988 | | #define RETSIGTYPE void |
|---|
| 1989 | | /* end confdefs.h. */ |
|---|
| 1990 | | #include <stdio.h> |
|---|
| 1991 | | #ifdef HAVE_SYS_TYPES_H |
|---|
| 1992 | | # include <sys/types.h> |
|---|
| 1993 | | #endif |
|---|
| 1994 | | #ifdef HAVE_SYS_STAT_H |
|---|
| 1995 | | # include <sys/stat.h> |
|---|
| 1996 | | #endif |
|---|
| 1997 | | #ifdef STDC_HEADERS |
|---|
| 1998 | | # include <stdlib.h> |
|---|
| 1999 | | # include <stddef.h> |
|---|
| 2000 | | #else |
|---|
| 2001 | | # ifdef HAVE_STDLIB_H |
|---|
| 2002 | | # include <stdlib.h> |
|---|
| 2003 | | # endif |
|---|
| 2004 | | #endif |
|---|
| 2005 | | #ifdef HAVE_STRING_H |
|---|
| 2006 | | # if !defined STDC_HEADERS && defined HAVE_MEMORY_H |
|---|
| 2007 | | # include <memory.h> |
|---|
| 2008 | | # endif |
|---|
| 2009 | | # include <string.h> |
|---|
| 2010 | | #endif |
|---|
| 2011 | | #ifdef HAVE_STRINGS_H |
|---|
| 2012 | | # include <strings.h> |
|---|
| 2013 | | #endif |
|---|
| 2014 | | #ifdef HAVE_INTTYPES_H |
|---|
| 2015 | | # include <inttypes.h> |
|---|
| 2016 | | #endif |
|---|
| 2017 | | #ifdef HAVE_STDINT_H |
|---|
| 2018 | | # include <stdint.h> |
|---|
| 2019 | | #endif |
|---|
| 2020 | | #ifdef HAVE_UNISTD_H |
|---|
| 2021 | | # include <unistd.h> |
|---|
| 2022 | | #endif |
|---|
| 2023 | | int |
|---|
| 2024 | | main () |
|---|
| 2025 | | { |
|---|
| 2026 | | if (sizeof ((int64_t))) |
|---|
| 2027 | | return 0; |
|---|
| 2028 | | ; |
|---|
| 2029 | | return 0; |
|---|
| 2030 | | } |
|---|
| 2031 | configure:21693: result: yes |
|---|
| 2032 | configure:21702: checking for int_fast64_t |
|---|
| 2033 | configure:21702: /usr/bin/clang -c -pipe -Os -flax-vector-conversions -arch x86_64 -I/opt/local/include conftest.c >&5 |
|---|
| 2034 | configure:21702: $? = 0 |
|---|
| 2035 | configure:21702: /usr/bin/clang -c -pipe -Os -flax-vector-conversions -arch x86_64 -I/opt/local/include conftest.c >&5 |
|---|
| 2036 | conftest.c:113:27: error: expected expression |
|---|
| 2037 | if (sizeof ((int_fast64_t))) |
|---|
| 2038 | ^ |
|---|
| 2039 | 1 error generated. |
|---|
| 2040 | configure:21702: $? = 1 |
|---|
| 2041 | configure: failed program was: |
|---|
| 2042 | | /* confdefs.h */ |
|---|
| 2043 | | #define PACKAGE_NAME "R" |
|---|
| 2044 | | #define PACKAGE_TARNAME "R" |
|---|
| 2045 | | #define PACKAGE_VERSION "3.1.0" |
|---|
| 2046 | | #define PACKAGE_STRING "R 3.1.0" |
|---|
| 2047 | | #define PACKAGE_BUGREPORT "http://bugs.r-project.org" |
|---|
| 2048 | | #define PACKAGE_URL "http://www.r-project.org" |
|---|
| 2049 | | #define PACKAGE "R" |
|---|
| 2050 | | #define VERSION "3.1.0" |
|---|
| 2051 | | #define R_PLATFORM "x86_64-apple-darwin13.2.0" |
|---|
| 2052 | | #define R_CPU "x86_64" |
|---|
| 2053 | | #define R_VENDOR "apple" |
|---|
| 2054 | | #define R_OS "darwin13.2.0" |
|---|
| 2055 | | #define Unix 1 |
|---|
| 2056 | | #define R_ARCH "" |
|---|
| 2057 | | #define STDC_HEADERS 1 |
|---|
| 2058 | | #define HAVE_SYS_TYPES_H 1 |
|---|
| 2059 | | #define HAVE_SYS_STAT_H 1 |
|---|
| 2060 | | #define HAVE_STDLIB_H 1 |
|---|
| 2061 | | #define HAVE_STRING_H 1 |
|---|
| 2062 | | #define HAVE_MEMORY_H 1 |
|---|
| 2063 | | #define HAVE_STRINGS_H 1 |
|---|
| 2064 | | #define HAVE_INTTYPES_H 1 |
|---|
| 2065 | | #define HAVE_STDINT_H 1 |
|---|
| 2066 | | #define HAVE_UNISTD_H 1 |
|---|
| 2067 | | #define __EXTENSIONS__ 1 |
|---|
| 2068 | | #define _ALL_SOURCE 1 |
|---|
| 2069 | | #define _GNU_SOURCE 1 |
|---|
| 2070 | | #define _POSIX_PTHREAD_SEMANTICS 1 |
|---|
| 2071 | | #define _TANDEM_SOURCE 1 |
|---|
| 2072 | | #define HAVE_DLFCN_H 1 |
|---|
| 2073 | | #define LT_OBJDIR ".libs/" |
|---|
| 2074 | | #define HAVE_LIBM 1 |
|---|
| 2075 | | #define HAVE_READLINE_HISTORY_H 1 |
|---|
| 2076 | | #define HAVE_READLINE_READLINE_H 1 |
|---|
| 2077 | | #define HAVE_LIBREADLINE 1 |
|---|
| 2078 | | #define HAVE_HISTORY_TRUNCATE_FILE 1 |
|---|
| 2079 | | #define HAVE_RL_COMPLETION_MATCHES 1 |
|---|
| 2080 | | #define STDC_HEADERS 1 |
|---|
| 2081 | | #define HAVE_DIRENT_H 1 |
|---|
| 2082 | | #define HAVE_SYS_WAIT_H 1 |
|---|
| 2083 | | #define HAVE_ARPA_INET_H 1 |
|---|
| 2084 | | #define HAVE_DLFCN_H 1 |
|---|
| 2085 | | #define HAVE_FCNTL_H 1 |
|---|
| 2086 | | #define HAVE_GLOB_H 1 |
|---|
| 2087 | | #define HAVE_GRP_H 1 |
|---|
| 2088 | | #define HAVE_LANGINFO_H 1 |
|---|
| 2089 | | #define HAVE_NETDB_H 1 |
|---|
| 2090 | | #define HAVE_NETINET_IN_H 1 |
|---|
| 2091 | | #define HAVE_PWD_H 1 |
|---|
| 2092 | | #define HAVE_SCHED_H 1 |
|---|
| 2093 | | #define HAVE_STRINGS_H 1 |
|---|
| 2094 | | #define HAVE_SYS_PARAM_H 1 |
|---|
| 2095 | | #define HAVE_SYS_RESOURCE_H 1 |
|---|
| 2096 | | #define HAVE_SYS_SELECT_H 1 |
|---|
| 2097 | | #define HAVE_SYS_SOCKET_H 1 |
|---|
| 2098 | | #define HAVE_SYS_STAT_H 1 |
|---|
| 2099 | | #define HAVE_SYS_TIME_H 1 |
|---|
| 2100 | | #define HAVE_SYS_TIMES_H 1 |
|---|
| 2101 | | #define HAVE_SYS_UTSNAME_H 1 |
|---|
| 2102 | | #define HAVE_UNISTD_H 1 |
|---|
| 2103 | | #define HAVE_UTIME_H 1 |
|---|
| 2104 | | #define HAVE_ERRNO_H 1 |
|---|
| 2105 | | #define HAVE_INTTYPES_H 1 |
|---|
| 2106 | | #define HAVE_LIMITS_H 1 |
|---|
| 2107 | | #define HAVE_LOCALE_H 1 |
|---|
| 2108 | | #define HAVE_STDARG_H 1 |
|---|
| 2109 | | #define HAVE_STDBOOL_H 1 |
|---|
| 2110 | | #define HAVE_STDINT_H 1 |
|---|
| 2111 | | #define HAVE_STRING_H 1 |
|---|
| 2112 | | #define HAVE_DECL_SIGSETJMP 1 |
|---|
| 2113 | | #define HAVE_DECL_SIGLONGJMP 1 |
|---|
| 2114 | | #define HAVE_POSIX_SETJMP 1 |
|---|
| 2115 | | #define RETSIGTYPE void |
|---|
| 2116 | | #define HAVE_INT64_T 1 |
|---|
| 2117 | | /* end confdefs.h. */ |
|---|
| 2118 | | #include <stdio.h> |
|---|
| 2119 | | #ifdef HAVE_SYS_TYPES_H |
|---|
| 2120 | | # include <sys/types.h> |
|---|
| 2121 | | #endif |
|---|
| 2122 | | #ifdef HAVE_SYS_STAT_H |
|---|
| 2123 | | # include <sys/stat.h> |
|---|
| 2124 | | #endif |
|---|
| 2125 | | #ifdef STDC_HEADERS |
|---|
| 2126 | | # include <stdlib.h> |
|---|
| 2127 | | # include <stddef.h> |
|---|
| 2128 | | #else |
|---|
| 2129 | | # ifdef HAVE_STDLIB_H |
|---|
| 2130 | | # include <stdlib.h> |
|---|
| 2131 | | # endif |
|---|
| 2132 | | #endif |
|---|
| 2133 | | #ifdef HAVE_STRING_H |
|---|
| 2134 | | # if !defined STDC_HEADERS && defined HAVE_MEMORY_H |
|---|
| 2135 | | # include <memory.h> |
|---|
| 2136 | | # endif |
|---|
| 2137 | | # include <string.h> |
|---|
| 2138 | | #endif |
|---|
| 2139 | | #ifdef HAVE_STRINGS_H |
|---|
| 2140 | | # include <strings.h> |
|---|
| 2141 | | #endif |
|---|
| 2142 | | #ifdef HAVE_INTTYPES_H |
|---|
| 2143 | | # include <inttypes.h> |
|---|
| 2144 | | #endif |
|---|
| 2145 | | #ifdef HAVE_STDINT_H |
|---|
| 2146 | | # include <stdint.h> |
|---|
| 2147 | | #endif |
|---|
| 2148 | | #ifdef HAVE_UNISTD_H |
|---|
| 2149 | | # include <unistd.h> |
|---|
| 2150 | | #endif |
|---|
| 2151 | | int |
|---|
| 2152 | | main () |
|---|
| 2153 | | { |
|---|
| 2154 | | if (sizeof ((int_fast64_t))) |
|---|
| 2155 | | return 0; |
|---|
| 2156 | | ; |
|---|
| 2157 | | return 0; |
|---|
| 2158 | | } |
|---|
| 2159 | configure:21702: result: yes |
|---|
| 2160 | configure:21712: checking for pid_t |
|---|
| 2161 | configure:21712: /usr/bin/clang -c -pipe -Os -flax-vector-conversions -arch x86_64 -I/opt/local/include conftest.c >&5 |
|---|
| 2162 | configure:21712: $? = 0 |
|---|
| 2163 | configure:21712: /usr/bin/clang -c -pipe -Os -flax-vector-conversions -arch x86_64 -I/opt/local/include conftest.c >&5 |
|---|
| 2164 | conftest.c:114:20: error: expected expression |
|---|
| 2165 | if (sizeof ((pid_t))) |
|---|
| 2166 | ^ |
|---|
| 2167 | 1 error generated. |
|---|
| 2168 | configure:21712: $? = 1 |
|---|
| 2169 | configure: failed program was: |
|---|
| 2170 | | /* confdefs.h */ |
|---|
| 2171 | | #define PACKAGE_NAME "R" |
|---|
| 2172 | | #define PACKAGE_TARNAME "R" |
|---|
| 2173 | | #define PACKAGE_VERSION "3.1.0" |
|---|
| 2174 | | #define PACKAGE_STRING "R 3.1.0" |
|---|
| 2175 | | #define PACKAGE_BUGREPORT "http://bugs.r-project.org" |
|---|
| 2176 | | #define PACKAGE_URL "http://www.r-project.org" |
|---|
| 2177 | | #define PACKAGE "R" |
|---|
| 2178 | | #define VERSION "3.1.0" |
|---|
| 2179 | | #define R_PLATFORM "x86_64-apple-darwin13.2.0" |
|---|
| 2180 | | #define R_CPU "x86_64" |
|---|
| 2181 | | #define R_VENDOR "apple" |
|---|
| 2182 | | #define R_OS "darwin13.2.0" |
|---|
| 2183 | | #define Unix 1 |
|---|
| 2184 | | #define R_ARCH "" |
|---|
| 2185 | | #define STDC_HEADERS 1 |
|---|
| 2186 | | #define HAVE_SYS_TYPES_H 1 |
|---|
| 2187 | | #define HAVE_SYS_STAT_H 1 |
|---|
| 2188 | | #define HAVE_STDLIB_H 1 |
|---|
| 2189 | | #define HAVE_STRING_H 1 |
|---|
| 2190 | | #define HAVE_MEMORY_H 1 |
|---|
| 2191 | | #define HAVE_STRINGS_H 1 |
|---|
| 2192 | | #define HAVE_INTTYPES_H 1 |
|---|
| 2193 | | #define HAVE_STDINT_H 1 |
|---|
| 2194 | | #define HAVE_UNISTD_H 1 |
|---|
| 2195 | | #define __EXTENSIONS__ 1 |
|---|
| 2196 | | #define _ALL_SOURCE 1 |
|---|
| 2197 | | #define _GNU_SOURCE 1 |
|---|
| 2198 | | #define _POSIX_PTHREAD_SEMANTICS 1 |
|---|
| 2199 | | #define _TANDEM_SOURCE 1 |
|---|
| 2200 | | #define HAVE_DLFCN_H 1 |
|---|
| 2201 | | #define LT_OBJDIR ".libs/" |
|---|
| 2202 | | #define HAVE_LIBM 1 |
|---|
| 2203 | | #define HAVE_READLINE_HISTORY_H 1 |
|---|
| 2204 | | #define HAVE_READLINE_READLINE_H 1 |
|---|
| 2205 | | #define HAVE_LIBREADLINE 1 |
|---|
| 2206 | | #define HAVE_HISTORY_TRUNCATE_FILE 1 |
|---|
| 2207 | | #define HAVE_RL_COMPLETION_MATCHES 1 |
|---|
| 2208 | | #define STDC_HEADERS 1 |
|---|
| 2209 | | #define HAVE_DIRENT_H 1 |
|---|
| 2210 | | #define HAVE_SYS_WAIT_H 1 |
|---|
| 2211 | | #define HAVE_ARPA_INET_H 1 |
|---|
| 2212 | | #define HAVE_DLFCN_H 1 |
|---|
| 2213 | | #define HAVE_FCNTL_H 1 |
|---|
| 2214 | | #define HAVE_GLOB_H 1 |
|---|
| 2215 | | #define HAVE_GRP_H 1 |
|---|
| 2216 | | #define HAVE_LANGINFO_H 1 |
|---|
| 2217 | | #define HAVE_NETDB_H 1 |
|---|
| 2218 | | #define HAVE_NETINET_IN_H 1 |
|---|
| 2219 | | #define HAVE_PWD_H 1 |
|---|
| 2220 | | #define HAVE_SCHED_H 1 |
|---|
| 2221 | | #define HAVE_STRINGS_H 1 |
|---|
| 2222 | | #define HAVE_SYS_PARAM_H 1 |
|---|
| 2223 | | #define HAVE_SYS_RESOURCE_H 1 |
|---|
| 2224 | | #define HAVE_SYS_SELECT_H 1 |
|---|
| 2225 | | #define HAVE_SYS_SOCKET_H 1 |
|---|
| 2226 | | #define HAVE_SYS_STAT_H 1 |
|---|
| 2227 | | #define HAVE_SYS_TIME_H 1 |
|---|
| 2228 | | #define HAVE_SYS_TIMES_H 1 |
|---|
| 2229 | | #define HAVE_SYS_UTSNAME_H 1 |
|---|
| 2230 | | #define HAVE_UNISTD_H 1 |
|---|
| 2231 | | #define HAVE_UTIME_H 1 |
|---|
| 2232 | | #define HAVE_ERRNO_H 1 |
|---|
| 2233 | | #define HAVE_INTTYPES_H 1 |
|---|
| 2234 | | #define HAVE_LIMITS_H 1 |
|---|
| 2235 | | #define HAVE_LOCALE_H 1 |
|---|
| 2236 | | #define HAVE_STDARG_H 1 |
|---|
| 2237 | | #define HAVE_STDBOOL_H 1 |
|---|
| 2238 | | #define HAVE_STDINT_H 1 |
|---|
| 2239 | | #define HAVE_STRING_H 1 |
|---|
| 2240 | | #define HAVE_DECL_SIGSETJMP 1 |
|---|
| 2241 | | #define HAVE_DECL_SIGLONGJMP 1 |
|---|
| 2242 | | #define HAVE_POSIX_SETJMP 1 |
|---|
| 2243 | | #define RETSIGTYPE void |
|---|
| 2244 | | #define HAVE_INT64_T 1 |
|---|
| 2245 | | #define HAVE_INT_FAST64_T 1 |
|---|
| 2246 | | /* end confdefs.h. */ |
|---|
| 2247 | | #include <stdio.h> |
|---|
| 2248 | | #ifdef HAVE_SYS_TYPES_H |
|---|
| 2249 | | # include <sys/types.h> |
|---|
| 2250 | | #endif |
|---|
| 2251 | | #ifdef HAVE_SYS_STAT_H |
|---|
| 2252 | | # include <sys/stat.h> |
|---|
| 2253 | | #endif |
|---|
| 2254 | | #ifdef STDC_HEADERS |
|---|
| 2255 | | # include <stdlib.h> |
|---|
| 2256 | | # include <stddef.h> |
|---|
| 2257 | | #else |
|---|
| 2258 | | # ifdef HAVE_STDLIB_H |
|---|
| 2259 | | # include <stdlib.h> |
|---|
| 2260 | | # endif |
|---|
| 2261 | | #endif |
|---|
| 2262 | | #ifdef HAVE_STRING_H |
|---|
| 2263 | | # if !defined STDC_HEADERS && defined HAVE_MEMORY_H |
|---|
| 2264 | | # include <memory.h> |
|---|
| 2265 | | # endif |
|---|
| 2266 | | # include <string.h> |
|---|
| 2267 | | #endif |
|---|
| 2268 | | #ifdef HAVE_STRINGS_H |
|---|
| 2269 | | # include <strings.h> |
|---|
| 2270 | | #endif |
|---|
| 2271 | | #ifdef HAVE_INTTYPES_H |
|---|
| 2272 | | # include <inttypes.h> |
|---|
| 2273 | | #endif |
|---|
| 2274 | | #ifdef HAVE_STDINT_H |
|---|
| 2275 | | # include <stdint.h> |
|---|
| 2276 | | #endif |
|---|
| 2277 | | #ifdef HAVE_UNISTD_H |
|---|
| 2278 | | # include <unistd.h> |
|---|
| 2279 | | #endif |
|---|
| 2280 | | int |
|---|
| 2281 | | main () |
|---|
| 2282 | | { |
|---|
| 2283 | | if (sizeof ((pid_t))) |
|---|
| 2284 | | return 0; |
|---|
| 2285 | | ; |
|---|
| 2286 | | return 0; |
|---|
| 2287 | | } |
|---|
| 2288 | configure:21712: result: yes |
|---|
| 2289 | configure:21723: checking for size_t |
|---|
| 2290 | configure:21723: /usr/bin/clang -c -pipe -Os -flax-vector-conversions -arch x86_64 -I/opt/local/include conftest.c >&5 |
|---|
| 2291 | configure:21723: $? = 0 |
|---|
| 2292 | configure:21723: /usr/bin/clang -c -pipe -Os -flax-vector-conversions -arch x86_64 -I/opt/local/include conftest.c >&5 |
|---|
| 2293 | conftest.c:114:21: error: expected expression |
|---|
| 2294 | if (sizeof ((size_t))) |
|---|
| 2295 | ^ |
|---|
| 2296 | 1 error generated. |
|---|
| 2297 | configure:21723: $? = 1 |
|---|
| 2298 | configure: failed program was: |
|---|
| 2299 | | /* confdefs.h */ |
|---|
| 2300 | | #define PACKAGE_NAME "R" |
|---|
| 2301 | | #define PACKAGE_TARNAME "R" |
|---|
| 2302 | | #define PACKAGE_VERSION "3.1.0" |
|---|
| 2303 | | #define PACKAGE_STRING "R 3.1.0" |
|---|
| 2304 | | #define PACKAGE_BUGREPORT "http://bugs.r-project.org" |
|---|
| 2305 | | #define PACKAGE_URL "http://www.r-project.org" |
|---|
| 2306 | | #define PACKAGE "R" |
|---|
| 2307 | | #define VERSION "3.1.0" |
|---|
| 2308 | | #define R_PLATFORM "x86_64-apple-darwin13.2.0" |
|---|
| 2309 | | #define R_CPU "x86_64" |
|---|
| 2310 | | #define R_VENDOR "apple" |
|---|
| 2311 | | #define R_OS "darwin13.2.0" |
|---|
| 2312 | | #define Unix 1 |
|---|
| 2313 | | #define R_ARCH "" |
|---|
| 2314 | | #define STDC_HEADERS 1 |
|---|
| 2315 | | #define HAVE_SYS_TYPES_H 1 |
|---|
| 2316 | | #define HAVE_SYS_STAT_H 1 |
|---|
| 2317 | | #define HAVE_STDLIB_H 1 |
|---|
| 2318 | | #define HAVE_STRING_H 1 |
|---|
| 2319 | | #define HAVE_MEMORY_H 1 |
|---|
| 2320 | | #define HAVE_STRINGS_H 1 |
|---|
| 2321 | | #define HAVE_INTTYPES_H 1 |
|---|
| 2322 | | #define HAVE_STDINT_H 1 |
|---|
| 2323 | | #define HAVE_UNISTD_H 1 |
|---|
| 2324 | | #define __EXTENSIONS__ 1 |
|---|
| 2325 | | #define _ALL_SOURCE 1 |
|---|
| 2326 | | #define _GNU_SOURCE 1 |
|---|
| 2327 | | #define _POSIX_PTHREAD_SEMANTICS 1 |
|---|
| 2328 | | #define _TANDEM_SOURCE 1 |
|---|
| 2329 | | #define HAVE_DLFCN_H 1 |
|---|
| 2330 | | #define LT_OBJDIR ".libs/" |
|---|
| 2331 | | #define HAVE_LIBM 1 |
|---|
| 2332 | | #define HAVE_READLINE_HISTORY_H 1 |
|---|
| 2333 | | #define HAVE_READLINE_READLINE_H 1 |
|---|
| 2334 | | #define HAVE_LIBREADLINE 1 |
|---|
| 2335 | | #define HAVE_HISTORY_TRUNCATE_FILE 1 |
|---|
| 2336 | | #define HAVE_RL_COMPLETION_MATCHES 1 |
|---|
| 2337 | | #define STDC_HEADERS 1 |
|---|
| 2338 | | #define HAVE_DIRENT_H 1 |
|---|
| 2339 | | #define HAVE_SYS_WAIT_H 1 |
|---|
| 2340 | | #define HAVE_ARPA_INET_H 1 |
|---|
| 2341 | | #define HAVE_DLFCN_H 1 |
|---|
| 2342 | | #define HAVE_FCNTL_H 1 |
|---|
| 2343 | | #define HAVE_GLOB_H 1 |
|---|
| 2344 | | #define HAVE_GRP_H 1 |
|---|
| 2345 | | #define HAVE_LANGINFO_H 1 |
|---|
| 2346 | | #define HAVE_NETDB_H 1 |
|---|
| 2347 | | #define HAVE_NETINET_IN_H 1 |
|---|
| 2348 | | #define HAVE_PWD_H 1 |
|---|
| 2349 | | #define HAVE_SCHED_H 1 |
|---|
| 2350 | | #define HAVE_STRINGS_H 1 |
|---|
| 2351 | | #define HAVE_SYS_PARAM_H 1 |
|---|
| 2352 | | #define HAVE_SYS_RESOURCE_H 1 |
|---|
| 2353 | | #define HAVE_SYS_SELECT_H 1 |
|---|
| 2354 | | #define HAVE_SYS_SOCKET_H 1 |
|---|
| 2355 | | #define HAVE_SYS_STAT_H 1 |
|---|
| 2356 | | #define HAVE_SYS_TIME_H 1 |
|---|
| 2357 | | #define HAVE_SYS_TIMES_H 1 |
|---|
| 2358 | | #define HAVE_SYS_UTSNAME_H 1 |
|---|
| 2359 | | #define HAVE_UNISTD_H 1 |
|---|
| 2360 | | #define HAVE_UTIME_H 1 |
|---|
| 2361 | | #define HAVE_ERRNO_H 1 |
|---|
| 2362 | | #define HAVE_INTTYPES_H 1 |
|---|
| 2363 | | #define HAVE_LIMITS_H 1 |
|---|
| 2364 | | #define HAVE_LOCALE_H 1 |
|---|
| 2365 | | #define HAVE_STDARG_H 1 |
|---|
| 2366 | | #define HAVE_STDBOOL_H 1 |
|---|
| 2367 | | #define HAVE_STDINT_H 1 |
|---|
| 2368 | | #define HAVE_STRING_H 1 |
|---|
| 2369 | | #define HAVE_DECL_SIGSETJMP 1 |
|---|
| 2370 | | #define HAVE_DECL_SIGLONGJMP 1 |
|---|
| 2371 | | #define HAVE_POSIX_SETJMP 1 |
|---|
| 2372 | | #define RETSIGTYPE void |
|---|
| 2373 | | #define HAVE_INT64_T 1 |
|---|
| 2374 | | #define HAVE_INT_FAST64_T 1 |
|---|
| 2375 | | /* end confdefs.h. */ |
|---|
| 2376 | | #include <stdio.h> |
|---|
| 2377 | | #ifdef HAVE_SYS_TYPES_H |
|---|
| 2378 | | # include <sys/types.h> |
|---|
| 2379 | | #endif |
|---|
| 2380 | | #ifdef HAVE_SYS_STAT_H |
|---|
| 2381 | | # include <sys/stat.h> |
|---|
| 2382 | | #endif |
|---|
| 2383 | | #ifdef STDC_HEADERS |
|---|
| 2384 | | # include <stdlib.h> |
|---|
| 2385 | | # include <stddef.h> |
|---|
| 2386 | | #else |
|---|
| 2387 | | # ifdef HAVE_STDLIB_H |
|---|
| 2388 | | # include <stdlib.h> |
|---|
| 2389 | | # endif |
|---|
| 2390 | | #endif |
|---|
| 2391 | | #ifdef HAVE_STRING_H |
|---|
| 2392 | | # if !defined STDC_HEADERS && defined HAVE_MEMORY_H |
|---|
| 2393 | | # include <memory.h> |
|---|
| 2394 | | # endif |
|---|
| 2395 | | # include <string.h> |
|---|
| 2396 | | #endif |
|---|
| 2397 | | #ifdef HAVE_STRINGS_H |
|---|
| 2398 | | # include <strings.h> |
|---|
| 2399 | | #endif |
|---|
| 2400 | | #ifdef HAVE_INTTYPES_H |
|---|
| 2401 | | # include <inttypes.h> |
|---|
| 2402 | | #endif |
|---|
| 2403 | | #ifdef HAVE_STDINT_H |
|---|
| 2404 | | # include <stdint.h> |
|---|
| 2405 | | #endif |
|---|
| 2406 | | #ifdef HAVE_UNISTD_H |
|---|
| 2407 | | # include <unistd.h> |
|---|
| 2408 | | #endif |
|---|
| 2409 | | int |
|---|
| 2410 | | main () |
|---|
| 2411 | | { |
|---|
| 2412 | | if (sizeof ((size_t))) |
|---|
| 2413 | | return 0; |
|---|
| 2414 | | ; |
|---|
| 2415 | | return 0; |
|---|
| 2416 | | } |
|---|
| 2417 | configure:21723: result: yes |
|---|
| 2418 | configure:21734: checking whether SIZE_MAX is declared |
|---|
| 2419 | configure:21767: /usr/bin/clang -o conftest -pipe -Os -flax-vector-conversions -arch x86_64 -I/opt/local/include -L/opt/local/lib -Wl,-headerpad_max_install_names -arch x86_64 conftest.c -lm >&5 |
|---|
| 2420 | configure:21767: $? = 0 |
|---|
| 2421 | configure:21767: ./conftest |
|---|
| 2422 | configure:21767: $? = 0 |
|---|
| 2423 | configure:21777: result: yes |
|---|
| 2424 | configure:21785: checking for blkcnt_t |
|---|
| 2425 | configure:21785: /usr/bin/clang -c -pipe -Os -flax-vector-conversions -arch x86_64 -I/opt/local/include conftest.c >&5 |
|---|
| 2426 | configure:21785: $? = 0 |
|---|
| 2427 | configure:21785: /usr/bin/clang -c -pipe -Os -flax-vector-conversions -arch x86_64 -I/opt/local/include conftest.c >&5 |
|---|
| 2428 | conftest.c:115:23: error: expected expression |
|---|
| 2429 | if (sizeof ((blkcnt_t))) |
|---|
| 2430 | ^ |
|---|
| 2431 | 1 error generated. |
|---|
| 2432 | configure:21785: $? = 1 |
|---|
| 2433 | configure: failed program was: |
|---|
| 2434 | | /* confdefs.h */ |
|---|
| 2435 | | #define PACKAGE_NAME "R" |
|---|
| 2436 | | #define PACKAGE_TARNAME "R" |
|---|
| 2437 | | #define PACKAGE_VERSION "3.1.0" |
|---|
| 2438 | | #define PACKAGE_STRING "R 3.1.0" |
|---|
| 2439 | | #define PACKAGE_BUGREPORT "http://bugs.r-project.org" |
|---|
| 2440 | | #define PACKAGE_URL "http://www.r-project.org" |
|---|
| 2441 | | #define PACKAGE "R" |
|---|
| 2442 | | #define VERSION "3.1.0" |
|---|
| 2443 | | #define R_PLATFORM "x86_64-apple-darwin13.2.0" |
|---|
| 2444 | | #define R_CPU "x86_64" |
|---|
| 2445 | | #define R_VENDOR "apple" |
|---|
| 2446 | | #define R_OS "darwin13.2.0" |
|---|
| 2447 | | #define Unix 1 |
|---|
| 2448 | | #define R_ARCH "" |
|---|
| 2449 | | #define STDC_HEADERS 1 |
|---|
| 2450 | | #define HAVE_SYS_TYPES_H 1 |
|---|
| 2451 | | #define HAVE_SYS_STAT_H 1 |
|---|
| 2452 | | #define HAVE_STDLIB_H 1 |
|---|
| 2453 | | #define HAVE_STRING_H 1 |
|---|
| 2454 | | #define HAVE_MEMORY_H 1 |
|---|
| 2455 | | #define HAVE_STRINGS_H 1 |
|---|
| 2456 | | #define HAVE_INTTYPES_H 1 |
|---|
| 2457 | | #define HAVE_STDINT_H 1 |
|---|
| 2458 | | #define HAVE_UNISTD_H 1 |
|---|
| 2459 | | #define __EXTENSIONS__ 1 |
|---|
| 2460 | | #define _ALL_SOURCE 1 |
|---|
| 2461 | | #define _GNU_SOURCE 1 |
|---|
| 2462 | | #define _POSIX_PTHREAD_SEMANTICS 1 |
|---|
| 2463 | | #define _TANDEM_SOURCE 1 |
|---|
| 2464 | | #define HAVE_DLFCN_H 1 |
|---|
| 2465 | | #define LT_OBJDIR ".libs/" |
|---|
| 2466 | | #define HAVE_LIBM 1 |
|---|
| 2467 | | #define HAVE_READLINE_HISTORY_H 1 |
|---|
| 2468 | | #define HAVE_READLINE_READLINE_H 1 |
|---|
| 2469 | | #define HAVE_LIBREADLINE 1 |
|---|
| 2470 | | #define HAVE_HISTORY_TRUNCATE_FILE 1 |
|---|
| 2471 | | #define HAVE_RL_COMPLETION_MATCHES 1 |
|---|
| 2472 | | #define STDC_HEADERS 1 |
|---|
| 2473 | | #define HAVE_DIRENT_H 1 |
|---|
| 2474 | | #define HAVE_SYS_WAIT_H 1 |
|---|
| 2475 | | #define HAVE_ARPA_INET_H 1 |
|---|
| 2476 | | #define HAVE_DLFCN_H 1 |
|---|
| 2477 | | #define HAVE_FCNTL_H 1 |
|---|
| 2478 | | #define HAVE_GLOB_H 1 |
|---|
| 2479 | | #define HAVE_GRP_H 1 |
|---|
| 2480 | | #define HAVE_LANGINFO_H 1 |
|---|
| 2481 | | #define HAVE_NETDB_H 1 |
|---|
| 2482 | | #define HAVE_NETINET_IN_H 1 |
|---|
| 2483 | | #define HAVE_PWD_H 1 |
|---|
| 2484 | | #define HAVE_SCHED_H 1 |
|---|
| 2485 | | #define HAVE_STRINGS_H 1 |
|---|
| 2486 | | #define HAVE_SYS_PARAM_H 1 |
|---|
| 2487 | | #define HAVE_SYS_RESOURCE_H 1 |
|---|
| 2488 | | #define HAVE_SYS_SELECT_H 1 |
|---|
| 2489 | | #define HAVE_SYS_SOCKET_H 1 |
|---|
| 2490 | | #define HAVE_SYS_STAT_H 1 |
|---|
| 2491 | | #define HAVE_SYS_TIME_H 1 |
|---|
| 2492 | | #define HAVE_SYS_TIMES_H 1 |
|---|
| 2493 | | #define HAVE_SYS_UTSNAME_H 1 |
|---|
| 2494 | | #define HAVE_UNISTD_H 1 |
|---|
| 2495 | | #define HAVE_UTIME_H 1 |
|---|
| 2496 | | #define HAVE_ERRNO_H 1 |
|---|
| 2497 | | #define HAVE_INTTYPES_H 1 |
|---|
| 2498 | | #define HAVE_LIMITS_H 1 |
|---|
| 2499 | | #define HAVE_LOCALE_H 1 |
|---|
| 2500 | | #define HAVE_STDARG_H 1 |
|---|
| 2501 | | #define HAVE_STDBOOL_H 1 |
|---|
| 2502 | | #define HAVE_STDINT_H 1 |
|---|
| 2503 | | #define HAVE_STRING_H 1 |
|---|
| 2504 | | #define HAVE_DECL_SIGSETJMP 1 |
|---|
| 2505 | | #define HAVE_DECL_SIGLONGJMP 1 |
|---|
| 2506 | | #define HAVE_POSIX_SETJMP 1 |
|---|
| 2507 | | #define RETSIGTYPE void |
|---|
| 2508 | | #define HAVE_INT64_T 1 |
|---|
| 2509 | | #define HAVE_INT_FAST64_T 1 |
|---|
| 2510 | | #define HAVE_DECL_SIZE_MAX 1 |
|---|
| 2511 | | /* end confdefs.h. */ |
|---|
| 2512 | | #include <stdio.h> |
|---|
| 2513 | | #ifdef HAVE_SYS_TYPES_H |
|---|
| 2514 | | # include <sys/types.h> |
|---|
| 2515 | | #endif |
|---|
| 2516 | | #ifdef HAVE_SYS_STAT_H |
|---|
| 2517 | | # include <sys/stat.h> |
|---|
| 2518 | | #endif |
|---|
| 2519 | | #ifdef STDC_HEADERS |
|---|
| 2520 | | # include <stdlib.h> |
|---|
| 2521 | | # include <stddef.h> |
|---|
| 2522 | | #else |
|---|
| 2523 | | # ifdef HAVE_STDLIB_H |
|---|
| 2524 | | # include <stdlib.h> |
|---|
| 2525 | | # endif |
|---|
| 2526 | | #endif |
|---|
| 2527 | | #ifdef HAVE_STRING_H |
|---|
| 2528 | | # if !defined STDC_HEADERS && defined HAVE_MEMORY_H |
|---|
| 2529 | | # include <memory.h> |
|---|
| 2530 | | # endif |
|---|
| 2531 | | # include <string.h> |
|---|
| 2532 | | #endif |
|---|
| 2533 | | #ifdef HAVE_STRINGS_H |
|---|
| 2534 | | # include <strings.h> |
|---|
| 2535 | | #endif |
|---|
| 2536 | | #ifdef HAVE_INTTYPES_H |
|---|
| 2537 | | # include <inttypes.h> |
|---|
| 2538 | | #endif |
|---|
| 2539 | | #ifdef HAVE_STDINT_H |
|---|
| 2540 | | # include <stdint.h> |
|---|
| 2541 | | #endif |
|---|
| 2542 | | #ifdef HAVE_UNISTD_H |
|---|
| 2543 | | # include <unistd.h> |
|---|
| 2544 | | #endif |
|---|
| 2545 | | int |
|---|
| 2546 | | main () |
|---|
| 2547 | | { |
|---|
| 2548 | | if (sizeof ((blkcnt_t))) |
|---|
| 2549 | | return 0; |
|---|
| 2550 | | ; |
|---|
| 2551 | | return 0; |
|---|
| 2552 | | } |
|---|
| 2553 | configure:21785: result: yes |
|---|
| 2554 | configure:21797: checking for type of socket length |
|---|
| 2555 | configure:21823: /usr/bin/clang -c -pipe -Os -flax-vector-conversions -arch x86_64 -I/opt/local/include conftest.c >&5 |
|---|
| 2556 | configure:21823: $? = 0 |
|---|
| 2557 | configure:21843: result: socklen_t * |
|---|
| 2558 | configure:21852: checking for stack_t |
|---|
| 2559 | configure:21852: /usr/bin/clang -c -pipe -Os -flax-vector-conversions -arch x86_64 -I/opt/local/include conftest.c >&5 |
|---|
| 2560 | configure:21852: $? = 0 |
|---|
| 2561 | configure:21852: /usr/bin/clang -c -pipe -Os -flax-vector-conversions -arch x86_64 -I/opt/local/include conftest.c >&5 |
|---|
| 2562 | conftest.c:85:22: error: expected expression |
|---|
| 2563 | if (sizeof ((stack_t))) |
|---|
| 2564 | ^ |
|---|
| 2565 | 1 error generated. |
|---|
| 2566 | configure:21852: $? = 1 |
|---|
| 2567 | configure: failed program was: |
|---|
| 2568 | | /* confdefs.h */ |
|---|
| 2569 | | #define PACKAGE_NAME "R" |
|---|
| 2570 | | #define PACKAGE_TARNAME "R" |
|---|
| 2571 | | #define PACKAGE_VERSION "3.1.0" |
|---|
| 2572 | | #define PACKAGE_STRING "R 3.1.0" |
|---|
| 2573 | | #define PACKAGE_BUGREPORT "http://bugs.r-project.org" |
|---|
| 2574 | | #define PACKAGE_URL "http://www.r-project.org" |
|---|
| 2575 | | #define PACKAGE "R" |
|---|
| 2576 | | #define VERSION "3.1.0" |
|---|
| 2577 | | #define R_PLATFORM "x86_64-apple-darwin13.2.0" |
|---|
| 2578 | | #define R_CPU "x86_64" |
|---|
| 2579 | | #define R_VENDOR "apple" |
|---|
| 2580 | | #define R_OS "darwin13.2.0" |
|---|
| 2581 | | #define Unix 1 |
|---|
| 2582 | | #define R_ARCH "" |
|---|
| 2583 | | #define STDC_HEADERS 1 |
|---|
| 2584 | | #define HAVE_SYS_TYPES_H 1 |
|---|
| 2585 | | #define HAVE_SYS_STAT_H 1 |
|---|
| 2586 | | #define HAVE_STDLIB_H 1 |
|---|
| 2587 | | #define HAVE_STRING_H 1 |
|---|
| 2588 | | #define HAVE_MEMORY_H 1 |
|---|
| 2589 | | #define HAVE_STRINGS_H 1 |
|---|
| 2590 | | #define HAVE_INTTYPES_H 1 |
|---|
| 2591 | | #define HAVE_STDINT_H 1 |
|---|
| 2592 | | #define HAVE_UNISTD_H 1 |
|---|
| 2593 | | #define __EXTENSIONS__ 1 |
|---|
| 2594 | | #define _ALL_SOURCE 1 |
|---|
| 2595 | | #define _GNU_SOURCE 1 |
|---|
| 2596 | | #define _POSIX_PTHREAD_SEMANTICS 1 |
|---|
| 2597 | | #define _TANDEM_SOURCE 1 |
|---|
| 2598 | | #define HAVE_DLFCN_H 1 |
|---|
| 2599 | | #define LT_OBJDIR ".libs/" |
|---|
| 2600 | | #define HAVE_LIBM 1 |
|---|
| 2601 | | #define HAVE_READLINE_HISTORY_H 1 |
|---|
| 2602 | | #define HAVE_READLINE_READLINE_H 1 |
|---|
| 2603 | | #define HAVE_LIBREADLINE 1 |
|---|
| 2604 | | #define HAVE_HISTORY_TRUNCATE_FILE 1 |
|---|
| 2605 | | #define HAVE_RL_COMPLETION_MATCHES 1 |
|---|
| 2606 | | #define STDC_HEADERS 1 |
|---|
| 2607 | | #define HAVE_DIRENT_H 1 |
|---|
| 2608 | | #define HAVE_SYS_WAIT_H 1 |
|---|
| 2609 | | #define HAVE_ARPA_INET_H 1 |
|---|
| 2610 | | #define HAVE_DLFCN_H 1 |
|---|
| 2611 | | #define HAVE_FCNTL_H 1 |
|---|
| 2612 | | #define HAVE_GLOB_H 1 |
|---|
| 2613 | | #define HAVE_GRP_H 1 |
|---|
| 2614 | | #define HAVE_LANGINFO_H 1 |
|---|
| 2615 | | #define HAVE_NETDB_H 1 |
|---|
| 2616 | | #define HAVE_NETINET_IN_H 1 |
|---|
| 2617 | | #define HAVE_PWD_H 1 |
|---|
| 2618 | | #define HAVE_SCHED_H 1 |
|---|
| 2619 | | #define HAVE_STRINGS_H 1 |
|---|
| 2620 | | #define HAVE_SYS_PARAM_H 1 |
|---|
| 2621 | | #define HAVE_SYS_RESOURCE_H 1 |
|---|
| 2622 | | #define HAVE_SYS_SELECT_H 1 |
|---|
| 2623 | | #define HAVE_SYS_SOCKET_H 1 |
|---|
| 2624 | | #define HAVE_SYS_STAT_H 1 |
|---|
| 2625 | | #define HAVE_SYS_TIME_H 1 |
|---|
| 2626 | | #define HAVE_SYS_TIMES_H 1 |
|---|
| 2627 | | #define HAVE_SYS_UTSNAME_H 1 |
|---|
| 2628 | | #define HAVE_UNISTD_H 1 |
|---|
| 2629 | | #define HAVE_UTIME_H 1 |
|---|
| 2630 | | #define HAVE_ERRNO_H 1 |
|---|
| 2631 | | #define HAVE_INTTYPES_H 1 |
|---|
| 2632 | | #define HAVE_LIMITS_H 1 |
|---|
| 2633 | | #define HAVE_LOCALE_H 1 |
|---|
| 2634 | | #define HAVE_STDARG_H 1 |
|---|
| 2635 | | #define HAVE_STDBOOL_H 1 |
|---|
| 2636 | | #define HAVE_STDINT_H 1 |
|---|
| 2637 | | #define HAVE_STRING_H 1 |
|---|
| 2638 | | #define HAVE_DECL_SIGSETJMP 1 |
|---|
| 2639 | | #define HAVE_DECL_SIGLONGJMP 1 |
|---|
| 2640 | | #define HAVE_POSIX_SETJMP 1 |
|---|
| 2641 | | #define RETSIGTYPE void |
|---|
| 2642 | | #define HAVE_INT64_T 1 |
|---|
| 2643 | | #define HAVE_INT_FAST64_T 1 |
|---|
| 2644 | | #define HAVE_DECL_SIZE_MAX 1 |
|---|
| 2645 | | #define R_SOCKLEN_T socklen_t |
|---|
| 2646 | | /* end confdefs.h. */ |
|---|
| 2647 | | #include <signal.h> |
|---|
| 2648 | | |
|---|
| 2649 | | int |
|---|
| 2650 | | main () |
|---|
| 2651 | | { |
|---|
| 2652 | | if (sizeof ((stack_t))) |
|---|
| 2653 | | return 0; |
|---|
| 2654 | | ; |
|---|
| 2655 | | return 0; |
|---|
| 2656 | | } |
|---|
| 2657 | configure:21852: result: yes |
|---|
| 2658 | configure:21868: checking for intptr_t |
|---|
| 2659 | configure:21868: /usr/bin/clang -c -pipe -Os -flax-vector-conversions -arch x86_64 -I/opt/local/include conftest.c >&5 |
|---|
| 2660 | configure:21868: $? = 0 |
|---|
| 2661 | configure:21868: /usr/bin/clang -c -pipe -Os -flax-vector-conversions -arch x86_64 -I/opt/local/include conftest.c >&5 |
|---|
| 2662 | conftest.c:91:23: error: expected expression |
|---|
| 2663 | if (sizeof ((intptr_t))) |
|---|
| 2664 | ^ |
|---|
| 2665 | 1 error generated. |
|---|
| 2666 | configure:21868: $? = 1 |
|---|
| 2667 | configure: failed program was: |
|---|
| 2668 | | /* confdefs.h */ |
|---|
| 2669 | | #define PACKAGE_NAME "R" |
|---|
| 2670 | | #define PACKAGE_TARNAME "R" |
|---|
| 2671 | | #define PACKAGE_VERSION "3.1.0" |
|---|
| 2672 | | #define PACKAGE_STRING "R 3.1.0" |
|---|
| 2673 | | #define PACKAGE_BUGREPORT "http://bugs.r-project.org" |
|---|
| 2674 | | #define PACKAGE_URL "http://www.r-project.org" |
|---|
| 2675 | | #define PACKAGE "R" |
|---|
| 2676 | | #define VERSION "3.1.0" |
|---|
| 2677 | | #define R_PLATFORM "x86_64-apple-darwin13.2.0" |
|---|
| 2678 | | #define R_CPU "x86_64" |
|---|
| 2679 | | #define R_VENDOR "apple" |
|---|
| 2680 | | #define R_OS "darwin13.2.0" |
|---|
| 2681 | | #define Unix 1 |
|---|
| 2682 | | #define R_ARCH "" |
|---|
| 2683 | | #define STDC_HEADERS 1 |
|---|
| 2684 | | #define HAVE_SYS_TYPES_H 1 |
|---|
| 2685 | | #define HAVE_SYS_STAT_H 1 |
|---|
| 2686 | | #define HAVE_STDLIB_H 1 |
|---|
| 2687 | | #define HAVE_STRING_H 1 |
|---|
| 2688 | | #define HAVE_MEMORY_H 1 |
|---|
| 2689 | | #define HAVE_STRINGS_H 1 |
|---|
| 2690 | | #define HAVE_INTTYPES_H 1 |
|---|
| 2691 | | #define HAVE_STDINT_H 1 |
|---|
| 2692 | | #define HAVE_UNISTD_H 1 |
|---|
| 2693 | | #define __EXTENSIONS__ 1 |
|---|
| 2694 | | #define _ALL_SOURCE 1 |
|---|
| 2695 | | #define _GNU_SOURCE 1 |
|---|
| 2696 | | #define _POSIX_PTHREAD_SEMANTICS 1 |
|---|
| 2697 | | #define _TANDEM_SOURCE 1 |
|---|
| 2698 | | #define HAVE_DLFCN_H 1 |
|---|
| 2699 | | #define LT_OBJDIR ".libs/" |
|---|
| 2700 | | #define HAVE_LIBM 1 |
|---|
| 2701 | | #define HAVE_READLINE_HISTORY_H 1 |
|---|
| 2702 | | #define HAVE_READLINE_READLINE_H 1 |
|---|
| 2703 | | #define HAVE_LIBREADLINE 1 |
|---|
| 2704 | | #define HAVE_HISTORY_TRUNCATE_FILE 1 |
|---|
| 2705 | | #define HAVE_RL_COMPLETION_MATCHES 1 |
|---|
| 2706 | | #define STDC_HEADERS 1 |
|---|
| 2707 | | #define HAVE_DIRENT_H 1 |
|---|
| 2708 | | #define HAVE_SYS_WAIT_H 1 |
|---|
| 2709 | | #define HAVE_ARPA_INET_H 1 |
|---|
| 2710 | | #define HAVE_DLFCN_H 1 |
|---|
| 2711 | | #define HAVE_FCNTL_H 1 |
|---|
| 2712 | | #define HAVE_GLOB_H 1 |
|---|
| 2713 | | #define HAVE_GRP_H 1 |
|---|
| 2714 | | #define HAVE_LANGINFO_H 1 |
|---|
| 2715 | | #define HAVE_NETDB_H 1 |
|---|
| 2716 | | #define HAVE_NETINET_IN_H 1 |
|---|
| 2717 | | #define HAVE_PWD_H 1 |
|---|
| 2718 | | #define HAVE_SCHED_H 1 |
|---|
| 2719 | | #define HAVE_STRINGS_H 1 |
|---|
| 2720 | | #define HAVE_SYS_PARAM_H 1 |
|---|
| 2721 | | #define HAVE_SYS_RESOURCE_H 1 |
|---|
| 2722 | | #define HAVE_SYS_SELECT_H 1 |
|---|
| 2723 | | #define HAVE_SYS_SOCKET_H 1 |
|---|
| 2724 | | #define HAVE_SYS_STAT_H 1 |
|---|
| 2725 | | #define HAVE_SYS_TIME_H 1 |
|---|
| 2726 | | #define HAVE_SYS_TIMES_H 1 |
|---|
| 2727 | | #define HAVE_SYS_UTSNAME_H 1 |
|---|
| 2728 | | #define HAVE_UNISTD_H 1 |
|---|
| 2729 | | #define HAVE_UTIME_H 1 |
|---|
| 2730 | | #define HAVE_ERRNO_H 1 |
|---|
| 2731 | | #define HAVE_INTTYPES_H 1 |
|---|
| 2732 | | #define HAVE_LIMITS_H 1 |
|---|
| 2733 | | #define HAVE_LOCALE_H 1 |
|---|
| 2734 | | #define HAVE_STDARG_H 1 |
|---|
| 2735 | | #define HAVE_STDBOOL_H 1 |
|---|
| 2736 | | #define HAVE_STDINT_H 1 |
|---|
| 2737 | | #define HAVE_STRING_H 1 |
|---|
| 2738 | | #define HAVE_DECL_SIGSETJMP 1 |
|---|
| 2739 | | #define HAVE_DECL_SIGLONGJMP 1 |
|---|
| 2740 | | #define HAVE_POSIX_SETJMP 1 |
|---|
| 2741 | | #define RETSIGTYPE void |
|---|
| 2742 | | #define HAVE_INT64_T 1 |
|---|
| 2743 | | #define HAVE_INT_FAST64_T 1 |
|---|
| 2744 | | #define HAVE_DECL_SIZE_MAX 1 |
|---|
| 2745 | | #define R_SOCKLEN_T socklen_t |
|---|
| 2746 | | #define HAVE_STACK_T 1 |
|---|
| 2747 | | /* end confdefs.h. */ |
|---|
| 2748 | | #ifdef HAVE_INTTYPES_H |
|---|
| 2749 | | #include <inttypes.h> |
|---|
| 2750 | | #endif |
|---|
| 2751 | | #ifdef HAVE_STDINT_H |
|---|
| 2752 | | #include <stdint.h> |
|---|
| 2753 | | #endif |
|---|
| 2754 | | |
|---|
| 2755 | | int |
|---|
| 2756 | | main () |
|---|
| 2757 | | { |
|---|
| 2758 | | if (sizeof ((intptr_t))) |
|---|
| 2759 | | return 0; |
|---|
| 2760 | | ; |
|---|
| 2761 | | return 0; |
|---|
| 2762 | | } |
|---|
| 2763 | configure:21868: result: yes |
|---|
| 2764 | configure:21883: checking for uintptr_t |
|---|
| 2765 | configure:21883: /usr/bin/clang -c -pipe -Os -flax-vector-conversions -arch x86_64 -I/opt/local/include conftest.c >&5 |
|---|
| 2766 | configure:21883: $? = 0 |
|---|
| 2767 | configure:21883: /usr/bin/clang -c -pipe -Os -flax-vector-conversions -arch x86_64 -I/opt/local/include conftest.c >&5 |
|---|
| 2768 | conftest.c:92:24: error: expected expression |
|---|
| 2769 | if (sizeof ((uintptr_t))) |
|---|
| 2770 | ^ |
|---|
| 2771 | 1 error generated. |
|---|
| 2772 | configure:21883: $? = 1 |
|---|
| 2773 | configure: failed program was: |
|---|
| 2774 | | /* confdefs.h */ |
|---|
| 2775 | | #define PACKAGE_NAME "R" |
|---|
| 2776 | | #define PACKAGE_TARNAME "R" |
|---|
| 2777 | | #define PACKAGE_VERSION "3.1.0" |
|---|
| 2778 | | #define PACKAGE_STRING "R 3.1.0" |
|---|
| 2779 | | #define PACKAGE_BUGREPORT "http://bugs.r-project.org" |
|---|
| 2780 | | #define PACKAGE_URL "http://www.r-project.org" |
|---|
| 2781 | | #define PACKAGE "R" |
|---|
| 2782 | | #define VERSION "3.1.0" |
|---|
| 2783 | | #define R_PLATFORM "x86_64-apple-darwin13.2.0" |
|---|
| 2784 | | #define R_CPU "x86_64" |
|---|
| 2785 | | #define R_VENDOR "apple" |
|---|
| 2786 | | #define R_OS "darwin13.2.0" |
|---|
| 2787 | | #define Unix 1 |
|---|
| 2788 | | #define R_ARCH "" |
|---|
| 2789 | | #define STDC_HEADERS 1 |
|---|
| 2790 | | #define HAVE_SYS_TYPES_H 1 |
|---|
| 2791 | | #define HAVE_SYS_STAT_H 1 |
|---|
| 2792 | | #define HAVE_STDLIB_H 1 |
|---|
| 2793 | | #define HAVE_STRING_H 1 |
|---|
| 2794 | | #define HAVE_MEMORY_H 1 |
|---|
| 2795 | | #define HAVE_STRINGS_H 1 |
|---|
| 2796 | | #define HAVE_INTTYPES_H 1 |
|---|
| 2797 | | #define HAVE_STDINT_H 1 |
|---|
| 2798 | | #define HAVE_UNISTD_H 1 |
|---|
| 2799 | | #define __EXTENSIONS__ 1 |
|---|
| 2800 | | #define _ALL_SOURCE 1 |
|---|
| 2801 | | #define _GNU_SOURCE 1 |
|---|
| 2802 | | #define _POSIX_PTHREAD_SEMANTICS 1 |
|---|
| 2803 | | #define _TANDEM_SOURCE 1 |
|---|
| 2804 | | #define HAVE_DLFCN_H 1 |
|---|
| 2805 | | #define LT_OBJDIR ".libs/" |
|---|
| 2806 | | #define HAVE_LIBM 1 |
|---|
| 2807 | | #define HAVE_READLINE_HISTORY_H 1 |
|---|
| 2808 | | #define HAVE_READLINE_READLINE_H 1 |
|---|
| 2809 | | #define HAVE_LIBREADLINE 1 |
|---|
| 2810 | | #define HAVE_HISTORY_TRUNCATE_FILE 1 |
|---|
| 2811 | | #define HAVE_RL_COMPLETION_MATCHES 1 |
|---|
| 2812 | | #define STDC_HEADERS 1 |
|---|
| 2813 | | #define HAVE_DIRENT_H 1 |
|---|
| 2814 | | #define HAVE_SYS_WAIT_H 1 |
|---|
| 2815 | | #define HAVE_ARPA_INET_H 1 |
|---|
| 2816 | | #define HAVE_DLFCN_H 1 |
|---|
| 2817 | | #define HAVE_FCNTL_H 1 |
|---|
| 2818 | | #define HAVE_GLOB_H 1 |
|---|
| 2819 | | #define HAVE_GRP_H 1 |
|---|
| 2820 | | #define HAVE_LANGINFO_H 1 |
|---|
| 2821 | | #define HAVE_NETDB_H 1 |
|---|
| 2822 | | #define HAVE_NETINET_IN_H 1 |
|---|
| 2823 | | #define HAVE_PWD_H 1 |
|---|
| 2824 | | #define HAVE_SCHED_H 1 |
|---|
| 2825 | | #define HAVE_STRINGS_H 1 |
|---|
| 2826 | | #define HAVE_SYS_PARAM_H 1 |
|---|
| 2827 | | #define HAVE_SYS_RESOURCE_H 1 |
|---|
| 2828 | | #define HAVE_SYS_SELECT_H 1 |
|---|
| 2829 | | #define HAVE_SYS_SOCKET_H 1 |
|---|
| 2830 | | #define HAVE_SYS_STAT_H 1 |
|---|
| 2831 | | #define HAVE_SYS_TIME_H 1 |
|---|
| 2832 | | #define HAVE_SYS_TIMES_H 1 |
|---|
| 2833 | | #define HAVE_SYS_UTSNAME_H 1 |
|---|
| 2834 | | #define HAVE_UNISTD_H 1 |
|---|
| 2835 | | #define HAVE_UTIME_H 1 |
|---|
| 2836 | | #define HAVE_ERRNO_H 1 |
|---|
| 2837 | | #define HAVE_INTTYPES_H 1 |
|---|
| 2838 | | #define HAVE_LIMITS_H 1 |
|---|
| 2839 | | #define HAVE_LOCALE_H 1 |
|---|
| 2840 | | #define HAVE_STDARG_H 1 |
|---|
| 2841 | | #define HAVE_STDBOOL_H 1 |
|---|
| 2842 | | #define HAVE_STDINT_H 1 |
|---|
| 2843 | | #define HAVE_STRING_H 1 |
|---|
| 2844 | | #define HAVE_DECL_SIGSETJMP 1 |
|---|
| 2845 | | #define HAVE_DECL_SIGLONGJMP 1 |
|---|
| 2846 | | #define HAVE_POSIX_SETJMP 1 |
|---|
| 2847 | | #define RETSIGTYPE void |
|---|
| 2848 | | #define HAVE_INT64_T 1 |
|---|
| 2849 | | #define HAVE_INT_FAST64_T 1 |
|---|
| 2850 | | #define HAVE_DECL_SIZE_MAX 1 |
|---|
| 2851 | | #define R_SOCKLEN_T socklen_t |
|---|
| 2852 | | #define HAVE_STACK_T 1 |
|---|
| 2853 | | #define HAVE_INTPTR_T 1 |
|---|
| 2854 | | /* end confdefs.h. */ |
|---|
| 2855 | | #ifdef HAVE_INTTYPES_H |
|---|
| 2856 | | #include <inttypes.h> |
|---|
| 2857 | | #endif |
|---|
| 2858 | | #ifdef HAVE_STDINT_H |
|---|
| 2859 | | #include <stdint.h> |
|---|
| 2860 | | #endif |
|---|
| 2861 | | |
|---|
| 2862 | | int |
|---|
| 2863 | | main () |
|---|
| 2864 | | { |
|---|
| 2865 | | if (sizeof ((uintptr_t))) |
|---|
| 2866 | | return 0; |
|---|
| 2867 | | ; |
|---|
| 2868 | | return 0; |
|---|
| 2869 | | } |
|---|
| 2870 | configure:21883: result: yes |
|---|
| 2871 | configure:21906: checking whether byte ordering is bigendian |
|---|
| 2872 | configure:21929: /usr/bin/clang -c -pipe -Os -flax-vector-conversions -arch x86_64 -I/opt/local/include conftest.c >&5 |
|---|
| 2873 | configure:21929: $? = 0 |
|---|
| 2874 | configure:21947: /usr/bin/clang -c -pipe -Os -flax-vector-conversions -arch x86_64 -I/opt/local/include conftest.c >&5 |
|---|
| 2875 | conftest.c:90:2: error: use of undeclared identifier 'not' |
|---|
| 2876 | not big endian |
|---|
| 2877 | ^ |
|---|
| 2878 | 1 error generated. |
|---|
| 2879 | configure:21947: $? = 1 |
|---|
| 2880 | configure: failed program was: |
|---|
| 2881 | | /* confdefs.h */ |
|---|
| 2882 | | #define PACKAGE_NAME "R" |
|---|
| 2883 | | #define PACKAGE_TARNAME "R" |
|---|
| 2884 | | #define PACKAGE_VERSION "3.1.0" |
|---|
| 2885 | | #define PACKAGE_STRING "R 3.1.0" |
|---|
| 2886 | | #define PACKAGE_BUGREPORT "http://bugs.r-project.org" |
|---|
| 2887 | | #define PACKAGE_URL "http://www.r-project.org" |
|---|
| 2888 | | #define PACKAGE "R" |
|---|
| 2889 | | #define VERSION "3.1.0" |
|---|
| 2890 | | #define R_PLATFORM "x86_64-apple-darwin13.2.0" |
|---|
| 2891 | | #define R_CPU "x86_64" |
|---|
| 2892 | | #define R_VENDOR "apple" |
|---|
| 2893 | | #define R_OS "darwin13.2.0" |
|---|
| 2894 | | #define Unix 1 |
|---|
| 2895 | | #define R_ARCH "" |
|---|
| 2896 | | #define STDC_HEADERS 1 |
|---|
| 2897 | | #define HAVE_SYS_TYPES_H 1 |
|---|
| 2898 | | #define HAVE_SYS_STAT_H 1 |
|---|
| 2899 | | #define HAVE_STDLIB_H 1 |
|---|
| 2900 | | #define HAVE_STRING_H 1 |
|---|
| 2901 | | #define HAVE_MEMORY_H 1 |
|---|
| 2902 | | #define HAVE_STRINGS_H 1 |
|---|
| 2903 | | #define HAVE_INTTYPES_H 1 |
|---|
| 2904 | | #define HAVE_STDINT_H 1 |
|---|
| 2905 | | #define HAVE_UNISTD_H 1 |
|---|
| 2906 | | #define __EXTENSIONS__ 1 |
|---|
| 2907 | | #define _ALL_SOURCE 1 |
|---|
| 2908 | | #define _GNU_SOURCE 1 |
|---|
| 2909 | | #define _POSIX_PTHREAD_SEMANTICS 1 |
|---|
| 2910 | | #define _TANDEM_SOURCE 1 |
|---|
| 2911 | | #define HAVE_DLFCN_H 1 |
|---|
| 2912 | | #define LT_OBJDIR ".libs/" |
|---|
| 2913 | | #define HAVE_LIBM 1 |
|---|
| 2914 | | #define HAVE_READLINE_HISTORY_H 1 |
|---|
| 2915 | | #define HAVE_READLINE_READLINE_H 1 |
|---|
| 2916 | | #define HAVE_LIBREADLINE 1 |
|---|
| 2917 | | #define HAVE_HISTORY_TRUNCATE_FILE 1 |
|---|
| 2918 | | #define HAVE_RL_COMPLETION_MATCHES 1 |
|---|
| 2919 | | #define STDC_HEADERS 1 |
|---|
| 2920 | | #define HAVE_DIRENT_H 1 |
|---|
| 2921 | | #define HAVE_SYS_WAIT_H 1 |
|---|
| 2922 | | #define HAVE_ARPA_INET_H 1 |
|---|
| 2923 | | #define HAVE_DLFCN_H 1 |
|---|
| 2924 | | #define HAVE_FCNTL_H 1 |
|---|
| 2925 | | #define HAVE_GLOB_H 1 |
|---|
| 2926 | | #define HAVE_GRP_H 1 |
|---|
| 2927 | | #define HAVE_LANGINFO_H 1 |
|---|
| 2928 | | #define HAVE_NETDB_H 1 |
|---|
| 2929 | | #define HAVE_NETINET_IN_H 1 |
|---|
| 2930 | | #define HAVE_PWD_H 1 |
|---|
| 2931 | | #define HAVE_SCHED_H 1 |
|---|
| 2932 | | #define HAVE_STRINGS_H 1 |
|---|
| 2933 | | #define HAVE_SYS_PARAM_H 1 |
|---|
| 2934 | | #define HAVE_SYS_RESOURCE_H 1 |
|---|
| 2935 | | #define HAVE_SYS_SELECT_H 1 |
|---|
| 2936 | | #define HAVE_SYS_SOCKET_H 1 |
|---|
| 2937 | | #define HAVE_SYS_STAT_H 1 |
|---|
| 2938 | | #define HAVE_SYS_TIME_H 1 |
|---|
| 2939 | | #define HAVE_SYS_TIMES_H 1 |
|---|
| 2940 | | #define HAVE_SYS_UTSNAME_H 1 |
|---|
| 2941 | | #define HAVE_UNISTD_H 1 |
|---|
| 2942 | | #define HAVE_UTIME_H 1 |
|---|
| 2943 | | #define HAVE_ERRNO_H 1 |
|---|
| 2944 | | #define HAVE_INTTYPES_H 1 |
|---|
| 2945 | | #define HAVE_LIMITS_H 1 |
|---|
| 2946 | | #define HAVE_LOCALE_H 1 |
|---|
| 2947 | | #define HAVE_STDARG_H 1 |
|---|
| 2948 | | #define HAVE_STDBOOL_H 1 |
|---|
| 2949 | | #define HAVE_STDINT_H 1 |
|---|
| 2950 | | #define HAVE_STRING_H 1 |
|---|
| 2951 | | #define HAVE_DECL_SIGSETJMP 1 |
|---|
| 2952 | | #define HAVE_DECL_SIGLONGJMP 1 |
|---|
| 2953 | | #define HAVE_POSIX_SETJMP 1 |
|---|
| 2954 | | #define RETSIGTYPE void |
|---|
| 2955 | | #define HAVE_INT64_T 1 |
|---|
| 2956 | | #define HAVE_INT_FAST64_T 1 |
|---|
| 2957 | | #define HAVE_DECL_SIZE_MAX 1 |
|---|
| 2958 | | #define R_SOCKLEN_T socklen_t |
|---|
| 2959 | | #define HAVE_STACK_T 1 |
|---|
| 2960 | | #define HAVE_INTPTR_T 1 |
|---|
| 2961 | | #define HAVE_UINTPTR_T 1 |
|---|
| 2962 | | /* end confdefs.h. */ |
|---|
| 2963 | | #include <sys/types.h> |
|---|
| 2964 | | #include <sys/param.h> |
|---|
| 2965 | | |
|---|
| 2966 | | int |
|---|
| 2967 | | main () |
|---|
| 2968 | | { |
|---|
| 2969 | | #if BYTE_ORDER != BIG_ENDIAN |
|---|
| 2970 | | not big endian |
|---|
| 2971 | | #endif |
|---|
| 2972 | | |
|---|
| 2973 | | ; |
|---|
| 2974 | | return 0; |
|---|
| 2975 | | } |
|---|
| 2976 | configure:22021: result: no |
|---|
| 2977 | configure:22035: checking for an ANSI C-conforming const |
|---|
| 2978 | configure:22101: /usr/bin/clang -c -pipe -Os -flax-vector-conversions -arch x86_64 -I/opt/local/include conftest.c >&5 |
|---|
| 2979 | configure:22101: $? = 0 |
|---|
| 2980 | configure:22108: result: yes |
|---|
| 2981 | configure:22120: checking for /usr/bin/clang option to accept ISO C99 |
|---|
| 2982 | configure:22269: /usr/bin/clang -c -pipe -Os -flax-vector-conversions -arch x86_64 -I/opt/local/include conftest.c >&5 |
|---|
| 2983 | configure:22269: $? = 0 |
|---|
| 2984 | configure:22282: result: none needed |
|---|
| 2985 | configure:22390: checking for /usr/bin/clang option to accept ISO Standard C |
|---|
| 2986 | configure:22401: result: none needed |
|---|
| 2987 | configure:22408: checking for inline |
|---|
| 2988 | configure:22423: /usr/bin/clang -c -pipe -Os -flax-vector-conversions -arch x86_64 -I/opt/local/include conftest.c >&5 |
|---|
| 2989 | configure:22423: $? = 0 |
|---|
| 2990 | configure:22430: result: inline |
|---|
| 2991 | configure:22446: checking size of int |
|---|
| 2992 | configure:22451: /usr/bin/clang -o conftest -pipe -Os -flax-vector-conversions -arch x86_64 -I/opt/local/include -L/opt/local/lib -Wl,-headerpad_max_install_names -arch x86_64 conftest.c -lm >&5 |
|---|
| 2993 | configure:22451: $? = 0 |
|---|
| 2994 | configure:22451: ./conftest |
|---|
| 2995 | configure:22451: $? = 0 |
|---|
| 2996 | configure:22465: result: 4 |
|---|
| 2997 | configure:22487: checking size of long |
|---|
| 2998 | configure:22492: /usr/bin/clang -o conftest -pipe -Os -flax-vector-conversions -arch x86_64 -I/opt/local/include -L/opt/local/lib -Wl,-headerpad_max_install_names -arch x86_64 conftest.c -lm >&5 |
|---|
| 2999 | configure:22492: $? = 0 |
|---|
| 3000 | configure:22492: ./conftest |
|---|
| 3001 | configure:22492: $? = 0 |
|---|
| 3002 | configure:22506: result: 8 |
|---|
| 3003 | configure:22520: checking size of long long |
|---|
| 3004 | configure:22525: /usr/bin/clang -o conftest -pipe -Os -flax-vector-conversions -arch x86_64 -I/opt/local/include -L/opt/local/lib -Wl,-headerpad_max_install_names -arch x86_64 conftest.c -lm >&5 |
|---|
| 3005 | configure:22525: $? = 0 |
|---|
| 3006 | configure:22525: ./conftest |
|---|
| 3007 | configure:22525: $? = 0 |
|---|
| 3008 | configure:22539: result: 8 |
|---|
| 3009 | configure:22553: checking size of double |
|---|
| 3010 | configure:22558: /usr/bin/clang -o conftest -pipe -Os -flax-vector-conversions -arch x86_64 -I/opt/local/include -L/opt/local/lib -Wl,-headerpad_max_install_names -arch x86_64 conftest.c -lm >&5 |
|---|
| 3011 | configure:22558: $? = 0 |
|---|
| 3012 | configure:22558: ./conftest |
|---|
| 3013 | configure:22558: $? = 0 |
|---|
| 3014 | configure:22572: result: 8 |
|---|
| 3015 | configure:22586: checking size of size_t |
|---|
| 3016 | configure:22591: /usr/bin/clang -o conftest -pipe -Os -flax-vector-conversions -arch x86_64 -I/opt/local/include -L/opt/local/lib -Wl,-headerpad_max_install_names -arch x86_64 conftest.c -lm >&5 |
|---|
| 3017 | configure:22591: $? = 0 |
|---|
| 3018 | configure:22591: ./conftest |
|---|
| 3019 | configure:22591: $? = 0 |
|---|
| 3020 | configure:22605: result: 8 |
|---|
| 3021 | configure:22635: checking size of long double |
|---|
| 3022 | configure:22640: /usr/bin/clang -o conftest -pipe -Os -flax-vector-conversions -arch x86_64 -I/opt/local/include -L/opt/local/lib -Wl,-headerpad_max_install_names -arch x86_64 conftest.c -lm >&5 |
|---|
| 3023 | configure:22640: $? = 0 |
|---|
| 3024 | configure:22640: ./conftest |
|---|
| 3025 | configure:22640: $? = 0 |
|---|
| 3026 | configure:22654: result: 16 |
|---|
| 3027 | configure:22670: checking whether we can compute C Make dependencies |
|---|
| 3028 | configure:22708: result: yes, using $(CC) -MM |
|---|
| 3029 | configure:22732: checking whether /usr/bin/clang supports -c -o FILE.lo |
|---|
| 3030 | configure:22742: /usr/bin/clang -pipe -Os -flax-vector-conversions -arch x86_64 -c conftest.c -o TMP/conftest.lo 1>&5 |
|---|
| 3031 | configure:22745: $? = 0 |
|---|
| 3032 | configure:22748: /usr/bin/clang -pipe -Os -flax-vector-conversions -arch x86_64 -c conftest.c -o TMP/conftest.lo 1>&5 |
|---|
| 3033 | configure:22751: $? = 0 |
|---|
| 3034 | configure:22759: result: yes |
|---|
| 3035 | configure:22866: checking how to get verbose linking output from /opt/local/bin/gfortran-mp-4.8 |
|---|
| 3036 | configure:22876: /opt/local/bin/gfortran-mp-4.8 -c -pipe -Os conftest.f >&5 |
|---|
| 3037 | <built-in>:0:0: internal compiler error: Illegal instruction: 4 |
|---|
| 3038 | |
|---|
| 3039 | <built-in>:0:0: internal compiler error: Abort trap: 6 |
|---|
| 3040 | gfortran-mp-4.8: internal compiler error: Abort trap: 6 (program f951) |
|---|
| 3041 | ./configure: line 2204: 25730 Abort trap: 6 $F77 -c $FFLAGS conftest.$ac_ext 1>&5 |
|---|
| 3042 | configure:22876: $? = 134 |
|---|
| 3043 | configure: failed program was: |
|---|
| 3044 | | program main |
|---|
| 3045 | | |
|---|
| 3046 | | end |
|---|
| 3047 | configure:22971: WARNING: compilation failed |
|---|
| 3048 | configure:22977: result: |
|---|
| 3049 | configure:22979: checking for Fortran 77 libraries of /opt/local/bin/gfortran-mp-4.8 |
|---|
| 3050 | configure:23002: /opt/local/bin/gfortran-mp-4.8 -o conftest -pipe -Os -L/opt/local/lib -Wl,-headerpad_max_install_names -arch x86_64 conftest.f |
|---|
| 3051 | <built-in>:0:0: internal compiler error: Illegal instruction: 4 |
|---|
| 3052 | |
|---|
| 3053 | <built-in>:0:0: internal compiler error: Abort trap: 6 |
|---|
| 3054 | gfortran-mp-4.8: internal compiler error: Abort trap: 6 (program f951) |
|---|
| 3055 | ./configure: line 23007: 25743 Abort trap: 6 $F77 -o conftest$ac_exeext $FFLAGS $LDFLAGS conftest.$ac_ext $LIBS 1>&5 |
|---|
| 3056 | configure:23198: result: |
|---|
| 3057 | configure:23216: checking how to get verbose linking output from /usr/bin/clang |
|---|
| 3058 | configure:23232: /usr/bin/clang -c -pipe -Os -flax-vector-conversions -arch x86_64 -I/opt/local/include conftest.c >&5 |
|---|
| 3059 | configure:23232: $? = 0 |
|---|
| 3060 | configure:23254: /usr/bin/clang -o conftest -pipe -Os -flax-vector-conversions -arch x86_64 -v -I/opt/local/include -L/opt/local/lib -Wl,-headerpad_max_install_names -arch x86_64 conftest.c >&5 |
|---|
| 3061 | Apple LLVM version 5.1 (clang-503.0.40) (based on LLVM 3.4svn) |
|---|
| 3062 | Target: x86_64-apple-darwin13.2.0 |
|---|
| 3063 | Thread model: posix |
|---|
| 3064 | clang -cc1 version 5.1 based upon LLVM 3.4svn default target x86_64-apple-darwin13.2.0 |
|---|
| 3065 | ignoring duplicate directory "/opt/local/include" |
|---|
| 3066 | #include "..." search starts here: |
|---|
| 3067 | #include <...> search starts here: |
|---|
| 3068 | /opt/local/include |
|---|
| 3069 | /usr/local/include |
|---|
| 3070 | /Applications/Xcode.app/Contents/Developer/Toolchains/XcodeDefault.xctoolchain/usr/bin/../lib/clang/5.1/include |
|---|
| 3071 | /Applications/Xcode.app/Contents/Developer/Toolchains/XcodeDefault.xctoolchain/usr/include |
|---|
| 3072 | /usr/include |
|---|
| 3073 | /System/Library/Frameworks (framework directory) |
|---|
| 3074 | /Library/Frameworks (framework directory) |
|---|
| 3075 | End of search list. |
|---|
| 3076 | configure:23254: /usr/bin/clang -o conftest -pipe -Os -flax-vector-conversions -arch x86_64 -verbose -I/opt/local/include -L/opt/local/lib -Wl,-headerpad_max_install_names -arch x86_64 conftest.c >&5 |
|---|
| 3077 | clang: error: unknown argument: '-verbose' [-Wunused-command-line-argument-hard-error-in-future] |
|---|
| 3078 | clang: note: this will be a hard error (cannot be downgraded to a warning) in the future |
|---|
| 3079 | configure:23254: /usr/bin/clang -o conftest -pipe -Os -flax-vector-conversions -arch x86_64 --verbose -I/opt/local/include -L/opt/local/lib -Wl,-headerpad_max_install_names -arch x86_64 conftest.c >&5 |
|---|
| 3080 | Apple LLVM version 5.1 (clang-503.0.40) (based on LLVM 3.4svn) |
|---|
| 3081 | Target: x86_64-apple-darwin13.2.0 |
|---|
| 3082 | Thread model: posix |
|---|
| 3083 | clang -cc1 version 5.1 based upon LLVM 3.4svn default target x86_64-apple-darwin13.2.0 |
|---|
| 3084 | ignoring duplicate directory "/opt/local/include" |
|---|
| 3085 | #include "..." search starts here: |
|---|
| 3086 | #include <...> search starts here: |
|---|
| 3087 | /opt/local/include |
|---|
| 3088 | /usr/local/include |
|---|
| 3089 | /Applications/Xcode.app/Contents/Developer/Toolchains/XcodeDefault.xctoolchain/usr/bin/../lib/clang/5.1/include |
|---|
| 3090 | /Applications/Xcode.app/Contents/Developer/Toolchains/XcodeDefault.xctoolchain/usr/include |
|---|
| 3091 | /usr/include |
|---|
| 3092 | /System/Library/Frameworks (framework directory) |
|---|
| 3093 | /Library/Frameworks (framework directory) |
|---|
| 3094 | End of search list. |
|---|
| 3095 | configure:23254: /usr/bin/clang -o conftest -pipe -Os -flax-vector-conversions -arch x86_64 -V -I/opt/local/include -L/opt/local/lib -Wl,-headerpad_max_install_names -arch x86_64 conftest.c >&5 |
|---|
| 3096 | clang: error: unsupported option '-V -I/opt/local/include' |
|---|
| 3097 | configure:23254: /usr/bin/clang -o conftest -pipe -Os -flax-vector-conversions -arch x86_64 -### -I/opt/local/include -L/opt/local/lib -Wl,-headerpad_max_install_names -arch x86_64 conftest.c >&5 |
|---|
| 3098 | Apple LLVM version 5.1 (clang-503.0.40) (based on LLVM 3.4svn) |
|---|
| 3099 | Target: x86_64-apple-darwin13.2.0 |
|---|
| 3100 | Thread model: posix |
|---|
| 3101 | "/Applications/Xcode.app/Contents/Developer/Toolchains/XcodeDefault.xctoolchain/usr/bin/clang" "-cc1" "-triple" "x86_64-apple-macosx10.9.0" "-emit-obj" "-disable-free" "-disable-llvm-verifier" "-main-file-name" "conftest.c" "-mrelocation-model" "pic" "-pic-level" "2" "-mdisable-fp-elim" "-masm-verbose" "-munwind-tables" "-target-cpu" "core2" "-target-linker-version" "236.3" "-resource-dir" "/Applications/Xcode.app/Contents/Developer/Toolchains/XcodeDefault.xctoolchain/usr/bin/../lib/clang/5.1" "-I" "/opt/local/include" "-I/opt/local/include" "-Os" "-fdebug-compilation-dir" "/opt/local/var/macports/build/_opt_local_var_macports_sources_rsync.macports.org_release_tarballs_ports_math_R/R/work/R-3.1.0" "-ferror-limit" "19" "-fmessage-length" "0" "-stack-protector" "1" "-mstackrealign" "-fblocks" "-fobjc-runtime=macosx-10.9.0" "-fencode-extended-block-signature" "-fdiagnostics-show-option" "-vectorize-loops" "-vectorize-slp" "-o" "/opt/local/var/macports/build/_opt_local_var_macports_sources_rsync.macports.org_release_tarballs_ports_math_R/R/work/.tmp/conftest-d4df95.o" "-x" "c" "conftest.c" |
|---|
| 3102 | "/Applications/Xcode.app/Contents/Developer/Toolchains/XcodeDefault.xctoolchain/usr/bin/ld" "-demangle" "-dynamic" "-arch" "x86_64" "-macosx_version_min" "10.9.0" "-o" "conftest" "-L/opt/local/lib" "-headerpad_max_install_names" "/opt/local/var/macports/build/_opt_local_var_macports_sources_rsync.macports.org_release_tarballs_ports_math_R/R/work/.tmp/conftest-d4df95.o" "-L/opt/local/lib" "-lSystem" "/Applications/Xcode.app/Contents/Developer/Toolchains/XcodeDefault.xctoolchain/usr/bin/../lib/clang/5.1/lib/darwin/libclang_rt.osx.a" |
|---|
| 3103 | configure:23290: WARNING: cannot determine how to obtain linking information from /usr/bin/clang |
|---|
| 3104 | configure:23300: result: |
|---|
| 3105 | configure:23302: checking for C libraries of /usr/bin/clang |
|---|
| 3106 | configure:23329: /usr/bin/clang -o conftest -pipe -Os -flax-vector-conversions -arch x86_64 -I/opt/local/include -L/opt/local/lib -Wl,-headerpad_max_install_names -arch x86_64 conftest.c >&5 |
|---|
| 3107 | |
|---|
| 3108 | configure:23480: result: |
|---|
| 3109 | configure:23615: checking for dummy main to link with Fortran 77 libraries |
|---|
| 3110 | configure:23649: /usr/bin/clang -o conftest -pipe -Os -flax-vector-conversions -arch x86_64 -I/opt/local/include -L/opt/local/lib -Wl,-headerpad_max_install_names -arch x86_64 conftest.c -lm >&5 |
|---|
| 3111 | configure:23649: $? = 0 |
|---|
| 3112 | configure:23694: result: none |
|---|
| 3113 | configure:23727: checking for Fortran 77 name-mangling scheme |
|---|
| 3114 | configure:23740: /opt/local/bin/gfortran-mp-4.8 -c -pipe -Os conftest.f >&5 |
|---|
| 3115 | <built-in>:0:0: internal compiler error: Illegal instruction: 4 |
|---|
| 3116 | |
|---|
| 3117 | <built-in>:0:0: internal compiler error: Abort trap: 6 |
|---|
| 3118 | gfortran-mp-4.8: internal compiler error: Abort trap: 6 (program f951) |
|---|
| 3119 | ./configure: line 2204: 25851 Abort trap: 6 $F77 -c $FFLAGS conftest.$ac_ext 1>&5 |
|---|
| 3120 | configure:23740: $? = 134 |
|---|
| 3121 | configure: failed program was: |
|---|
| 3122 | | subroutine foobar() |
|---|
| 3123 | | return |
|---|
| 3124 | | end |
|---|
| 3125 | | subroutine foo_bar() |
|---|
| 3126 | | return |
|---|
| 3127 | | end |
|---|
| 3128 | configure:23873: error: in `/opt/local/var/macports/build/_opt_local_var_macports_sources_rsync.macports.org_release_tarballs_ports_math_R/R/work/R-3.1.0': |
|---|
| 3129 | configure:23875: error: cannot compile a simple Fortran program |
|---|
| 3130 | See `config.log' for more details |
|---|
| 3131 | |
|---|
| 3132 | ## ---------------- ## |
|---|
| 3133 | ## Cache variables. ## |
|---|
| 3134 | ## ---------------- ## |
|---|
| 3135 | |
|---|
| 3136 | ac_cv_build=x86_64-apple-darwin13.2.0 |
|---|
| 3137 | ac_cv_c_bigendian=no |
|---|
| 3138 | ac_cv_c_compiler_gnu=yes |
|---|
| 3139 | ac_cv_c_const=yes |
|---|
| 3140 | ac_cv_c_uint64_t=yes |
|---|
| 3141 | ac_cv_cxx_compiler_gnu=yes |
|---|
| 3142 | ac_cv_env_BLAS_LIBS_set= |
|---|
| 3143 | ac_cv_env_BLAS_LIBS_value= |
|---|
| 3144 | ac_cv_env_CCC_set= |
|---|
| 3145 | ac_cv_env_CCC_value= |
|---|
| 3146 | ac_cv_env_CC_set=set |
|---|
| 3147 | ac_cv_env_CC_value=/usr/bin/clang |
|---|
| 3148 | ac_cv_env_CFLAGS_set=set |
|---|
| 3149 | ac_cv_env_CFLAGS_value='-pipe -Os -flax-vector-conversions -arch x86_64' |
|---|
| 3150 | ac_cv_env_CPICFLAGS_set= |
|---|
| 3151 | ac_cv_env_CPICFLAGS_value= |
|---|
| 3152 | ac_cv_env_CPPFLAGS_set=set |
|---|
| 3153 | ac_cv_env_CPPFLAGS_value=-I/opt/local/include |
|---|
| 3154 | ac_cv_env_CPP_set= |
|---|
| 3155 | ac_cv_env_CPP_value= |
|---|
| 3156 | ac_cv_env_CXX1XFLAGS_set= |
|---|
| 3157 | ac_cv_env_CXX1XFLAGS_value= |
|---|
| 3158 | ac_cv_env_CXX1XPICFLAGS_set= |
|---|
| 3159 | ac_cv_env_CXX1XPICFLAGS_value= |
|---|
| 3160 | ac_cv_env_CXX1XSTD_set= |
|---|
| 3161 | ac_cv_env_CXX1XSTD_value= |
|---|
| 3162 | ac_cv_env_CXX1X_set= |
|---|
| 3163 | ac_cv_env_CXX1X_value= |
|---|
| 3164 | ac_cv_env_CXXCPP_set= |
|---|
| 3165 | ac_cv_env_CXXCPP_value= |
|---|
| 3166 | ac_cv_env_CXXFLAGS_set=set |
|---|
| 3167 | ac_cv_env_CXXFLAGS_value='-pipe -Os -arch x86_64 -stdlib=libc++' |
|---|
| 3168 | ac_cv_env_CXXPICFLAGS_set= |
|---|
| 3169 | ac_cv_env_CXXPICFLAGS_value= |
|---|
| 3170 | ac_cv_env_CXX_set=set |
|---|
| 3171 | ac_cv_env_CXX_value=/usr/bin/clang++ |
|---|
| 3172 | ac_cv_env_DEFS_set= |
|---|
| 3173 | ac_cv_env_DEFS_value= |
|---|
| 3174 | ac_cv_env_DYLIB_LDFLAGS_set= |
|---|
| 3175 | ac_cv_env_DYLIB_LDFLAGS_value= |
|---|
| 3176 | ac_cv_env_DYLIB_LD_set= |
|---|
| 3177 | ac_cv_env_DYLIB_LD_value= |
|---|
| 3178 | ac_cv_env_F77_set=set |
|---|
| 3179 | ac_cv_env_F77_value=/opt/local/bin/gfortran-mp-4.8 |
|---|
| 3180 | ac_cv_env_FCFLAGS_set=set |
|---|
| 3181 | ac_cv_env_FCFLAGS_value='-pipe -Os -m64' |
|---|
| 3182 | ac_cv_env_FCPICFLAGS_set= |
|---|
| 3183 | ac_cv_env_FCPICFLAGS_value= |
|---|
| 3184 | ac_cv_env_FC_set=set |
|---|
| 3185 | ac_cv_env_FC_value=/opt/local/bin/gfortran-mp-4.8 |
|---|
| 3186 | ac_cv_env_FFLAGS_set=set |
|---|
| 3187 | ac_cv_env_FFLAGS_value='-pipe -Os' |
|---|
| 3188 | ac_cv_env_FPICFLAGS_set= |
|---|
| 3189 | ac_cv_env_FPICFLAGS_value= |
|---|
| 3190 | ac_cv_env_JAVA_HOME_set= |
|---|
| 3191 | ac_cv_env_JAVA_HOME_value= |
|---|
| 3192 | ac_cv_env_LAPACK_LIBS_set= |
|---|
| 3193 | ac_cv_env_LAPACK_LIBS_value= |
|---|
| 3194 | ac_cv_env_LDFLAGS_set=set |
|---|
| 3195 | ac_cv_env_LDFLAGS_value='-L/opt/local/lib -Wl,-headerpad_max_install_names -arch x86_64' |
|---|
| 3196 | ac_cv_env_LIBS_set= |
|---|
| 3197 | ac_cv_env_LIBS_value= |
|---|
| 3198 | ac_cv_env_LIBnn_set= |
|---|
| 3199 | ac_cv_env_LIBnn_value= |
|---|
| 3200 | ac_cv_env_MAIN_CFLAGS_set= |
|---|
| 3201 | ac_cv_env_MAIN_CFLAGS_value= |
|---|
| 3202 | ac_cv_env_MAIN_FFLAGS_set= |
|---|
| 3203 | ac_cv_env_MAIN_FFLAGS_value= |
|---|
| 3204 | ac_cv_env_MAIN_LDFLAGS_set= |
|---|
| 3205 | ac_cv_env_MAIN_LDFLAGS_value= |
|---|
| 3206 | ac_cv_env_MAIN_LD_set= |
|---|
| 3207 | ac_cv_env_MAIN_LD_value= |
|---|
| 3208 | ac_cv_env_MAKE_set= |
|---|
| 3209 | ac_cv_env_MAKE_value= |
|---|
| 3210 | ac_cv_env_OBJCFLAGS_set=set |
|---|
| 3211 | ac_cv_env_OBJCFLAGS_value='-pipe -Os -arch x86_64' |
|---|
| 3212 | ac_cv_env_OBJC_set=set |
|---|
| 3213 | ac_cv_env_OBJC_value=/usr/bin/clang |
|---|
| 3214 | ac_cv_env_R_BATCHSAVE_set= |
|---|
| 3215 | ac_cv_env_R_BATCHSAVE_value= |
|---|
| 3216 | ac_cv_env_R_BROWSER_set= |
|---|
| 3217 | ac_cv_env_R_BROWSER_value= |
|---|
| 3218 | ac_cv_env_R_PAPERSIZE_set= |
|---|
| 3219 | ac_cv_env_R_PAPERSIZE_value= |
|---|
| 3220 | ac_cv_env_R_PDFVIEWER_set= |
|---|
| 3221 | ac_cv_env_R_PDFVIEWER_value= |
|---|
| 3222 | ac_cv_env_R_PRINTCMD_set= |
|---|
| 3223 | ac_cv_env_R_PRINTCMD_value= |
|---|
| 3224 | ac_cv_env_R_SHELL_set= |
|---|
| 3225 | ac_cv_env_R_SHELL_value= |
|---|
| 3226 | ac_cv_env_SAFE_FFLAGS_set= |
|---|
| 3227 | ac_cv_env_SAFE_FFLAGS_value= |
|---|
| 3228 | ac_cv_env_SHLIB_CFLAGS_set= |
|---|
| 3229 | ac_cv_env_SHLIB_CFLAGS_value= |
|---|
| 3230 | ac_cv_env_SHLIB_CXX1XLDFLAGS_set= |
|---|
| 3231 | ac_cv_env_SHLIB_CXX1XLDFLAGS_value= |
|---|
| 3232 | ac_cv_env_SHLIB_CXX1XLD_set= |
|---|
| 3233 | ac_cv_env_SHLIB_CXX1XLD_value= |
|---|
| 3234 | ac_cv_env_SHLIB_CXXLDFLAGS_set= |
|---|
| 3235 | ac_cv_env_SHLIB_CXXLDFLAGS_value= |
|---|
| 3236 | ac_cv_env_SHLIB_CXXLD_set= |
|---|
| 3237 | ac_cv_env_SHLIB_CXXLD_value= |
|---|
| 3238 | ac_cv_env_SHLIB_FCLDFLAGS_set= |
|---|
| 3239 | ac_cv_env_SHLIB_FCLDFLAGS_value= |
|---|
| 3240 | ac_cv_env_SHLIB_FCLD_set= |
|---|
| 3241 | ac_cv_env_SHLIB_FCLD_value= |
|---|
| 3242 | ac_cv_env_SHLIB_FFLAGS_set= |
|---|
| 3243 | ac_cv_env_SHLIB_FFLAGS_value= |
|---|
| 3244 | ac_cv_env_SHLIB_LDFLAGS_set= |
|---|
| 3245 | ac_cv_env_SHLIB_LDFLAGS_value= |
|---|
| 3246 | ac_cv_env_SHLIB_LD_set= |
|---|
| 3247 | ac_cv_env_SHLIB_LD_value= |
|---|
| 3248 | ac_cv_env_TAR_set= |
|---|
| 3249 | ac_cv_env_TAR_value= |
|---|
| 3250 | ac_cv_env_TCLTK_CPPFLAGS_set= |
|---|
| 3251 | ac_cv_env_TCLTK_CPPFLAGS_value= |
|---|
| 3252 | ac_cv_env_TCLTK_LIBS_set= |
|---|
| 3253 | ac_cv_env_TCLTK_LIBS_value= |
|---|
| 3254 | ac_cv_env_XMKMF_set= |
|---|
| 3255 | ac_cv_env_XMKMF_value= |
|---|
| 3256 | ac_cv_env_YACC_set= |
|---|
| 3257 | ac_cv_env_YACC_value= |
|---|
| 3258 | ac_cv_env_YFLAGS_set= |
|---|
| 3259 | ac_cv_env_YFLAGS_value= |
|---|
| 3260 | ac_cv_env_build_alias_set= |
|---|
| 3261 | ac_cv_env_build_alias_value= |
|---|
| 3262 | ac_cv_env_host_alias_set= |
|---|
| 3263 | ac_cv_env_host_alias_value= |
|---|
| 3264 | ac_cv_env_r_arch_set= |
|---|
| 3265 | ac_cv_env_r_arch_value= |
|---|
| 3266 | ac_cv_env_target_alias_set= |
|---|
| 3267 | ac_cv_env_target_alias_value= |
|---|
| 3268 | ac_cv_f77_compiler_gnu=no |
|---|
| 3269 | ac_cv_f77_dummy_main=none |
|---|
| 3270 | ac_cv_f77_libs= |
|---|
| 3271 | ac_cv_fortran_dummy_main=none |
|---|
| 3272 | ac_cv_func_history_truncate_file=yes |
|---|
| 3273 | ac_cv_have_decl_rl_completion_matches=yes |
|---|
| 3274 | ac_cv_have_decl_siglongjmp=yes |
|---|
| 3275 | ac_cv_have_decl_sigsetjmp=yes |
|---|
| 3276 | ac_cv_header_arpa_inet_h=yes |
|---|
| 3277 | ac_cv_header_dirent_dirent_h=yes |
|---|
| 3278 | ac_cv_header_dl_h=no |
|---|
| 3279 | ac_cv_header_dlfcn_h=yes |
|---|
| 3280 | ac_cv_header_elf_h=no |
|---|
| 3281 | ac_cv_header_errno_h=yes |
|---|
| 3282 | ac_cv_header_fcntl_h=yes |
|---|
| 3283 | ac_cv_header_floatingpoint_h=no |
|---|
| 3284 | ac_cv_header_fpu_control_h=no |
|---|
| 3285 | ac_cv_header_glob_h=yes |
|---|
| 3286 | ac_cv_header_grp_h=yes |
|---|
| 3287 | ac_cv_header_inttypes_h=yes |
|---|
| 3288 | ac_cv_header_langinfo_h=yes |
|---|
| 3289 | ac_cv_header_limits_h=yes |
|---|
| 3290 | ac_cv_header_locale_h=yes |
|---|
| 3291 | ac_cv_header_memory_h=yes |
|---|
| 3292 | ac_cv_header_minix_config_h=no |
|---|
| 3293 | ac_cv_header_netdb_h=yes |
|---|
| 3294 | ac_cv_header_netinet_in_h=yes |
|---|
| 3295 | ac_cv_header_pwd_h=yes |
|---|
| 3296 | ac_cv_header_readline_history_h=yes |
|---|
| 3297 | ac_cv_header_readline_readline_h=yes |
|---|
| 3298 | ac_cv_header_sched_h=yes |
|---|
| 3299 | ac_cv_header_stdarg_h=yes |
|---|
| 3300 | ac_cv_header_stdbool_h=yes |
|---|
| 3301 | ac_cv_header_stdc=yes |
|---|
| 3302 | ac_cv_header_stdint_h=yes |
|---|
| 3303 | ac_cv_header_stdlib_h=yes |
|---|
| 3304 | ac_cv_header_string_h=yes |
|---|
| 3305 | ac_cv_header_strings_h=yes |
|---|
| 3306 | ac_cv_header_sys_param_h=yes |
|---|
| 3307 | ac_cv_header_sys_resource_h=yes |
|---|
| 3308 | ac_cv_header_sys_select_h=yes |
|---|
| 3309 | ac_cv_header_sys_socket_h=yes |
|---|
| 3310 | ac_cv_header_sys_stat_h=yes |
|---|
| 3311 | ac_cv_header_sys_time_h=yes |
|---|
| 3312 | ac_cv_header_sys_times_h=yes |
|---|
| 3313 | ac_cv_header_sys_types_h=yes |
|---|
| 3314 | ac_cv_header_sys_utsname_h=yes |
|---|
| 3315 | ac_cv_header_sys_wait_h=yes |
|---|
| 3316 | ac_cv_header_unistd_h=yes |
|---|
| 3317 | ac_cv_header_utime_h=yes |
|---|
| 3318 | ac_cv_host=x86_64-apple-darwin13.2.0 |
|---|
| 3319 | ac_cv_lib_m_sin=yes |
|---|
| 3320 | ac_cv_lib_readline_rl_callback_read_char=yes |
|---|
| 3321 | ac_cv_objc_compiler_gnu=yes |
|---|
| 3322 | ac_cv_objext=o |
|---|
| 3323 | ac_cv_path_EGREP='/opt/local/bin/grep -E' |
|---|
| 3324 | ac_cv_path_FGREP='/opt/local/bin/grep -F' |
|---|
| 3325 | ac_cv_path_GETWD=/bin/pwd |
|---|
| 3326 | ac_cv_path_GREP=/opt/local/bin/grep |
|---|
| 3327 | ac_cv_path_INSTALL_INFO=/opt/local/bin/install-info |
|---|
| 3328 | ac_cv_path_KPSEWHICH=/opt/local/bin/kpsewhich |
|---|
| 3329 | ac_cv_path_MAKEINDEX=/opt/local/bin/makeindex |
|---|
| 3330 | ac_cv_path_MAKEINFO=/opt/local/bin/makeinfo |
|---|
| 3331 | ac_cv_path_NOTANGLE=false |
|---|
| 3332 | ac_cv_path_PAGER=/opt/local/bin/less |
|---|
| 3333 | ac_cv_path_PDFLATEX=/opt/local/bin/pdflatex |
|---|
| 3334 | ac_cv_path_PDFTEX=/opt/local/bin/pdftex |
|---|
| 3335 | ac_cv_path_PKGCONF=/opt/local/bin/pkg-config |
|---|
| 3336 | ac_cv_path_REALPATH=false |
|---|
| 3337 | ac_cv_path_R_BROWSER=/opt/local/bin/xdg-open |
|---|
| 3338 | ac_cv_path_R_BZIPCMD=/opt/local/bin/bzip2 |
|---|
| 3339 | ac_cv_path_R_GZIPCMD=/opt/local/bin/gzip |
|---|
| 3340 | ac_cv_path_R_PDFVIEWER=/opt/local/bin/xdg-open |
|---|
| 3341 | ac_cv_path_R_UNZIPCMD=/usr/bin/unzip |
|---|
| 3342 | ac_cv_path_R_ZIPCMD=/usr/bin/zip |
|---|
| 3343 | ac_cv_path_SED=/usr/bin/sed |
|---|
| 3344 | ac_cv_path_TAR=/usr/bin/tar |
|---|
| 3345 | ac_cv_path_TEX=/opt/local/bin/tex |
|---|
| 3346 | ac_cv_path_TEXI2DVI=/opt/local/bin/texi2dvi |
|---|
| 3347 | ac_cv_path_WHICH=/usr/bin/which |
|---|
| 3348 | ac_cv_prog_AR=ar |
|---|
| 3349 | ac_cv_prog_AWK=gawk |
|---|
| 3350 | ac_cv_prog_CPP='/usr/bin/clang -E' |
|---|
| 3351 | ac_cv_prog_CXXCPP='/usr/bin/clang++ -E' |
|---|
| 3352 | ac_cv_prog_YACC='bison -y' |
|---|
| 3353 | ac_cv_prog_ac_ct_CC=/usr/bin/clang |
|---|
| 3354 | ac_cv_prog_ac_ct_DSYMUTIL=dsymutil |
|---|
| 3355 | ac_cv_prog_ac_ct_LIPO=lipo |
|---|
| 3356 | ac_cv_prog_ac_ct_NMEDIT=nmedit |
|---|
| 3357 | ac_cv_prog_ac_ct_OTOOL=otool |
|---|
| 3358 | ac_cv_prog_ac_ct_RANLIB=ranlib |
|---|
| 3359 | ac_cv_prog_ac_ct_STRIP=strip |
|---|
| 3360 | ac_cv_prog_cc_c89= |
|---|
| 3361 | ac_cv_prog_cc_c99= |
|---|
| 3362 | ac_cv_prog_cc_g=yes |
|---|
| 3363 | ac_cv_prog_cc_stdc= |
|---|
| 3364 | ac_cv_prog_cxx_g=yes |
|---|
| 3365 | ac_cv_prog_f77_g=no |
|---|
| 3366 | ac_cv_prog_gcc_traditional=no |
|---|
| 3367 | ac_cv_prog_objc_g=yes |
|---|
| 3368 | ac_cv_safe_to_define___extensions__=yes |
|---|
| 3369 | ac_cv_search_dlopen='none required' |
|---|
| 3370 | ac_cv_search_opendir='none required' |
|---|
| 3371 | ac_cv_sizeof_double=8 |
|---|
| 3372 | ac_cv_sizeof_int=4 |
|---|
| 3373 | ac_cv_sizeof_long=8 |
|---|
| 3374 | ac_cv_sizeof_long_double=16 |
|---|
| 3375 | ac_cv_sizeof_long_long=8 |
|---|
| 3376 | ac_cv_sizeof_size_t=8 |
|---|
| 3377 | ac_cv_type_blkcnt_t=yes |
|---|
| 3378 | ac_cv_type_int64_t=yes |
|---|
| 3379 | ac_cv_type_int_fast64_t=yes |
|---|
| 3380 | ac_cv_type_intptr_t=yes |
|---|
| 3381 | ac_cv_type_pid_t=yes |
|---|
| 3382 | ac_cv_type_signal=void |
|---|
| 3383 | ac_cv_type_size_t=yes |
|---|
| 3384 | ac_cv_type_stack_t=yes |
|---|
| 3385 | ac_cv_type_uintptr_t=yes |
|---|
| 3386 | lt_cv_apple_cc_single_mod=yes |
|---|
| 3387 | lt_cv_deplibs_check_method=pass_all |
|---|
| 3388 | lt_cv_file_magic_cmd='$MAGIC_CMD' |
|---|
| 3389 | lt_cv_file_magic_test_file= |
|---|
| 3390 | lt_cv_ld_exported_symbols_list=yes |
|---|
| 3391 | lt_cv_ld_reload_flag=-r |
|---|
| 3392 | lt_cv_nm_interface='BSD nm' |
|---|
| 3393 | lt_cv_objdir=.libs |
|---|
| 3394 | lt_cv_path_LD=/Applications/Xcode.app/Contents/Developer/Toolchains/XcodeDefault.xctoolchain/usr/bin/ld |
|---|
| 3395 | lt_cv_path_LDCXX=/Applications/Xcode.app/Contents/Developer/Toolchains/XcodeDefault.xctoolchain/usr/bin/ld |
|---|
| 3396 | lt_cv_path_NM=/opt/local/bin/nm |
|---|
| 3397 | lt_cv_prog_compiler_c_o=yes |
|---|
| 3398 | lt_cv_prog_compiler_c_o_CXX=yes |
|---|
| 3399 | lt_cv_prog_compiler_c_o_F77=no |
|---|
| 3400 | lt_cv_prog_compiler_pic_works=yes |
|---|
| 3401 | lt_cv_prog_compiler_pic_works_CXX=yes |
|---|
| 3402 | lt_cv_prog_compiler_rtti_exceptions=yes |
|---|
| 3403 | lt_cv_prog_compiler_static_works=no |
|---|
| 3404 | lt_cv_prog_compiler_static_works_CXX=no |
|---|
| 3405 | lt_cv_prog_compiler_static_works_F77=no |
|---|
| 3406 | lt_cv_prog_gnu_ld=no |
|---|
| 3407 | lt_cv_prog_gnu_ldcxx=no |
|---|
| 3408 | lt_cv_sys_global_symbol_pipe='sed -n -e '\''s/^.*[ ]\([BCDEGRST][BCDEGRST]*\)[ ][ ]*_\([_A-Za-z][_A-Za-z0-9]*\)$/\1 _\2 \2/p'\''' |
|---|
| 3409 | lt_cv_sys_global_symbol_to_c_name_address='sed -n -e '\''s/^: \([^ ]*\) $/ {\"\1\", (void *) 0},/p'\'' -e '\''s/^[BCDEGRST]* \([^ ]*\) \([^ ]*\)$/ {"\2", (void *) \&\2},/p'\''' |
|---|
| 3410 | lt_cv_sys_global_symbol_to_c_name_address_lib_prefix='sed -n -e '\''s/^: \([^ ]*\) $/ {\"\1\", (void *) 0},/p'\'' -e '\''s/^[BCDEGRST]* \([^ ]*\) \(lib[^ ]*\)$/ {"\2", (void *) \&\2},/p'\'' -e '\''s/^[BCDEGRST]* \([^ ]*\) \([^ ]*\)$/ {"lib\2", (void *) \&\2},/p'\''' |
|---|
| 3411 | lt_cv_sys_global_symbol_to_cdecl='sed -n -e '\''s/^T .* \(.*\)$/extern int \1();/p'\'' -e '\''s/^[BCDEGRST]* .* \(.*\)$/extern char \1;/p'\''' |
|---|
| 3412 | lt_cv_sys_max_cmd_len=196608 |
|---|
| 3413 | r_cv_OBJCXX=/usr/bin/clang++ |
|---|
| 3414 | r_cv_c_inline=inline |
|---|
| 3415 | r_cv_c_libs= |
|---|
| 3416 | r_cv_header_glibc2=no |
|---|
| 3417 | r_cv_header_setjmp_posix=yes |
|---|
| 3418 | r_cv_prog_c_v= |
|---|
| 3419 | r_cv_prog_cc_c_o_lo=yes |
|---|
| 3420 | r_cv_prog_cc_m='$(CC) -MM' |
|---|
| 3421 | r_cv_prog_cc_vis=yes |
|---|
| 3422 | r_cv_prog_f77_vis=no |
|---|
| 3423 | r_cv_prog_makeinfo_v4=yes |
|---|
| 3424 | r_cv_size_max=yes |
|---|
| 3425 | r_cv_type_socklen=socklen_t |
|---|
| 3426 | r_cv_visibility_attribute=no |
|---|
| 3427 | |
|---|
| 3428 | ## ----------------- ## |
|---|
| 3429 | ## Output variables. ## |
|---|
| 3430 | ## ----------------- ## |
|---|
| 3431 | |
|---|
| 3432 | ACLOCAL='aclocal' |
|---|
| 3433 | ALLOCA='' |
|---|
| 3434 | AR='ar' |
|---|
| 3435 | ARFLAGS='rc' |
|---|
| 3436 | AUTOCONF='autoconf' |
|---|
| 3437 | AUTOHEADER='autoheader' |
|---|
| 3438 | AUTOMAKE='automake' |
|---|
| 3439 | AWK='gawk' |
|---|
| 3440 | BITMAP_LIBS='' |
|---|
| 3441 | BLAS_LIBS0='' |
|---|
| 3442 | BLAS_LIBS='' |
|---|
| 3443 | BLAS_SHLIB_FALSE='' |
|---|
| 3444 | BLAS_SHLIB_TRUE='' |
|---|
| 3445 | BUILDDIR_IS_SRCDIR='yes' |
|---|
| 3446 | BUILD_AQUA_FALSE='' |
|---|
| 3447 | BUILD_AQUA_TRUE='' |
|---|
| 3448 | BUILD_BZLIB_FALSE='' |
|---|
| 3449 | BUILD_BZLIB_TRUE='' |
|---|
| 3450 | BUILD_CC='' |
|---|
| 3451 | BUILD_CYGWIN_FALSE='' |
|---|
| 3452 | BUILD_CYGWIN_TRUE='' |
|---|
| 3453 | BUILD_DEVCAIRO_FALSE='' |
|---|
| 3454 | BUILD_DEVCAIRO_TRUE='' |
|---|
| 3455 | BUILD_HTML_FALSE='' |
|---|
| 3456 | BUILD_HTML_TRUE='#' |
|---|
| 3457 | BUILD_INCLUDED_LIBINTL='' |
|---|
| 3458 | BUILD_LIBINTL_FALSE='' |
|---|
| 3459 | BUILD_LIBINTL_TRUE='' |
|---|
| 3460 | BUILD_LTO_FALSE='' |
|---|
| 3461 | BUILD_LTO_TRUE='#' |
|---|
| 3462 | BUILD_PCRE_FALSE='' |
|---|
| 3463 | BUILD_PCRE_TRUE='' |
|---|
| 3464 | BUILD_R='' |
|---|
| 3465 | BUILD_TRE_FALSE='' |
|---|
| 3466 | BUILD_TRE_TRUE='' |
|---|
| 3467 | BUILD_TZONE_FALSE='' |
|---|
| 3468 | BUILD_TZONE_TRUE='' |
|---|
| 3469 | BUILD_X11_FALSE='' |
|---|
| 3470 | BUILD_X11_TRUE='' |
|---|
| 3471 | BUILD_XDR_FALSE='' |
|---|
| 3472 | BUILD_XDR_TRUE='' |
|---|
| 3473 | BUILD_XZ_FALSE='' |
|---|
| 3474 | BUILD_XZ_TRUE='' |
|---|
| 3475 | BUILD_ZLIB_FALSE='' |
|---|
| 3476 | BUILD_ZLIB_TRUE='' |
|---|
| 3477 | BYTE_COMPILE_PACKAGES_FALSE='#' |
|---|
| 3478 | BYTE_COMPILE_PACKAGES_TRUE='' |
|---|
| 3479 | CAIROX11_CPPFLAGS='' |
|---|
| 3480 | CAIROX11_LIBS='' |
|---|
| 3481 | CAIRO_CPPFLAGS='' |
|---|
| 3482 | CAIRO_LIBS='' |
|---|
| 3483 | CATOBJEXT='' |
|---|
| 3484 | CC='/usr/bin/clang' |
|---|
| 3485 | CFLAGS='-pipe -Os -flax-vector-conversions -arch x86_64' |
|---|
| 3486 | CFLAG_VISIBILITY='' |
|---|
| 3487 | COMPILE_FORTRAN_DOUBLE_COMPLEX_FALSE='' |
|---|
| 3488 | COMPILE_FORTRAN_DOUBLE_COMPLEX_TRUE='' |
|---|
| 3489 | CPICFLAGS='' |
|---|
| 3490 | CPP='/usr/bin/clang -E' |
|---|
| 3491 | CPPFLAGS='-I/opt/local/include' |
|---|
| 3492 | CROSS_COMPILING_FALSE='' |
|---|
| 3493 | CROSS_COMPILING_TRUE='#' |
|---|
| 3494 | CXX1X='' |
|---|
| 3495 | CXX1XFLAGS='' |
|---|
| 3496 | CXX1XPICFLAGS='' |
|---|
| 3497 | CXX1XSTD='' |
|---|
| 3498 | CXX='/usr/bin/clang++' |
|---|
| 3499 | CXXCPP0='$(CXX) -E' |
|---|
| 3500 | CXXCPP='/usr/bin/clang++ -E' |
|---|
| 3501 | CXXFLAGS='-pipe -Os -arch x86_64 -stdlib=libc++' |
|---|
| 3502 | CXXPICFLAGS='' |
|---|
| 3503 | C_VISIBILITY='' |
|---|
| 3504 | DATADIRNAME='' |
|---|
| 3505 | DEFS='' |
|---|
| 3506 | DSYMUTIL='dsymutil' |
|---|
| 3507 | DUMPBIN='' |
|---|
| 3508 | DYLIB_EXT='' |
|---|
| 3509 | DYLIB_LD='' |
|---|
| 3510 | DYLIB_LDFLAGS='' |
|---|
| 3511 | DYLIB_UNDEFINED_ALLOWED_FALSE='' |
|---|
| 3512 | DYLIB_UNDEFINED_ALLOWED_TRUE='' |
|---|
| 3513 | ECHO_C='\c' |
|---|
| 3514 | ECHO_N='' |
|---|
| 3515 | ECHO_T='' |
|---|
| 3516 | EGREP='/opt/local/bin/grep -E' |
|---|
| 3517 | EXEEXT='' |
|---|
| 3518 | F77='/opt/local/bin/gfortran-mp-4.8' |
|---|
| 3519 | F77_VISIBILITY='' |
|---|
| 3520 | FC='/opt/local/bin/gfortran-mp-4.8' |
|---|
| 3521 | FCFLAGS='-pipe -Os -m64' |
|---|
| 3522 | FCFLAGS_f90='' |
|---|
| 3523 | FCFLAGS_f95='' |
|---|
| 3524 | FCLIBS='' |
|---|
| 3525 | FCPICFLAGS='' |
|---|
| 3526 | FFLAGS='-pipe -Os' |
|---|
| 3527 | FGREP='/opt/local/bin/grep -F' |
|---|
| 3528 | FLIBS='' |
|---|
| 3529 | FLIBS_IN_SO='' |
|---|
| 3530 | FOUNDATION_CPPFLAGS='' |
|---|
| 3531 | FOUNDATION_LIBS='' |
|---|
| 3532 | FPICFLAGS='' |
|---|
| 3533 | FW_VERSION='3.1' |
|---|
| 3534 | GENCAT='' |
|---|
| 3535 | GETWD='/bin/pwd' |
|---|
| 3536 | GLIBC21='' |
|---|
| 3537 | GLIBC2='' |
|---|
| 3538 | GREP='/opt/local/bin/grep' |
|---|
| 3539 | HAVE_ASPRINTF='' |
|---|
| 3540 | HAVE_CXX11='' |
|---|
| 3541 | HAVE_FORTRAN_DOUBLE_COMPLEX='' |
|---|
| 3542 | HAVE_POSIX_PRINTF='' |
|---|
| 3543 | HAVE_SNPRINTF='' |
|---|
| 3544 | HAVE_VISIBILITY='' |
|---|
| 3545 | HAVE_WPRINTF='' |
|---|
| 3546 | INSTALL_DATA='${INSTALL} -m 644' |
|---|
| 3547 | INSTALL_INFO='/opt/local/bin/install-info' |
|---|
| 3548 | INSTALL_PROGRAM='${INSTALL}' |
|---|
| 3549 | INSTALL_SCRIPT='${INSTALL}' |
|---|
| 3550 | INSTOBJEXT='' |
|---|
| 3551 | INTLBISON='' |
|---|
| 3552 | INTLLIBS='' |
|---|
| 3553 | INTLOBJS='' |
|---|
| 3554 | INTL_LIBTOOL_SUFFIX_PREFIX='' |
|---|
| 3555 | INTL_MACOSX_LIBS='' |
|---|
| 3556 | JAR='' |
|---|
| 3557 | JAVA='' |
|---|
| 3558 | JAVAC='' |
|---|
| 3559 | JAVAH='' |
|---|
| 3560 | JAVA_CPPFLAGS0='' |
|---|
| 3561 | JAVA_HOME='' |
|---|
| 3562 | JAVA_LD_LIBRARY_PATH='' |
|---|
| 3563 | JAVA_LIBS0='' |
|---|
| 3564 | KPSEWHICH='/opt/local/bin/kpsewhich' |
|---|
| 3565 | LAPACK_LDFLAGS='' |
|---|
| 3566 | LAPACK_LIBS='' |
|---|
| 3567 | LD='/Applications/Xcode.app/Contents/Developer/Toolchains/XcodeDefault.xctoolchain/usr/bin/ld' |
|---|
| 3568 | LDFLAGS='-L/opt/local/lib -Wl,-headerpad_max_install_names -arch x86_64' |
|---|
| 3569 | LIBICONV='' |
|---|
| 3570 | LIBINTL='' |
|---|
| 3571 | LIBM='' |
|---|
| 3572 | LIBMULTITHREAD='' |
|---|
| 3573 | LIBOBJS='' |
|---|
| 3574 | LIBPTH='' |
|---|
| 3575 | LIBR='-L$(R_HOME)/lib$(R_ARCH) -lR' |
|---|
| 3576 | LIBR_LDFLAGS='' |
|---|
| 3577 | LIBS='-lm ' |
|---|
| 3578 | LIBTHREAD='' |
|---|
| 3579 | LIBTOOL='$(SHELL) $(top_builddir)/libtool' |
|---|
| 3580 | LIBTOOL_DEPS='tools/ltmain.sh' |
|---|
| 3581 | LIBnn='lib' |
|---|
| 3582 | LIPO='lipo' |
|---|
| 3583 | LN_S='ln -s' |
|---|
| 3584 | LTLIBICONV='' |
|---|
| 3585 | LTLIBINTL='' |
|---|
| 3586 | LTLIBMULTITHREAD='' |
|---|
| 3587 | LTLIBOBJS='' |
|---|
| 3588 | LTLIBPTH='' |
|---|
| 3589 | LTLIBTHREAD='' |
|---|
| 3590 | LTO='' |
|---|
| 3591 | LTOALL='' |
|---|
| 3592 | MAINTAINER_MODE_FALSE='' |
|---|
| 3593 | MAINTAINER_MODE_TRUE='#' |
|---|
| 3594 | MAIN_CFLAGS='' |
|---|
| 3595 | MAIN_FFLAGS='' |
|---|
| 3596 | MAIN_LD='' |
|---|
| 3597 | MAIN_LDFLAGS='' |
|---|
| 3598 | MAJ_MIN_VERSION='3.1' |
|---|
| 3599 | MAKE='make' |
|---|
| 3600 | MAKEINDEX='/opt/local/bin/makeindex' |
|---|
| 3601 | MAKEINFO='/opt/local/bin/makeinfo' |
|---|
| 3602 | MKDIR_P='' |
|---|
| 3603 | NM='/opt/local/bin/nm' |
|---|
| 3604 | NMEDIT='nmedit' |
|---|
| 3605 | NOTANGLE='false' |
|---|
| 3606 | OBJC='/usr/bin/clang' |
|---|
| 3607 | OBJCFLAGS='-pipe -Os -arch x86_64' |
|---|
| 3608 | OBJCXX='/usr/bin/clang++' |
|---|
| 3609 | OBJCXXFLAGS='-pipe -Os -arch x86_64 -stdlib=libc++' |
|---|
| 3610 | OBJC_LIBS='' |
|---|
| 3611 | OBJDUMP='false' |
|---|
| 3612 | OBJEXT='o' |
|---|
| 3613 | OPENMP_CFLAGS='' |
|---|
| 3614 | OPENMP_CXXFLAGS='' |
|---|
| 3615 | OPENMP_FCFLAGS='' |
|---|
| 3616 | OPENMP_FFLAGS='' |
|---|
| 3617 | OSF_SH_BUG='' |
|---|
| 3618 | OTOOL64=':' |
|---|
| 3619 | OTOOL='otool' |
|---|
| 3620 | PACKAGE='R' |
|---|
| 3621 | PACKAGE_BUGREPORT='http://bugs.r-project.org' |
|---|
| 3622 | PACKAGE_NAME='R' |
|---|
| 3623 | PACKAGE_STRING='R 3.1.0' |
|---|
| 3624 | PACKAGE_TARNAME='R' |
|---|
| 3625 | PACKAGE_URL='http://www.r-project.org' |
|---|
| 3626 | PACKAGE_VERSION='3.1.0' |
|---|
| 3627 | PAGER='/opt/local/bin/less' |
|---|
| 3628 | PAPERCONF='' |
|---|
| 3629 | PATH_SEPARATOR=':' |
|---|
| 3630 | PDFLATEX='/opt/local/bin/pdflatex' |
|---|
| 3631 | PDFTEX='/opt/local/bin/pdftex' |
|---|
| 3632 | PKGCONF='/opt/local/bin/pkg-config' |
|---|
| 3633 | POSUB='' |
|---|
| 3634 | PRI_MACROS_BROKEN='' |
|---|
| 3635 | RANLIB='ranlib' |
|---|
| 3636 | RBLAS_LDFLAGS='' |
|---|
| 3637 | READLINE_LIBS='-lreadline ' |
|---|
| 3638 | REALPATH='false' |
|---|
| 3639 | RLAPACK_LDFLAGS='' |
|---|
| 3640 | RMATH_HAVE_EXPM1='' |
|---|
| 3641 | RMATH_HAVE_HYPOT='' |
|---|
| 3642 | RMATH_HAVE_LOG1P='' |
|---|
| 3643 | RMATH_HAVE_WORKING_LOG1P='' |
|---|
| 3644 | R_ARCH='' |
|---|
| 3645 | R_BATCHSAVE='' |
|---|
| 3646 | R_BROWSER='/opt/local/bin/xdg-open' |
|---|
| 3647 | R_BZIPCMD='/opt/local/bin/bzip2' |
|---|
| 3648 | R_CONFIG_ARGS=' '\''--prefix=/opt/local/Library/Frameworks'\'' '\''--enable-R-framework'\'' '\''--enable-R-shlib'\'' '\''--enable-BLAS-shlib'\'' '\''--disable-openmp'\'' '\''--with-readline'\'' '\''--with-aqua'\'' '\''--without-tcltk'\'' '\''--with-libpng'\'' '\''--with-ICU'\'' '\''--with-included-gettext'\'' '\''--without-internal-tzcode'\'' '\''--with-blas=-framework vecLib'\'' '\''--with-lapack=-framework vecLib'\'' '\''--with-x'\'' '\''--with-jpeglib'\'' '\''--x-include=/opt/local/include/X11'\'' '\''--x-lib=/opt/local/lib'\'' '\''--with-cairo'\'' '\''--with-recommended-packages'\'' '\''CC=/usr/bin/clang'\'' '\''CFLAGS=-pipe -Os -flax-vector-conversions -arch x86_64'\'' '\''LDFLAGS=-L/opt/local/lib -Wl,-headerpad_max_install_names -arch x86_64'\'' '\''CPPFLAGS=-I/opt/local/include'\'' '\''F77=/opt/local/bin/gfortran-mp-4.8'\'' '\''FFLAGS=-pipe -Os'\'' '\''CXX=/usr/bin/clang++'\'' '\''CXXFLAGS=-pipe -Os -arch x86_64 -stdlib=libc++'\'' '\''OBJC=/usr/bin/clang'\'' '\''OBJCFLAGS=-pipe -Os -arch x86_64'\'' '\''FC=/opt/local/bin/gfortran-mp-4.8'\'' '\''FCFLAGS=-pipe -Os -m64'\''' |
|---|
| 3649 | R_DEFS='' |
|---|
| 3650 | R_GZIPCMD='/opt/local/bin/gzip' |
|---|
| 3651 | R_JAVA_LD_LIBRARY_PATH='' |
|---|
| 3652 | R_LD_LIBRARY_PATH='' |
|---|
| 3653 | R_OPENMP_CFLAGS='' |
|---|
| 3654 | R_OPENMP_FFLAGS='' |
|---|
| 3655 | R_OS='darwin13.2.0' |
|---|
| 3656 | R_OSTYPE='unix' |
|---|
| 3657 | R_PAPERSIZE='' |
|---|
| 3658 | R_PDFVIEWER='/opt/local/bin/xdg-open' |
|---|
| 3659 | R_PLATFORM='x86_64-apple-darwin13.2.0' |
|---|
| 3660 | R_PRINTCMD='' |
|---|
| 3661 | R_PROFILING='' |
|---|
| 3662 | R_RD4PDF='times,hyper' |
|---|
| 3663 | R_SHELL='' |
|---|
| 3664 | R_SYSTEM_ABI='' |
|---|
| 3665 | R_UNZIPCMD='/usr/bin/unzip' |
|---|
| 3666 | R_XTRA_CFLAGS='' |
|---|
| 3667 | R_XTRA_CPPFLAGS2='-I$(R_INCLUDE_DIR)' |
|---|
| 3668 | R_XTRA_CPPFLAGS='' |
|---|
| 3669 | R_XTRA_CXXFLAGS='' |
|---|
| 3670 | R_XTRA_FFLAGS='' |
|---|
| 3671 | R_XTRA_LIBS='' |
|---|
| 3672 | R_ZIPCMD='/usr/bin/zip' |
|---|
| 3673 | Rshlibpath_var='DYLD_FALLBACK_LIBRARY_PATH' |
|---|
| 3674 | SAFE_FFLAGS='' |
|---|
| 3675 | SED='/usr/bin/sed' |
|---|
| 3676 | SHELL='/bin/sh' |
|---|
| 3677 | SHLIB_CFLAGS='' |
|---|
| 3678 | SHLIB_CXX1XLD='' |
|---|
| 3679 | SHLIB_CXX1XLDFLAGS='' |
|---|
| 3680 | SHLIB_CXXFLAGS='' |
|---|
| 3681 | SHLIB_CXXLD='' |
|---|
| 3682 | SHLIB_CXXLDFLAGS='' |
|---|
| 3683 | SHLIB_EXT='' |
|---|
| 3684 | SHLIB_FCLD='' |
|---|
| 3685 | SHLIB_FCLDFLAGS='' |
|---|
| 3686 | SHLIB_FFLAGS='' |
|---|
| 3687 | SHLIB_LD='' |
|---|
| 3688 | SHLIB_LDFLAGS='' |
|---|
| 3689 | SHLIB_LIBADD='' |
|---|
| 3690 | SHLIB_OPENMP_CFLAGS='' |
|---|
| 3691 | SHLIB_OPENMP_CXXFLAGS='' |
|---|
| 3692 | SHLIB_OPENMP_FCFLAGS='' |
|---|
| 3693 | SHLIB_OPENMP_FFLAGS='' |
|---|
| 3694 | STATICR1='' |
|---|
| 3695 | STATICR2='' |
|---|
| 3696 | STRIP='strip' |
|---|
| 3697 | TAR='/usr/bin/tar' |
|---|
| 3698 | TCLTK_CPPFLAGS='' |
|---|
| 3699 | TCLTK_LIBS='' |
|---|
| 3700 | TCL_CONFIG='' |
|---|
| 3701 | TEX='/opt/local/bin/tex' |
|---|
| 3702 | TEXI2DVI='/opt/local/bin/texi2dvi' |
|---|
| 3703 | TEXI2DVICMD='/opt/local/bin/texi2dvi' |
|---|
| 3704 | TIRPC_CPPFLAGS='' |
|---|
| 3705 | TK_CONFIG='' |
|---|
| 3706 | USE_EXPORTFILES_FALSE='' |
|---|
| 3707 | USE_EXPORTFILES_TRUE='' |
|---|
| 3708 | USE_EXTERNAL_BLAS_FALSE='' |
|---|
| 3709 | USE_EXTERNAL_BLAS_TRUE='' |
|---|
| 3710 | USE_EXTERNAL_LAPACK_FALSE='' |
|---|
| 3711 | USE_EXTERNAL_LAPACK_TRUE='' |
|---|
| 3712 | USE_ICU='' |
|---|
| 3713 | USE_ICU_APPLE='' |
|---|
| 3714 | USE_INCLUDED_LIBINTL='' |
|---|
| 3715 | USE_MMAP_ZLIB_FALSE='' |
|---|
| 3716 | USE_MMAP_ZLIB_TRUE='' |
|---|
| 3717 | USE_NLS='' |
|---|
| 3718 | USE_NLS_FALSE='' |
|---|
| 3719 | USE_NLS_TRUE='' |
|---|
| 3720 | USE_RECOMMENDED_PACKAGES_FALSE='' |
|---|
| 3721 | USE_RECOMMENDED_PACKAGES_TRUE='' |
|---|
| 3722 | USE_VECLIB_G95FIX_FALSE='' |
|---|
| 3723 | USE_VECLIB_G95FIX_TRUE='' |
|---|
| 3724 | VERSION='3.1.0' |
|---|
| 3725 | WANT_R_FRAMEWORK_FALSE='#' |
|---|
| 3726 | WANT_R_FRAMEWORK_TRUE='' |
|---|
| 3727 | WANT_R_SHLIB_FALSE='#' |
|---|
| 3728 | WANT_R_SHLIB_TRUE='' |
|---|
| 3729 | WANT_R_STATIC_FALSE='' |
|---|
| 3730 | WANT_R_STATIC_TRUE='#' |
|---|
| 3731 | WHICH='/usr/bin/which' |
|---|
| 3732 | WOE32DLL='' |
|---|
| 3733 | XMKMF='' |
|---|
| 3734 | XTRA_INTL_CPPFLAGS='' |
|---|
| 3735 | X_CFLAGS='' |
|---|
| 3736 | X_EXTRA_LIBS='' |
|---|
| 3737 | X_LIBS='' |
|---|
| 3738 | X_PRE_LIBS='' |
|---|
| 3739 | YACC='bison -y' |
|---|
| 3740 | YFLAGS='' |
|---|
| 3741 | ac_ct_CC='/usr/bin/clang' |
|---|
| 3742 | ac_ct_CXX='' |
|---|
| 3743 | ac_ct_DUMPBIN='' |
|---|
| 3744 | ac_ct_F77='' |
|---|
| 3745 | ac_ct_FC='' |
|---|
| 3746 | ac_ct_OBJC='' |
|---|
| 3747 | bindir='${exec_prefix}/bin' |
|---|
| 3748 | build='x86_64-apple-darwin13.2.0' |
|---|
| 3749 | build_alias='' |
|---|
| 3750 | build_cpu='x86_64' |
|---|
| 3751 | build_os='darwin13.2.0' |
|---|
| 3752 | build_vendor='apple' |
|---|
| 3753 | config_opts=' '\''--prefix=/opt/local/Library/Frameworks'\'' '\''--enable-R-framework'\'' '\''--enable-R-shlib'\'' '\''--enable-BLAS-shlib'\'' '\''--disable-openmp'\'' '\''--with-readline'\'' '\''--with-aqua'\'' '\''--without-tcltk'\'' '\''--with-libpng'\'' '\''--with-ICU'\'' '\''--with-included-gettext'\'' '\''--without-internal-tzcode'\'' '\''--with-blas=-framework vecLib'\'' '\''--with-lapack=-framework vecLib'\'' '\''--with-x'\'' '\''--with-jpeglib'\'' '\''--x-include=/opt/local/include/X11'\'' '\''--x-lib=/opt/local/lib'\'' '\''--with-cairo'\'' '\''--with-recommended-packages'\'' '\''CC=/usr/bin/clang'\'' '\''CFLAGS=-pipe -Os -flax-vector-conversions -arch x86_64'\'' '\''LDFLAGS=-L/opt/local/lib -Wl,-headerpad_max_install_names -arch x86_64'\'' '\''CPPFLAGS=-I/opt/local/include'\'' '\''F77=/opt/local/bin/gfortran-mp-4.8'\'' '\''FFLAGS=-pipe -Os'\'' '\''CXX=/usr/bin/clang++'\'' '\''CXXFLAGS=-pipe -Os -arch x86_64 -stdlib=libc++'\'' '\''OBJC=/usr/bin/clang'\'' '\''OBJCFLAGS=-pipe -Os -arch x86_64'\'' '\''FC=/opt/local/bin/gfortran-mp-4.8'\'' '\''FCFLAGS=-pipe -Os -m64'\''' |
|---|
| 3754 | custom_JAVA_CPPFLAGS='' |
|---|
| 3755 | custom_JAVA_HOME='' |
|---|
| 3756 | custom_JAVA_LD_LIBRARY_PATH='' |
|---|
| 3757 | custom_JAVA_LIBS='' |
|---|
| 3758 | datadir='${datarootdir}' |
|---|
| 3759 | datarootdir='${prefix}/share' |
|---|
| 3760 | docdir='${datarootdir}/doc/${PACKAGE_TARNAME}' |
|---|
| 3761 | dvidir='${docdir}' |
|---|
| 3762 | exec_prefix='NONE' |
|---|
| 3763 | host='x86_64-apple-darwin13.2.0' |
|---|
| 3764 | host_alias='' |
|---|
| 3765 | host_cpu='x86_64' |
|---|
| 3766 | host_os='darwin13.2.0' |
|---|
| 3767 | host_vendor='apple' |
|---|
| 3768 | htmldir='${docdir}' |
|---|
| 3769 | includedir='${prefix}/include' |
|---|
| 3770 | infodir='${datarootdir}/info' |
|---|
| 3771 | libdir='${exec_prefix}/${LIBnn}' |
|---|
| 3772 | libexecdir='${exec_prefix}/libexec' |
|---|
| 3773 | localedir='${datarootdir}/locale' |
|---|
| 3774 | localstatedir='${prefix}/var' |
|---|
| 3775 | lt_ECHO='/bin/echo' |
|---|
| 3776 | mandir='${datarootdir}/man' |
|---|
| 3777 | mkdir_p='' |
|---|
| 3778 | oldincludedir='/usr/include' |
|---|
| 3779 | pdfdir='${docdir}' |
|---|
| 3780 | prefix='/opt/local/Library/Frameworks' |
|---|
| 3781 | program_transform_name='s,x,x,' |
|---|
| 3782 | psdir='${docdir}' |
|---|
| 3783 | r_arch='' |
|---|
| 3784 | rdocdir='${rhome}/doc' |
|---|
| 3785 | rincludedir='${rhome}/include' |
|---|
| 3786 | rsharedir='${rhome}/share' |
|---|
| 3787 | sbindir='${exec_prefix}/sbin' |
|---|
| 3788 | sharedstatedir='${prefix}/com' |
|---|
| 3789 | shlibpath_var='DYLD_LIBRARY_PATH' |
|---|
| 3790 | striplib='strip -x' |
|---|
| 3791 | stripstaticlib='strip -S' |
|---|
| 3792 | sysconfdir='${prefix}/etc' |
|---|
| 3793 | target_alias='' |
|---|
| 3794 | use_tcltk='' |
|---|
| 3795 | |
|---|
| 3796 | ## ------------------- ## |
|---|
| 3797 | ## File substitutions. ## |
|---|
| 3798 | ## ------------------- ## |
|---|
| 3799 | |
|---|
| 3800 | r_cc_lo_rules_frag='Makefrag.cc_lo' |
|---|
| 3801 | r_cc_rules_frag='Makefrag.cc' |
|---|
| 3802 | r_cxx_rules_frag='' |
|---|
| 3803 | r_objc_rules_frag='' |
|---|
| 3804 | |
|---|
| 3805 | ## ----------- ## |
|---|
| 3806 | ## confdefs.h. ## |
|---|
| 3807 | ## ----------- ## |
|---|
| 3808 | |
|---|
| 3809 | /* confdefs.h */ |
|---|
| 3810 | #define PACKAGE_NAME "R" |
|---|
| 3811 | #define PACKAGE_TARNAME "R" |
|---|
| 3812 | #define PACKAGE_VERSION "3.1.0" |
|---|
| 3813 | #define PACKAGE_STRING "R 3.1.0" |
|---|
| 3814 | #define PACKAGE_BUGREPORT "http://bugs.r-project.org" |
|---|
| 3815 | #define PACKAGE_URL "http://www.r-project.org" |
|---|
| 3816 | #define PACKAGE "R" |
|---|
| 3817 | #define VERSION "3.1.0" |
|---|
| 3818 | #define R_PLATFORM "x86_64-apple-darwin13.2.0" |
|---|
| 3819 | #define R_CPU "x86_64" |
|---|
| 3820 | #define R_VENDOR "apple" |
|---|
| 3821 | #define R_OS "darwin13.2.0" |
|---|
| 3822 | #define Unix 1 |
|---|
| 3823 | #define R_ARCH "" |
|---|
| 3824 | #define STDC_HEADERS 1 |
|---|
| 3825 | #define HAVE_SYS_TYPES_H 1 |
|---|
| 3826 | #define HAVE_SYS_STAT_H 1 |
|---|
| 3827 | #define HAVE_STDLIB_H 1 |
|---|
| 3828 | #define HAVE_STRING_H 1 |
|---|
| 3829 | #define HAVE_MEMORY_H 1 |
|---|
| 3830 | #define HAVE_STRINGS_H 1 |
|---|
| 3831 | #define HAVE_INTTYPES_H 1 |
|---|
| 3832 | #define HAVE_STDINT_H 1 |
|---|
| 3833 | #define HAVE_UNISTD_H 1 |
|---|
| 3834 | #define __EXTENSIONS__ 1 |
|---|
| 3835 | #define _ALL_SOURCE 1 |
|---|
| 3836 | #define _GNU_SOURCE 1 |
|---|
| 3837 | #define _POSIX_PTHREAD_SEMANTICS 1 |
|---|
| 3838 | #define _TANDEM_SOURCE 1 |
|---|
| 3839 | #define HAVE_DLFCN_H 1 |
|---|
| 3840 | #define LT_OBJDIR ".libs/" |
|---|
| 3841 | #define HAVE_LIBM 1 |
|---|
| 3842 | #define HAVE_READLINE_HISTORY_H 1 |
|---|
| 3843 | #define HAVE_READLINE_READLINE_H 1 |
|---|
| 3844 | #define HAVE_LIBREADLINE 1 |
|---|
| 3845 | #define HAVE_HISTORY_TRUNCATE_FILE 1 |
|---|
| 3846 | #define HAVE_RL_COMPLETION_MATCHES 1 |
|---|
| 3847 | #define STDC_HEADERS 1 |
|---|
| 3848 | #define HAVE_DIRENT_H 1 |
|---|
| 3849 | #define HAVE_SYS_WAIT_H 1 |
|---|
| 3850 | #define HAVE_ARPA_INET_H 1 |
|---|
| 3851 | #define HAVE_DLFCN_H 1 |
|---|
| 3852 | #define HAVE_FCNTL_H 1 |
|---|
| 3853 | #define HAVE_GLOB_H 1 |
|---|
| 3854 | #define HAVE_GRP_H 1 |
|---|
| 3855 | #define HAVE_LANGINFO_H 1 |
|---|
| 3856 | #define HAVE_NETDB_H 1 |
|---|
| 3857 | #define HAVE_NETINET_IN_H 1 |
|---|
| 3858 | #define HAVE_PWD_H 1 |
|---|
| 3859 | #define HAVE_SCHED_H 1 |
|---|
| 3860 | #define HAVE_STRINGS_H 1 |
|---|
| 3861 | #define HAVE_SYS_PARAM_H 1 |
|---|
| 3862 | #define HAVE_SYS_RESOURCE_H 1 |
|---|
| 3863 | #define HAVE_SYS_SELECT_H 1 |
|---|
| 3864 | #define HAVE_SYS_SOCKET_H 1 |
|---|
| 3865 | #define HAVE_SYS_STAT_H 1 |
|---|
| 3866 | #define HAVE_SYS_TIME_H 1 |
|---|
| 3867 | #define HAVE_SYS_TIMES_H 1 |
|---|
| 3868 | #define HAVE_SYS_UTSNAME_H 1 |
|---|
| 3869 | #define HAVE_UNISTD_H 1 |
|---|
| 3870 | #define HAVE_UTIME_H 1 |
|---|
| 3871 | #define HAVE_ERRNO_H 1 |
|---|
| 3872 | #define HAVE_INTTYPES_H 1 |
|---|
| 3873 | #define HAVE_LIMITS_H 1 |
|---|
| 3874 | #define HAVE_LOCALE_H 1 |
|---|
| 3875 | #define HAVE_STDARG_H 1 |
|---|
| 3876 | #define HAVE_STDBOOL_H 1 |
|---|
| 3877 | #define HAVE_STDINT_H 1 |
|---|
| 3878 | #define HAVE_STRING_H 1 |
|---|
| 3879 | #define HAVE_DECL_SIGSETJMP 1 |
|---|
| 3880 | #define HAVE_DECL_SIGLONGJMP 1 |
|---|
| 3881 | #define HAVE_POSIX_SETJMP 1 |
|---|
| 3882 | #define RETSIGTYPE void |
|---|
| 3883 | #define HAVE_INT64_T 1 |
|---|
| 3884 | #define HAVE_INT_FAST64_T 1 |
|---|
| 3885 | #define HAVE_DECL_SIZE_MAX 1 |
|---|
| 3886 | #define R_SOCKLEN_T socklen_t |
|---|
| 3887 | #define HAVE_STACK_T 1 |
|---|
| 3888 | #define HAVE_INTPTR_T 1 |
|---|
| 3889 | #define HAVE_UINTPTR_T 1 |
|---|
| 3890 | #define R_INLINE inline |
|---|
| 3891 | #define SIZEOF_INT 4 |
|---|
| 3892 | #define INT_32_BITS 1 |
|---|
| 3893 | #define SIZEOF_LONG 8 |
|---|
| 3894 | #define SIZEOF_LONG_LONG 8 |
|---|
| 3895 | #define SIZEOF_DOUBLE 8 |
|---|
| 3896 | #define SIZEOF_SIZE_T 8 |
|---|
| 3897 | #define HAVE_LONG_DOUBLE 1 |
|---|
| 3898 | #define SIZEOF_LONG_DOUBLE 16 |
|---|
| 3899 | |
|---|
| 3900 | configure: exit 1 |
|---|