Ticket #44581: main.3.log

File main.3.log, 163.2 KB (added by m74z00219@…, 7 years ago)

cmake log

Line 
1version:1
2:debug:main epoch: in tree: 0 installed: 0
3:debug:main libidn 1.29_0 exists in the ports tree
4:debug:main libidn 1.29_0 +universal is the latest installed
5:debug:main libidn 1.29_0 +universal is active
6:debug:main Merging existing variants '+universal' into variants
7:debug:main new fully merged portvariants: universal + bash_completion +
8:debug:main Changing to port directory: /opt/local/var/macports/sources/rsync.macports.org/release/tarballs/ports/mail/libidn
9:debug:main OS darwin/14.0.0 (Mac OS X 10.10) arch i386
10:debug:main Sourcing PortGroup conflicts_build 1.0 from /opt/local/var/macports/sources/rsync.macports.org/release/tarballs/ports/_resources/port1.0/group/conflicts_build-1.0.tcl
11:debug:main adding the default universal variant
12:debug:main Reading variant descriptions from /opt/local/var/macports/sources/rsync.macports.org/release/tarballs/ports/_resources/port1.0/variant_descriptions.conf
13:debug:main Requested variant +bash_completion is not provided by port libidn.
14:debug:main Executing variant universal provides universal
15:debug:main Running callback portconfigure::add_automatic_compiler_dependencies
16:debug:main Finished running callback portconfigure::add_automatic_compiler_dependencies
17:debug:main Running callback portbuild::add_automatic_buildsystem_dependencies
18:debug:main Finished running callback portbuild::add_automatic_buildsystem_dependencies
19:debug:main No need to upgrade! libidn 1.29_0 >= libidn 1.29_0
20:debug:main epoch: in tree: 0 installed: 0
21:debug:main libiconv 1.14_0 exists in the ports tree
22:debug:main libiconv 1.14_0 +universal is the latest installed
23:debug:main libiconv 1.14_0 +universal is active
24:debug:main Merging existing variants '+universal' into variants
25:debug:main new fully merged portvariants: universal + bash_completion +
26:debug:main Changing to port directory: /opt/local/var/macports/sources/rsync.macports.org/release/tarballs/ports/textproc/libiconv
27:debug:main OS darwin/14.0.0 (Mac OS X 10.10) arch i386
28:debug:main Reading variant descriptions from /opt/local/var/macports/sources/rsync.macports.org/release/tarballs/ports/_resources/port1.0/variant_descriptions.conf
29:debug:main Sourcing PortGroup muniversal 1.0 from /opt/local/var/macports/sources/rsync.macports.org/release/tarballs/ports/_resources/port1.0/group/muniversal-1.0.tcl
30:debug:main universal variant already exists, so not adding the default one
31:debug:main Requested variant +bash_completion is not provided by port libiconv.
32:debug:main Executing variant universal provides universal
33:debug:main Running callback portconfigure::add_automatic_compiler_dependencies
34:debug:main Finished running callback portconfigure::add_automatic_compiler_dependencies
35:debug:main Running callback portbuild::add_automatic_buildsystem_dependencies
36:debug:main Finished running callback portbuild::add_automatic_buildsystem_dependencies
37:debug:main No need to upgrade! libiconv 1.14_0 >= libiconv 1.14_0
38:debug:main epoch: in tree: 2 installed: 2
39:debug:main gettext 0.19.2_0 exists in the ports tree
40:debug:main gettext 0.19.2_0  is the latest installed
41:debug:main gettext 0.19.2_0 +universal is active
42:debug:main Merging existing variants '+universal' into variants
43:debug:main new fully merged portvariants: universal + bash_completion +
44:debug:main Changing to port directory: /opt/local/var/macports/sources/rsync.macports.org/release/tarballs/ports/devel/gettext
45:debug:main OS darwin/14.0.0 (Mac OS X 10.10) arch i386
46:debug:main Sourcing PortGroup compiler_blacklist_versions 1.0 from /opt/local/var/macports/sources/rsync.macports.org/release/tarballs/ports/_resources/port1.0/group/compiler_blacklist_versions-1.0.tcl
47:debug:main Reading variant descriptions from /opt/local/var/macports/sources/rsync.macports.org/release/tarballs/ports/_resources/port1.0/variant_descriptions.conf
48:debug:main Sourcing PortGroup muniversal 1.0 from /opt/local/var/macports/sources/rsync.macports.org/release/tarballs/ports/_resources/port1.0/group/muniversal-1.0.tcl
49:debug:main compiler clang 600.0.54 not blacklisted because it doesn't match {clang < 211.10.1}
50:debug:main universal variant already exists, so not adding the default one
51:debug:main Requested variant +bash_completion is not provided by port gettext.
52:debug:main Executing variant universal provides universal
53:debug:main Running callback portconfigure::add_automatic_compiler_dependencies
54:debug:main Finished running callback portconfigure::add_automatic_compiler_dependencies
55:debug:main Running callback portbuild::add_automatic_buildsystem_dependencies
56:debug:main Finished running callback portbuild::add_automatic_buildsystem_dependencies
57:debug:main No need to upgrade! gettext 0.19.2_0 >= gettext 0.19.2_0
58:debug:main epoch: in tree: 0 installed: 0
59:debug:main expat 2.1.0_0 exists in the ports tree
60:debug:main expat 2.1.0_0 +universal is the latest installed
61:debug:main expat 2.1.0_0 +universal is active
62:debug:main Merging existing variants '+universal' into variants
63:debug:main new fully merged portvariants: universal + bash_completion +
64:debug:main Changing to port directory: /opt/local/var/macports/sources/rsync.macports.org/release/tarballs/ports/textproc/expat
65:debug:main OS darwin/14.0.0 (Mac OS X 10.10) arch i386
66:debug:main adding the default universal variant
67:debug:main Reading variant descriptions from /opt/local/var/macports/sources/rsync.macports.org/release/tarballs/ports/_resources/port1.0/variant_descriptions.conf
68:debug:main Requested variant +bash_completion is not provided by port expat.
69:debug:main Executing variant universal provides universal
70:debug:main Running callback portconfigure::add_automatic_compiler_dependencies
71:debug:main Finished running callback portconfigure::add_automatic_compiler_dependencies
72:debug:main Running callback portbuild::add_automatic_buildsystem_dependencies
73:debug:main Finished running callback portbuild::add_automatic_buildsystem_dependencies
74:debug:main No need to upgrade! expat 2.1.0_0 >= expat 2.1.0_0
75:debug:main epoch: in tree: 0 installed: 0
76:debug:main ncurses 5.9_2 exists in the ports tree
77:debug:main ncurses 5.9_2  is the latest installed
78:debug:main ncurses 5.9_2 +universal is active
79:debug:main Merging existing variants '+universal' into variants
80:debug:main new fully merged portvariants: universal + bash_completion +
81:debug:main Changing to port directory: /opt/local/var/macports/sources/rsync.macports.org/release/tarballs/ports/devel/ncurses
82:debug:main OS darwin/14.0.0 (Mac OS X 10.10) arch i386
83:debug:main adding the default universal variant
84:debug:main Reading variant descriptions from /opt/local/var/macports/sources/rsync.macports.org/release/tarballs/ports/_resources/port1.0/variant_descriptions.conf
85:debug:main Requested variant +bash_completion is not provided by port ncurses.
86:debug:main Executing variant universal provides universal
87:debug:main Running callback portconfigure::add_automatic_compiler_dependencies
88:debug:main Finished running callback portconfigure::add_automatic_compiler_dependencies
89:debug:main Running callback portbuild::add_automatic_buildsystem_dependencies
90:debug:main Finished running callback portbuild::add_automatic_buildsystem_dependencies
91:debug:main No need to upgrade! ncurses 5.9_2 >= ncurses 5.9_2
92:debug:main epoch: in tree: 1 installed: 1
93:debug:main openssl 1.0.1i_0 exists in the ports tree
94:debug:main openssl 1.0.1i_0  is the latest installed
95:debug:main openssl 1.0.1i_0 +universal is active
96:debug:main Merging existing variants '+universal' into variants
97:debug:main new fully merged portvariants: universal + bash_completion +
98:debug:main Changing to port directory: /opt/local/var/macports/sources/rsync.macports.org/release/tarballs/ports/devel/openssl
99:debug:main OS darwin/14.0.0 (Mac OS X 10.10) arch i386
100:debug:main Reading variant descriptions from /opt/local/var/macports/sources/rsync.macports.org/release/tarballs/ports/_resources/port1.0/variant_descriptions.conf
101:debug:main Sourcing PortGroup muniversal 1.0 from /opt/local/var/macports/sources/rsync.macports.org/release/tarballs/ports/_resources/port1.0/group/muniversal-1.0.tcl
102:debug:main universal variant already exists, so not adding the default one
103:debug:main Requested variant +bash_completion is not provided by port openssl.
104:debug:main Executing variant universal provides universal
105:debug:main Running callback portconfigure::add_automatic_compiler_dependencies
106:debug:main Finished running callback portconfigure::add_automatic_compiler_dependencies
107:debug:main Running callback portbuild::add_automatic_buildsystem_dependencies
108:debug:main Finished running callback portbuild::add_automatic_buildsystem_dependencies
109:debug:main No need to upgrade! openssl 1.0.1i_0 >= openssl 1.0.1i_0
110:debug:main epoch: in tree: 0 installed: 0
111:debug:main zlib 1.2.8_0 exists in the ports tree
112:debug:main zlib 1.2.8_0  is the latest installed
113:debug:main zlib 1.2.8_0 +universal is active
114:debug:main Merging existing variants '+universal' into variants
115:debug:main new fully merged portvariants: universal + bash_completion +
116:debug:main Changing to port directory: /opt/local/var/macports/sources/rsync.macports.org/release/tarballs/ports/archivers/zlib
117:debug:main OS darwin/14.0.0 (Mac OS X 10.10) arch i386
118:debug:main Sourcing PortGroup xcodeversion 1.0 from /opt/local/var/macports/sources/rsync.macports.org/release/tarballs/ports/_resources/port1.0/group/xcodeversion-1.0.tcl
119:debug:main adding the default universal variant
120:debug:main Reading variant descriptions from /opt/local/var/macports/sources/rsync.macports.org/release/tarballs/ports/_resources/port1.0/variant_descriptions.conf
121:debug:main Requested variant +bash_completion is not provided by port zlib.
122:debug:main Executing variant universal provides universal
123:debug:main Running callback portconfigure::add_automatic_compiler_dependencies
124:debug:main Finished running callback portconfigure::add_automatic_compiler_dependencies
125:debug:main Running callback portbuild::add_automatic_buildsystem_dependencies
126:debug:main Finished running callback portbuild::add_automatic_buildsystem_dependencies
127:debug:main No need to upgrade! zlib 1.2.8_0 >= zlib 1.2.8_0
128:debug:main epoch: in tree: 0 installed: 0
129:debug:main curl 7.38.0_0 exists in the ports tree
130:debug:main curl 7.38.0_0 +ssl is the latest installed
131:debug:main curl 7.38.0_0 +ssl is active
132:debug:main Merging existing variants '+ssl' into variants
133:debug:main new fully merged portvariants: ssl + bash_completion +
134:debug:main Changing to port directory: /opt/local/var/macports/sources/rsync.macports.org/release/tarballs/ports/net/curl
135:debug:main OS darwin/14.0.0 (Mac OS X 10.10) arch i386
136:debug:main Reading variant descriptions from /opt/local/var/macports/sources/rsync.macports.org/release/tarballs/ports/_resources/port1.0/variant_descriptions.conf
137:debug:main Sourcing PortGroup muniversal 1.0 from /opt/local/var/macports/sources/rsync.macports.org/release/tarballs/ports/_resources/port1.0/group/muniversal-1.0.tcl
138:debug:main universal variant already exists, so not adding the default one
139:debug:main Requested variant +bash_completion is not provided by port curl.
140:debug:main Executing variant ssl provides ssl
141:debug:main Running callback portconfigure::add_automatic_compiler_dependencies
142:debug:main Finished running callback portconfigure::add_automatic_compiler_dependencies
143:debug:main Running callback portbuild::add_automatic_buildsystem_dependencies
144:debug:main Finished running callback portbuild::add_automatic_buildsystem_dependencies
145:debug:main No need to upgrade! curl 7.38.0_0 >= curl 7.38.0_0
146:debug:main epoch: in tree: 0 installed: 0
147:debug:main curl-ca-bundle 7.38.0_0 exists in the ports tree
148:debug:main curl-ca-bundle 7.38.0_0  is the latest installed
149:debug:main curl-ca-bundle 7.38.0_0  is active
150:debug:main Merging existing variants '' into variants
151:debug:main new fully merged portvariants: bash_completion +
152:debug:main Changing to port directory: /opt/local/var/macports/sources/rsync.macports.org/release/tarballs/ports/net/curl
153:debug:main OS darwin/14.0.0 (Mac OS X 10.10) arch i386
154:debug:main universal_variant is false, so not adding the default universal variant
155:debug:main Requested variant +bash_completion is not provided by port curl-ca-bundle.
156:debug:main Running callback portconfigure::add_automatic_compiler_dependencies
157:debug:main Finished running callback portconfigure::add_automatic_compiler_dependencies
158:debug:main Running callback portbuild::add_automatic_buildsystem_dependencies
159:debug:main Finished running callback portbuild::add_automatic_buildsystem_dependencies
160:debug:main No need to upgrade! curl-ca-bundle 7.38.0_0 >= curl-ca-bundle 7.38.0_0
161:debug:main epoch: in tree: 0 installed: 0
162:debug:main bzip2 1.0.6_0 exists in the ports tree
163:debug:main bzip2 1.0.6_0  is the latest installed
164:debug:main bzip2 1.0.6_0  is active
165:debug:main Merging existing variants '' into variants
166:debug:main new fully merged portvariants: bash_completion +
167:debug:main Changing to port directory: /opt/local/var/macports/sources/rsync.macports.org/release/tarballs/ports/archivers/bzip2
168:debug:main OS darwin/14.0.0 (Mac OS X 10.10) arch i386
169:debug:main Reading variant descriptions from /opt/local/var/macports/sources/rsync.macports.org/release/tarballs/ports/_resources/port1.0/variant_descriptions.conf
170:debug:main universal variant already exists, so not adding the default one
171:debug:main Requested variant +bash_completion is not provided by port bzip2.
172:debug:main Running callback portconfigure::add_automatic_compiler_dependencies
173:debug:main Finished running callback portconfigure::add_automatic_compiler_dependencies
174:debug:main Running callback portbuild::add_automatic_buildsystem_dependencies
175:debug:main Finished running callback portbuild::add_automatic_buildsystem_dependencies
176:debug:main No need to upgrade! bzip2 1.0.6_0 >= bzip2 1.0.6_0
177:debug:main epoch: in tree: 0 installed: 0
178:debug:main libarchive 3.1.2_0 exists in the ports tree
179:debug:main libarchive 3.1.2_0  is the latest installed
180:debug:main libarchive 3.1.2_0  is active
181:debug:main Merging existing variants '' into variants
182:debug:main new fully merged portvariants: bash_completion +
183:debug:main Changing to port directory: /opt/local/var/macports/sources/rsync.macports.org/release/tarballs/ports/archivers/libarchive
184:debug:main OS darwin/14.0.0 (Mac OS X 10.10) arch i386
185:debug:main adding the default universal variant
186:debug:main Reading variant descriptions from /opt/local/var/macports/sources/rsync.macports.org/release/tarballs/ports/_resources/port1.0/variant_descriptions.conf
187:debug:main Requested variant +bash_completion is not provided by port libarchive.
188:debug:main Running callback portconfigure::add_automatic_compiler_dependencies
189:debug:main Finished running callback portconfigure::add_automatic_compiler_dependencies
190:debug:main Running callback portbuild::add_automatic_buildsystem_dependencies
191:debug:main Finished running callback portbuild::add_automatic_buildsystem_dependencies
192:debug:main No need to upgrade! libarchive 3.1.2_0 >= libarchive 3.1.2_0
193:debug:main epoch: in tree: 0 installed: 0
194:debug:main libxml2 2.9.1_0 exists in the ports tree
195:debug:main libxml2 2.9.1_0  is the latest installed
196:debug:main libxml2 2.9.1_0  is active
197:debug:main Merging existing variants '' into variants
198:debug:main new fully merged portvariants: bash_completion +
199:debug:main Changing to port directory: /opt/local/var/macports/sources/rsync.macports.org/release/tarballs/ports/textproc/libxml2
200:debug:main OS darwin/14.0.0 (Mac OS X 10.10) arch i386
201:debug:main adding the default universal variant
202:debug:main Reading variant descriptions from /opt/local/var/macports/sources/rsync.macports.org/release/tarballs/ports/_resources/port1.0/variant_descriptions.conf
203:debug:main Requested variant +bash_completion is not provided by port libxml2.
204:debug:main Running callback portconfigure::add_automatic_compiler_dependencies
205:debug:main Finished running callback portconfigure::add_automatic_compiler_dependencies
206:debug:main Running callback portbuild::add_automatic_buildsystem_dependencies
207:debug:main Finished running callback portbuild::add_automatic_buildsystem_dependencies
208:debug:main No need to upgrade! libxml2 2.9.1_0 >= libxml2 2.9.1_0
209:debug:main epoch: in tree: 0 installed: 0
210:debug:main xz 5.0.7_0 exists in the ports tree
211:debug:main xz 5.0.7_0  is the latest installed
212:debug:main xz 5.0.7_0  is active
213:debug:main Merging existing variants '' into variants
214:debug:main new fully merged portvariants: bash_completion +
215:debug:main Changing to port directory: /opt/local/var/macports/sources/rsync.macports.org/release/tarballs/ports/archivers/xz
216:debug:main OS darwin/14.0.0 (Mac OS X 10.10) arch i386
217:debug:main adding the default universal variant
218:debug:main Reading variant descriptions from /opt/local/var/macports/sources/rsync.macports.org/release/tarballs/ports/_resources/port1.0/variant_descriptions.conf
219:debug:main Requested variant +bash_completion is not provided by port xz.
220:debug:main Running callback portconfigure::add_automatic_compiler_dependencies
221:debug:main Finished running callback portconfigure::add_automatic_compiler_dependencies
222:debug:main Running callback portbuild::add_automatic_buildsystem_dependencies
223:debug:main Finished running callback portbuild::add_automatic_buildsystem_dependencies
224:debug:main No need to upgrade! xz 5.0.7_0 >= xz 5.0.7_0
225:debug:main epoch: in tree: 0 installed: 0
226:debug:main lzo2 2.06_0 exists in the ports tree
227:debug:main lzo2 2.06_0  is the latest installed
228:debug:main lzo2 2.06_0  is active
229:debug:main Merging existing variants '' into variants
230:debug:main new fully merged portvariants: bash_completion +
231:debug:main Changing to port directory: /opt/local/var/macports/sources/rsync.macports.org/release/tarballs/ports/archivers/lzo2
232:debug:main OS darwin/14.0.0 (Mac OS X 10.10) arch i386
233:debug:main Reading variant descriptions from /opt/local/var/macports/sources/rsync.macports.org/release/tarballs/ports/_resources/port1.0/variant_descriptions.conf
234:debug:main Sourcing PortGroup muniversal 1.0 from /opt/local/var/macports/sources/rsync.macports.org/release/tarballs/ports/_resources/port1.0/group/muniversal-1.0.tcl
235:debug:main universal variant already exists, so not adding the default one
236:debug:main Requested variant +bash_completion is not provided by port lzo2.
237:debug:main Running callback portconfigure::add_automatic_compiler_dependencies
238:debug:main Finished running callback portconfigure::add_automatic_compiler_dependencies
239:debug:main Running callback portbuild::add_automatic_buildsystem_dependencies
240:debug:main Finished running callback portbuild::add_automatic_buildsystem_dependencies
241:debug:main No need to upgrade! lzo2 2.06_0 >= lzo2 2.06_0
242:msg:main --->  Computing dependencies for cmake:info:main .:debug:main cmake has no conflicts
243:debug:main Searching for dependency: libidn
244:debug:main Found Dependency: receipt exists for libidn
245:debug:main Searching for dependency: openssl
246:debug:main Found Dependency: receipt exists for openssl
247:debug:main Searching for dependency: curl
248:debug:main Found Dependency: receipt exists for curl
249:debug:main Searching for dependency: expat
250:debug:main Found Dependency: receipt exists for expat
251:debug:main Searching for dependency: zlib
252:debug:main Found Dependency: receipt exists for zlib
253:debug:main Searching for dependency: bzip2
254:debug:main Found Dependency: receipt exists for bzip2
255:debug:main Searching for dependency: libarchive
256:debug:main Found Dependency: receipt exists for libarchive
257:msg:main
258:debug:main Executing org.macports.main (cmake)
259:debug:main changing euid/egid - current euid: 0 - current egid: 0
260:debug:main egid changed to: 20
261:debug:main euid changed to: 501
262:debug:archivefetch archivefetch phase started at Wed Oct  1 17:56:56 EDT 2014
263:msg:archivefetch --->  Fetching archive for cmake
264:debug:archivefetch Executing org.macports.archivefetch (cmake)
265:debug:archivefetch euid/egid changed to: 0/0
266:debug:archivefetch chowned /opt/local/var/macports/incoming to macports
267:debug:archivefetch euid/egid changed to: 501/20
268:info:archivefetch --->  cmake-3.0.2_0.darwin_14.x86_64.tbz2 doesn't seem to exist in /opt/local/var/macports/incoming/verified
269:msg:archivefetch --->  Attempting to fetch cmake-3.0.2_0.darwin_14.x86_64.tbz2 from http://packages.macports.org/cmake
270:debug:archivefetch Fetching archive failed:: The requested URL returned error: 404 Not Found
271:msg:archivefetch --->  Attempting to fetch cmake-3.0.2_0.darwin_14.x86_64.tbz2 from http://mse.uk.packages.macports.org/sites/packages.macports.org/cmake
272:debug:archivefetch Fetching archive failed:: The requested URL returned error: 404 Not Found
273:msg:archivefetch --->  Attempting to fetch cmake-3.0.2_0.darwin_14.x86_64.tbz2 from http://lil.fr.packages.macports.org/cmake
274:debug:archivefetch Fetching archive failed:: The requested URL returned error: 404 Not Found
275:debug:archivefetch Privilege de-escalation not attempted as not running as root.
276:debug:fetch fetch phase started at Wed Oct  1 17:56:57 EDT 2014
277:notice:fetch --->  Fetching distfiles for cmake
278:debug:fetch Executing org.macports.fetch (cmake)
279:debug:fetch Privilege de-escalation not attempted as not running as root.
280:debug:checksum checksum phase started at Wed Oct  1 17:56:57 EDT 2014
281:notice:checksum --->  Verifying checksums for cmake
282:debug:checksum Executing org.macports.checksum (cmake)
283:info:checksum --->  Checksumming cmake-3.0.2.tar.gz
284:debug:checksum Calculated (rmd160) is b94ea2ed4dced373e289fa5f66674a227135f350
285:debug:checksum Correct (rmd160) checksum for cmake-3.0.2.tar.gz
286:debug:checksum Calculated (sha256) is 6b4ea61eadbbd9bec0ccb383c29d1f4496eacc121ef7acf37c7a24777805693e
287:debug:checksum Correct (sha256) checksum for cmake-3.0.2.tar.gz
288:debug:checksum Privilege de-escalation not attempted as not running as root.
289:debug:extract extract phase started at Wed Oct  1 17:56:57 EDT 2014
290:notice:extract --->  Extracting cmake
291:debug:extract Executing org.macports.extract (cmake)
292:info:extract --->  Extracting cmake-3.0.2.tar.gz
293:debug:extract setting option extract.args to '/opt/local/var/macports/distfiles/cmake/cmake-3.0.2.tar.gz'
294:debug:extract Environment:
295CC_PRINT_OPTIONS='YES'
296CC_PRINT_OPTIONS_FILE='/opt/local/var/macports/build/_opt_local_var_macports_sources_rsync.macports.org_release_tarballs_ports_devel_cmake/cmake/work/.CC_PRINT_OPTIONS'
297CPATH='/opt/local/include'
298LIBRARY_PATH='/opt/local/lib'
299MACOSX_DEPLOYMENT_TARGET='10.10'
300:debug:extract Assembled command: 'cd "/opt/local/var/macports/build/_opt_local_var_macports_sources_rsync.macports.org_release_tarballs_ports_devel_cmake/cmake/work" && /usr/bin/gzip -dc '/opt/local/var/macports/distfiles/cmake/cmake-3.0.2.tar.gz' | /usr/bin/tar -xf -'
301:debug:extract Executing command line:  cd "/opt/local/var/macports/build/_opt_local_var_macports_sources_rsync.macports.org_release_tarballs_ports_devel_cmake/cmake/work" && /usr/bin/gzip -dc '/opt/local/var/macports/distfiles/cmake/cmake-3.0.2.tar.gz' | /usr/bin/tar -xf -
302:debug:extract euid/egid changed to: 0/0
303:debug:extract chowned /opt/local/var/macports/build/_opt_local_var_macports_sources_rsync.macports.org_release_tarballs_ports_devel_cmake/cmake/work to macports
304:debug:extract euid/egid changed to: 501/20
305:debug:extract Privilege de-escalation not attempted as not running as root.
306:debug:patch patch phase started at Wed Oct  1 17:57:02 EDT 2014
307:debug:patch Executing org.macports.patch (cmake)
308:notice:patch --->  Applying patches to cmake
309:info:patch --->  Applying patch-CMakeFindFrameworks.cmake.diff
310:debug:patch Environment:
311CC_PRINT_OPTIONS='YES'
312CC_PRINT_OPTIONS_FILE='/opt/local/var/macports/build/_opt_local_var_macports_sources_rsync.macports.org_release_tarballs_ports_devel_cmake/cmake/work/.CC_PRINT_OPTIONS'
313CPATH='/opt/local/include'
314LIBRARY_PATH='/opt/local/lib'
315MACOSX_DEPLOYMENT_TARGET='10.10'
316:debug:patch Assembled command: 'cd "/opt/local/var/macports/build/_opt_local_var_macports_sources_rsync.macports.org_release_tarballs_ports_devel_cmake/cmake/work/cmake-3.0.2" && /usr/bin/patch -p0'
317:debug:patch Executing command line:  cd "/opt/local/var/macports/build/_opt_local_var_macports_sources_rsync.macports.org_release_tarballs_ports_devel_cmake/cmake/work/cmake-3.0.2" && /usr/bin/patch -p0 < '/opt/local/var/macports/sources/rsync.macports.org/release/tarballs/ports/devel/cmake/files/patch-CMakeFindFrameworks.cmake.diff'
318:info:patch patching file Modules/CMakeFindFrameworks.cmake
319:info:patch --->  Applying patch-Modules-FindFreetype.cmake.diff
320:debug:patch Environment:
321CC_PRINT_OPTIONS='YES'
322CC_PRINT_OPTIONS_FILE='/opt/local/var/macports/build/_opt_local_var_macports_sources_rsync.macports.org_release_tarballs_ports_devel_cmake/cmake/work/.CC_PRINT_OPTIONS'
323CPATH='/opt/local/include'
324LIBRARY_PATH='/opt/local/lib'
325MACOSX_DEPLOYMENT_TARGET='10.10'
326:debug:patch Assembled command: 'cd "/opt/local/var/macports/build/_opt_local_var_macports_sources_rsync.macports.org_release_tarballs_ports_devel_cmake/cmake/work/cmake-3.0.2" && /usr/bin/patch -p0'
327:debug:patch Executing command line:  cd "/opt/local/var/macports/build/_opt_local_var_macports_sources_rsync.macports.org_release_tarballs_ports_devel_cmake/cmake/work/cmake-3.0.2" && /usr/bin/patch -p0 < '/opt/local/var/macports/sources/rsync.macports.org/release/tarballs/ports/devel/cmake/files/patch-Modules-FindFreetype.cmake.diff'
328:info:patch patching file Modules/FindFreetype.cmake
329:info:patch --->  Applying patch-Modules-FindQt4.cmake.diff
330:debug:patch Environment:
331CC_PRINT_OPTIONS='YES'
332CC_PRINT_OPTIONS_FILE='/opt/local/var/macports/build/_opt_local_var_macports_sources_rsync.macports.org_release_tarballs_ports_devel_cmake/cmake/work/.CC_PRINT_OPTIONS'
333CPATH='/opt/local/include'
334LIBRARY_PATH='/opt/local/lib'
335MACOSX_DEPLOYMENT_TARGET='10.10'
336:debug:patch Assembled command: 'cd "/opt/local/var/macports/build/_opt_local_var_macports_sources_rsync.macports.org_release_tarballs_ports_devel_cmake/cmake/work/cmake-3.0.2" && /usr/bin/patch -p0'
337:debug:patch Executing command line:  cd "/opt/local/var/macports/build/_opt_local_var_macports_sources_rsync.macports.org_release_tarballs_ports_devel_cmake/cmake/work/cmake-3.0.2" && /usr/bin/patch -p0 < '/opt/local/var/macports/sources/rsync.macports.org/release/tarballs/ports/devel/cmake/files/patch-Modules-FindQt4.cmake.diff'
338:info:patch patching file Modules/FindQt4.cmake
339:info:patch --->  Applying patch-Modules-Platform-Darwin.cmake.diff
340:debug:patch Environment:
341CC_PRINT_OPTIONS='YES'
342CC_PRINT_OPTIONS_FILE='/opt/local/var/macports/build/_opt_local_var_macports_sources_rsync.macports.org_release_tarballs_ports_devel_cmake/cmake/work/.CC_PRINT_OPTIONS'
343CPATH='/opt/local/include'
344LIBRARY_PATH='/opt/local/lib'
345MACOSX_DEPLOYMENT_TARGET='10.10'
346:debug:patch Assembled command: 'cd "/opt/local/var/macports/build/_opt_local_var_macports_sources_rsync.macports.org_release_tarballs_ports_devel_cmake/cmake/work/cmake-3.0.2" && /usr/bin/patch -p0'
347:debug:patch Executing command line:  cd "/opt/local/var/macports/build/_opt_local_var_macports_sources_rsync.macports.org_release_tarballs_ports_devel_cmake/cmake/work/cmake-3.0.2" && /usr/bin/patch -p0 < '/opt/local/var/macports/sources/rsync.macports.org/release/tarballs/ports/devel/cmake/files/patch-Modules-Platform-Darwin.cmake.diff'
348:info:patch patching file Modules/Platform/Darwin.cmake
349:info:patch --->  Applying patch-Modules-noArchCheck.diff
350:debug:patch Environment:
351CC_PRINT_OPTIONS='YES'
352CC_PRINT_OPTIONS_FILE='/opt/local/var/macports/build/_opt_local_var_macports_sources_rsync.macports.org_release_tarballs_ports_devel_cmake/cmake/work/.CC_PRINT_OPTIONS'
353CPATH='/opt/local/include'
354LIBRARY_PATH='/opt/local/lib'
355MACOSX_DEPLOYMENT_TARGET='10.10'
356:debug:patch Assembled command: 'cd "/opt/local/var/macports/build/_opt_local_var_macports_sources_rsync.macports.org_release_tarballs_ports_devel_cmake/cmake/work/cmake-3.0.2" && /usr/bin/patch -p0'
357:debug:patch Executing command line:  cd "/opt/local/var/macports/build/_opt_local_var_macports_sources_rsync.macports.org_release_tarballs_ports_devel_cmake/cmake/work/cmake-3.0.2" && /usr/bin/patch -p0 < '/opt/local/var/macports/sources/rsync.macports.org/release/tarballs/ports/devel/cmake/files/patch-Modules-noArchCheck.diff'
358:info:patch patching file ./Modules/BasicConfigVersion-AnyNewerVersion.cmake.in
359:info:patch patching file ./Modules/BasicConfigVersion-ExactVersion.cmake.in
360:info:patch patching file ./Modules/BasicConfigVersion-SameMajorVersion.cmake.in
361:debug:patch Executing proc-post-org.macports.patch-patch-0
362:info:patch --->  Patching macports.cmake: s|__PREFIX__|/opt/local|g
363:debug:patch Executing reinplace: /usr/bin/sed s|__PREFIX__|/opt/local|g < /opt/local/var/macports/build/_opt_local_var_macports_sources_rsync.macports.org_release_tarballs_ports_devel_cmake/cmake/work/cmake-3.0.2/macports.cmake >@ file10 2>@stderr
364:debug:patch euid/egid changed to: 0/0
365:debug:patch chowned /opt/local/var/macports/build/_opt_local_var_macports_sources_rsync.macports.org_release_tarballs_ports_devel_cmake/cmake/work/cmake-3.0.2/macports.cmake to macports
366:debug:patch euid/egid changed to: 501/20
367:debug:patch euid/egid changed to: 0/0
368:debug:patch setting attributes on /opt/local/var/macports/build/_opt_local_var_macports_sources_rsync.macports.org_release_tarballs_ports_devel_cmake/cmake/work/cmake-3.0.2/macports.cmake
369:debug:patch euid/egid changed to: 501/20
370:info:patch --->  Patching CMakeFindFrameworks.cmake: s|__PREFIX__|/opt/local|g
371:debug:patch Executing reinplace: /usr/bin/sed s|__PREFIX__|/opt/local|g < /opt/local/var/macports/build/_opt_local_var_macports_sources_rsync.macports.org_release_tarballs_ports_devel_cmake/cmake/work/cmake-3.0.2/Modules/CMakeFindFrameworks.cmake >@ file10 2>@stderr
372:debug:patch euid/egid changed to: 0/0
373:debug:patch chowned /opt/local/var/macports/build/_opt_local_var_macports_sources_rsync.macports.org_release_tarballs_ports_devel_cmake/cmake/work/cmake-3.0.2/Modules/CMakeFindFrameworks.cmake to macports
374:debug:patch euid/egid changed to: 501/20
375:debug:patch euid/egid changed to: 0/0
376:debug:patch setting attributes on /opt/local/var/macports/build/_opt_local_var_macports_sources_rsync.macports.org_release_tarballs_ports_devel_cmake/cmake/work/cmake-3.0.2/Modules/CMakeFindFrameworks.cmake
377:debug:patch euid/egid changed to: 501/20
378:debug:patch Privilege de-escalation not attempted as not running as root.
379:debug:configure configure phase started at Wed Oct  1 17:57:02 EDT 2014
380:notice:configure --->  Configuring cmake
381:debug:configure Using compiler 'Xcode Clang'
382:debug:configure Executing org.macports.configure (cmake)
383:debug:configure Environment:
384CC='/usr/bin/clang'
385CC_PRINT_OPTIONS='YES'
386CC_PRINT_OPTIONS_FILE='/opt/local/var/macports/build/_opt_local_var_macports_sources_rsync.macports.org_release_tarballs_ports_devel_cmake/cmake/work/.CC_PRINT_OPTIONS'
387CFLAGS='-pipe -Os -arch x86_64'
388CMAKE_INCLUDE_PATH='/opt/local/include/ncurses'
389CMAKE_LIBRARY_PATH='/opt/local/lib'
390CMAKE_PREFIX_PATH='/opt/local'
391CPATH='/opt/local/include'
392CPPFLAGS='-I/opt/local/include'
393CXX='/usr/bin/clang++'
394CXXFLAGS='-pipe -Os -arch x86_64 -stdlib=libc++'
395F77FLAGS='-m64'
396F90FLAGS='-pipe -Os -m64'
397FCFLAGS='-pipe -Os -m64'
398FFLAGS='-pipe -Os'
399INSTALL='/usr/bin/install -c'
400LDFLAGS='-L/opt/local/lib -Wl,-headerpad_max_install_names -arch x86_64'
401LIBRARY_PATH='/opt/local/lib'
402MACOSX_DEPLOYMENT_TARGET='10.10'
403OBJC='/usr/bin/clang'
404OBJCFLAGS='-pipe -Os -arch x86_64'
405OBJCXX='/usr/bin/clang++'
406OBJCXXFLAGS='-pipe -Os -arch x86_64 -stdlib=libc++'
407:debug:configure Assembled command: 'cd "/opt/local/var/macports/build/_opt_local_var_macports_sources_rsync.macports.org_release_tarballs_ports_devel_cmake/cmake/work/cmake-3.0.2" && ./configure --prefix=/opt/local --mandir=/share/man --docdir=/share/doc/cmake --parallel=2 --init=/opt/local/var/macports/build/_opt_local_var_macports_sources_rsync.macports.org_release_tarballs_ports_devel_cmake/cmake/work/cmake-3.0.2/macports.cmake --system-libs'
408:debug:configure Executing command line:  cd "/opt/local/var/macports/build/_opt_local_var_macports_sources_rsync.macports.org_release_tarballs_ports_devel_cmake/cmake/work/cmake-3.0.2" && ./configure --prefix=/opt/local --mandir=/share/man --docdir=/share/doc/cmake --parallel=2 --init=/opt/local/var/macports/build/_opt_local_var_macports_sources_rsync.macports.org_release_tarballs_ports_devel_cmake/cmake/work/cmake-3.0.2/macports.cmake --system-libs
409:info:configure ---------------------------------------------
410:info:configure CMake 3.0.2, Copyright 2000-2014 Kitware, Inc.
411:info:configure C compiler on this system is: /usr/bin/clang -pipe -Os -arch x86_64
412:info:configure C++ compiler on this system is: /usr/bin/clang++ -pipe -Os -arch x86_64 -stdlib=libc++
413:info:configure Makefile processor on this system is: gmake
414:info:configure /usr/bin/clang++ is GNU compiler
415:info:configure /usr/bin/clang++ has setenv
416:info:configure /usr/bin/clang++ has unsetenv
417:info:configure /usr/bin/clang++ does not have environ in stdlib.h
418:info:configure /usr/bin/clang++ has STL in std:: namespace
419:info:configure /usr/bin/clang++ has ANSI streams
420:info:configure /usr/bin/clang++ has streams in std:: namespace
421:info:configure /usr/bin/clang++ has sstream
422:info:configure /usr/bin/clang++ has operator!=(string, char*)
423:info:configure /usr/bin/clang++ has stl iterator_traits
424:info:configure /usr/bin/clang++ has standard template allocator
425:info:configure /usr/bin/clang++ has allocator<>::rebind<>
426:info:configure /usr/bin/clang++ does not have non-standard allocator<>::max_size argument
427:info:configure /usr/bin/clang++ has stl containers supporting allocator objects
428:info:configure /usr/bin/clang++ has stl wstring
429:info:configure /usr/bin/clang++ has header cstddef
430:info:configure /usr/bin/clang++ requires template friends to use <>
431:info:configure /usr/bin/clang++ supports member templates
432:info:configure /usr/bin/clang++ has standard template specialization syntax
433:info:configure /usr/bin/clang++ has argument dependent lookup
434:info:configure /usr/bin/clang++ does not have struct stat with st_mtim member
435:info:configure /usr/bin/clang++ has ios::binary openmode
436:info:configure /usr/bin/clang++ has ANSI for scoping
437:info:configure ---------------------------------------------
438:info:configure /usr/bin/clang++ -pipe -Os -arch x86_64 -stdlib=libc++  -I/opt/local/var/macports/build/_opt_local_var_macports_sources_rsync.macports.org_release_tarballs_ports_devel_cmake/cmake/work/cmake-3.0.2/Bootstrap.cmk -I/opt/local/var/macports/build/_opt_local_var_macports_sources_rsync.macports.org_release_tarballs_ports_devel_cmake/cmake/work/cmake-3.0.2/Source   -I/opt/local/var/macports/build/_opt_local_var_macports_sources_rsync.macports.org_release_tarballs_ports_devel_cmake/cmake/work/cmake-3.0.2/Bootstrap.cmk -c /opt/local/var/macports/build/_opt_local_var_macports_sources_rsync.macports.org_release_tarballs_ports_devel_cmake/cmake/work/cmake-3.0.2/Source/cmStandardIncludes.cxx -o cmStandardIncludes.o
439:info:configure /usr/bin/clang++ -pipe -Os -arch x86_64 -stdlib=libc++  -I/opt/local/var/macports/build/_opt_local_var_macports_sources_rsync.macports.org_release_tarballs_ports_devel_cmake/cmake/work/cmake-3.0.2/Bootstrap.cmk -I/opt/local/var/macports/build/_opt_local_var_macports_sources_rsync.macports.org_release_tarballs_ports_devel_cmake/cmake/work/cmake-3.0.2/Source   -I/opt/local/var/macports/build/_opt_local_var_macports_sources_rsync.macports.org_release_tarballs_ports_devel_cmake/cmake/work/cmake-3.0.2/Bootstrap.cmk -c /opt/local/var/macports/build/_opt_local_var_macports_sources_rsync.macports.org_release_tarballs_ports_devel_cmake/cmake/work/cmake-3.0.2/Source/cmake.cxx -o cmake.o
440:info:configure /usr/bin/clang++ -pipe -Os -arch x86_64 -stdlib=libc++  -I/opt/local/var/macports/build/_opt_local_var_macports_sources_rsync.macports.org_release_tarballs_ports_devel_cmake/cmake/work/cmake-3.0.2/Bootstrap.cmk -I/opt/local/var/macports/build/_opt_local_var_macports_sources_rsync.macports.org_release_tarballs_ports_devel_cmake/cmake/work/cmake-3.0.2/Source   -I/opt/local/var/macports/build/_opt_local_var_macports_sources_rsync.macports.org_release_tarballs_ports_devel_cmake/cmake/work/cmake-3.0.2/Bootstrap.cmk -c /opt/local/var/macports/build/_opt_local_var_macports_sources_rsync.macports.org_release_tarballs_ports_devel_cmake/cmake/work/cmake-3.0.2/Source/cmakemain.cxx -o cmakemain.o
441:info:configure /usr/bin/clang++ -pipe -Os -arch x86_64 -stdlib=libc++  -I/opt/local/var/macports/build/_opt_local_var_macports_sources_rsync.macports.org_release_tarballs_ports_devel_cmake/cmake/work/cmake-3.0.2/Bootstrap.cmk -I/opt/local/var/macports/build/_opt_local_var_macports_sources_rsync.macports.org_release_tarballs_ports_devel_cmake/cmake/work/cmake-3.0.2/Source   -I/opt/local/var/macports/build/_opt_local_var_macports_sources_rsync.macports.org_release_tarballs_ports_devel_cmake/cmake/work/cmake-3.0.2/Bootstrap.cmk -c /opt/local/var/macports/build/_opt_local_var_macports_sources_rsync.macports.org_release_tarballs_ports_devel_cmake/cmake/work/cmake-3.0.2/Source/cmcmd.cxx -o cmcmd.o
442:info:configure /usr/bin/clang++ -pipe -Os -arch x86_64 -stdlib=libc++  -I/opt/local/var/macports/build/_opt_local_var_macports_sources_rsync.macports.org_release_tarballs_ports_devel_cmake/cmake/work/cmake-3.0.2/Bootstrap.cmk -I/opt/local/var/macports/build/_opt_local_var_macports_sources_rsync.macports.org_release_tarballs_ports_devel_cmake/cmake/work/cmake-3.0.2/Source   -I/opt/local/var/macports/build/_opt_local_var_macports_sources_rsync.macports.org_release_tarballs_ports_devel_cmake/cmake/work/cmake-3.0.2/Bootstrap.cmk -c /opt/local/var/macports/build/_opt_local_var_macports_sources_rsync.macports.org_release_tarballs_ports_devel_cmake/cmake/work/cmake-3.0.2/Source/cmCommandArgumentLexer.cxx -o cmCommandArgumentLexer.o
443:info:configure /usr/bin/clang++ -pipe -Os -arch x86_64 -stdlib=libc++  -I/opt/local/var/macports/build/_opt_local_var_macports_sources_rsync.macports.org_release_tarballs_ports_devel_cmake/cmake/work/cmake-3.0.2/Bootstrap.cmk -I/opt/local/var/macports/build/_opt_local_var_macports_sources_rsync.macports.org_release_tarballs_ports_devel_cmake/cmake/work/cmake-3.0.2/Source   -I/opt/local/var/macports/build/_opt_local_var_macports_sources_rsync.macports.org_release_tarballs_ports_devel_cmake/cmake/work/cmake-3.0.2/Bootstrap.cmk -c /opt/local/var/macports/build/_opt_local_var_macports_sources_rsync.macports.org_release_tarballs_ports_devel_cmake/cmake/work/cmake-3.0.2/Source/cmCommandArgumentParser.cxx -o cmCommandArgumentParser.o
444:info:configure /usr/bin/clang++ -pipe -Os -arch x86_64 -stdlib=libc++  -I/opt/local/var/macports/build/_opt_local_var_macports_sources_rsync.macports.org_release_tarballs_ports_devel_cmake/cmake/work/cmake-3.0.2/Bootstrap.cmk -I/opt/local/var/macports/build/_opt_local_var_macports_sources_rsync.macports.org_release_tarballs_ports_devel_cmake/cmake/work/cmake-3.0.2/Source   -I/opt/local/var/macports/build/_opt_local_var_macports_sources_rsync.macports.org_release_tarballs_ports_devel_cmake/cmake/work/cmake-3.0.2/Bootstrap.cmk -c /opt/local/var/macports/build/_opt_local_var_macports_sources_rsync.macports.org_release_tarballs_ports_devel_cmake/cmake/work/cmake-3.0.2/Source/cmCommandArgumentParserHelper.cxx -o cmCommandArgumentParserHelper.o
445:info:configure /usr/bin/clang++ -pipe -Os -arch x86_64 -stdlib=libc++  -I/opt/local/var/macports/build/_opt_local_var_macports_sources_rsync.macports.org_release_tarballs_ports_devel_cmake/cmake/work/cmake-3.0.2/Bootstrap.cmk -I/opt/local/var/macports/build/_opt_local_var_macports_sources_rsync.macports.org_release_tarballs_ports_devel_cmake/cmake/work/cmake-3.0.2/Source   -I/opt/local/var/macports/build/_opt_local_var_macports_sources_rsync.macports.org_release_tarballs_ports_devel_cmake/cmake/work/cmake-3.0.2/Bootstrap.cmk -c /opt/local/var/macports/build/_opt_local_var_macports_sources_rsync.macports.org_release_tarballs_ports_devel_cmake/cmake/work/cmake-3.0.2/Source/cmDefinitions.cxx -o cmDefinitions.o
446:info:configure /usr/bin/clang++ -pipe -Os -arch x86_64 -stdlib=libc++  -I/opt/local/var/macports/build/_opt_local_var_macports_sources_rsync.macports.org_release_tarballs_ports_devel_cmake/cmake/work/cmake-3.0.2/Bootstrap.cmk -I/opt/local/var/macports/build/_opt_local_var_macports_sources_rsync.macports.org_release_tarballs_ports_devel_cmake/cmake/work/cmake-3.0.2/Source   -I/opt/local/var/macports/build/_opt_local_var_macports_sources_rsync.macports.org_release_tarballs_ports_devel_cmake/cmake/work/cmake-3.0.2/Bootstrap.cmk -c /opt/local/var/macports/build/_opt_local_var_macports_sources_rsync.macports.org_release_tarballs_ports_devel_cmake/cmake/work/cmake-3.0.2/Source/cmDepends.cxx -o cmDepends.o
447:info:configure /usr/bin/clang++ -pipe -Os -arch x86_64 -stdlib=libc++  -I/opt/local/var/macports/build/_opt_local_var_macports_sources_rsync.macports.org_release_tarballs_ports_devel_cmake/cmake/work/cmake-3.0.2/Bootstrap.cmk -I/opt/local/var/macports/build/_opt_local_var_macports_sources_rsync.macports.org_release_tarballs_ports_devel_cmake/cmake/work/cmake-3.0.2/Source   -I/opt/local/var/macports/build/_opt_local_var_macports_sources_rsync.macports.org_release_tarballs_ports_devel_cmake/cmake/work/cmake-3.0.2/Bootstrap.cmk -c /opt/local/var/macports/build/_opt_local_var_macports_sources_rsync.macports.org_release_tarballs_ports_devel_cmake/cmake/work/cmake-3.0.2/Source/cmDependsC.cxx -o cmDependsC.o
448:info:configure /usr/bin/clang++ -pipe -Os -arch x86_64 -stdlib=libc++  -I/opt/local/var/macports/build/_opt_local_var_macports_sources_rsync.macports.org_release_tarballs_ports_devel_cmake/cmake/work/cmake-3.0.2/Bootstrap.cmk -I/opt/local/var/macports/build/_opt_local_var_macports_sources_rsync.macports.org_release_tarballs_ports_devel_cmake/cmake/work/cmake-3.0.2/Source   -I/opt/local/var/macports/build/_opt_local_var_macports_sources_rsync.macports.org_release_tarballs_ports_devel_cmake/cmake/work/cmake-3.0.2/Bootstrap.cmk -c /opt/local/var/macports/build/_opt_local_var_macports_sources_rsync.macports.org_release_tarballs_ports_devel_cmake/cmake/work/cmake-3.0.2/Source/cmDocumentationFormatter.cxx -o cmDocumentationFormatter.o
449:info:configure /usr/bin/clang++ -pipe -Os -arch x86_64 -stdlib=libc++  -I/opt/local/var/macports/build/_opt_local_var_macports_sources_rsync.macports.org_release_tarballs_ports_devel_cmake/cmake/work/cmake-3.0.2/Bootstrap.cmk -I/opt/local/var/macports/build/_opt_local_var_macports_sources_rsync.macports.org_release_tarballs_ports_devel_cmake/cmake/work/cmake-3.0.2/Source   -I/opt/local/var/macports/build/_opt_local_var_macports_sources_rsync.macports.org_release_tarballs_ports_devel_cmake/cmake/work/cmake-3.0.2/Bootstrap.cmk -c /opt/local/var/macports/build/_opt_local_var_macports_sources_rsync.macports.org_release_tarballs_ports_devel_cmake/cmake/work/cmake-3.0.2/Source/cmPolicies.cxx -o cmPolicies.o
450:info:configure /usr/bin/clang++ -pipe -Os -arch x86_64 -stdlib=libc++  -I/opt/local/var/macports/build/_opt_local_var_macports_sources_rsync.macports.org_release_tarballs_ports_devel_cmake/cmake/work/cmake-3.0.2/Bootstrap.cmk -I/opt/local/var/macports/build/_opt_local_var_macports_sources_rsync.macports.org_release_tarballs_ports_devel_cmake/cmake/work/cmake-3.0.2/Source   -I/opt/local/var/macports/build/_opt_local_var_macports_sources_rsync.macports.org_release_tarballs_ports_devel_cmake/cmake/work/cmake-3.0.2/Bootstrap.cmk -c /opt/local/var/macports/build/_opt_local_var_macports_sources_rsync.macports.org_release_tarballs_ports_devel_cmake/cmake/work/cmake-3.0.2/Source/cmProperty.cxx -o cmProperty.o
451:info:configure /usr/bin/clang++ -pipe -Os -arch x86_64 -stdlib=libc++  -I/opt/local/var/macports/build/_opt_local_var_macports_sources_rsync.macports.org_release_tarballs_ports_devel_cmake/cmake/work/cmake-3.0.2/Bootstrap.cmk -I/opt/local/var/macports/build/_opt_local_var_macports_sources_rsync.macports.org_release_tarballs_ports_devel_cmake/cmake/work/cmake-3.0.2/Source   -I/opt/local/var/macports/build/_opt_local_var_macports_sources_rsync.macports.org_release_tarballs_ports_devel_cmake/cmake/work/cmake-3.0.2/Bootstrap.cmk -c /opt/local/var/macports/build/_opt_local_var_macports_sources_rsync.macports.org_release_tarballs_ports_devel_cmake/cmake/work/cmake-3.0.2/Source/cmPropertyMap.cxx -o cmPropertyMap.o
452:info:configure /usr/bin/clang++ -pipe -Os -arch x86_64 -stdlib=libc++  -I/opt/local/var/macports/build/_opt_local_var_macports_sources_rsync.macports.org_release_tarballs_ports_devel_cmake/cmake/work/cmake-3.0.2/Bootstrap.cmk -I/opt/local/var/macports/build/_opt_local_var_macports_sources_rsync.macports.org_release_tarballs_ports_devel_cmake/cmake/work/cmake-3.0.2/Source   -I/opt/local/var/macports/build/_opt_local_var_macports_sources_rsync.macports.org_release_tarballs_ports_devel_cmake/cmake/work/cmake-3.0.2/Bootstrap.cmk -c /opt/local/var/macports/build/_opt_local_var_macports_sources_rsync.macports.org_release_tarballs_ports_devel_cmake/cmake/work/cmake-3.0.2/Source/cmPropertyDefinition.cxx -o cmPropertyDefinition.o
453:info:configure /usr/bin/clang++ -pipe -Os -arch x86_64 -stdlib=libc++  -I/opt/local/var/macports/build/_opt_local_var_macports_sources_rsync.macports.org_release_tarballs_ports_devel_cmake/cmake/work/cmake-3.0.2/Bootstrap.cmk -I/opt/local/var/macports/build/_opt_local_var_macports_sources_rsync.macports.org_release_tarballs_ports_devel_cmake/cmake/work/cmake-3.0.2/Source   -I/opt/local/var/macports/build/_opt_local_var_macports_sources_rsync.macports.org_release_tarballs_ports_devel_cmake/cmake/work/cmake-3.0.2/Bootstrap.cmk -c /opt/local/var/macports/build/_opt_local_var_macports_sources_rsync.macports.org_release_tarballs_ports_devel_cmake/cmake/work/cmake-3.0.2/Source/cmPropertyDefinitionMap.cxx -o cmPropertyDefinitionMap.o
454:info:configure /usr/bin/clang++ -pipe -Os -arch x86_64 -stdlib=libc++  -I/opt/local/var/macports/build/_opt_local_var_macports_sources_rsync.macports.org_release_tarballs_ports_devel_cmake/cmake/work/cmake-3.0.2/Bootstrap.cmk -I/opt/local/var/macports/build/_opt_local_var_macports_sources_rsync.macports.org_release_tarballs_ports_devel_cmake/cmake/work/cmake-3.0.2/Source   -I/opt/local/var/macports/build/_opt_local_var_macports_sources_rsync.macports.org_release_tarballs_ports_devel_cmake/cmake/work/cmake-3.0.2/Bootstrap.cmk -c /opt/local/var/macports/build/_opt_local_var_macports_sources_rsync.macports.org_release_tarballs_ports_devel_cmake/cmake/work/cmake-3.0.2/Source/cmMakeDepend.cxx -o cmMakeDepend.o
455:info:configure /usr/bin/clang++ -pipe -Os -arch x86_64 -stdlib=libc++  -I/opt/local/var/macports/build/_opt_local_var_macports_sources_rsync.macports.org_release_tarballs_ports_devel_cmake/cmake/work/cmake-3.0.2/Bootstrap.cmk -I/opt/local/var/macports/build/_opt_local_var_macports_sources_rsync.macports.org_release_tarballs_ports_devel_cmake/cmake/work/cmake-3.0.2/Source   -I/opt/local/var/macports/build/_opt_local_var_macports_sources_rsync.macports.org_release_tarballs_ports_devel_cmake/cmake/work/cmake-3.0.2/Bootstrap.cmk -c /opt/local/var/macports/build/_opt_local_var_macports_sources_rsync.macports.org_release_tarballs_ports_devel_cmake/cmake/work/cmake-3.0.2/Source/cmMakefile.cxx -o cmMakefile.o
456:info:configure /usr/bin/clang++ -pipe -Os -arch x86_64 -stdlib=libc++  -I/opt/local/var/macports/build/_opt_local_var_macports_sources_rsync.macports.org_release_tarballs_ports_devel_cmake/cmake/work/cmake-3.0.2/Bootstrap.cmk -I/opt/local/var/macports/build/_opt_local_var_macports_sources_rsync.macports.org_release_tarballs_ports_devel_cmake/cmake/work/cmake-3.0.2/Source   -I/opt/local/var/macports/build/_opt_local_var_macports_sources_rsync.macports.org_release_tarballs_ports_devel_cmake/cmake/work/cmake-3.0.2/Bootstrap.cmk -c /opt/local/var/macports/build/_opt_local_var_macports_sources_rsync.macports.org_release_tarballs_ports_devel_cmake/cmake/work/cmake-3.0.2/Source/cmExportFileGenerator.cxx -o cmExportFileGenerator.o
457:info:configure /usr/bin/clang++ -pipe -Os -arch x86_64 -stdlib=libc++  -I/opt/local/var/macports/build/_opt_local_var_macports_sources_rsync.macports.org_release_tarballs_ports_devel_cmake/cmake/work/cmake-3.0.2/Bootstrap.cmk -I/opt/local/var/macports/build/_opt_local_var_macports_sources_rsync.macports.org_release_tarballs_ports_devel_cmake/cmake/work/cmake-3.0.2/Source   -I/opt/local/var/macports/build/_opt_local_var_macports_sources_rsync.macports.org_release_tarballs_ports_devel_cmake/cmake/work/cmake-3.0.2/Bootstrap.cmk -c /opt/local/var/macports/build/_opt_local_var_macports_sources_rsync.macports.org_release_tarballs_ports_devel_cmake/cmake/work/cmake-3.0.2/Source/cmExportInstallFileGenerator.cxx -o cmExportInstallFileGenerator.o
458:info:configure /usr/bin/clang++ -pipe -Os -arch x86_64 -stdlib=libc++  -I/opt/local/var/macports/build/_opt_local_var_macports_sources_rsync.macports.org_release_tarballs_ports_devel_cmake/cmake/work/cmake-3.0.2/Bootstrap.cmk -I/opt/local/var/macports/build/_opt_local_var_macports_sources_rsync.macports.org_release_tarballs_ports_devel_cmake/cmake/work/cmake-3.0.2/Source   -I/opt/local/var/macports/build/_opt_local_var_macports_sources_rsync.macports.org_release_tarballs_ports_devel_cmake/cmake/work/cmake-3.0.2/Bootstrap.cmk -c /opt/local/var/macports/build/_opt_local_var_macports_sources_rsync.macports.org_release_tarballs_ports_devel_cmake/cmake/work/cmake-3.0.2/Source/cmExportTryCompileFileGenerator.cxx -o cmExportTryCompileFileGenerator.o
459:info:configure /usr/bin/clang++ -pipe -Os -arch x86_64 -stdlib=libc++  -I/opt/local/var/macports/build/_opt_local_var_macports_sources_rsync.macports.org_release_tarballs_ports_devel_cmake/cmake/work/cmake-3.0.2/Bootstrap.cmk -I/opt/local/var/macports/build/_opt_local_var_macports_sources_rsync.macports.org_release_tarballs_ports_devel_cmake/cmake/work/cmake-3.0.2/Source   -I/opt/local/var/macports/build/_opt_local_var_macports_sources_rsync.macports.org_release_tarballs_ports_devel_cmake/cmake/work/cmake-3.0.2/Bootstrap.cmk -c /opt/local/var/macports/build/_opt_local_var_macports_sources_rsync.macports.org_release_tarballs_ports_devel_cmake/cmake/work/cmake-3.0.2/Source/cmExportSet.cxx -o cmExportSet.o
460:info:configure /usr/bin/clang++ -pipe -Os -arch x86_64 -stdlib=libc++  -I/opt/local/var/macports/build/_opt_local_var_macports_sources_rsync.macports.org_release_tarballs_ports_devel_cmake/cmake/work/cmake-3.0.2/Bootstrap.cmk -I/opt/local/var/macports/build/_opt_local_var_macports_sources_rsync.macports.org_release_tarballs_ports_devel_cmake/cmake/work/cmake-3.0.2/Source   -I/opt/local/var/macports/build/_opt_local_var_macports_sources_rsync.macports.org_release_tarballs_ports_devel_cmake/cmake/work/cmake-3.0.2/Bootstrap.cmk -c /opt/local/var/macports/build/_opt_local_var_macports_sources_rsync.macports.org_release_tarballs_ports_devel_cmake/cmake/work/cmake-3.0.2/Source/cmExportSetMap.cxx -o cmExportSetMap.o
461:info:configure /usr/bin/clang++ -pipe -Os -arch x86_64 -stdlib=libc++  -I/opt/local/var/macports/build/_opt_local_var_macports_sources_rsync.macports.org_release_tarballs_ports_devel_cmake/cmake/work/cmake-3.0.2/Bootstrap.cmk -I/opt/local/var/macports/build/_opt_local_var_macports_sources_rsync.macports.org_release_tarballs_ports_devel_cmake/cmake/work/cmake-3.0.2/Source   -I/opt/local/var/macports/build/_opt_local_var_macports_sources_rsync.macports.org_release_tarballs_ports_devel_cmake/cmake/work/cmake-3.0.2/Bootstrap.cmk -c /opt/local/var/macports/build/_opt_local_var_macports_sources_rsync.macports.org_release_tarballs_ports_devel_cmake/cmake/work/cmake-3.0.2/Source/cmInstallDirectoryGenerator.cxx -o cmInstallDirectoryGenerator.o
462:info:configure /usr/bin/clang++ -pipe -Os -arch x86_64 -stdlib=libc++  -I/opt/local/var/macports/build/_opt_local_var_macports_sources_rsync.macports.org_release_tarballs_ports_devel_cmake/cmake/work/cmake-3.0.2/Bootstrap.cmk -I/opt/local/var/macports/build/_opt_local_var_macports_sources_rsync.macports.org_release_tarballs_ports_devel_cmake/cmake/work/cmake-3.0.2/Source   -I/opt/local/var/macports/build/_opt_local_var_macports_sources_rsync.macports.org_release_tarballs_ports_devel_cmake/cmake/work/cmake-3.0.2/Bootstrap.cmk -c /opt/local/var/macports/build/_opt_local_var_macports_sources_rsync.macports.org_release_tarballs_ports_devel_cmake/cmake/work/cmake-3.0.2/Source/cmGeneratedFileStream.cxx -o cmGeneratedFileStream.o
463:info:configure /usr/bin/clang++ -pipe -Os -arch x86_64 -stdlib=libc++  -I/opt/local/var/macports/build/_opt_local_var_macports_sources_rsync.macports.org_release_tarballs_ports_devel_cmake/cmake/work/cmake-3.0.2/Bootstrap.cmk -I/opt/local/var/macports/build/_opt_local_var_macports_sources_rsync.macports.org_release_tarballs_ports_devel_cmake/cmake/work/cmake-3.0.2/Source   -I/opt/local/var/macports/build/_opt_local_var_macports_sources_rsync.macports.org_release_tarballs_ports_devel_cmake/cmake/work/cmake-3.0.2/Bootstrap.cmk -c /opt/local/var/macports/build/_opt_local_var_macports_sources_rsync.macports.org_release_tarballs_ports_devel_cmake/cmake/work/cmake-3.0.2/Source/cmGeneratorTarget.cxx -o cmGeneratorTarget.o
464:info:configure /usr/bin/clang++ -pipe -Os -arch x86_64 -stdlib=libc++  -I/opt/local/var/macports/build/_opt_local_var_macports_sources_rsync.macports.org_release_tarballs_ports_devel_cmake/cmake/work/cmake-3.0.2/Bootstrap.cmk -I/opt/local/var/macports/build/_opt_local_var_macports_sources_rsync.macports.org_release_tarballs_ports_devel_cmake/cmake/work/cmake-3.0.2/Source   -I/opt/local/var/macports/build/_opt_local_var_macports_sources_rsync.macports.org_release_tarballs_ports_devel_cmake/cmake/work/cmake-3.0.2/Bootstrap.cmk -c /opt/local/var/macports/build/_opt_local_var_macports_sources_rsync.macports.org_release_tarballs_ports_devel_cmake/cmake/work/cmake-3.0.2/Source/cmGeneratorExpressionDAGChecker.cxx -o cmGeneratorExpressionDAGChecker.o
465:info:configure /usr/bin/clang++ -pipe -Os -arch x86_64 -stdlib=libc++  -I/opt/local/var/macports/build/_opt_local_var_macports_sources_rsync.macports.org_release_tarballs_ports_devel_cmake/cmake/work/cmake-3.0.2/Bootstrap.cmk -I/opt/local/var/macports/build/_opt_local_var_macports_sources_rsync.macports.org_release_tarballs_ports_devel_cmake/cmake/work/cmake-3.0.2/Source   -I/opt/local/var/macports/build/_opt_local_var_macports_sources_rsync.macports.org_release_tarballs_ports_devel_cmake/cmake/work/cmake-3.0.2/Bootstrap.cmk -c /opt/local/var/macports/build/_opt_local_var_macports_sources_rsync.macports.org_release_tarballs_ports_devel_cmake/cmake/work/cmake-3.0.2/Source/cmGeneratorExpressionEvaluator.cxx -o cmGeneratorExpressionEvaluator.o
466:info:configure /usr/bin/clang++ -pipe -Os -arch x86_64 -stdlib=libc++  -I/opt/local/var/macports/build/_opt_local_var_macports_sources_rsync.macports.org_release_tarballs_ports_devel_cmake/cmake/work/cmake-3.0.2/Bootstrap.cmk -I/opt/local/var/macports/build/_opt_local_var_macports_sources_rsync.macports.org_release_tarballs_ports_devel_cmake/cmake/work/cmake-3.0.2/Source   -I/opt/local/var/macports/build/_opt_local_var_macports_sources_rsync.macports.org_release_tarballs_ports_devel_cmake/cmake/work/cmake-3.0.2/Bootstrap.cmk -c /opt/local/var/macports/build/_opt_local_var_macports_sources_rsync.macports.org_release_tarballs_ports_devel_cmake/cmake/work/cmake-3.0.2/Source/cmGeneratorExpressionLexer.cxx -o cmGeneratorExpressionLexer.o
467:info:configure /usr/bin/clang++ -pipe -Os -arch x86_64 -stdlib=libc++  -I/opt/local/var/macports/build/_opt_local_var_macports_sources_rsync.macports.org_release_tarballs_ports_devel_cmake/cmake/work/cmake-3.0.2/Bootstrap.cmk -I/opt/local/var/macports/build/_opt_local_var_macports_sources_rsync.macports.org_release_tarballs_ports_devel_cmake/cmake/work/cmake-3.0.2/Source   -I/opt/local/var/macports/build/_opt_local_var_macports_sources_rsync.macports.org_release_tarballs_ports_devel_cmake/cmake/work/cmake-3.0.2/Bootstrap.cmk -c /opt/local/var/macports/build/_opt_local_var_macports_sources_rsync.macports.org_release_tarballs_ports_devel_cmake/cmake/work/cmake-3.0.2/Source/cmGeneratorExpressionParser.cxx -o cmGeneratorExpressionParser.o
468:info:configure /usr/bin/clang++ -pipe -Os -arch x86_64 -stdlib=libc++  -I/opt/local/var/macports/build/_opt_local_var_macports_sources_rsync.macports.org_release_tarballs_ports_devel_cmake/cmake/work/cmake-3.0.2/Bootstrap.cmk -I/opt/local/var/macports/build/_opt_local_var_macports_sources_rsync.macports.org_release_tarballs_ports_devel_cmake/cmake/work/cmake-3.0.2/Source   -I/opt/local/var/macports/build/_opt_local_var_macports_sources_rsync.macports.org_release_tarballs_ports_devel_cmake/cmake/work/cmake-3.0.2/Bootstrap.cmk -c /opt/local/var/macports/build/_opt_local_var_macports_sources_rsync.macports.org_release_tarballs_ports_devel_cmake/cmake/work/cmake-3.0.2/Source/cmGeneratorExpression.cxx -o cmGeneratorExpression.o
469:info:configure /usr/bin/clang++ -pipe -Os -arch x86_64 -stdlib=libc++  -I/opt/local/var/macports/build/_opt_local_var_macports_sources_rsync.macports.org_release_tarballs_ports_devel_cmake/cmake/work/cmake-3.0.2/Bootstrap.cmk -I/opt/local/var/macports/build/_opt_local_var_macports_sources_rsync.macports.org_release_tarballs_ports_devel_cmake/cmake/work/cmake-3.0.2/Source   -I/opt/local/var/macports/build/_opt_local_var_macports_sources_rsync.macports.org_release_tarballs_ports_devel_cmake/cmake/work/cmake-3.0.2/Bootstrap.cmk -c /opt/local/var/macports/build/_opt_local_var_macports_sources_rsync.macports.org_release_tarballs_ports_devel_cmake/cmake/work/cmake-3.0.2/Source/cmGlobalGenerator.cxx -o cmGlobalGenerator.o
470:info:configure /usr/bin/clang++ -pipe -Os -arch x86_64 -stdlib=libc++  -I/opt/local/var/macports/build/_opt_local_var_macports_sources_rsync.macports.org_release_tarballs_ports_devel_cmake/cmake/work/cmake-3.0.2/Bootstrap.cmk -I/opt/local/var/macports/build/_opt_local_var_macports_sources_rsync.macports.org_release_tarballs_ports_devel_cmake/cmake/work/cmake-3.0.2/Source   -I/opt/local/var/macports/build/_opt_local_var_macports_sources_rsync.macports.org_release_tarballs_ports_devel_cmake/cmake/work/cmake-3.0.2/Bootstrap.cmk -c /opt/local/var/macports/build/_opt_local_var_macports_sources_rsync.macports.org_release_tarballs_ports_devel_cmake/cmake/work/cmake-3.0.2/Source/cmLocalGenerator.cxx -o cmLocalGenerator.o
471:info:configure /usr/bin/clang++ -pipe -Os -arch x86_64 -stdlib=libc++  -I/opt/local/var/macports/build/_opt_local_var_macports_sources_rsync.macports.org_release_tarballs_ports_devel_cmake/cmake/work/cmake-3.0.2/Bootstrap.cmk -I/opt/local/var/macports/build/_opt_local_var_macports_sources_rsync.macports.org_release_tarballs_ports_devel_cmake/cmake/work/cmake-3.0.2/Source   -I/opt/local/var/macports/build/_opt_local_var_macports_sources_rsync.macports.org_release_tarballs_ports_devel_cmake/cmake/work/cmake-3.0.2/Bootstrap.cmk -c /opt/local/var/macports/build/_opt_local_var_macports_sources_rsync.macports.org_release_tarballs_ports_devel_cmake/cmake/work/cmake-3.0.2/Source/cmInstallGenerator.cxx -o cmInstallGenerator.o
472:info:configure /usr/bin/clang++ -pipe -Os -arch x86_64 -stdlib=libc++  -I/opt/local/var/macports/build/_opt_local_var_macports_sources_rsync.macports.org_release_tarballs_ports_devel_cmake/cmake/work/cmake-3.0.2/Bootstrap.cmk -I/opt/local/var/macports/build/_opt_local_var_macports_sources_rsync.macports.org_release_tarballs_ports_devel_cmake/cmake/work/cmake-3.0.2/Source   -I/opt/local/var/macports/build/_opt_local_var_macports_sources_rsync.macports.org_release_tarballs_ports_devel_cmake/cmake/work/cmake-3.0.2/Bootstrap.cmk -c /opt/local/var/macports/build/_opt_local_var_macports_sources_rsync.macports.org_release_tarballs_ports_devel_cmake/cmake/work/cmake-3.0.2/Source/cmInstallExportGenerator.cxx -o cmInstallExportGenerator.o
473:info:configure /usr/bin/clang++ -pipe -Os -arch x86_64 -stdlib=libc++  -I/opt/local/var/macports/build/_opt_local_var_macports_sources_rsync.macports.org_release_tarballs_ports_devel_cmake/cmake/work/cmake-3.0.2/Bootstrap.cmk -I/opt/local/var/macports/build/_opt_local_var_macports_sources_rsync.macports.org_release_tarballs_ports_devel_cmake/cmake/work/cmake-3.0.2/Source   -I/opt/local/var/macports/build/_opt_local_var_macports_sources_rsync.macports.org_release_tarballs_ports_devel_cmake/cmake/work/cmake-3.0.2/Bootstrap.cmk -c /opt/local/var/macports/build/_opt_local_var_macports_sources_rsync.macports.org_release_tarballs_ports_devel_cmake/cmake/work/cmake-3.0.2/Source/cmInstallFilesGenerator.cxx -o cmInstallFilesGenerator.o
474:info:configure /usr/bin/clang++ -pipe -Os -arch x86_64 -stdlib=libc++  -I/opt/local/var/macports/build/_opt_local_var_macports_sources_rsync.macports.org_release_tarballs_ports_devel_cmake/cmake/work/cmake-3.0.2/Bootstrap.cmk -I/opt/local/var/macports/build/_opt_local_var_macports_sources_rsync.macports.org_release_tarballs_ports_devel_cmake/cmake/work/cmake-3.0.2/Source   -I/opt/local/var/macports/build/_opt_local_var_macports_sources_rsync.macports.org_release_tarballs_ports_devel_cmake/cmake/work/cmake-3.0.2/Bootstrap.cmk -c /opt/local/var/macports/build/_opt_local_var_macports_sources_rsync.macports.org_release_tarballs_ports_devel_cmake/cmake/work/cmake-3.0.2/Source/cmInstallScriptGenerator.cxx -o cmInstallScriptGenerator.o
475:info:configure /usr/bin/clang++ -pipe -Os -arch x86_64 -stdlib=libc++  -I/opt/local/var/macports/build/_opt_local_var_macports_sources_rsync.macports.org_release_tarballs_ports_devel_cmake/cmake/work/cmake-3.0.2/Bootstrap.cmk -I/opt/local/var/macports/build/_opt_local_var_macports_sources_rsync.macports.org_release_tarballs_ports_devel_cmake/cmake/work/cmake-3.0.2/Source   -I/opt/local/var/macports/build/_opt_local_var_macports_sources_rsync.macports.org_release_tarballs_ports_devel_cmake/cmake/work/cmake-3.0.2/Bootstrap.cmk -c /opt/local/var/macports/build/_opt_local_var_macports_sources_rsync.macports.org_release_tarballs_ports_devel_cmake/cmake/work/cmake-3.0.2/Source/cmInstallTargetGenerator.cxx -o cmInstallTargetGenerator.o
476:info:configure /usr/bin/clang++ -pipe -Os -arch x86_64 -stdlib=libc++  -I/opt/local/var/macports/build/_opt_local_var_macports_sources_rsync.macports.org_release_tarballs_ports_devel_cmake/cmake/work/cmake-3.0.2/Bootstrap.cmk -I/opt/local/var/macports/build/_opt_local_var_macports_sources_rsync.macports.org_release_tarballs_ports_devel_cmake/cmake/work/cmake-3.0.2/Source   -I/opt/local/var/macports/build/_opt_local_var_macports_sources_rsync.macports.org_release_tarballs_ports_devel_cmake/cmake/work/cmake-3.0.2/Bootstrap.cmk -c /opt/local/var/macports/build/_opt_local_var_macports_sources_rsync.macports.org_release_tarballs_ports_devel_cmake/cmake/work/cmake-3.0.2/Source/cmScriptGenerator.cxx -o cmScriptGenerator.o
477:info:configure /usr/bin/clang++ -pipe -Os -arch x86_64 -stdlib=libc++  -I/opt/local/var/macports/build/_opt_local_var_macports_sources_rsync.macports.org_release_tarballs_ports_devel_cmake/cmake/work/cmake-3.0.2/Bootstrap.cmk -I/opt/local/var/macports/build/_opt_local_var_macports_sources_rsync.macports.org_release_tarballs_ports_devel_cmake/cmake/work/cmake-3.0.2/Source   -I/opt/local/var/macports/build/_opt_local_var_macports_sources_rsync.macports.org_release_tarballs_ports_devel_cmake/cmake/work/cmake-3.0.2/Bootstrap.cmk -c /opt/local/var/macports/build/_opt_local_var_macports_sources_rsync.macports.org_release_tarballs_ports_devel_cmake/cmake/work/cmake-3.0.2/Source/cmSourceFile.cxx -o cmSourceFile.o
478:info:configure /usr/bin/clang++ -pipe -Os -arch x86_64 -stdlib=libc++  -I/opt/local/var/macports/build/_opt_local_var_macports_sources_rsync.macports.org_release_tarballs_ports_devel_cmake/cmake/work/cmake-3.0.2/Bootstrap.cmk -I/opt/local/var/macports/build/_opt_local_var_macports_sources_rsync.macports.org_release_tarballs_ports_devel_cmake/cmake/work/cmake-3.0.2/Source   -I/opt/local/var/macports/build/_opt_local_var_macports_sources_rsync.macports.org_release_tarballs_ports_devel_cmake/cmake/work/cmake-3.0.2/Bootstrap.cmk -c /opt/local/var/macports/build/_opt_local_var_macports_sources_rsync.macports.org_release_tarballs_ports_devel_cmake/cmake/work/cmake-3.0.2/Source/cmSourceFileLocation.cxx -o cmSourceFileLocation.o
479:info:configure /usr/bin/clang++ -pipe -Os -arch x86_64 -stdlib=libc++  -I/opt/local/var/macports/build/_opt_local_var_macports_sources_rsync.macports.org_release_tarballs_ports_devel_cmake/cmake/work/cmake-3.0.2/Bootstrap.cmk -I/opt/local/var/macports/build/_opt_local_var_macports_sources_rsync.macports.org_release_tarballs_ports_devel_cmake/cmake/work/cmake-3.0.2/Source   -I/opt/local/var/macports/build/_opt_local_var_macports_sources_rsync.macports.org_release_tarballs_ports_devel_cmake/cmake/work/cmake-3.0.2/Bootstrap.cmk -c /opt/local/var/macports/build/_opt_local_var_macports_sources_rsync.macports.org_release_tarballs_ports_devel_cmake/cmake/work/cmake-3.0.2/Source/cmSystemTools.cxx -o cmSystemTools.o
480:info:configure /usr/bin/clang++ -pipe -Os -arch x86_64 -stdlib=libc++  -I/opt/local/var/macports/build/_opt_local_var_macports_sources_rsync.macports.org_release_tarballs_ports_devel_cmake/cmake/work/cmake-3.0.2/Bootstrap.cmk -I/opt/local/var/macports/build/_opt_local_var_macports_sources_rsync.macports.org_release_tarballs_ports_devel_cmake/cmake/work/cmake-3.0.2/Source   -I/opt/local/var/macports/build/_opt_local_var_macports_sources_rsync.macports.org_release_tarballs_ports_devel_cmake/cmake/work/cmake-3.0.2/Bootstrap.cmk -c /opt/local/var/macports/build/_opt_local_var_macports_sources_rsync.macports.org_release_tarballs_ports_devel_cmake/cmake/work/cmake-3.0.2/Source/cmTestGenerator.cxx -o cmTestGenerator.o
481:info:configure /usr/bin/clang++ -pipe -Os -arch x86_64 -stdlib=libc++  -I/opt/local/var/macports/build/_opt_local_var_macports_sources_rsync.macports.org_release_tarballs_ports_devel_cmake/cmake/work/cmake-3.0.2/Bootstrap.cmk -I/opt/local/var/macports/build/_opt_local_var_macports_sources_rsync.macports.org_release_tarballs_ports_devel_cmake/cmake/work/cmake-3.0.2/Source   -I/opt/local/var/macports/build/_opt_local_var_macports_sources_rsync.macports.org_release_tarballs_ports_devel_cmake/cmake/work/cmake-3.0.2/Bootstrap.cmk -c /opt/local/var/macports/build/_opt_local_var_macports_sources_rsync.macports.org_release_tarballs_ports_devel_cmake/cmake/work/cmake-3.0.2/Source/cmVersion.cxx -o cmVersion.o
482:info:configure /usr/bin/clang++ -pipe -Os -arch x86_64 -stdlib=libc++  -I/opt/local/var/macports/build/_opt_local_var_macports_sources_rsync.macports.org_release_tarballs_ports_devel_cmake/cmake/work/cmake-3.0.2/Bootstrap.cmk -I/opt/local/var/macports/build/_opt_local_var_macports_sources_rsync.macports.org_release_tarballs_ports_devel_cmake/cmake/work/cmake-3.0.2/Source   -I/opt/local/var/macports/build/_opt_local_var_macports_sources_rsync.macports.org_release_tarballs_ports_devel_cmake/cmake/work/cmake-3.0.2/Bootstrap.cmk -c /opt/local/var/macports/build/_opt_local_var_macports_sources_rsync.macports.org_release_tarballs_ports_devel_cmake/cmake/work/cmake-3.0.2/Source/cmFileTimeComparison.cxx -o cmFileTimeComparison.o
483:info:configure /usr/bin/clang++ -pipe -Os -arch x86_64 -stdlib=libc++  -I/opt/local/var/macports/build/_opt_local_var_macports_sources_rsync.macports.org_release_tarballs_ports_devel_cmake/cmake/work/cmake-3.0.2/Bootstrap.cmk -I/opt/local/var/macports/build/_opt_local_var_macports_sources_rsync.macports.org_release_tarballs_ports_devel_cmake/cmake/work/cmake-3.0.2/Source   -I/opt/local/var/macports/build/_opt_local_var_macports_sources_rsync.macports.org_release_tarballs_ports_devel_cmake/cmake/work/cmake-3.0.2/Bootstrap.cmk -c /opt/local/var/macports/build/_opt_local_var_macports_sources_rsync.macports.org_release_tarballs_ports_devel_cmake/cmake/work/cmake-3.0.2/Source/cmGlobalUnixMakefileGenerator3.cxx -o cmGlobalUnixMakefileGenerator3.o
484:info:configure /usr/bin/clang++ -pipe -Os -arch x86_64 -stdlib=libc++  -I/opt/local/var/macports/build/_opt_local_var_macports_sources_rsync.macports.org_release_tarballs_ports_devel_cmake/cmake/work/cmake-3.0.2/Bootstrap.cmk -I/opt/local/var/macports/build/_opt_local_var_macports_sources_rsync.macports.org_release_tarballs_ports_devel_cmake/cmake/work/cmake-3.0.2/Source   -I/opt/local/var/macports/build/_opt_local_var_macports_sources_rsync.macports.org_release_tarballs_ports_devel_cmake/cmake/work/cmake-3.0.2/Bootstrap.cmk -c /opt/local/var/macports/build/_opt_local_var_macports_sources_rsync.macports.org_release_tarballs_ports_devel_cmake/cmake/work/cmake-3.0.2/Source/cmLocalUnixMakefileGenerator3.cxx -o cmLocalUnixMakefileGenerator3.o
485:info:configure /usr/bin/clang++ -pipe -Os -arch x86_64 -stdlib=libc++  -I/opt/local/var/macports/build/_opt_local_var_macports_sources_rsync.macports.org_release_tarballs_ports_devel_cmake/cmake/work/cmake-3.0.2/Bootstrap.cmk -I/opt/local/var/macports/build/_opt_local_var_macports_sources_rsync.macports.org_release_tarballs_ports_devel_cmake/cmake/work/cmake-3.0.2/Source   -I/opt/local/var/macports/build/_opt_local_var_macports_sources_rsync.macports.org_release_tarballs_ports_devel_cmake/cmake/work/cmake-3.0.2/Bootstrap.cmk -c /opt/local/var/macports/build/_opt_local_var_macports_sources_rsync.macports.org_release_tarballs_ports_devel_cmake/cmake/work/cmake-3.0.2/Source/cmMakefileExecutableTargetGenerator.cxx -o cmMakefileExecutableTargetGenerator.o
486:info:configure /usr/bin/clang++ -pipe -Os -arch x86_64 -stdlib=libc++  -I/opt/local/var/macports/build/_opt_local_var_macports_sources_rsync.macports.org_release_tarballs_ports_devel_cmake/cmake/work/cmake-3.0.2/Bootstrap.cmk -I/opt/local/var/macports/build/_opt_local_var_macports_sources_rsync.macports.org_release_tarballs_ports_devel_cmake/cmake/work/cmake-3.0.2/Source   -I/opt/local/var/macports/build/_opt_local_var_macports_sources_rsync.macports.org_release_tarballs_ports_devel_cmake/cmake/work/cmake-3.0.2/Bootstrap.cmk -c /opt/local/var/macports/build/_opt_local_var_macports_sources_rsync.macports.org_release_tarballs_ports_devel_cmake/cmake/work/cmake-3.0.2/Source/cmMakefileLibraryTargetGenerator.cxx -o cmMakefileLibraryTargetGenerator.o
487:info:configure /usr/bin/clang++ -pipe -Os -arch x86_64 -stdlib=libc++  -I/opt/local/var/macports/build/_opt_local_var_macports_sources_rsync.macports.org_release_tarballs_ports_devel_cmake/cmake/work/cmake-3.0.2/Bootstrap.cmk -I/opt/local/var/macports/build/_opt_local_var_macports_sources_rsync.macports.org_release_tarballs_ports_devel_cmake/cmake/work/cmake-3.0.2/Source   -I/opt/local/var/macports/build/_opt_local_var_macports_sources_rsync.macports.org_release_tarballs_ports_devel_cmake/cmake/work/cmake-3.0.2/Bootstrap.cmk -c /opt/local/var/macports/build/_opt_local_var_macports_sources_rsync.macports.org_release_tarballs_ports_devel_cmake/cmake/work/cmake-3.0.2/Source/cmMakefileTargetGenerator.cxx -o cmMakefileTargetGenerator.o
488:info:configure /usr/bin/clang++ -pipe -Os -arch x86_64 -stdlib=libc++  -I/opt/local/var/macports/build/_opt_local_var_macports_sources_rsync.macports.org_release_tarballs_ports_devel_cmake/cmake/work/cmake-3.0.2/Bootstrap.cmk -I/opt/local/var/macports/build/_opt_local_var_macports_sources_rsync.macports.org_release_tarballs_ports_devel_cmake/cmake/work/cmake-3.0.2/Source   -I/opt/local/var/macports/build/_opt_local_var_macports_sources_rsync.macports.org_release_tarballs_ports_devel_cmake/cmake/work/cmake-3.0.2/Bootstrap.cmk -c /opt/local/var/macports/build/_opt_local_var_macports_sources_rsync.macports.org_release_tarballs_ports_devel_cmake/cmake/work/cmake-3.0.2/Source/cmMakefileUtilityTargetGenerator.cxx -o cmMakefileUtilityTargetGenerator.o
489:info:configure /usr/bin/clang++ -pipe -Os -arch x86_64 -stdlib=libc++  -I/opt/local/var/macports/build/_opt_local_var_macports_sources_rsync.macports.org_release_tarballs_ports_devel_cmake/cmake/work/cmake-3.0.2/Bootstrap.cmk -I/opt/local/var/macports/build/_opt_local_var_macports_sources_rsync.macports.org_release_tarballs_ports_devel_cmake/cmake/work/cmake-3.0.2/Source   -I/opt/local/var/macports/build/_opt_local_var_macports_sources_rsync.macports.org_release_tarballs_ports_devel_cmake/cmake/work/cmake-3.0.2/Bootstrap.cmk -c /opt/local/var/macports/build/_opt_local_var_macports_sources_rsync.macports.org_release_tarballs_ports_devel_cmake/cmake/work/cmake-3.0.2/Source/cmOSXBundleGenerator.cxx -o cmOSXBundleGenerator.o
490:info:configure /usr/bin/clang++ -pipe -Os -arch x86_64 -stdlib=libc++  -I/opt/local/var/macports/build/_opt_local_var_macports_sources_rsync.macports.org_release_tarballs_ports_devel_cmake/cmake/work/cmake-3.0.2/Bootstrap.cmk -I/opt/local/var/macports/build/_opt_local_var_macports_sources_rsync.macports.org_release_tarballs_ports_devel_cmake/cmake/work/cmake-3.0.2/Source   -I/opt/local/var/macports/build/_opt_local_var_macports_sources_rsync.macports.org_release_tarballs_ports_devel_cmake/cmake/work/cmake-3.0.2/Bootstrap.cmk -c /opt/local/var/macports/build/_opt_local_var_macports_sources_rsync.macports.org_release_tarballs_ports_devel_cmake/cmake/work/cmake-3.0.2/Source/cmNewLineStyle.cxx -o cmNewLineStyle.o
491:info:configure /usr/bin/clang++ -pipe -Os -arch x86_64 -stdlib=libc++  -I/opt/local/var/macports/build/_opt_local_var_macports_sources_rsync.macports.org_release_tarballs_ports_devel_cmake/cmake/work/cmake-3.0.2/Bootstrap.cmk -I/opt/local/var/macports/build/_opt_local_var_macports_sources_rsync.macports.org_release_tarballs_ports_devel_cmake/cmake/work/cmake-3.0.2/Source   -I/opt/local/var/macports/build/_opt_local_var_macports_sources_rsync.macports.org_release_tarballs_ports_devel_cmake/cmake/work/cmake-3.0.2/Bootstrap.cmk -c /opt/local/var/macports/build/_opt_local_var_macports_sources_rsync.macports.org_release_tarballs_ports_devel_cmake/cmake/work/cmake-3.0.2/Source/cmBootstrapCommands1.cxx -o cmBootstrapCommands1.o
492:info:configure /usr/bin/clang++ -pipe -Os -arch x86_64 -stdlib=libc++  -I/opt/local/var/macports/build/_opt_local_var_macports_sources_rsync.macports.org_release_tarballs_ports_devel_cmake/cmake/work/cmake-3.0.2/Bootstrap.cmk -I/opt/local/var/macports/build/_opt_local_var_macports_sources_rsync.macports.org_release_tarballs_ports_devel_cmake/cmake/work/cmake-3.0.2/Source   -I/opt/local/var/macports/build/_opt_local_var_macports_sources_rsync.macports.org_release_tarballs_ports_devel_cmake/cmake/work/cmake-3.0.2/Bootstrap.cmk -c /opt/local/var/macports/build/_opt_local_var_macports_sources_rsync.macports.org_release_tarballs_ports_devel_cmake/cmake/work/cmake-3.0.2/Source/cmBootstrapCommands2.cxx -o cmBootstrapCommands2.o
493:info:configure /usr/bin/clang++ -pipe -Os -arch x86_64 -stdlib=libc++  -I/opt/local/var/macports/build/_opt_local_var_macports_sources_rsync.macports.org_release_tarballs_ports_devel_cmake/cmake/work/cmake-3.0.2/Bootstrap.cmk -I/opt/local/var/macports/build/_opt_local_var_macports_sources_rsync.macports.org_release_tarballs_ports_devel_cmake/cmake/work/cmake-3.0.2/Source   -I/opt/local/var/macports/build/_opt_local_var_macports_sources_rsync.macports.org_release_tarballs_ports_devel_cmake/cmake/work/cmake-3.0.2/Bootstrap.cmk -c /opt/local/var/macports/build/_opt_local_var_macports_sources_rsync.macports.org_release_tarballs_ports_devel_cmake/cmake/work/cmake-3.0.2/Source/cmCommandsForBootstrap.cxx -o cmCommandsForBootstrap.o
494:info:configure /usr/bin/clang++ -pipe -Os -arch x86_64 -stdlib=libc++  -I/opt/local/var/macports/build/_opt_local_var_macports_sources_rsync.macports.org_release_tarballs_ports_devel_cmake/cmake/work/cmake-3.0.2/Bootstrap.cmk -I/opt/local/var/macports/build/_opt_local_var_macports_sources_rsync.macports.org_release_tarballs_ports_devel_cmake/cmake/work/cmake-3.0.2/Source   -I/opt/local/var/macports/build/_opt_local_var_macports_sources_rsync.macports.org_release_tarballs_ports_devel_cmake/cmake/work/cmake-3.0.2/Bootstrap.cmk -c /opt/local/var/macports/build/_opt_local_var_macports_sources_rsync.macports.org_release_tarballs_ports_devel_cmake/cmake/work/cmake-3.0.2/Source/cmTarget.cxx -o cmTarget.o
495:info:configure /usr/bin/clang++ -pipe -Os -arch x86_64 -stdlib=libc++  -I/opt/local/var/macports/build/_opt_local_var_macports_sources_rsync.macports.org_release_tarballs_ports_devel_cmake/cmake/work/cmake-3.0.2/Bootstrap.cmk -I/opt/local/var/macports/build/_opt_local_var_macports_sources_rsync.macports.org_release_tarballs_ports_devel_cmake/cmake/work/cmake-3.0.2/Source   -I/opt/local/var/macports/build/_opt_local_var_macports_sources_rsync.macports.org_release_tarballs_ports_devel_cmake/cmake/work/cmake-3.0.2/Bootstrap.cmk -c /opt/local/var/macports/build/_opt_local_var_macports_sources_rsync.macports.org_release_tarballs_ports_devel_cmake/cmake/work/cmake-3.0.2/Source/cmTest.cxx -o cmTest.o
496:info:configure /usr/bin/clang++ -pipe -Os -arch x86_64 -stdlib=libc++  -I/opt/local/var/macports/build/_opt_local_var_macports_sources_rsync.macports.org_release_tarballs_ports_devel_cmake/cmake/work/cmake-3.0.2/Bootstrap.cmk -I/opt/local/var/macports/build/_opt_local_var_macports_sources_rsync.macports.org_release_tarballs_ports_devel_cmake/cmake/work/cmake-3.0.2/Source   -I/opt/local/var/macports/build/_opt_local_var_macports_sources_rsync.macports.org_release_tarballs_ports_devel_cmake/cmake/work/cmake-3.0.2/Bootstrap.cmk -c /opt/local/var/macports/build/_opt_local_var_macports_sources_rsync.macports.org_release_tarballs_ports_devel_cmake/cmake/work/cmake-3.0.2/Source/cmCustomCommand.cxx -o cmCustomCommand.o
497:info:configure /usr/bin/clang++ -pipe -Os -arch x86_64 -stdlib=libc++  -I/opt/local/var/macports/build/_opt_local_var_macports_sources_rsync.macports.org_release_tarballs_ports_devel_cmake/cmake/work/cmake-3.0.2/Bootstrap.cmk -I/opt/local/var/macports/build/_opt_local_var_macports_sources_rsync.macports.org_release_tarballs_ports_devel_cmake/cmake/work/cmake-3.0.2/Source   -I/opt/local/var/macports/build/_opt_local_var_macports_sources_rsync.macports.org_release_tarballs_ports_devel_cmake/cmake/work/cmake-3.0.2/Bootstrap.cmk -c /opt/local/var/macports/build/_opt_local_var_macports_sources_rsync.macports.org_release_tarballs_ports_devel_cmake/cmake/work/cmake-3.0.2/Source/cmCustomCommandGenerator.cxx -o cmCustomCommandGenerator.o
498:info:configure /usr/bin/clang++ -pipe -Os -arch x86_64 -stdlib=libc++  -I/opt/local/var/macports/build/_opt_local_var_macports_sources_rsync.macports.org_release_tarballs_ports_devel_cmake/cmake/work/cmake-3.0.2/Bootstrap.cmk -I/opt/local/var/macports/build/_opt_local_var_macports_sources_rsync.macports.org_release_tarballs_ports_devel_cmake/cmake/work/cmake-3.0.2/Source   -I/opt/local/var/macports/build/_opt_local_var_macports_sources_rsync.macports.org_release_tarballs_ports_devel_cmake/cmake/work/cmake-3.0.2/Bootstrap.cmk -c /opt/local/var/macports/build/_opt_local_var_macports_sources_rsync.macports.org_release_tarballs_ports_devel_cmake/cmake/work/cmake-3.0.2/Source/cmCacheManager.cxx -o cmCacheManager.o
499:info:configure /usr/bin/clang++ -pipe -Os -arch x86_64 -stdlib=libc++  -I/opt/local/var/macports/build/_opt_local_var_macports_sources_rsync.macports.org_release_tarballs_ports_devel_cmake/cmake/work/cmake-3.0.2/Bootstrap.cmk -I/opt/local/var/macports/build/_opt_local_var_macports_sources_rsync.macports.org_release_tarballs_ports_devel_cmake/cmake/work/cmake-3.0.2/Source   -I/opt/local/var/macports/build/_opt_local_var_macports_sources_rsync.macports.org_release_tarballs_ports_devel_cmake/cmake/work/cmake-3.0.2/Bootstrap.cmk -c /opt/local/var/macports/build/_opt_local_var_macports_sources_rsync.macports.org_release_tarballs_ports_devel_cmake/cmake/work/cmake-3.0.2/Source/cmListFileCache.cxx -o cmListFileCache.o
500:info:configure /usr/bin/clang++ -pipe -Os -arch x86_64 -stdlib=libc++  -I/opt/local/var/macports/build/_opt_local_var_macports_sources_rsync.macports.org_release_tarballs_ports_devel_cmake/cmake/work/cmake-3.0.2/Bootstrap.cmk -I/opt/local/var/macports/build/_opt_local_var_macports_sources_rsync.macports.org_release_tarballs_ports_devel_cmake/cmake/work/cmake-3.0.2/Source   -I/opt/local/var/macports/build/_opt_local_var_macports_sources_rsync.macports.org_release_tarballs_ports_devel_cmake/cmake/work/cmake-3.0.2/Bootstrap.cmk -c /opt/local/var/macports/build/_opt_local_var_macports_sources_rsync.macports.org_release_tarballs_ports_devel_cmake/cmake/work/cmake-3.0.2/Source/cmComputeLinkDepends.cxx -o cmComputeLinkDepends.o
501:info:configure /usr/bin/clang++ -pipe -Os -arch x86_64 -stdlib=libc++  -I/opt/local/var/macports/build/_opt_local_var_macports_sources_rsync.macports.org_release_tarballs_ports_devel_cmake/cmake/work/cmake-3.0.2/Bootstrap.cmk -I/opt/local/var/macports/build/_opt_local_var_macports_sources_rsync.macports.org_release_tarballs_ports_devel_cmake/cmake/work/cmake-3.0.2/Source   -I/opt/local/var/macports/build/_opt_local_var_macports_sources_rsync.macports.org_release_tarballs_ports_devel_cmake/cmake/work/cmake-3.0.2/Bootstrap.cmk -c /opt/local/var/macports/build/_opt_local_var_macports_sources_rsync.macports.org_release_tarballs_ports_devel_cmake/cmake/work/cmake-3.0.2/Source/cmComputeLinkInformation.cxx -o cmComputeLinkInformation.o
502:info:configure /usr/bin/clang++ -pipe -Os -arch x86_64 -stdlib=libc++  -I/opt/local/var/macports/build/_opt_local_var_macports_sources_rsync.macports.org_release_tarballs_ports_devel_cmake/cmake/work/cmake-3.0.2/Bootstrap.cmk -I/opt/local/var/macports/build/_opt_local_var_macports_sources_rsync.macports.org_release_tarballs_ports_devel_cmake/cmake/work/cmake-3.0.2/Source   -I/opt/local/var/macports/build/_opt_local_var_macports_sources_rsync.macports.org_release_tarballs_ports_devel_cmake/cmake/work/cmake-3.0.2/Bootstrap.cmk -c /opt/local/var/macports/build/_opt_local_var_macports_sources_rsync.macports.org_release_tarballs_ports_devel_cmake/cmake/work/cmake-3.0.2/Source/cmOrderDirectories.cxx -o cmOrderDirectories.o
503:info:configure /usr/bin/clang++ -pipe -Os -arch x86_64 -stdlib=libc++  -I/opt/local/var/macports/build/_opt_local_var_macports_sources_rsync.macports.org_release_tarballs_ports_devel_cmake/cmake/work/cmake-3.0.2/Bootstrap.cmk -I/opt/local/var/macports/build/_opt_local_var_macports_sources_rsync.macports.org_release_tarballs_ports_devel_cmake/cmake/work/cmake-3.0.2/Source   -I/opt/local/var/macports/build/_opt_local_var_macports_sources_rsync.macports.org_release_tarballs_ports_devel_cmake/cmake/work/cmake-3.0.2/Bootstrap.cmk -c /opt/local/var/macports/build/_opt_local_var_macports_sources_rsync.macports.org_release_tarballs_ports_devel_cmake/cmake/work/cmake-3.0.2/Source/cmComputeTargetDepends.cxx -o cmComputeTargetDepends.o
504:info:configure /usr/bin/clang++ -pipe -Os -arch x86_64 -stdlib=libc++  -I/opt/local/var/macports/build/_opt_local_var_macports_sources_rsync.macports.org_release_tarballs_ports_devel_cmake/cmake/work/cmake-3.0.2/Bootstrap.cmk -I/opt/local/var/macports/build/_opt_local_var_macports_sources_rsync.macports.org_release_tarballs_ports_devel_cmake/cmake/work/cmake-3.0.2/Source   -I/opt/local/var/macports/build/_opt_local_var_macports_sources_rsync.macports.org_release_tarballs_ports_devel_cmake/cmake/work/cmake-3.0.2/Bootstrap.cmk -c /opt/local/var/macports/build/_opt_local_var_macports_sources_rsync.macports.org_release_tarballs_ports_devel_cmake/cmake/work/cmake-3.0.2/Source/cmComputeComponentGraph.cxx -o cmComputeComponentGraph.o
505:info:configure /usr/bin/clang++ -pipe -Os -arch x86_64 -stdlib=libc++  -I/opt/local/var/macports/build/_opt_local_var_macports_sources_rsync.macports.org_release_tarballs_ports_devel_cmake/cmake/work/cmake-3.0.2/Bootstrap.cmk -I/opt/local/var/macports/build/_opt_local_var_macports_sources_rsync.macports.org_release_tarballs_ports_devel_cmake/cmake/work/cmake-3.0.2/Source   -I/opt/local/var/macports/build/_opt_local_var_macports_sources_rsync.macports.org_release_tarballs_ports_devel_cmake/cmake/work/cmake-3.0.2/Bootstrap.cmk -c /opt/local/var/macports/build/_opt_local_var_macports_sources_rsync.macports.org_release_tarballs_ports_devel_cmake/cmake/work/cmake-3.0.2/Source/cmExprLexer.cxx -o cmExprLexer.o
506:info:configure /usr/bin/clang++ -pipe -Os -arch x86_64 -stdlib=libc++  -I/opt/local/var/macports/build/_opt_local_var_macports_sources_rsync.macports.org_release_tarballs_ports_devel_cmake/cmake/work/cmake-3.0.2/Bootstrap.cmk -I/opt/local/var/macports/build/_opt_local_var_macports_sources_rsync.macports.org_release_tarballs_ports_devel_cmake/cmake/work/cmake-3.0.2/Source   -I/opt/local/var/macports/build/_opt_local_var_macports_sources_rsync.macports.org_release_tarballs_ports_devel_cmake/cmake/work/cmake-3.0.2/Bootstrap.cmk -c /opt/local/var/macports/build/_opt_local_var_macports_sources_rsync.macports.org_release_tarballs_ports_devel_cmake/cmake/work/cmake-3.0.2/Source/cmExprParser.cxx -o cmExprParser.o
507:info:configure /usr/bin/clang++ -pipe -Os -arch x86_64 -stdlib=libc++  -I/opt/local/var/macports/build/_opt_local_var_macports_sources_rsync.macports.org_release_tarballs_ports_devel_cmake/cmake/work/cmake-3.0.2/Bootstrap.cmk -I/opt/local/var/macports/build/_opt_local_var_macports_sources_rsync.macports.org_release_tarballs_ports_devel_cmake/cmake/work/cmake-3.0.2/Source   -I/opt/local/var/macports/build/_opt_local_var_macports_sources_rsync.macports.org_release_tarballs_ports_devel_cmake/cmake/work/cmake-3.0.2/Bootstrap.cmk -c /opt/local/var/macports/build/_opt_local_var_macports_sources_rsync.macports.org_release_tarballs_ports_devel_cmake/cmake/work/cmake-3.0.2/Source/cmExprParserHelper.cxx -o cmExprParserHelper.o
508:info:configure /usr/bin/clang++ -pipe -Os -arch x86_64 -stdlib=libc++  -I/opt/local/var/macports/build/_opt_local_var_macports_sources_rsync.macports.org_release_tarballs_ports_devel_cmake/cmake/work/cmake-3.0.2/Bootstrap.cmk -I/opt/local/var/macports/build/_opt_local_var_macports_sources_rsync.macports.org_release_tarballs_ports_devel_cmake/cmake/work/cmake-3.0.2/Source   -I/opt/local/var/macports/build/_opt_local_var_macports_sources_rsync.macports.org_release_tarballs_ports_devel_cmake/cmake/work/cmake-3.0.2/Bootstrap.cmk -c /opt/local/var/macports/build/_opt_local_var_macports_sources_rsync.macports.org_release_tarballs_ports_devel_cmake/cmake/work/cmake-3.0.2/Source/cmGlobalNinjaGenerator.cxx -o cmGlobalNinjaGenerator.o
509:info:configure /usr/bin/clang++ -pipe -Os -arch x86_64 -stdlib=libc++  -I/opt/local/var/macports/build/_opt_local_var_macports_sources_rsync.macports.org_release_tarballs_ports_devel_cmake/cmake/work/cmake-3.0.2/Bootstrap.cmk -I/opt/local/var/macports/build/_opt_local_var_macports_sources_rsync.macports.org_release_tarballs_ports_devel_cmake/cmake/work/cmake-3.0.2/Source   -I/opt/local/var/macports/build/_opt_local_var_macports_sources_rsync.macports.org_release_tarballs_ports_devel_cmake/cmake/work/cmake-3.0.2/Bootstrap.cmk -c /opt/local/var/macports/build/_opt_local_var_macports_sources_rsync.macports.org_release_tarballs_ports_devel_cmake/cmake/work/cmake-3.0.2/Source/cmLocalNinjaGenerator.cxx -o cmLocalNinjaGenerator.o
510:info:configure /usr/bin/clang++ -pipe -Os -arch x86_64 -stdlib=libc++  -I/opt/local/var/macports/build/_opt_local_var_macports_sources_rsync.macports.org_release_tarballs_ports_devel_cmake/cmake/work/cmake-3.0.2/Bootstrap.cmk -I/opt/local/var/macports/build/_opt_local_var_macports_sources_rsync.macports.org_release_tarballs_ports_devel_cmake/cmake/work/cmake-3.0.2/Source   -I/opt/local/var/macports/build/_opt_local_var_macports_sources_rsync.macports.org_release_tarballs_ports_devel_cmake/cmake/work/cmake-3.0.2/Bootstrap.cmk -c /opt/local/var/macports/build/_opt_local_var_macports_sources_rsync.macports.org_release_tarballs_ports_devel_cmake/cmake/work/cmake-3.0.2/Source/cmNinjaTargetGenerator.cxx -o cmNinjaTargetGenerator.o
511:info:configure /usr/bin/clang++ -pipe -Os -arch x86_64 -stdlib=libc++  -I/opt/local/var/macports/build/_opt_local_var_macports_sources_rsync.macports.org_release_tarballs_ports_devel_cmake/cmake/work/cmake-3.0.2/Bootstrap.cmk -I/opt/local/var/macports/build/_opt_local_var_macports_sources_rsync.macports.org_release_tarballs_ports_devel_cmake/cmake/work/cmake-3.0.2/Source   -I/opt/local/var/macports/build/_opt_local_var_macports_sources_rsync.macports.org_release_tarballs_ports_devel_cmake/cmake/work/cmake-3.0.2/Bootstrap.cmk -c /opt/local/var/macports/build/_opt_local_var_macports_sources_rsync.macports.org_release_tarballs_ports_devel_cmake/cmake/work/cmake-3.0.2/Source/cmNinjaNormalTargetGenerator.cxx -o cmNinjaNormalTargetGenerator.o
512:info:configure /usr/bin/clang++ -pipe -Os -arch x86_64 -stdlib=libc++  -I/opt/local/var/macports/build/_opt_local_var_macports_sources_rsync.macports.org_release_tarballs_ports_devel_cmake/cmake/work/cmake-3.0.2/Bootstrap.cmk -I/opt/local/var/macports/build/_opt_local_var_macports_sources_rsync.macports.org_release_tarballs_ports_devel_cmake/cmake/work/cmake-3.0.2/Source   -I/opt/local/var/macports/build/_opt_local_var_macports_sources_rsync.macports.org_release_tarballs_ports_devel_cmake/cmake/work/cmake-3.0.2/Bootstrap.cmk -c /opt/local/var/macports/build/_opt_local_var_macports_sources_rsync.macports.org_release_tarballs_ports_devel_cmake/cmake/work/cmake-3.0.2/Source/cmNinjaUtilityTargetGenerator.cxx -o cmNinjaUtilityTargetGenerator.o
513:info:configure /usr/bin/clang -pipe -Os -arch x86_64 -I/opt/local/var/macports/build/_opt_local_var_macports_sources_rsync.macports.org_release_tarballs_ports_devel_cmake/cmake/work/cmake-3.0.2/Bootstrap.cmk -I/opt/local/var/macports/build/_opt_local_var_macports_sources_rsync.macports.org_release_tarballs_ports_devel_cmake/cmake/work/cmake-3.0.2/Source   -I/opt/local/var/macports/build/_opt_local_var_macports_sources_rsync.macports.org_release_tarballs_ports_devel_cmake/cmake/work/cmake-3.0.2/Bootstrap.cmk -c /opt/local/var/macports/build/_opt_local_var_macports_sources_rsync.macports.org_release_tarballs_ports_devel_cmake/cmake/work/cmake-3.0.2/Source/cmListFileLexer.c -o cmListFileLexer.o
514:info:configure /usr/bin/clang++ -pipe -Os -arch x86_64 -stdlib=libc++  -I/opt/local/var/macports/build/_opt_local_var_macports_sources_rsync.macports.org_release_tarballs_ports_devel_cmake/cmake/work/cmake-3.0.2/Bootstrap.cmk -I/opt/local/var/macports/build/_opt_local_var_macports_sources_rsync.macports.org_release_tarballs_ports_devel_cmake/cmake/work/cmake-3.0.2/Source   -I/opt/local/var/macports/build/_opt_local_var_macports_sources_rsync.macports.org_release_tarballs_ports_devel_cmake/cmake/work/cmake-3.0.2/Bootstrap.cmk -DKWSYS_NAMESPACE=cmsys  -c /opt/local/var/macports/build/_opt_local_var_macports_sources_rsync.macports.org_release_tarballs_ports_devel_cmake/cmake/work/cmake-3.0.2/Source/kwsys/Directory.cxx -o Directory.o
515:info:configure /usr/bin/clang++ -pipe -Os -arch x86_64 -stdlib=libc++  -I/opt/local/var/macports/build/_opt_local_var_macports_sources_rsync.macports.org_release_tarballs_ports_devel_cmake/cmake/work/cmake-3.0.2/Bootstrap.cmk -I/opt/local/var/macports/build/_opt_local_var_macports_sources_rsync.macports.org_release_tarballs_ports_devel_cmake/cmake/work/cmake-3.0.2/Source   -I/opt/local/var/macports/build/_opt_local_var_macports_sources_rsync.macports.org_release_tarballs_ports_devel_cmake/cmake/work/cmake-3.0.2/Bootstrap.cmk -DKWSYS_NAMESPACE=cmsys  -c /opt/local/var/macports/build/_opt_local_var_macports_sources_rsync.macports.org_release_tarballs_ports_devel_cmake/cmake/work/cmake-3.0.2/Source/kwsys/EncodingCXX.cxx -o EncodingCXX.o
516:info:configure /usr/bin/clang++ -pipe -Os -arch x86_64 -stdlib=libc++  -I/opt/local/var/macports/build/_opt_local_var_macports_sources_rsync.macports.org_release_tarballs_ports_devel_cmake/cmake/work/cmake-3.0.2/Bootstrap.cmk -I/opt/local/var/macports/build/_opt_local_var_macports_sources_rsync.macports.org_release_tarballs_ports_devel_cmake/cmake/work/cmake-3.0.2/Source   -I/opt/local/var/macports/build/_opt_local_var_macports_sources_rsync.macports.org_release_tarballs_ports_devel_cmake/cmake/work/cmake-3.0.2/Bootstrap.cmk -DKWSYS_NAMESPACE=cmsys  -c /opt/local/var/macports/build/_opt_local_var_macports_sources_rsync.macports.org_release_tarballs_ports_devel_cmake/cmake/work/cmake-3.0.2/Source/kwsys/Glob.cxx -o Glob.o
517:info:configure /usr/bin/clang++ -pipe -Os -arch x86_64 -stdlib=libc++  -I/opt/local/var/macports/build/_opt_local_var_macports_sources_rsync.macports.org_release_tarballs_ports_devel_cmake/cmake/work/cmake-3.0.2/Bootstrap.cmk -I/opt/local/var/macports/build/_opt_local_var_macports_sources_rsync.macports.org_release_tarballs_ports_devel_cmake/cmake/work/cmake-3.0.2/Source   -I/opt/local/var/macports/build/_opt_local_var_macports_sources_rsync.macports.org_release_tarballs_ports_devel_cmake/cmake/work/cmake-3.0.2/Bootstrap.cmk -DKWSYS_NAMESPACE=cmsys  -c /opt/local/var/macports/build/_opt_local_var_macports_sources_rsync.macports.org_release_tarballs_ports_devel_cmake/cmake/work/cmake-3.0.2/Source/kwsys/RegularExpression.cxx -o RegularExpression.o
518:info:configure /usr/bin/clang++ -pipe -Os -arch x86_64 -stdlib=libc++  -I/opt/local/var/macports/build/_opt_local_var_macports_sources_rsync.macports.org_release_tarballs_ports_devel_cmake/cmake/work/cmake-3.0.2/Bootstrap.cmk -I/opt/local/var/macports/build/_opt_local_var_macports_sources_rsync.macports.org_release_tarballs_ports_devel_cmake/cmake/work/cmake-3.0.2/Source   -I/opt/local/var/macports/build/_opt_local_var_macports_sources_rsync.macports.org_release_tarballs_ports_devel_cmake/cmake/work/cmake-3.0.2/Bootstrap.cmk -DKWSYS_NAMESPACE=cmsys -DKWSYS_CXX_HAS_SETENV=1 -DKWSYS_CXX_HAS_UNSETENV=1 -DKWSYS_CXX_HAS_ENVIRON_IN_STDLIB_H=0 -DKWSYS_CXX_HAS_UTIMENSAT=0 -DKWSYS_CXX_HAS_UTIMES=0 -c /opt/local/var/macports/build/_opt_local_var_macports_sources_rsync.macports.org_release_tarballs_ports_devel_cmake/cmake/work/cmake-3.0.2/Source/kwsys/SystemTools.cxx -o SystemTools.o
519:info:configure /usr/bin/clang -pipe -Os -arch x86_64 -I/opt/local/var/macports/build/_opt_local_var_macports_sources_rsync.macports.org_release_tarballs_ports_devel_cmake/cmake/work/cmake-3.0.2/Bootstrap.cmk -I/opt/local/var/macports/build/_opt_local_var_macports_sources_rsync.macports.org_release_tarballs_ports_devel_cmake/cmake/work/cmake-3.0.2/Source   -I/opt/local/var/macports/build/_opt_local_var_macports_sources_rsync.macports.org_release_tarballs_ports_devel_cmake/cmake/work/cmake-3.0.2/Bootstrap.cmk -DKWSYS_NAMESPACE=cmsys  -c /opt/local/var/macports/build/_opt_local_var_macports_sources_rsync.macports.org_release_tarballs_ports_devel_cmake/cmake/work/cmake-3.0.2/Source/kwsys/EncodingC.c -o EncodingC.o
520:info:configure /usr/bin/clang -pipe -Os -arch x86_64 -I/opt/local/var/macports/build/_opt_local_var_macports_sources_rsync.macports.org_release_tarballs_ports_devel_cmake/cmake/work/cmake-3.0.2/Bootstrap.cmk -I/opt/local/var/macports/build/_opt_local_var_macports_sources_rsync.macports.org_release_tarballs_ports_devel_cmake/cmake/work/cmake-3.0.2/Source   -I/opt/local/var/macports/build/_opt_local_var_macports_sources_rsync.macports.org_release_tarballs_ports_devel_cmake/cmake/work/cmake-3.0.2/Bootstrap.cmk -DKWSYS_NAMESPACE=cmsys  -c /opt/local/var/macports/build/_opt_local_var_macports_sources_rsync.macports.org_release_tarballs_ports_devel_cmake/cmake/work/cmake-3.0.2/Source/kwsys/ProcessUNIX.c -o ProcessUNIX.o
521:info:configure /usr/bin/clang -pipe -Os -arch x86_64 -I/opt/local/var/macports/build/_opt_local_var_macports_sources_rsync.macports.org_release_tarballs_ports_devel_cmake/cmake/work/cmake-3.0.2/Bootstrap.cmk -I/opt/local/var/macports/build/_opt_local_var_macports_sources_rsync.macports.org_release_tarballs_ports_devel_cmake/cmake/work/cmake-3.0.2/Source   -I/opt/local/var/macports/build/_opt_local_var_macports_sources_rsync.macports.org_release_tarballs_ports_devel_cmake/cmake/work/cmake-3.0.2/Bootstrap.cmk -DKWSYS_NAMESPACE=cmsys -DKWSYS_STRING_C -c /opt/local/var/macports/build/_opt_local_var_macports_sources_rsync.macports.org_release_tarballs_ports_devel_cmake/cmake/work/cmake-3.0.2/Source/kwsys/String.c -o String.o
522:info:configure /usr/bin/clang -pipe -Os -arch x86_64 -I/opt/local/var/macports/build/_opt_local_var_macports_sources_rsync.macports.org_release_tarballs_ports_devel_cmake/cmake/work/cmake-3.0.2/Bootstrap.cmk -I/opt/local/var/macports/build/_opt_local_var_macports_sources_rsync.macports.org_release_tarballs_ports_devel_cmake/cmake/work/cmake-3.0.2/Source   -I/opt/local/var/macports/build/_opt_local_var_macports_sources_rsync.macports.org_release_tarballs_ports_devel_cmake/cmake/work/cmake-3.0.2/Bootstrap.cmk -DKWSYS_NAMESPACE=cmsys  -c /opt/local/var/macports/build/_opt_local_var_macports_sources_rsync.macports.org_release_tarballs_ports_devel_cmake/cmake/work/cmake-3.0.2/Source/kwsys/System.c -o System.o
523:info:configure /usr/bin/clang++ -L/opt/local/lib -Wl,-headerpad_max_install_names -arch x86_64 -framework CoreFoundation -pipe -Os -arch x86_64 -stdlib=libc++  -I/opt/local/var/macports/build/_opt_local_var_macports_sources_rsync.macports.org_release_tarballs_ports_devel_cmake/cmake/work/cmake-3.0.2/Bootstrap.cmk -I/opt/local/var/macports/build/_opt_local_var_macports_sources_rsync.macports.org_release_tarballs_ports_devel_cmake/cmake/work/cmake-3.0.2/Source   -I/opt/local/var/macports/build/_opt_local_var_macports_sources_rsync.macports.org_release_tarballs_ports_devel_cmake/cmake/work/cmake-3.0.2/Bootstrap.cmk  cmStandardIncludes.o cmake.o cmakemain.o cmcmd.o cmCommandArgumentLexer.o cmCommandArgumentParser.o cmCommandArgumentParserHelper.o cmDefinitions.o cmDepends.o cmDependsC.o cmDocumentationFormatter.o cmPolicies.o cmProperty.o cmPropertyMap.o cmPropertyDefinition.o cmPropertyDefinitionMap.o cmMakeDepend.o cmMakefile.o cmExportFileGenerator.o cmExportInstallFileGenerator.o cmExportTryCompileFileGenerator.o cmExportSet.o cmExportSetMap.o cmInstallDirectoryGenerator.o cmGeneratedFileStream.o cmGeneratorTarget.o cmGeneratorExpressionDAGChecker.o cmGeneratorExpressionEvaluator.o cmGeneratorExpressionLexer.o cmGeneratorExpressionParser.o cmGeneratorExpression.o cmGlobalGenerator.o cmLocalGenerator.o cmInstallGenerator.o cmInstallExportGenerator.o cmInstallFilesGenerator.o cmInstallScriptGenerator.o cmInstallTargetGenerator.o cmScriptGenerator.o cmSourceFile.o cmSourceFileLocation.o cmSystemTools.o cmTestGenerator.o cmVersion.o cmFileTimeComparison.o cmGlobalUnixMakefileGenerator3.o cmLocalUnixMakefileGenerator3.o cmMakefileExecutableTargetGenerator.o cmMakefileLibraryTargetGenerator.o cmMakefileTargetGenerator.o cmMakefileUtilityTargetGenerator.o cmOSXBundleGenerator.o cmNewLineStyle.o cmBootstrapCommands1.o cmBootstrapCommands2.o cmCommandsForBootstrap.o cmTarget.o cmTest.o cmCustomCommand.o cmCustomCommandGenerator.o cmCacheManager.o cmListFileCache.o cmComputeLinkDepends.o cmComputeLinkInformation.o cmOrderDirectories.o cmComputeTargetDepends.o cmComputeComponentGraph.o cmExprLexer.o cmExprParser.o cmExprParserHelper.o cmGlobalNinjaGenerator.o cmLocalNinjaGenerator.o cmNinjaTargetGenerator.o cmNinjaNormalTargetGenerator.o cmNinjaUtilityTargetGenerator.o cmListFileLexer.o Directory.o EncodingCXX.o Glob.o RegularExpression.o SystemTools.o EncodingC.o ProcessUNIX.o String.o System.o -o cmake
524:info:configure loading initial cache file /opt/local/var/macports/build/_opt_local_var_macports_sources_rsync.macports.org_release_tarballs_ports_devel_cmake/cmake/work/cmake-3.0.2/Bootstrap.cmk/InitialCacheFlags.cmake
525:info:configure -- The C compiler identification is AppleClang 6.0.0.6000054
526:info:configure -- The CXX compiler identification is AppleClang 6.0.0.6000054
527:info:configure -- Check for working C compiler: /usr/bin/clang
528:info:configure -- Check for working C compiler: /usr/bin/clang -- works
529:info:configure -- Detecting C compiler ABI info
530:info:configure -- Detecting C compiler ABI info - done
531:info:configure -- Check for working CXX compiler: /usr/bin/clang++
532:info:configure -- Check for working CXX compiler: /usr/bin/clang++ -- works
533:info:configure -- Detecting CXX compiler ABI info
534:info:configure -- Detecting CXX compiler ABI info - done
535:info:configure -- Looking for C++ include iostream
536:info:configure -- Looking for C++ include iostream - found
537:info:configure -- Check for STD namespace
538:info:configure -- Check for STD namespace - found
539:info:configure -- Check for ANSI scope
540:info:configure -- Check for ANSI scope - found
541:info:configure -- Check for sstream
542:info:configure -- Check for sstream - found
543:info:configure -- Looking for unsetenv
544:info:configure -- Looking for unsetenv - found
545:info:configure -- Looking for environ
546:info:configure -- Looking for environ - not found
547:info:configure -- Checking whether header cstdio is available
548:info:configure -- Checking whether header cstdio is available - yes
549:info:configure -- Checking for Large File Support
550:info:configure -- Checking for Large File Support - yes
551:info:configure -- Checking whether STL classes are in std namespace
552:info:configure -- Checking whether STL classes are in std namespace - yes
553:info:configure -- Checking whether ANSI stream headers are available
554:info:configure -- Checking whether ANSI stream headers are available - yes
555:info:configure -- Checking whether ANSI streams are in std namespace
556:info:configure -- Checking whether ANSI streams are in std namespace - yes
557:info:configure -- Checking whether ANSI string stream is available
558:info:configure -- Checking whether ANSI string stream is available - yes
559:info:configure -- Checking whether header cstddef is available
560:info:configure -- Checking whether header cstddef is available - yes
561:info:configure -- Checking whether stl string has operator!= for char*
562:info:configure -- Checking whether stl string has operator!= for char* - yes
563:info:configure -- Checking whether stl has iterator_traits
564:info:configure -- Checking whether stl has iterator_traits - yes
565:info:configure -- Checking whether stl has standard template allocator
566:info:configure -- Checking whether stl has standard template allocator - yes
567:info:configure -- Checking for rebind member of stl allocator
568:info:configure -- Checking for rebind member of stl allocator - yes
569:info:configure -- Checking for non-standard argument to stl allocator<>::max_size
570:info:configure -- Checking for non-standard argument to stl allocator<>::max_size - no
571:info:configure -- Checking whether stl containers support allocator objects.
572:info:configure -- Checking whether stl containers support allocator objects. - yes
573:info:configure -- Checking whether ios has binary openmode
574:info:configure -- Checking whether ios has binary openmode - yes
575:info:configure -- Checking whether "<>" is needed for template friends
576:info:configure -- Checking whether "<>" is needed for template friends - yes
577:info:configure -- Checking for member template support
578:info:configure -- Checking for member template support - yes
579:info:configure -- Checking for standard template specialization syntax
580:info:configure -- Checking for standard template specialization syntax - yes
581:info:configure -- Checking whether argument dependent lookup is supported
582:info:configure -- Checking whether argument dependent lookup is supported - yes
583:info:configure -- Checking whether struct stat has st_mtim member
584:info:configure -- Checking whether struct stat has st_mtim member - no
585:info:configure -- Checking whether C++ compiler has 'long long'
586:info:configure -- Checking whether C++ compiler has 'long long' - yes
587:info:configure -- Checking whether C++ compiler has '__int64'
588:info:configure -- Checking whether C++ compiler has '__int64' - no
589:info:configure -- Checking for C type size macros
590:info:configure -- Checking for C type size macros - compiled
591:info:configure -- Looking for sys/types.h
592:info:configure -- Looking for sys/types.h - found
593:info:configure -- Looking for stdint.h
594:info:configure -- Looking for stdint.h - found
595:info:configure -- Looking for stddef.h
596:info:configure -- Looking for stddef.h - found
597:info:configure -- Check size of char
598:info:configure -- Check size of char - done
599:info:configure -- Check size of __int64
600:info:configure -- Check size of __int64 - failed
601:info:configure -- Checking whether char is signed
602:info:configure -- Checking whether char is signed - yes
603:info:configure -- Checking whether wstring is available
604:info:configure -- Checking whether wstring is available - yes
605:info:configure -- Checking if istream supports long long
606:info:configure -- Checking if istream supports long long - yes
607:info:configure -- Checking if ostream supports long long
608:info:configure -- Checking if ostream supports long long - yes
609:info:configure -- Checking whether C compiler has ptrdiff_t in stddef.h
610:info:configure -- Checking whether C compiler has ptrdiff_t in stddef.h - yes
611:info:configure -- Checking whether C compiler has ssize_t in unistd.h
612:info:configure -- Checking whether C compiler has ssize_t in unistd.h - yes
613:info:configure -- Checking whether CXX compiler has setenv
614:info:configure -- Checking whether CXX compiler has setenv - yes
615:info:configure -- Checking whether CXX compiler has unsetenv
616:info:configure -- Checking whether CXX compiler has unsetenv - yes
617:info:configure -- Checking whether CXX compiler has environ in stdlib.h
618:info:configure -- Checking whether CXX compiler has environ in stdlib.h - no
619:info:configure -- Checking whether CXX compiler has utimes
620:info:configure -- Checking whether CXX compiler has utimes - yes
621:info:configure -- Checking whether CXX compiler has utimensat
622:info:configure -- Checking whether CXX compiler has utimensat - no
623:info:configure -- Looking for include files sys/types.h, ifaddrs.h
624:info:configure -- Looking for include files sys/types.h, ifaddrs.h - found
625:info:configure -- Checking whether CXX compiler has rlimit64
626:info:configure -- Checking whether CXX compiler has rlimit64 - no
627:info:configure -- Checking whether CXX compiler has atol
628:info:configure -- Checking whether CXX compiler has atol - yes
629:info:configure -- Checking whether CXX compiler has atoll
630:info:configure -- Checking whether CXX compiler has atoll - yes
631:info:configure -- Checking whether CXX compiler has _atoi64
632:info:configure -- Checking whether CXX compiler has _atoi64 - no
633:info:configure -- Looking for C++ include execinfo.h
634:info:configure -- Looking for C++ include execinfo.h - found
635:info:configure -- Checking whether backtrace works with this C++ compiler
636:info:configure -- Checking whether backtrace works with this C++ compiler - yes
637:info:configure -- Looking for C++ include dlfcn.h
638:info:configure -- Looking for C++ include dlfcn.h - found
639:info:configure -- Checking whether dladdr works with this C++ compiler
640:info:configure -- Checking whether dladdr works with this C++ compiler - yes
641:info:configure -- Looking for C++ include cxxabi.h
642:info:configure -- Looking for C++ include cxxabi.h - found
643:info:configure -- Checking whether cxxabi works with this C++ compiler
644:info:configure -- Checking whether cxxabi works with this C++ compiler - yes
645:info:configure -- Using system-installed BZIP2
646:info:configure -- Using system-installed CURL
647:info:configure -- Using system-installed EXPAT
648:info:configure -- Using system-installed LIBARCHIVE
649:info:configure -- Using system-installed ZLIB
650:info:configure -- Found ZLIB: /opt/local/lib/libz.dylib (found version "1.2.3")
651:info:configure -- Found CURL: /Library/Frameworks/libcurl.framework (found version "7.38.0")
652:info:configure -- Found BZip2: /opt/local/lib/libbz2.dylib (found version "1.0")
653:info:configure -- Looking for BZ2_bzCompressInit in /opt/local/lib/libbz2.dylib
654:info:configure -- Looking for BZ2_bzCompressInit in /opt/local/lib/libbz2.dylib - found
655:info:configure -- Found LibArchive: /opt/local/lib/libarchive.dylib (found version "3.1.2")
656:info:configure -- Found EXPAT: /opt/local/lib/libexpat.dylib (found version "2.0.1")
657:info:configure -- Looking for wsyncup in /opt/local/lib/libncurses.dylib
658:info:configure -- Looking for wsyncup in /opt/local/lib/libncurses.dylib - found
659:info:configure -- Looking for cbreak in /opt/local/lib/libncurses.dylib
660:info:configure -- Looking for cbreak in /opt/local/lib/libncurses.dylib - found
661:info:configure -- Looking for elf.h
662:info:configure -- Looking for elf.h - not found
663:info:configure -- Looking for a Fortran compiler
664:info:configure -- Looking for a Fortran compiler - NOTFOUND
665:info:configure -- Forcing CTEST_TEST_CPACK=OFF on OSX < 10.4
666:info:configure -- OSX_VERSION='10.10'
667:info:configure -- Performing Test run_pic_test
668:info:configure -- Performing Test run_pic_test - Success
669:info:configure sh: /bin/ps: Operation not permitted
670:info:configure -- Configuring done
671:info:configure -- Generating done
672:info:configure -- Build files have been written to: /opt/local/var/macports/build/_opt_local_var_macports_sources_rsync.macports.org_release_tarballs_ports_devel_cmake/cmake/work/cmake-3.0.2
673:info:configure ---------------------------------------------
674:info:configure CMake has bootstrapped.  Now run gmake.
675:debug:configure Privilege de-escalation not attempted as not running as root.
676:debug:build build phase started at Wed Oct  1 18:00:26 EDT 2014
677:notice:build --->  Building cmake
678:debug:build Executing org.macports.build (cmake)
679:debug:build Environment:
680CC_PRINT_OPTIONS='YES'
681CC_PRINT_OPTIONS_FILE='/opt/local/var/macports/build/_opt_local_var_macports_sources_rsync.macports.org_release_tarballs_ports_devel_cmake/cmake/work/.CC_PRINT_OPTIONS'
682CPATH='/opt/local/include'
683LIBRARY_PATH='/opt/local/lib'
684MACOSX_DEPLOYMENT_TARGET='10.10'
685:debug:build Assembled command: 'cd "/opt/local/var/macports/build/_opt_local_var_macports_sources_rsync.macports.org_release_tarballs_ports_devel_cmake/cmake/work/cmake-3.0.2" && /usr/bin/make -j2 -w all'
686:debug:build Executing command line:  cd "/opt/local/var/macports/build/_opt_local_var_macports_sources_rsync.macports.org_release_tarballs_ports_devel_cmake/cmake/work/cmake-3.0.2" && /usr/bin/make -j2 -w all
687:info:build make: Entering directory `/opt/local/var/macports/build/_opt_local_var_macports_sources_rsync.macports.org_release_tarballs_ports_devel_cmake/cmake/work/cmake-3.0.2'
688:info:build make[1]: Entering directory `/opt/local/var/macports/build/_opt_local_var_macports_sources_rsync.macports.org_release_tarballs_ports_devel_cmake/cmake/work/cmake-3.0.2'
689:info:build make[2]: Entering directory `/opt/local/var/macports/build/_opt_local_var_macports_sources_rsync.macports.org_release_tarballs_ports_devel_cmake/cmake/work/cmake-3.0.2'
690:info:build make[2]: Entering directory `/opt/local/var/macports/build/_opt_local_var_macports_sources_rsync.macports.org_release_tarballs_ports_devel_cmake/cmake/work/cmake-3.0.2'
691:info:build Scanning dependencies of target cmsys
692:info:build make[2]: Leaving directory `/opt/local/var/macports/build/_opt_local_var_macports_sources_rsync.macports.org_release_tarballs_ports_devel_cmake/cmake/work/cmake-3.0.2'
693:info:build make[2]: Entering directory `/opt/local/var/macports/build/_opt_local_var_macports_sources_rsync.macports.org_release_tarballs_ports_devel_cmake/cmake/work/cmake-3.0.2'
694:info:build Scanning dependencies of target cmIML_test
695:info:build [  0%] make[2]: Leaving directory `/opt/local/var/macports/build/_opt_local_var_macports_sources_rsync.macports.org_release_tarballs_ports_devel_cmake/cmake/work/cmake-3.0.2'
696:info:build Building C object Source/kwsys/CMakeFiles/cmsys.dir/ProcessUNIX.c.o
697:info:build make[2]: Entering directory `/opt/local/var/macports/build/_opt_local_var_macports_sources_rsync.macports.org_release_tarballs_ports_devel_cmake/cmake/work/cmake-3.0.2'
698:info:build [  0%] Building C object Utilities/KWIML/test/CMakeFiles/cmIML_test.dir/test.c.o
699:info:build [  1%] Building C object Utilities/KWIML/test/CMakeFiles/cmIML_test.dir/test_ABI_C.c.o
700:info:build [  1%] Building C object Utilities/KWIML/test/CMakeFiles/cmIML_test.dir/test_INT_C.c.o
701:info:build [  2%] Building C object Source/kwsys/CMakeFiles/cmsys.dir/Base64.c.o
702:info:build [  2%] Building C object Source/kwsys/CMakeFiles/cmsys.dir/EncodingC.c.o
703:info:build [  2%] Building C object Source/kwsys/CMakeFiles/cmsys.dir/MD5.c.o
704:info:build [  3%] Building C object Utilities/KWIML/test/CMakeFiles/cmIML_test.dir/test_include_C.c.o
705:info:build [  3%] Building CXX object Utilities/KWIML/test/CMakeFiles/cmIML_test.dir/test_ABI_CXX.cxx.o
706:info:build [  3%] Building CXX object Utilities/KWIML/test/CMakeFiles/cmIML_test.dir/test_INT_CXX.cxx.o
707:info:build [  4%] Building C object Source/kwsys/CMakeFiles/cmsys.dir/Terminal.c.o
708:info:build [  4%] Building C object Source/kwsys/CMakeFiles/cmsys.dir/System.c.o
709:info:build [  5%] Building CXX object Utilities/KWIML/test/CMakeFiles/cmIML_test.dir/test_include_CXX.cxx.o
710:info:build [  5%] Building C object Source/kwsys/CMakeFiles/cmsys.dir/String.c.o
711:info:build [  6%] Building CXX object Source/kwsys/CMakeFiles/cmsys.dir/Directory.cxx.o
712:info:build Linking CXX executable cmIML_test
713:info:build make[2]: Leaving directory `/opt/local/var/macports/build/_opt_local_var_macports_sources_rsync.macports.org_release_tarballs_ports_devel_cmake/cmake/work/cmake-3.0.2'
714:info:build [  6%] Built target cmIML_test
715:info:build make[2]: Entering directory `/opt/local/var/macports/build/_opt_local_var_macports_sources_rsync.macports.org_release_tarballs_ports_devel_cmake/cmake/work/cmake-3.0.2'
716:info:build Scanning dependencies of target cmsys_c
717:info:build make[2]: Leaving directory `/opt/local/var/macports/build/_opt_local_var_macports_sources_rsync.macports.org_release_tarballs_ports_devel_cmake/cmake/work/cmake-3.0.2'
718:info:build make[2]: Entering directory `/opt/local/var/macports/build/_opt_local_var_macports_sources_rsync.macports.org_release_tarballs_ports_devel_cmake/cmake/work/cmake-3.0.2'
719:info:build [  7%] Building C object Source/kwsys/CMakeFiles/cmsys_c.dir/ProcessUNIX.c.o
720:info:build [  7%] [  7%] Building C object Source/kwsys/CMakeFiles/cmsys_c.dir/Base64.c.o
721:info:build Building CXX object Source/kwsys/CMakeFiles/cmsys.dir/DynamicLoader.cxx.o
722:info:build [  7%] Building C object Source/kwsys/CMakeFiles/cmsys_c.dir/EncodingC.c.o
723:info:build [  7%] Building CXX object Source/kwsys/CMakeFiles/cmsys.dir/EncodingCXX.cxx.o
724:info:build [  8%] Building C object Source/kwsys/CMakeFiles/cmsys_c.dir/MD5.c.o
725:info:build [  8%] Building C object Source/kwsys/CMakeFiles/cmsys_c.dir/Terminal.c.o
726:info:build [  8%] Building C object Source/kwsys/CMakeFiles/cmsys_c.dir/System.c.o
727:info:build [  9%] Building C object Source/kwsys/CMakeFiles/cmsys_c.dir/String.c.o
728:info:build Linking C static library libcmsys_c.a
729:info:build [ 10%] Building CXX object Source/kwsys/CMakeFiles/cmsys.dir/Glob.cxx.o
730:info:build make[2]: Leaving directory `/opt/local/var/macports/build/_opt_local_var_macports_sources_rsync.macports.org_release_tarballs_ports_devel_cmake/cmake/work/cmake-3.0.2'
731:info:build [ 10%] Built target cmsys_c
732:info:build make[2]: Entering directory `/opt/local/var/macports/build/_opt_local_var_macports_sources_rsync.macports.org_release_tarballs_ports_devel_cmake/cmake/work/cmake-3.0.2'
733:info:build Scanning dependencies of target cmcompress
734:info:build make[2]: Leaving directory `/opt/local/var/macports/build/_opt_local_var_macports_sources_rsync.macports.org_release_tarballs_ports_devel_cmake/cmake/work/cmake-3.0.2'
735:info:build make[2]: Entering directory `/opt/local/var/macports/build/_opt_local_var_macports_sources_rsync.macports.org_release_tarballs_ports_devel_cmake/cmake/work/cmake-3.0.2'
736:info:build [ 10%] Building C object Utilities/cmcompress/CMakeFiles/cmcompress.dir/cmcompress.c.o
737:info:build Linking C static library libcmcompress.a
738:info:build make[2]: Leaving directory `/opt/local/var/macports/build/_opt_local_var_macports_sources_rsync.macports.org_release_tarballs_ports_devel_cmake/cmake/work/cmake-3.0.2'
739:info:build [ 10%] Built target cmcompress
740:info:build make[2]: Entering directory `/opt/local/var/macports/build/_opt_local_var_macports_sources_rsync.macports.org_release_tarballs_ports_devel_cmake/cmake/work/cmake-3.0.2'
741:info:build Scanning dependencies of target cmForm
742:info:build make[2]: Leaving directory `/opt/local/var/macports/build/_opt_local_var_macports_sources_rsync.macports.org_release_tarballs_ports_devel_cmake/cmake/work/cmake-3.0.2'
743:info:build make[2]: Entering directory `/opt/local/var/macports/build/_opt_local_var_macports_sources_rsync.macports.org_release_tarballs_ports_devel_cmake/cmake/work/cmake-3.0.2'
744:info:build [ 10%] [ 10%] Building CXX object Source/kwsys/CMakeFiles/cmsys.dir/RegularExpression.cxx.o
745:info:build Building C object Source/CursesDialog/form/CMakeFiles/cmForm.dir/fld_arg.c.o
746:info:build [ 10%] Building C object Source/CursesDialog/form/CMakeFiles/cmForm.dir/fld_attr.c.o
747:info:build [ 11%] Building C object Source/CursesDialog/form/CMakeFiles/cmForm.dir/fld_current.c.o
748:info:build [ 11%] Building C object Source/CursesDialog/form/CMakeFiles/cmForm.dir/fld_def.c.o
749:info:build [ 11%] Building C object Source/CursesDialog/form/CMakeFiles/cmForm.dir/fld_dup.c.o
750:info:build [ 12%] [ 11%] Building C object Source/CursesDialog/form/CMakeFiles/cmForm.dir/fld_ftchoice.c.o
751:info:build Building CXX object Source/kwsys/CMakeFiles/cmsys.dir/SystemTools.cxx.o
752:info:build [ 12%] Building C object Source/CursesDialog/form/CMakeFiles/cmForm.dir/fld_ftlink.c.o
753:info:build [ 12%] Building C object Source/CursesDialog/form/CMakeFiles/cmForm.dir/fld_info.c.o
754:info:build [ 13%] Building C object Source/CursesDialog/form/CMakeFiles/cmForm.dir/fld_just.c.o
755:info:build [ 13%] Building C object Source/CursesDialog/form/CMakeFiles/cmForm.dir/fld_link.c.o
756:info:build [ 13%] Building C object Source/CursesDialog/form/CMakeFiles/cmForm.dir/fld_max.c.o
757:info:build [ 14%] Building C object Source/CursesDialog/form/CMakeFiles/cmForm.dir/fld_move.c.o
758:info:build [ 14%] Building C object Source/CursesDialog/form/CMakeFiles/cmForm.dir/fld_newftyp.c.o
759:info:build [ 15%] Building C object Source/CursesDialog/form/CMakeFiles/cmForm.dir/fld_opts.c.o
760:info:build [ 15%] Building C object Source/CursesDialog/form/CMakeFiles/cmForm.dir/fld_pad.c.o
761:info:build [ 15%] Building C object Source/CursesDialog/form/CMakeFiles/cmForm.dir/fld_page.c.o
762:info:build [ 16%] Building C object Source/CursesDialog/form/CMakeFiles/cmForm.dir/fld_stat.c.o
763:info:build [ 16%] Building C object Source/CursesDialog/form/CMakeFiles/cmForm.dir/fld_type.c.o
764:info:build [ 16%] Building C object Source/CursesDialog/form/CMakeFiles/cmForm.dir/fld_user.c.o
765:info:build [ 17%] Building C object Source/CursesDialog/form/CMakeFiles/cmForm.dir/frm_cursor.c.o
766:info:build [ 17%] Building C object Source/CursesDialog/form/CMakeFiles/cmForm.dir/frm_data.c.o
767:info:build [ 17%] Building C object Source/CursesDialog/form/CMakeFiles/cmForm.dir/frm_def.c.o
768:info:build [ 18%] Building C object Source/CursesDialog/form/CMakeFiles/cmForm.dir/frm_driver.c.o
769:info:build [ 18%] Building C object Source/CursesDialog/form/CMakeFiles/cmForm.dir/frm_hook.c.o
770:info:build [ 18%] Building C object Source/CursesDialog/form/CMakeFiles/cmForm.dir/frm_opts.c.o
771:info:build [ 19%] Building C object Source/CursesDialog/form/CMakeFiles/cmForm.dir/frm_page.c.o
772:info:build [ 19%] Building C object Source/CursesDialog/form/CMakeFiles/cmForm.dir/frm_post.c.o
773:info:build [ 19%] Building C object Source/CursesDialog/form/CMakeFiles/cmForm.dir/frm_req_name.c.o
774:info:build [ 20%] Building C object Source/CursesDialog/form/CMakeFiles/cmForm.dir/frm_scale.c.o
775:info:build [ 21%] Building CXX object Source/kwsys/CMakeFiles/cmsys.dir/CommandLineArguments.cxx.o
776:info:build [ 21%] Building C object Source/CursesDialog/form/CMakeFiles/cmForm.dir/frm_sub.c.o
777:info:build [ 21%] Building C object Source/CursesDialog/form/CMakeFiles/cmForm.dir/frm_user.c.o
778:info:build [ 22%] Building C object Source/CursesDialog/form/CMakeFiles/cmForm.dir/frm_win.c.o
779:info:build [ 22%] Building C object Source/CursesDialog/form/CMakeFiles/cmForm.dir/fty_alnum.c.o
780:info:build [ 22%] Building C object Source/CursesDialog/form/CMakeFiles/cmForm.dir/fty_alpha.c.o
781:info:build [ 23%] Building C object Source/CursesDialog/form/CMakeFiles/cmForm.dir/fty_enum.c.o
782:info:build [ 23%] Building C object Source/CursesDialog/form/CMakeFiles/cmForm.dir/fty_int.c.o
783:info:build [ 23%] Building C object Source/CursesDialog/form/CMakeFiles/cmForm.dir/fty_ipv4.c.o
784:info:build [ 24%] Building C object Source/CursesDialog/form/CMakeFiles/cmForm.dir/fty_num.c.o
785:info:build [ 24%] Building C object Source/CursesDialog/form/CMakeFiles/cmForm.dir/fty_regex.c.o
786:info:build Linking C static library libcmForm.a
787:info:build make[2]: Leaving directory `/opt/local/var/macports/build/_opt_local_var_macports_sources_rsync.macports.org_release_tarballs_ports_devel_cmake/cmake/work/cmake-3.0.2'
788:info:build [ 24%] Built target cmForm
789:info:build make[2]: Entering directory `/opt/local/var/macports/build/_opt_local_var_macports_sources_rsync.macports.org_release_tarballs_ports_devel_cmake/cmake/work/cmake-3.0.2'
790:info:build Scanning dependencies of target foo
791:info:build make[2]: Leaving directory `/opt/local/var/macports/build/_opt_local_var_macports_sources_rsync.macports.org_release_tarballs_ports_devel_cmake/cmake/work/cmake-3.0.2'
792:info:build make[2]: Entering directory `/opt/local/var/macports/build/_opt_local_var_macports_sources_rsync.macports.org_release_tarballs_ports_devel_cmake/cmake/work/cmake-3.0.2'
793:info:build [ 25%] Building CXX object Tests/FindPackageModeMakefileTest/CMakeFiles/foo.dir/foo.cpp.o
794:info:build Linking CXX static library libfoo.a
795:info:build make[2]: Leaving directory `/opt/local/var/macports/build/_opt_local_var_macports_sources_rsync.macports.org_release_tarballs_ports_devel_cmake/cmake/work/cmake-3.0.2'
796:info:build [ 25%] Built target foo
797:info:build make[2]: Entering directory `/opt/local/var/macports/build/_opt_local_var_macports_sources_rsync.macports.org_release_tarballs_ports_devel_cmake/cmake/work/cmake-3.0.2'
798:info:build Scanning dependencies of target pseudonl_BC
799:info:build make[2]: Leaving directory `/opt/local/var/macports/build/_opt_local_var_macports_sources_rsync.macports.org_release_tarballs_ports_devel_cmake/cmake/work/cmake-3.0.2'
800:info:build make[2]: Entering directory `/opt/local/var/macports/build/_opt_local_var_macports_sources_rsync.macports.org_release_tarballs_ports_devel_cmake/cmake/work/cmake-3.0.2'
801:info:build [ 25%] Building C object Tests/CTestTestMemcheck/NoLogDummyChecker/CMakeFiles/pseudonl_BC.dir/ret0.c.o
802:info:build Linking C executable BC
803:info:build make[2]: Leaving directory `/opt/local/var/macports/build/_opt_local_var_macports_sources_rsync.macports.org_release_tarballs_ports_devel_cmake/cmake/work/cmake-3.0.2'
804:info:build [ 25%] Built target pseudonl_BC
805:info:build make[2]: Entering directory `/opt/local/var/macports/build/_opt_local_var_macports_sources_rsync.macports.org_release_tarballs_ports_devel_cmake/cmake/work/cmake-3.0.2'
806:info:build Scanning dependencies of target pseudonl_purify
807:info:build make[2]: Leaving directory `/opt/local/var/macports/build/_opt_local_var_macports_sources_rsync.macports.org_release_tarballs_ports_devel_cmake/cmake/work/cmake-3.0.2'
808:info:build make[2]: Entering directory `/opt/local/var/macports/build/_opt_local_var_macports_sources_rsync.macports.org_release_tarballs_ports_devel_cmake/cmake/work/cmake-3.0.2'
809:info:build [ 26%] Building C object Tests/CTestTestMemcheck/NoLogDummyChecker/CMakeFiles/pseudonl_purify.dir/ret0.c.o
810:info:build Linking C executable purify
811:info:build make[2]: Leaving directory `/opt/local/var/macports/build/_opt_local_var_macports_sources_rsync.macports.org_release_tarballs_ports_devel_cmake/cmake/work/cmake-3.0.2'
812:info:build [ 26%] Built target pseudonl_purify
813:info:build make[2]: Entering directory `/opt/local/var/macports/build/_opt_local_var_macports_sources_rsync.macports.org_release_tarballs_ports_devel_cmake/cmake/work/cmake-3.0.2'
814:info:build Scanning dependencies of target pseudonl_valgrind
815:info:build make[2]: Leaving directory `/opt/local/var/macports/build/_opt_local_var_macports_sources_rsync.macports.org_release_tarballs_ports_devel_cmake/cmake/work/cmake-3.0.2'
816:info:build make[2]: Entering directory `/opt/local/var/macports/build/_opt_local_var_macports_sources_rsync.macports.org_release_tarballs_ports_devel_cmake/cmake/work/cmake-3.0.2'
817:info:build [ 26%] Building C object Tests/CTestTestMemcheck/NoLogDummyChecker/CMakeFiles/pseudonl_valgrind.dir/ret0.c.o
818:info:build Linking C executable valgrind
819:info:build make[2]: Leaving directory `/opt/local/var/macports/build/_opt_local_var_macports_sources_rsync.macports.org_release_tarballs_ports_devel_cmake/cmake/work/cmake-3.0.2'
820:info:build [ 26%] Built target pseudonl_valgrind
821:info:build make[2]: Entering directory `/opt/local/var/macports/build/_opt_local_var_macports_sources_rsync.macports.org_release_tarballs_ports_devel_cmake/cmake/work/cmake-3.0.2'
822:info:build Scanning dependencies of target cmsysTestProcess
823:info:build make[2]: Leaving directory `/opt/local/var/macports/build/_opt_local_var_macports_sources_rsync.macports.org_release_tarballs_ports_devel_cmake/cmake/work/cmake-3.0.2'
824:info:build [ 26%] Building CXX object Source/kwsys/CMakeFiles/cmsys.dir/IOStream.cxx.o
825:info:build make[2]: Entering directory `/opt/local/var/macports/build/_opt_local_var_macports_sources_rsync.macports.org_release_tarballs_ports_devel_cmake/cmake/work/cmake-3.0.2'
826:info:build [ 26%] Building C object Source/kwsys/CMakeFiles/cmsysTestProcess.dir/testProcess.c.o
827:info:build Linking C executable cmsysTestProcess
828:info:build make[2]: Leaving directory `/opt/local/var/macports/build/_opt_local_var_macports_sources_rsync.macports.org_release_tarballs_ports_devel_cmake/cmake/work/cmake-3.0.2'
829:info:build [ 26%] Built target cmsysTestProcess
830:info:build make[2]: Entering directory `/opt/local/var/macports/build/_opt_local_var_macports_sources_rsync.macports.org_release_tarballs_ports_devel_cmake/cmake/work/cmake-3.0.2'
831:info:build Scanning dependencies of target cmsysTestSharedForward
832:info:build make[2]: Leaving directory `/opt/local/var/macports/build/_opt_local_var_macports_sources_rsync.macports.org_release_tarballs_ports_devel_cmake/cmake/work/cmake-3.0.2'
833:info:build make[2]: Entering directory `/opt/local/var/macports/build/_opt_local_var_macports_sources_rsync.macports.org_release_tarballs_ports_devel_cmake/cmake/work/cmake-3.0.2'
834:info:build [ 26%] Building C object Source/kwsys/CMakeFiles/cmsysTestSharedForward.dir/testSharedForward.c.o
835:info:build Linking C executable cmsysTestSharedForward
836:info:build make[2]: Leaving directory `/opt/local/var/macports/build/_opt_local_var_macports_sources_rsync.macports.org_release_tarballs_ports_devel_cmake/cmake/work/cmake-3.0.2'
837:info:build [ 26%] Built target cmsysTestSharedForward
838:info:build make[2]: Entering directory `/opt/local/var/macports/build/_opt_local_var_macports_sources_rsync.macports.org_release_tarballs_ports_devel_cmake/cmake/work/cmake-3.0.2'
839:info:build Scanning dependencies of target cmsysTestsC
840:info:build make[2]: Leaving directory `/opt/local/var/macports/build/_opt_local_var_macports_sources_rsync.macports.org_release_tarballs_ports_devel_cmake/cmake/work/cmake-3.0.2'
841:info:build make[2]: Entering directory `/opt/local/var/macports/build/_opt_local_var_macports_sources_rsync.macports.org_release_tarballs_ports_devel_cmake/cmake/work/cmake-3.0.2'
842:info:build [ 27%] Building C object Source/kwsys/CMakeFiles/cmsysTestsC.dir/cmsysTestsC.c.o
843:info:build [ 27%] Building CXX object Source/kwsys/CMakeFiles/cmsys.dir/SystemInformation.cxx.o
844:info:build [ 27%] Building C object Source/kwsys/CMakeFiles/cmsysTestsC.dir/testEncode.c.o
845:info:build [ 28%] Building C object Source/kwsys/CMakeFiles/cmsysTestsC.dir/testTerminal.c.o
846:info:build Linking C executable cmsysTestsC
847:info:build make[2]: Leaving directory `/opt/local/var/macports/build/_opt_local_var_macports_sources_rsync.macports.org_release_tarballs_ports_devel_cmake/cmake/work/cmake-3.0.2'
848:info:build [ 28%] Built target cmsysTestsC
849:info:build Linking CXX static library libcmsys.a
850:info:build make[2]: Leaving directory `/opt/local/var/macports/build/_opt_local_var_macports_sources_rsync.macports.org_release_tarballs_ports_devel_cmake/cmake/work/cmake-3.0.2'
851:info:build [ 28%] Built target cmsys
852:info:build make[2]: Entering directory `/opt/local/var/macports/build/_opt_local_var_macports_sources_rsync.macports.org_release_tarballs_ports_devel_cmake/cmake/work/cmake-3.0.2'
853:info:build make[2]: Entering directory `/opt/local/var/macports/build/_opt_local_var_macports_sources_rsync.macports.org_release_tarballs_ports_devel_cmake/cmake/work/cmake-3.0.2'
854:info:build Scanning dependencies of target cmsysTestDynload
855:info:build make[2]: Leaving directory `/opt/local/var/macports/build/_opt_local_var_macports_sources_rsync.macports.org_release_tarballs_ports_devel_cmake/cmake/work/cmake-3.0.2'
856:info:build make[2]: Entering directory `/opt/local/var/macports/build/_opt_local_var_macports_sources_rsync.macports.org_release_tarballs_ports_devel_cmake/cmake/work/cmake-3.0.2'
857:info:build [ 29%] Scanning dependencies of target cmsysTestsCxx
858:info:build make[2]: Leaving directory `/opt/local/var/macports/build/_opt_local_var_macports_sources_rsync.macports.org_release_tarballs_ports_devel_cmake/cmake/work/cmake-3.0.2'
859:info:build Building C object Source/kwsys/CMakeFiles/cmsysTestDynload.dir/testDynload.c.o
860:info:build make[2]: Entering directory `/opt/local/var/macports/build/_opt_local_var_macports_sources_rsync.macports.org_release_tarballs_ports_devel_cmake/cmake/work/cmake-3.0.2'
861:info:build [ 29%] Building CXX object Source/kwsys/CMakeFiles/cmsysTestsCxx.dir/cmsysTestsCxx.cxx.o
862:info:build Linking C shared module libcmsysTestDynload.so
863:info:build [ 29%] Building CXX object Source/kwsys/CMakeFiles/cmsysTestsCxx.dir/testAutoPtr.cxx.o
864:info:build make[2]: Leaving directory `/opt/local/var/macports/build/_opt_local_var_macports_sources_rsync.macports.org_release_tarballs_ports_devel_cmake/cmake/work/cmake-3.0.2'
865:info:build [ 30%] [ 30%] Building CXX object Source/kwsys/CMakeFiles/cmsysTestsCxx.dir/testHashSTL.cxx.o
866:info:build Built target cmsysTestDynload
867:info:build make[2]: Entering directory `/opt/local/var/macports/build/_opt_local_var_macports_sources_rsync.macports.org_release_tarballs_ports_devel_cmake/cmake/work/cmake-3.0.2'
868:info:build [ 30%] Building CXX object Source/kwsys/CMakeFiles/cmsysTestsCxx.dir/testIOS.cxx.o
869:info:build [ 30%] Building CXX object Source/kwsys/CMakeFiles/cmsysTestsCxx.dir/testSystemTools.cxx.o
870:info:build [ 31%] Building CXX object Source/kwsys/CMakeFiles/cmsysTestsCxx.dir/testCommandLineArguments.cxx.o
871:info:build [ 31%] Building CXX object Source/kwsys/CMakeFiles/cmsysTestsCxx.dir/testCommandLineArguments1.cxx.o
872:info:build [ 31%] Building CXX object Source/kwsys/CMakeFiles/cmsysTestsCxx.dir/testEncoding.cxx.o
873:info:build [ 32%] Building CXX object Source/kwsys/CMakeFiles/cmsysTestsCxx.dir/testFStream.cxx.o
874:info:build Scanning dependencies of target CMakeLib
875:info:build make[2]: Leaving directory `/opt/local/var/macports/build/_opt_local_var_macports_sources_rsync.macports.org_release_tarballs_ports_devel_cmake/cmake/work/cmake-3.0.2'
876:info:build make[2]: Entering directory `/opt/local/var/macports/build/_opt_local_var_macports_sources_rsync.macports.org_release_tarballs_ports_devel_cmake/cmake/work/cmake-3.0.2'
877:info:build [ 32%] Building CXX object Source/CMakeFiles/CMakeLib.dir/cmStandardIncludes.cxx.o
878:info:build [ 32%] Building CXX object Source/kwsys/CMakeFiles/cmsysTestsCxx.dir/testSystemInformation.cxx.o
879:info:build [ 32%] Building CXX object Source/CMakeFiles/CMakeLib.dir/cmArchiveWrite.cxx.o
880:info:build [ 32%] Building CXX object Source/kwsys/CMakeFiles/cmsysTestsCxx.dir/testDynamicLoader.cxx.o
881:info:build /opt/local/var/macports/build/_opt_local_var_macports_sources_rsync.macports.org_release_tarballs_ports_devel_cmake/cmake/work/cmake-3.0.2/Source/cmArchiveWrite.cxx:67:10: warning: 'archive_write_set_compression_none' is deprecated [-Wdeprecated-declarations]
882:info:build       if(archive_write_set_compression_none(this->Archive) != ARCHIVE_OK)
883:info:build          ^
884:info:build /opt/local/include/archive.h:628:15: note: 'archive_write_set_compression_none' has been explicitly marked deprecated here
885:info:build __LA_DECL int archive_write_set_compression_none(struct archive *)
886:info:build               ^
887:info:build /opt/local/var/macports/build/_opt_local_var_macports_sources_rsync.macports.org_release_tarballs_ports_devel_cmake/cmake/work/cmake-3.0.2/Source/cmArchiveWrite.cxx:75:10: warning: 'archive_write_set_compression_compress' is deprecated [-Wdeprecated-declarations]
888:info:build       if(archive_write_set_compression_compress(this->Archive) != ARCHIVE_OK)
889:info:build          ^
890:info:build /opt/local/include/archive.h:620:15: note: 'archive_write_set_compression_compress' has been explicitly marked deprecated here
891:info:build __LA_DECL int archive_write_set_compression_compress(struct archive *)
892:info:build               ^
893:info:build /opt/local/var/macports/build/_opt_local_var_macports_sources_rsync.macports.org_release_tarballs_ports_devel_cmake/cmake/work/cmake-3.0.2/Source/cmArchiveWrite.cxx:83:10: warning: 'archive_write_set_compression_gzip' is deprecated [-Wdeprecated-declarations]
894:info:build       if(archive_write_set_compression_gzip(this->Archive) != ARCHIVE_OK)
895:info:build          ^
896:info:build /opt/local/include/archive.h:622:15: note: 'archive_write_set_compression_gzip' has been explicitly marked deprecated here
897:info:build __LA_DECL int archive_write_set_compression_gzip(struct archive *)
898:info:build               ^
899:info:build /opt/local/var/macports/build/_opt_local_var_macports_sources_rsync.macports.org_release_tarballs_ports_devel_cmake/cmake/work/cmake-3.0.2/Source/cmArchiveWrite.cxx:91:10: warning: 'archive_write_set_compression_bzip2' is deprecated [-Wdeprecated-declarations]
900:info:build       if(archive_write_set_compression_bzip2(this->Archive) != ARCHIVE_OK)
901:info:build          ^
902:info:build /opt/local/include/archive.h:618:15: note: 'archive_write_set_compression_bzip2' has been explicitly marked deprecated here
903:info:build __LA_DECL int archive_write_set_compression_bzip2(struct archive *)
904:info:build               ^
905:info:build /opt/local/var/macports/build/_opt_local_var_macports_sources_rsync.macports.org_release_tarballs_ports_devel_cmake/cmake/work/cmake-3.0.2/Source/cmArchiveWrite.cxx:99:10: warning: 'archive_write_set_compression_lzma' is deprecated [-Wdeprecated-declarations]
906:info:build       if(archive_write_set_compression_lzma(this->Archive) != ARCHIVE_OK)
907:info:build          ^
908:info:build /opt/local/include/archive.h:626:15: note: 'archive_write_set_compression_lzma' has been explicitly marked deprecated here
909:info:build __LA_DECL int archive_write_set_compression_lzma(struct archive *)
910:info:build               ^
911:info:build /opt/local/var/macports/build/_opt_local_var_macports_sources_rsync.macports.org_release_tarballs_ports_devel_cmake/cmake/work/cmake-3.0.2/Source/cmArchiveWrite.cxx:107:10: warning: 'archive_write_set_compression_xz' is deprecated [-Wdeprecated-declarations]
912:info:build       if(archive_write_set_compression_xz(this->Archive) != ARCHIVE_OK)
913:info:build          ^
914:info:build /opt/local/include/archive.h:632:15: note: 'archive_write_set_compression_xz' has been explicitly marked deprecated here
915:info:build __LA_DECL int archive_write_set_compression_xz(struct archive *)
916:info:build               ^
917:info:build /opt/local/var/macports/build/_opt_local_var_macports_sources_rsync.macports.org_release_tarballs_ports_devel_cmake/cmake/work/cmake-3.0.2/Source/cmArchiveWrite.cxx:165:3: warning: 'archive_read_finish' is deprecated [-Wdeprecated-declarations]
918:info:build   archive_read_finish(this->Disk);
919:info:build   ^
920:info:build /opt/local/include/archive.h:585:17: note: 'archive_read_finish' has been explicitly marked deprecated here
921:info:build __LA_DECL int            archive_read_finish(struct archive *) __LA_DEPRECATED;
922:info:build                          ^
923:info:build /opt/local/var/macports/build/_opt_local_var_macports_sources_rsync.macports.org_release_tarballs_ports_devel_cmake/cmake/work/cmake-3.0.2/Source/cmArchiveWrite.cxx:166:3: warning: 'archive_write_finish' is deprecated [-Wdeprecated-declarations]
924:info:build   archive_write_finish(this->Archive);
925:info:build   ^
926:info:build /opt/local/include/archive.h:721:17: note: 'archive_write_finish' has been explicitly marked deprecated here
927:info:build __LA_DECL int            archive_write_finish(struct archive *) __LA_DEPRECATED;
928:info:build                          ^
929:info:build Linking CXX executable cmsysTestsCxx
930:info:build 8 warnings generated.
931:info:build [ 33%] Building CXX object Source/CMakeFiles/CMakeLib.dir/cmBootstrapCommands1.cxx.o
932:info:build make[2]: Leaving directory `/opt/local/var/macports/build/_opt_local_var_macports_sources_rsync.macports.org_release_tarballs_ports_devel_cmake/cmake/work/cmake-3.0.2'
933:info:build [ 33%] Built target cmsysTestsCxx
934:info:build make[2]: Entering directory `/opt/local/var/macports/build/_opt_local_var_macports_sources_rsync.macports.org_release_tarballs_ports_devel_cmake/cmake/work/cmake-3.0.2'
935:info:build Scanning dependencies of target OSXScriptLauncher
936:info:build make[2]: Leaving directory `/opt/local/var/macports/build/_opt_local_var_macports_sources_rsync.macports.org_release_tarballs_ports_devel_cmake/cmake/work/cmake-3.0.2'
937:info:build make[2]: Entering directory `/opt/local/var/macports/build/_opt_local_var_macports_sources_rsync.macports.org_release_tarballs_ports_devel_cmake/cmake/work/cmake-3.0.2'
938:info:build [ 33%] Building CXX object Source/CMakeFiles/OSXScriptLauncher.dir/CPack/OSXScriptLauncher.cxx.o
939:info:build Linking CXX executable ../bin/OSXScriptLauncher
940:info:build make[2]: Leaving directory `/opt/local/var/macports/build/_opt_local_var_macports_sources_rsync.macports.org_release_tarballs_ports_devel_cmake/cmake/work/cmake-3.0.2'
941:info:build [ 33%] Built target OSXScriptLauncher
942:info:build [ 33%] Building CXX object Source/CMakeFiles/CMakeLib.dir/cmBootstrapCommands2.cxx.o
943:info:build [ 33%] Building CXX object Source/CMakeFiles/CMakeLib.dir/cmCacheManager.cxx.o
944:info:build [ 34%] Building CXX object Source/CMakeFiles/CMakeLib.dir/cmCommands.cxx.o
945:info:build [ 34%] Building CXX object Source/CMakeFiles/CMakeLib.dir/cmCommandArgumentLexer.cxx.o
946:info:build [ 34%] Building CXX object Source/CMakeFiles/CMakeLib.dir/cmCommandArgumentParser.cxx.o
947:info:build [ 35%] Building CXX object Source/CMakeFiles/CMakeLib.dir/cmCommandArgumentParserHelper.cxx.o
948:info:build [ 35%] Building CXX object Source/CMakeFiles/CMakeLib.dir/cmComputeComponentGraph.cxx.o
949:info:build [ 35%] Building CXX object Source/CMakeFiles/CMakeLib.dir/cmComputeLinkDepends.cxx.o
950:info:build [ 36%] Building CXX object Source/CMakeFiles/CMakeLib.dir/cmComputeLinkInformation.cxx.o
951:info:build [ 36%] Building CXX object Source/CMakeFiles/CMakeLib.dir/cmComputeTargetDepends.cxx.o
952:info:build [ 36%] Building CXX object Source/CMakeFiles/CMakeLib.dir/cmCryptoHash.cxx.o
953:info:build [ 37%] Building CXX object Source/CMakeFiles/CMakeLib.dir/cmCustomCommand.cxx.o
954:info:build [ 37%] Building CXX object Source/CMakeFiles/CMakeLib.dir/cmCustomCommandGenerator.cxx.o
955:info:build [ 37%] Building CXX object Source/CMakeFiles/CMakeLib.dir/cmDefinitions.cxx.o
956:info:build [ 38%] Building CXX object Source/CMakeFiles/CMakeLib.dir/cmDepends.cxx.o
957:info:build [ 38%] Building CXX object Source/CMakeFiles/CMakeLib.dir/cmDependsC.cxx.o
958:info:build [ 38%] Building CXX object Source/CMakeFiles/CMakeLib.dir/cmDependsFortran.cxx.o
959:info:build [ 39%] Building CXX object Source/CMakeFiles/CMakeLib.dir/cmDependsFortranLexer.cxx.o
960:info:build [ 39%] Building CXX object Source/CMakeFiles/CMakeLib.dir/cmDependsFortranParser.cxx.o
961:info:build [ 39%] Building CXX object Source/CMakeFiles/CMakeLib.dir/cmDependsJava.cxx.o
962:info:build [ 40%] Building CXX object Source/CMakeFiles/CMakeLib.dir/cmDependsJavaLexer.cxx.o
963:info:build [ 40%] Building CXX object Source/CMakeFiles/CMakeLib.dir/cmDependsJavaParser.cxx.o
964:info:build [ 40%] Building CXX object Source/CMakeFiles/CMakeLib.dir/cmDependsJavaParserHelper.cxx.o
965:info:build [ 41%] Building CXX object Source/CMakeFiles/CMakeLib.dir/cmDocumentation.cxx.o
966:info:build [ 41%] Building CXX object Source/CMakeFiles/CMakeLib.dir/cmDocumentationFormatter.cxx.o
967:info:build [ 42%] Building CXX object Source/CMakeFiles/CMakeLib.dir/cmDocumentationSection.cxx.o
968:info:build [ 42%] Building CXX object Source/CMakeFiles/CMakeLib.dir/cmDynamicLoader.cxx.o
969:info:build [ 42%] Building CXX object Source/CMakeFiles/CMakeLib.dir/cmExprLexer.cxx.o
970:info:build [ 43%] Building CXX object Source/CMakeFiles/CMakeLib.dir/cmExprParser.cxx.o
971:info:build [ 43%] Building CXX object Source/CMakeFiles/CMakeLib.dir/cmExprParserHelper.cxx.o
972:info:build [ 43%] Building CXX object Source/CMakeFiles/CMakeLib.dir/cmExportBuildFileGenerator.cxx.o
973:info:build [ 44%] Building CXX object Source/CMakeFiles/CMakeLib.dir/cmExportFileGenerator.cxx.o
974:info:build [ 44%] Building CXX object Source/CMakeFiles/CMakeLib.dir/cmExportInstallFileGenerator.cxx.o
975:info:build [ 44%] Building CXX object Source/CMakeFiles/CMakeLib.dir/cmExportTryCompileFileGenerator.cxx.o
976:info:build [ 45%] Building CXX object Source/CMakeFiles/CMakeLib.dir/cmExportSet.cxx.o
977:info:build [ 45%] Building CXX object Source/CMakeFiles/CMakeLib.dir/cmExportSetMap.cxx.o
978:info:build [ 45%] Building CXX object Source/CMakeFiles/CMakeLib.dir/cmExtraCodeBlocksGenerator.cxx.o
979:info:build [ 46%] Building CXX object Source/CMakeFiles/CMakeLib.dir/cmExtraCodeLiteGenerator.cxx.o
980:info:build [ 46%] Building CXX object Source/CMakeFiles/CMakeLib.dir/cmExtraEclipseCDT4Generator.cxx.o
981:info:build [ 46%] Building CXX object Source/CMakeFiles/CMakeLib.dir/cmExtraKateGenerator.cxx.o
982:info:build [ 47%] Building CXX object Source/CMakeFiles/CMakeLib.dir/cmExtraSublimeTextGenerator.cxx.o
983:info:build [ 47%] Building CXX object Source/CMakeFiles/CMakeLib.dir/cmFileTimeComparison.cxx.o
984:info:build [ 47%] Building CXX object Source/CMakeFiles/CMakeLib.dir/cmGeneratedFileStream.cxx.o
985:info:build [ 48%] Building CXX object Source/CMakeFiles/CMakeLib.dir/cmGeneratorExpressionDAGChecker.cxx.o
986:info:build [ 48%] Building CXX object Source/CMakeFiles/CMakeLib.dir/cmGeneratorExpressionEvaluator.cxx.o
987:info:build [ 48%] Building CXX object Source/CMakeFiles/CMakeLib.dir/cmGeneratorExpressionLexer.cxx.o
988:info:build [ 49%] Building CXX object Source/CMakeFiles/CMakeLib.dir/cmGeneratorExpressionParser.cxx.o
989:info:build [ 49%] Building CXX object Source/CMakeFiles/CMakeLib.dir/cmGeneratorExpression.cxx.o
990:info:build [ 49%] Building CXX object Source/CMakeFiles/CMakeLib.dir/cmGeneratorTarget.cxx.o
991:info:build [ 50%] Building CXX object Source/CMakeFiles/CMakeLib.dir/cmGlobalGenerator.cxx.o
992:info:build [ 50%] Building CXX object Source/CMakeFiles/CMakeLib.dir/cmGlobalUnixMakefileGenerator3.cxx.o
993:info:build [ 50%] Building CXX object Source/CMakeFiles/CMakeLib.dir/cmGraphVizWriter.cxx.o
994:info:build [ 51%] Building CXX object Source/CMakeFiles/CMakeLib.dir/cmInstallGenerator.cxx.o
995:info:build [ 51%] Building CXX object Source/CMakeFiles/CMakeLib.dir/cmInstallExportGenerator.cxx.o
996:info:build [ 52%] Building CXX object Source/CMakeFiles/CMakeLib.dir/cmInstallFilesGenerator.cxx.o
997:info:build [ 52%] Building CXX object Source/CMakeFiles/CMakeLib.dir/cmInstallScriptGenerator.cxx.o
998:info:build [ 52%] Building CXX object Source/CMakeFiles/CMakeLib.dir/cmInstallTargetGenerator.cxx.o
999:info:build [ 53%] Building CXX object Source/CMakeFiles/CMakeLib.dir/cmInstallDirectoryGenerator.cxx.o
1000:info:build [ 53%] Building CXX object Source/CMakeFiles/CMakeLib.dir/cmListFileCache.cxx.o
1001:info:build [ 53%] Building C object Source/CMakeFiles/CMakeLib.dir/cmListFileLexer.c.o
1002:info:build [ 54%] Building CXX object Source/CMakeFiles/CMakeLib.dir/cmLocalGenerator.cxx.o
1003:info:build [ 54%] Building CXX object Source/CMakeFiles/CMakeLib.dir/cmLocalUnixMakefileGenerator3.cxx.o
1004:info:build [ 54%] Building CXX object Source/CMakeFiles/CMakeLib.dir/cmMakeDepend.cxx.o
1005:info:build [ 55%] Building CXX object Source/CMakeFiles/CMakeLib.dir/cmMakefile.cxx.o
1006:info:build [ 55%] Building CXX object Source/CMakeFiles/CMakeLib.dir/cmMakefileTargetGenerator.cxx.o
1007:info:build [ 55%] Building CXX object Source/CMakeFiles/CMakeLib.dir/cmMakefileExecutableTargetGenerator.cxx.o
1008:info:build [ 56%] Building CXX object Source/CMakeFiles/CMakeLib.dir/cmMakefileLibraryTargetGenerator.cxx.o
1009:info:build [ 56%] Building CXX object Source/CMakeFiles/CMakeLib.dir/cmMakefileUtilityTargetGenerator.cxx.o
1010:info:build [ 56%] Building CXX object Source/CMakeFiles/CMakeLib.dir/cmOSXBundleGenerator.cxx.o
1011:info:build [ 57%] Building CXX object Source/CMakeFiles/CMakeLib.dir/cmNewLineStyle.cxx.o
1012:info:build [ 57%] Building CXX object Source/CMakeFiles/CMakeLib.dir/cmOrderDirectories.cxx.o
1013:info:build [ 57%] Building CXX object Source/CMakeFiles/CMakeLib.dir/cmPolicies.cxx.o
1014:info:build [ 58%] Building CXX object Source/CMakeFiles/CMakeLib.dir/cmProcessTools.cxx.o
1015:info:build [ 58%] Building CXX object Source/CMakeFiles/CMakeLib.dir/cmProperty.cxx.o
1016:info:build [ 58%] Building CXX object Source/CMakeFiles/CMakeLib.dir/cmPropertyDefinition.cxx.o
1017:info:build [ 59%] Building CXX object Source/CMakeFiles/CMakeLib.dir/cmPropertyDefinitionMap.cxx.o
1018:info:build [ 59%] Building CXX object Source/CMakeFiles/CMakeLib.dir/cmPropertyMap.cxx.o
1019:info:build [ 59%] Building CXX object Source/CMakeFiles/CMakeLib.dir/cmQtAutoGenerators.cxx.o
1020:info:build [ 60%] Building CXX object Source/CMakeFiles/CMakeLib.dir/cmRST.cxx.o
1021:info:build [ 60%] Building CXX object Source/CMakeFiles/CMakeLib.dir/cmScriptGenerator.cxx.o
1022:info:build [ 60%] Building CXX object Source/CMakeFiles/CMakeLib.dir/cmSourceFile.cxx.o
1023:info:build [ 61%] Building CXX object Source/CMakeFiles/CMakeLib.dir/cmSourceFileLocation.cxx.o
1024:info:build [ 61%] Building CXX object Source/CMakeFiles/CMakeLib.dir/cmSourceGroup.cxx.o
1025:info:build [ 62%] Building CXX object Source/CMakeFiles/CMakeLib.dir/cmSystemTools.cxx.o
1026:info:build /opt/local/var/macports/build/_opt_local_var_macports_sources_rsync.macports.org_release_tarballs_ports_devel_cmake/cmake/work/cmake-3.0.2/Source/cmSystemTools.cxx:1675:3: warning: 'archive_read_support_compression_all' is deprecated [-Wdeprecated-declarations]
1027:info:build   archive_read_support_compression_all(a);
1028:info:build   ^
1029:info:build /opt/local/include/archive.h:311:15: note: 'archive_read_support_compression_all' has been explicitly marked deprecated here
1030:info:build __LA_DECL int archive_read_support_compression_all(struct archive *)
1031:info:build               ^
1032:info:build /opt/local/var/macports/build/_opt_local_var_macports_sources_rsync.macports.org_release_tarballs_ports_devel_cmake/cmake/work/cmake-3.0.2/Source/cmSystemTools.cxx:1678:11: warning: 'archive_read_open_file' is deprecated [-Wdeprecated-declarations]
1033:info:build   int r = archive_read_open_file(a, outFileName, 10240);
1034:info:build           ^
1035:info:build /opt/local/include/archive.h:440:15: note: 'archive_read_open_file' has been explicitly marked deprecated here
1036:info:build __LA_DECL int archive_read_open_file(struct archive *,
1037:info:build               ^
1038:info:build /opt/local/var/macports/build/_opt_local_var_macports_sources_rsync.macports.org_release_tarballs_ports_devel_cmake/cmake/work/cmake-3.0.2/Source/cmSystemTools.cxx:1758:3: warning: 'archive_read_finish' is deprecated [-Wdeprecated-declarations]
1039:info:build   archive_read_finish(a);
1040:info:build   ^
1041:info:build /opt/local/include/archive.h:585:17: note: 'archive_read_finish' has been explicitly marked deprecated here
1042:info:build __LA_DECL int            archive_read_finish(struct archive *) __LA_DEPRECATED;
1043:info:build                          ^
1044:info:build [ 62%] Building CXX object Source/CMakeFiles/CMakeLib.dir/cmTarget.cxx.o
1045:info:build 3 warnings generated.
1046:info:build [ 62%] Building CXX object Source/CMakeFiles/CMakeLib.dir/cmTest.cxx.o
1047:info:build [ 63%] Building CXX object Source/CMakeFiles/CMakeLib.dir/cmTestGenerator.cxx.o
1048:info:build [ 63%] Building CXX object Source/CMakeFiles/CMakeLib.dir/cmVariableWatch.cxx.o
1049:info:build [ 63%] Building CXX object Source/CMakeFiles/CMakeLib.dir/cmVersion.cxx.o
1050:info:build [ 64%] Building CXX object Source/CMakeFiles/CMakeLib.dir/cmXMLParser.cxx.o
1051:info:build [ 64%] Building CXX object Source/CMakeFiles/CMakeLib.dir/cmXMLSafe.cxx.o
1052:info:build [ 64%] Building CXX object Source/CMakeFiles/CMakeLib.dir/cmake.cxx.o
1053:info:build [ 65%] Building C object Source/CMakeFiles/CMakeLib.dir/cm_sha2.c.o
1054:info:build [ 65%] Building C object Source/CMakeFiles/CMakeLib.dir/cm_utf8.c.o
1055:info:build [ 65%] Building CXX object Source/CMakeFiles/CMakeLib.dir/cmGlobalKdevelopGenerator.cxx.o
1056:info:build [ 66%] Building CXX object Source/CMakeFiles/CMakeLib.dir/cmXCodeObject.cxx.o
1057:info:build [ 66%] Building CXX object Source/CMakeFiles/CMakeLib.dir/cmXCode21Object.cxx.o
1058:info:build [ 66%] Building CXX object Source/CMakeFiles/CMakeLib.dir/cmGlobalXCodeGenerator.cxx.o
1059:info:build [ 67%] Building CXX object Source/CMakeFiles/CMakeLib.dir/cmLocalXCodeGenerator.cxx.o
1060:info:build [ 67%] Building CXX object Source/CMakeFiles/CMakeLib.dir/cmGlobalNinjaGenerator.cxx.o
1061:info:build [ 67%] Building CXX object Source/CMakeFiles/CMakeLib.dir/cmLocalNinjaGenerator.cxx.o
1062:info:build [ 68%] Building CXX object Source/CMakeFiles/CMakeLib.dir/cmNinjaTargetGenerator.cxx.o
1063:info:build [ 68%] Building CXX object Source/CMakeFiles/CMakeLib.dir/cmNinjaNormalTargetGenerator.cxx.o
1064:info:build [ 68%] Building CXX object Source/CMakeFiles/CMakeLib.dir/cmNinjaUtilityTargetGenerator.cxx.o
1065:info:build Linking CXX static library libCMakeLib.a
1066:info:build make[2]: Leaving directory `/opt/local/var/macports/build/_opt_local_var_macports_sources_rsync.macports.org_release_tarballs_ports_devel_cmake/cmake/work/cmake-3.0.2'
1067:info:build [ 68%] Built target CMakeLib
1068:info:build make[2]: Entering directory `/opt/local/var/macports/build/_opt_local_var_macports_sources_rsync.macports.org_release_tarballs_ports_devel_cmake/cmake/work/cmake-3.0.2'
1069:info:build make[2]: Entering directory `/opt/local/var/macports/build/_opt_local_var_macports_sources_rsync.macports.org_release_tarballs_ports_devel_cmake/cmake/work/cmake-3.0.2'
1070:info:build Scanning dependencies of target CPackLib
1071:info:build make[2]: Leaving directory `/opt/local/var/macports/build/_opt_local_var_macports_sources_rsync.macports.org_release_tarballs_ports_devel_cmake/cmake/work/cmake-3.0.2'
1072:info:build make[2]: Entering directory `/opt/local/var/macports/build/_opt_local_var_macports_sources_rsync.macports.org_release_tarballs_ports_devel_cmake/cmake/work/cmake-3.0.2'
1073:info:build [ 68%] Building CXX object Source/CMakeFiles/CPackLib.dir/CPack/cmCPackArchiveGenerator.cxx.o
1074:info:build Scanning dependencies of target CTestLib
1075:info:build make[2]: Leaving directory `/opt/local/var/macports/build/_opt_local_var_macports_sources_rsync.macports.org_release_tarballs_ports_devel_cmake/cmake/work/cmake-3.0.2'
1076:info:build make[2]: Entering directory `/opt/local/var/macports/build/_opt_local_var_macports_sources_rsync.macports.org_release_tarballs_ports_devel_cmake/cmake/work/cmake-3.0.2'
1077:info:build [ 68%] Building CXX object Source/CMakeFiles/CTestLib.dir/cmCTest.cxx.o
1078:info:build [ 69%] Building CXX object Source/CMakeFiles/CPackLib.dir/CPack/cmCPackComponentGroup.cxx.o
1079:info:build [ 69%] Building CXX object Source/CMakeFiles/CPackLib.dir/CPack/cmCPackGeneratorFactory.cxx.o
1080:info:build [ 69%] Building CXX object Source/CMakeFiles/CPackLib.dir/CPack/cmCPackGenerator.cxx.o
1081:info:build [ 69%] Building CXX object Source/CMakeFiles/CTestLib.dir/CTest/cmProcess.cxx.o
1082:info:build [ 70%] Building CXX object Source/CMakeFiles/CTestLib.dir/CTest/cmCTestBatchTestHandler.cxx.o
1083:info:build [ 70%] Building CXX object Source/CMakeFiles/CTestLib.dir/CTest/cmCTestBuildAndTestHandler.cxx.o
1084:info:build [ 71%] Building CXX object Source/CMakeFiles/CPackLib.dir/CPack/cmCPackLog.cxx.o
1085:info:build [ 71%] Building CXX object Source/CMakeFiles/CPackLib.dir/CPack/cmCPackNSISGenerator.cxx.o
1086:info:build [ 71%] Building CXX object Source/CMakeFiles/CTestLib.dir/CTest/cmCTestBuildCommand.cxx.o
1087:info:build [ 72%] Building CXX object Source/CMakeFiles/CTestLib.dir/CTest/cmCTestBuildHandler.cxx.o
1088:info:build [ 72%] Building CXX object Source/CMakeFiles/CPackLib.dir/CPack/cmCPackSTGZGenerator.cxx.o
1089:info:build [ 73%] Building CXX object Source/CMakeFiles/CPackLib.dir/CPack/cmCPackTGZGenerator.cxx.o
1090:info:build [ 73%] Building CXX object Source/CMakeFiles/CPackLib.dir/CPack/cmCPackTarBZip2Generator.cxx.o
1091:info:build [ 73%] Building CXX object Source/CMakeFiles/CTestLib.dir/CTest/cmCTestConfigureCommand.cxx.o
1092:info:build [ 73%] Building CXX object Source/CMakeFiles/CPackLib.dir/CPack/cmCPackTarCompressGenerator.cxx.o
1093:info:build [ 74%] Building CXX object Source/CMakeFiles/CPackLib.dir/CPack/cmCPackZIPGenerator.cxx.o
1094:info:build [ 74%] Building CXX object Source/CMakeFiles/CTestLib.dir/CTest/cmCTestConfigureHandler.cxx.o
1095:info:build [ 74%] Building CXX object Source/CMakeFiles/CPackLib.dir/CPack/cmCPackDebGenerator.cxx.o
1096:info:build [ 75%] Building CXX object Source/CMakeFiles/CTestLib.dir/CTest/cmCTestCoverageCommand.cxx.o
1097:info:build [ 75%] Building CXX object Source/CMakeFiles/CPackLib.dir/CPack/cmCPackRPMGenerator.cxx.o
1098:info:build [ 75%] Building CXX object Source/CMakeFiles/CTestLib.dir/CTest/cmCTestCoverageHandler.cxx.o
1099:info:build [ 76%] Building CXX object Source/CMakeFiles/CPackLib.dir/CPack/cmCPackBundleGenerator.cxx.o
1100:info:build [ 76%] Building CXX object Source/CMakeFiles/CPackLib.dir/CPack/cmCPackDragNDropGenerator.cxx.o
1101:info:build [ 76%] Building CXX object Source/CMakeFiles/CPackLib.dir/CPack/cmCPackOSXX11Generator.cxx.o
1102:info:build [ 76%] Building CXX object Source/CMakeFiles/CTestLib.dir/CTest/cmParseMumpsCoverage.cxx.o
1103:info:build [ 77%] Building CXX object Source/CMakeFiles/CPackLib.dir/CPack/cmCPackPackageMakerGenerator.cxx.o
1104:info:build [ 78%] Building CXX object Source/CMakeFiles/CTestLib.dir/CTest/cmParseCacheCoverage.cxx.o
1105:info:build [ 78%] Building CXX object Source/CMakeFiles/CTestLib.dir/CTest/cmParseGTMCoverage.cxx.o
1106:info:build Linking CXX static library libCPackLib.a
1107:info:build make[2]: Leaving directory `/opt/local/var/macports/build/_opt_local_var_macports_sources_rsync.macports.org_release_tarballs_ports_devel_cmake/cmake/work/cmake-3.0.2'
1108:info:build [ 78%] Built target CPackLib
1109:info:build make[2]: Entering directory `/opt/local/var/macports/build/_opt_local_var_macports_sources_rsync.macports.org_release_tarballs_ports_devel_cmake/cmake/work/cmake-3.0.2'
1110:info:build Scanning dependencies of target ccmake
1111:info:build make[2]: Leaving directory `/opt/local/var/macports/build/_opt_local_var_macports_sources_rsync.macports.org_release_tarballs_ports_devel_cmake/cmake/work/cmake-3.0.2'
1112:info:build make[2]: Entering directory `/opt/local/var/macports/build/_opt_local_var_macports_sources_rsync.macports.org_release_tarballs_ports_devel_cmake/cmake/work/cmake-3.0.2'
1113:info:build [ 79%] Building CXX object Source/CMakeFiles/ccmake.dir/CursesDialog/cmCursesOptionsWidget.cxx.o
1114:info:build [ 80%] Building CXX object Source/CMakeFiles/CTestLib.dir/CTest/cmParsePHPCoverage.cxx.o
1115:info:build [ 80%] Building CXX object Source/CMakeFiles/ccmake.dir/CursesDialog/cmCursesBoolWidget.cxx.o
1116:info:build [ 80%] Building CXX object Source/CMakeFiles/CTestLib.dir/CTest/cmParsePythonCoverage.cxx.o
1117:info:build [ 80%] Building CXX object Source/CMakeFiles/ccmake.dir/CursesDialog/cmCursesCacheEntryComposite.cxx.o
1118:info:build [ 81%] Building CXX object Source/CMakeFiles/ccmake.dir/CursesDialog/cmCursesDummyWidget.cxx.o
1119:info:build [ 81%] Building CXX object Source/CMakeFiles/CTestLib.dir/CTest/cmCTestEmptyBinaryDirectoryCommand.cxx.o
1120:info:build [ 81%] Building CXX object Source/CMakeFiles/ccmake.dir/CursesDialog/cmCursesFilePathWidget.cxx.o
1121:info:build [ 81%] Building CXX object Source/CMakeFiles/ccmake.dir/CursesDialog/cmCursesForm.cxx.o
1122:info:build [ 82%] Building CXX object Source/CMakeFiles/CTestLib.dir/CTest/cmCTestGenericHandler.cxx.o
1123:info:build [ 83%] Building CXX object Source/CMakeFiles/ccmake.dir/CursesDialog/cmCursesLabelWidget.cxx.o
1124:info:build [ 83%] Building CXX object Source/CMakeFiles/ccmake.dir/CursesDialog/cmCursesLongMessageForm.cxx.o
1125:info:build [ 83%] Building CXX object Source/CMakeFiles/CTestLib.dir/CTest/cmCTestHandlerCommand.cxx.o
1126:info:build [ 83%] Building CXX object Source/CMakeFiles/ccmake.dir/CursesDialog/cmCursesMainForm.cxx.o
1127:info:build [ 83%] Building CXX object Source/CMakeFiles/CTestLib.dir/CTest/cmCTestLaunch.cxx.o
1128:info:build [ 84%] Building CXX object Source/CMakeFiles/ccmake.dir/CursesDialog/cmCursesPathWidget.cxx.o
1129:info:build [ 84%] Building CXX object Source/CMakeFiles/ccmake.dir/CursesDialog/cmCursesStringWidget.cxx.o
1130:info:build [ 84%] Building CXX object Source/CMakeFiles/ccmake.dir/CursesDialog/cmCursesWidget.cxx.o
1131:info:build [ 85%] Building CXX object Source/CMakeFiles/CTestLib.dir/CTest/cmCTestMemCheckCommand.cxx.o
1132:info:build [ 86%] Building CXX object Source/CMakeFiles/ccmake.dir/CursesDialog/ccmake.cxx.o
1133:info:build [ 86%] Building CXX object Source/CMakeFiles/CTestLib.dir/CTest/cmCTestMemCheckHandler.cxx.o
1134:info:build Linking CXX executable ../bin/ccmake
1135:info:build ld: warning: ignoring file /Library/Frameworks/libcurl.framework/libcurl, file was built for i386 which is not the architecture being linked (x86_64): /Library/Frameworks/libcurl.framework/libcurl
1136:info:build Undefined symbols for architecture x86_64:
1137:info:build   "_curl_easy_cleanup", referenced from:
1138:info:build       cmFileCommand::HandleDownloadCommand(std::__1::vector<std::__1::basic_string<char, std::__1::char_traits<char>, std::__1::allocator<char> >, std::__1::allocator<std::__1::basic_string<char, std::__1::char_traits<char>, std::__1::allocator<char> > > > const&) in libCMakeLib.a(cmBootstrapCommands1.cxx.o)
1139:info:build       cmFileCommand::HandleUploadCommand(std::__1::vector<std::__1::basic_string<char, std::__1::char_traits<char>, std::__1::allocator<char> >, std::__1::allocator<std::__1::basic_string<char, std::__1::char_traits<char>, std::__1::allocator<char> > > > const&) in libCMakeLib.a(cmBootstrapCommands1.cxx.o)
1140:info:build   "_curl_easy_init", referenced from:
1141:info:build       cmFileCommand::HandleDownloadCommand(std::__1::vector<std::__1::basic_string<char, std::__1::char_traits<char>, std::__1::allocator<char> >, std::__1::allocator<std::__1::basic_string<char, std::__1::char_traits<char>, std::__1::allocator<char> > > > const&) in libCMakeLib.a(cmBootstrapCommands1.cxx.o)
1142:info:build       cmFileCommand::HandleUploadCommand(std::__1::vector<std::__1::basic_string<char, std::__1::char_traits<char>, std::__1::allocator<char> >, std::__1::allocator<std::__1::basic_string<char, std::__1::char_traits<char>, std::__1::allocator<char> > > > const&) in libCMakeLib.a(cmBootstrapCommands1.cxx.o)
1143:info:build   "_curl_easy_perform", referenced from:
1144:info:build       cmFileCommand::HandleDownloadCommand(std::__1::vector<std::__1::basic_string<char, std::__1::char_traits<char>, std::__1::allocator<char> >, std::__1::allocator<std::__1::basic_string<char, std::__1::char_traits<char>, std::__1::allocator<char> > > > const&) in libCMakeLib.a(cmBootstrapCommands1.cxx.o)
1145:info:build       cmFileCommand::HandleUploadCommand(std::__1::vector<std::__1::basic_string<char, std::__1::char_traits<char>, std::__1::allocator<char> >, std::__1::allocator<std::__1::basic_string<char, std::__1::char_traits<char>, std::__1::allocator<char> > > > const&) in libCMakeLib.a(cmBootstrapCommands1.cxx.o)
1146:info:build   "_curl_easy_setopt", referenced from:
1147:info:build       cmFileCommand::HandleDownloadCommand(std::__1::vector<std::__1::basic_string<char, std::__1::char_traits<char>, std::__1::allocator<char> >, std::__1::allocator<std::__1::basic_string<char, std::__1::char_traits<char>, std::__1::allocator<char> > > > const&) in libCMakeLib.a(cmBootstrapCommands1.cxx.o)
1148:info:build       cmFileCommand::HandleUploadCommand(std::__1::vector<std::__1::basic_string<char, std::__1::char_traits<char>, std::__1::allocator<char> >, std::__1::allocator<std::__1::basic_string<char, std::__1::char_traits<char>, std::__1::allocator<char> > > > const&) in libCMakeLib.a(cmBootstrapCommands1.cxx.o)
1149:info:build   "_curl_easy_strerror", referenced from:
1150:info:build       cmFileCommand::HandleDownloadCommand(std::__1::vector<std::__1::basic_string<char, std::__1::char_traits<char>, std::__1::allocator<char> >, std::__1::allocator<std::__1::basic_string<char, std::__1::char_traits<char>, std::__1::allocator<char> > > > const&) in libCMakeLib.a(cmBootstrapCommands1.cxx.o)
1151:info:build       cmFileCommand::HandleUploadCommand(std::__1::vector<std::__1::basic_string<char, std::__1::char_traits<char>, std::__1::allocator<char> >, std::__1::allocator<std::__1::basic_string<char, std::__1::char_traits<char>, std::__1::allocator<char> > > > const&) in libCMakeLib.a(cmBootstrapCommands1.cxx.o)
1152:info:build   "_curl_global_cleanup", referenced from:
1153:info:build       cmFileCommand::HandleDownloadCommand(std::__1::vector<std::__1::basic_string<char, std::__1::char_traits<char>, std::__1::allocator<char> >, std::__1::allocator<std::__1::basic_string<char, std::__1::char_traits<char>, std::__1::allocator<char> > > > const&) in libCMakeLib.a(cmBootstrapCommands1.cxx.o)
1154:info:build       cmFileCommand::HandleUploadCommand(std::__1::vector<std::__1::basic_string<char, std::__1::char_traits<char>, std::__1::allocator<char> >, std::__1::allocator<std::__1::basic_string<char, std::__1::char_traits<char>, std::__1::allocator<char> > > > const&) in libCMakeLib.a(cmBootstrapCommands1.cxx.o)
1155:info:build   "_curl_global_init", referenced from:
1156:info:build       cmFileCommand::HandleDownloadCommand(std::__1::vector<std::__1::basic_string<char, std::__1::char_traits<char>, std::__1::allocator<char> >, std::__1::allocator<std::__1::basic_string<char, std::__1::char_traits<char>, std::__1::allocator<char> > > > const&) in libCMakeLib.a(cmBootstrapCommands1.cxx.o)
1157:info:build       cmFileCommand::HandleUploadCommand(std::__1::vector<std::__1::basic_string<char, std::__1::char_traits<char>, std::__1::allocator<char> >, std::__1::allocator<std::__1::basic_string<char, std::__1::char_traits<char>, std::__1::allocator<char> > > > const&) in libCMakeLib.a(cmBootstrapCommands1.cxx.o)
1158:info:build ld: symbol(s) not found for architecture x86_64
1159:info:build clang: error: linker command failed with exit code 1 (use -v to see invocation)
1160:info:build make[2]: *** [bin/ccmake] Error 1
1161:info:build make[2]: Leaving directory `/opt/local/var/macports/build/_opt_local_var_macports_sources_rsync.macports.org_release_tarballs_ports_devel_cmake/cmake/work/cmake-3.0.2'
1162:info:build make[1]: *** [Source/CMakeFiles/ccmake.dir/all] Error 2
1163:info:build make[1]: *** Waiting for unfinished jobs....
1164:info:build [ 86%] Building CXX object Source/CMakeFiles/CTestLib.dir/CTest/cmCTestMultiProcessHandler.cxx.o
1165:info:build [ 87%] Building CXX object Source/CMakeFiles/CTestLib.dir/CTest/cmCTestReadCustomFilesCommand.cxx.o
1166:info:build [ 87%] Building CXX object Source/CMakeFiles/CTestLib.dir/CTest/cmCTestRunScriptCommand.cxx.o
1167:info:build [ 87%] Building CXX object Source/CMakeFiles/CTestLib.dir/CTest/cmCTestRunTest.cxx.o
1168:info:build [ 88%] Building CXX object Source/CMakeFiles/CTestLib.dir/CTest/cmCTestScriptHandler.cxx.o
1169:info:build [ 88%] Building CXX object Source/CMakeFiles/CTestLib.dir/CTest/cmCTestSleepCommand.cxx.o
1170:info:build [ 88%] Building CXX object Source/CMakeFiles/CTestLib.dir/CTest/cmCTestStartCommand.cxx.o
1171:info:build [ 89%] Building CXX object Source/CMakeFiles/CTestLib.dir/CTest/cmCTestSubmitCommand.cxx.o
1172:info:build [ 89%] Building CXX object Source/CMakeFiles/CTestLib.dir/CTest/cmCTestSubmitHandler.cxx.o
1173:info:build [ 89%] Building CXX object Source/CMakeFiles/CTestLib.dir/CTest/cmCTestTestCommand.cxx.o
1174:info:build [ 90%] Building CXX object Source/CMakeFiles/CTestLib.dir/CTest/cmCTestTestHandler.cxx.o
1175:info:build [ 90%] Building CXX object Source/CMakeFiles/CTestLib.dir/CTest/cmCTestUpdateCommand.cxx.o
1176:info:build [ 90%] Building CXX object Source/CMakeFiles/CTestLib.dir/CTest/cmCTestUpdateHandler.cxx.o
1177:info:build [ 91%] Building CXX object Source/CMakeFiles/CTestLib.dir/CTest/cmCTestUploadCommand.cxx.o
1178:info:build [ 91%] Building CXX object Source/CMakeFiles/CTestLib.dir/CTest/cmCTestUploadHandler.cxx.o
1179:info:build [ 91%] Building CXX object Source/CMakeFiles/CTestLib.dir/CTest/cmCTestVC.cxx.o
1180:info:build [ 92%] Building CXX object Source/CMakeFiles/CTestLib.dir/CTest/cmCTestGlobalVC.cxx.o
1181:info:build [ 92%] Building CXX object Source/CMakeFiles/CTestLib.dir/CTest/cmCTestCVS.cxx.o
1182:info:build [ 92%] Building CXX object Source/CMakeFiles/CTestLib.dir/CTest/cmCTestSVN.cxx.o
1183:info:build [ 93%] Building CXX object Source/CMakeFiles/CTestLib.dir/CTest/cmCTestBZR.cxx.o
1184:info:build [ 93%] Building CXX object Source/CMakeFiles/CTestLib.dir/CTest/cmCTestGIT.cxx.o
1185:info:build [ 94%] Building CXX object Source/CMakeFiles/CTestLib.dir/CTest/cmCTestHG.cxx.o
1186:info:build [ 94%] Building CXX object Source/CMakeFiles/CTestLib.dir/CTest/cmCTestP4.cxx.o
1187:info:build Linking CXX static library libCTestLib.a
1188:info:build make[2]: Leaving directory `/opt/local/var/macports/build/_opt_local_var_macports_sources_rsync.macports.org_release_tarballs_ports_devel_cmake/cmake/work/cmake-3.0.2'
1189:info:build [ 94%] Built target CTestLib
1190:info:build make[1]: Leaving directory `/opt/local/var/macports/build/_opt_local_var_macports_sources_rsync.macports.org_release_tarballs_ports_devel_cmake/cmake/work/cmake-3.0.2'
1191:info:build make: *** [all] Error 2
1192:info:build make: Leaving directory `/opt/local/var/macports/build/_opt_local_var_macports_sources_rsync.macports.org_release_tarballs_ports_devel_cmake/cmake/work/cmake-3.0.2'
1193:info:build Command failed:  cd "/opt/local/var/macports/build/_opt_local_var_macports_sources_rsync.macports.org_release_tarballs_ports_devel_cmake/cmake/work/cmake-3.0.2" && /usr/bin/make -j2 -w all
1194:info:build Exit code: 2
1195:error:build org.macports.build for port cmake returned: command execution failed
1196:debug:build Error code: CHILDSTATUS 63082 2
1197:debug:build Backtrace: command execution failed
1198    while executing
1199"system -nice 0 $fullcmdstring"
1200    ("eval" body line 1)
1201    invoked from within
1202"eval system $notty $nice \$fullcmdstring"
1203    invoked from within
1204"command_exec build"
1205    (procedure "portbuild::build_main" line 8)
1206    invoked from within
1207"portbuild::build_main org.macports.build"
1208    ("eval" body line 1)
1209    invoked from within
1210"eval $procedure $targetname"
1211:info:build Warning: targets not executed for cmake: org.macports.activate org.macports.build org.macports.destroot org.macports.install
1212:notice:build Please see the log file for port cmake for details:
1213    /opt/local/var/macports/logs/_opt_local_var_macports_sources_rsync.macports.org_release_tarballs_ports_devel_cmake/cmake/main.log