Ticket #45487: main.log

File main.log, 129.3 KB (added by kristian.peters@…, 6 years ago)

main.log

Line 
1version:1
2:debug:main epoch: in tree: 0 installed: 0
3:debug:main xorg-libXaw 1.0.12_0 exists in the ports tree
4:debug:main xorg-libXaw 1.0.12_0  is the latest installed
5:debug:main xorg-libXaw 1.0.12_0  is active
6:debug:main Merging existing variants '' into variants
7:debug:main new fully merged portvariants:
8:debug:main Changing to port directory: /opt/var/macports/sources/rsync.macports.org/release/tarballs/ports/x11/xorg-libXaw
9:debug:main OS darwin/14.0.0 (Mac OS X 10.10) arch i386
10:debug:main adding the default universal variant
11:debug:main Reading variant descriptions from /opt/var/macports/sources/rsync.macports.org/release/tarballs/ports/_resources/port1.0/variant_descriptions.conf
12:debug:main Running callback portconfigure::add_automatic_compiler_dependencies
13:debug:main Finished running callback portconfigure::add_automatic_compiler_dependencies
14:debug:main Running callback portbuild::add_automatic_buildsystem_dependencies
15:debug:main Finished running callback portbuild::add_automatic_buildsystem_dependencies
16:debug:main No need to upgrade! xorg-libXaw 1.0.12_0 >= xorg-libXaw 1.0.12_0
17:debug:main epoch: in tree: 0 installed: 0
18:debug:main xorg-libsm 1.2.1_0 exists in the ports tree
19:debug:main xorg-libsm 1.2.1_0  is the latest installed
20:debug:main xorg-libsm 1.2.1_0  is active
21:debug:main Merging existing variants '' into variants
22:debug:main new fully merged portvariants:
23:debug:main Changing to port directory: /opt/var/macports/sources/rsync.macports.org/release/tarballs/ports/x11/xorg-libsm
24:debug:main OS darwin/14.0.0 (Mac OS X 10.10) arch i386
25:debug:main adding the default universal variant
26:debug:main Reading variant descriptions from /opt/var/macports/sources/rsync.macports.org/release/tarballs/ports/_resources/port1.0/variant_descriptions.conf
27:debug:main Running callback portconfigure::add_automatic_compiler_dependencies
28:debug:main Finished running callback portconfigure::add_automatic_compiler_dependencies
29:debug:main Running callback portbuild::add_automatic_buildsystem_dependencies
30:debug:main Finished running callback portbuild::add_automatic_buildsystem_dependencies
31:debug:main No need to upgrade! xorg-libsm 1.2.1_0 >= xorg-libsm 1.2.1_0
32:debug:main epoch: in tree: 0 installed: 0
33:debug:main xorg-libice 1.0.8_0 exists in the ports tree
34:debug:main xorg-libice 1.0.8_0  is the latest installed
35:debug:main xorg-libice 1.0.8_0  is active
36:debug:main Merging existing variants '' into variants
37:debug:main new fully merged portvariants:
38:debug:main Changing to port directory: /opt/var/macports/sources/rsync.macports.org/release/tarballs/ports/x11/xorg-libice
39:debug:main OS darwin/14.0.0 (Mac OS X 10.10) arch i386
40:debug:main adding the default universal variant
41:debug:main Reading variant descriptions from /opt/var/macports/sources/rsync.macports.org/release/tarballs/ports/_resources/port1.0/variant_descriptions.conf
42:debug:main Running callback portconfigure::add_automatic_compiler_dependencies
43:debug:main Finished running callback portconfigure::add_automatic_compiler_dependencies
44:debug:main Running callback portbuild::add_automatic_buildsystem_dependencies
45:debug:main Finished running callback portbuild::add_automatic_buildsystem_dependencies
46:debug:main No need to upgrade! xorg-libice 1.0.8_0 >= xorg-libice 1.0.8_0
47:debug:main epoch: in tree: 0 installed: 0
48:debug:main xorg-xproto 7.0.26_0 exists in the ports tree
49:debug:main xorg-xproto 7.0.26_0  is the latest installed
50:debug:main xorg-xproto 7.0.26_0  is active
51:debug:main Merging existing variants '' into variants
52:debug:main new fully merged portvariants:
53:debug:main Changing to port directory: /opt/var/macports/sources/rsync.macports.org/release/tarballs/ports/x11/xorg-xproto
54:debug:main OS darwin/14.0.0 (Mac OS X 10.10) arch i386
55:debug:main only one arch supported, so not adding the default universal variant
56:debug:main Running callback portconfigure::add_automatic_compiler_dependencies
57:debug:main Finished running callback portconfigure::add_automatic_compiler_dependencies
58:debug:main Running callback portbuild::add_automatic_buildsystem_dependencies
59:debug:main Finished running callback portbuild::add_automatic_buildsystem_dependencies
60:debug:main No need to upgrade! xorg-xproto 7.0.26_0 >= xorg-xproto 7.0.26_0
61:debug:main epoch: in tree: 0 installed: 0
62:debug:main xorg-libXext 1.3.3_0 exists in the ports tree
63:debug:main xorg-libXext 1.3.3_0  is the latest installed
64:debug:main xorg-libXext 1.3.3_0  is active
65:debug:main Merging existing variants '' into variants
66:debug:main new fully merged portvariants:
67:debug:main Changing to port directory: /opt/var/macports/sources/rsync.macports.org/release/tarballs/ports/x11/xorg-libXext
68:debug:main OS darwin/14.0.0 (Mac OS X 10.10) arch i386
69:debug:main adding the default universal variant
70:debug:main Reading variant descriptions from /opt/var/macports/sources/rsync.macports.org/release/tarballs/ports/_resources/port1.0/variant_descriptions.conf
71:debug:main Running callback portconfigure::add_automatic_compiler_dependencies
72:debug:main Finished running callback portconfigure::add_automatic_compiler_dependencies
73:debug:main Running callback portbuild::add_automatic_buildsystem_dependencies
74:debug:main Finished running callback portbuild::add_automatic_buildsystem_dependencies
75:debug:main No need to upgrade! xorg-libXext 1.3.3_0 >= xorg-libXext 1.3.3_0
76:debug:main epoch: in tree: 0 installed: 0
77:debug:main xorg-libX11 1.6.2_0 exists in the ports tree
78:debug:main xorg-libX11 1.6.2_0  is the latest installed
79:debug:main xorg-libX11 1.6.2_0  is active
80:debug:main Merging existing variants '' into variants
81:debug:main new fully merged portvariants:
82:debug:main Changing to port directory: /opt/var/macports/sources/rsync.macports.org/release/tarballs/ports/x11/xorg-libX11
83:debug:main OS darwin/14.0.0 (Mac OS X 10.10) arch i386
84:debug:main adding the default universal variant
85:debug:main Reading variant descriptions from /opt/var/macports/sources/rsync.macports.org/release/tarballs/ports/_resources/port1.0/variant_descriptions.conf
86:debug:main Running callback portconfigure::add_automatic_compiler_dependencies
87:debug:main Finished running callback portconfigure::add_automatic_compiler_dependencies
88:debug:main Running callback portbuild::add_automatic_buildsystem_dependencies
89:debug:main Finished running callback portbuild::add_automatic_buildsystem_dependencies
90:debug:main No need to upgrade! xorg-libX11 1.6.2_0 >= xorg-libX11 1.6.2_0
91:debug:main epoch: in tree: 0 installed: 0
92:debug:main xorg-libXdmcp 1.1.1_0 exists in the ports tree
93:debug:main xorg-libXdmcp 1.1.1_0  is the latest installed
94:debug:main xorg-libXdmcp 1.1.1_0  is active
95:debug:main Merging existing variants '' into variants
96:debug:main new fully merged portvariants:
97:debug:main Changing to port directory: /opt/var/macports/sources/rsync.macports.org/release/tarballs/ports/x11/xorg-libXdmcp
98:debug:main OS darwin/14.0.0 (Mac OS X 10.10) arch i386
99:debug:main adding the default universal variant
100:debug:main Reading variant descriptions from /opt/var/macports/sources/rsync.macports.org/release/tarballs/ports/_resources/port1.0/variant_descriptions.conf
101:debug:main Running callback portconfigure::add_automatic_compiler_dependencies
102:debug:main Finished running callback portconfigure::add_automatic_compiler_dependencies
103:debug:main Running callback portbuild::add_automatic_buildsystem_dependencies
104:debug:main Finished running callback portbuild::add_automatic_buildsystem_dependencies
105:debug:main No need to upgrade! xorg-libXdmcp 1.1.1_0 >= xorg-libXdmcp 1.1.1_0
106:debug:main epoch: in tree: 0 installed: 0
107:debug:main xorg-libXau 1.0.8_0 exists in the ports tree
108:debug:main xorg-libXau 1.0.8_0  is the latest installed
109:debug:main xorg-libXau 1.0.8_0  is active
110:debug:main Merging existing variants '' into variants
111:debug:main new fully merged portvariants:
112:debug:main Changing to port directory: /opt/var/macports/sources/rsync.macports.org/release/tarballs/ports/x11/xorg-libXau
113:debug:main OS darwin/14.0.0 (Mac OS X 10.10) arch i386
114:debug:main adding the default universal variant
115:debug:main Reading variant descriptions from /opt/var/macports/sources/rsync.macports.org/release/tarballs/ports/_resources/port1.0/variant_descriptions.conf
116:debug:main Running callback portconfigure::add_automatic_compiler_dependencies
117:debug:main Finished running callback portconfigure::add_automatic_compiler_dependencies
118:debug:main Running callback portbuild::add_automatic_buildsystem_dependencies
119:debug:main Finished running callback portbuild::add_automatic_buildsystem_dependencies
120:debug:main No need to upgrade! xorg-libXau 1.0.8_0 >= xorg-libXau 1.0.8_0
121:debug:main epoch: in tree: 0 installed: 0
122:debug:main xorg-libxcb 1.11_0 exists in the ports tree
123:debug:main xorg-libxcb 1.11_0 +python27 is the latest installed
124:debug:main xorg-libxcb 1.11_0 +python27 is active
125:debug:main Merging existing variants '+python27' into variants
126:debug:main new fully merged portvariants: python27 +
127:debug:main Changing to port directory: /opt/var/macports/sources/rsync.macports.org/release/tarballs/ports/x11/xorg-libxcb
128:debug:main OS darwin/14.0.0 (Mac OS X 10.10) arch i386
129:debug:main adding the default universal variant
130:debug:main Reading variant descriptions from /opt/var/macports/sources/rsync.macports.org/release/tarballs/ports/_resources/port1.0/variant_descriptions.conf
131:debug:main Executing variant python27 provides python27
132:debug:main Running callback portconfigure::add_automatic_compiler_dependencies
133:debug:main Finished running callback portconfigure::add_automatic_compiler_dependencies
134:debug:main Running callback portbuild::add_automatic_buildsystem_dependencies
135:debug:main Finished running callback portbuild::add_automatic_buildsystem_dependencies
136:debug:main No need to upgrade! xorg-libxcb 1.11_0 >= xorg-libxcb 1.11_0
137:debug:main epoch: in tree: 0 installed: 0
138:debug:main xorg-xcb-proto 1.11_0 exists in the ports tree
139:debug:main xorg-xcb-proto 1.11_0 +python27 is the latest installed
140:debug:main xorg-xcb-proto 1.11_0 +python27 is active
141:debug:main Merging existing variants '+python27' into variants
142:debug:main new fully merged portvariants: python27 +
143:debug:main Changing to port directory: /opt/var/macports/sources/rsync.macports.org/release/tarballs/ports/x11/xorg-xcb-proto
144:debug:main OS darwin/14.0.0 (Mac OS X 10.10) arch i386
145:debug:main only one arch supported, so not adding the default universal variant
146:debug:main Executing variant python27 provides python27
147:debug:main Running callback portconfigure::add_automatic_compiler_dependencies
148:debug:main Finished running callback portconfigure::add_automatic_compiler_dependencies
149:debug:main Running callback portbuild::add_automatic_buildsystem_dependencies
150:debug:main Finished running callback portbuild::add_automatic_buildsystem_dependencies
151:debug:main No need to upgrade! xorg-xcb-proto 1.11_0 >= xorg-xcb-proto 1.11_0
152:debug:main epoch: in tree: 2 installed: 2
153:debug:main python27 2.7.8_3 exists in the ports tree
154:debug:main python27 2.7.8_3  is the latest installed
155:debug:main python27 2.7.8_3  is active
156:debug:main Merging existing variants '' into variants
157:debug:main new fully merged portvariants:
158:debug:main Changing to port directory: /opt/var/macports/sources/rsync.macports.org/release/tarballs/ports/lang/python27
159:debug:main OS darwin/14.0.0 (Mac OS X 10.10) arch i386
160:debug:main Sourcing PortGroup select 1.0 from /opt/var/macports/sources/rsync.macports.org/release/tarballs/ports/_resources/port1.0/group/select-1.0.tcl
161:debug:main Reading variant descriptions from /opt/var/macports/sources/rsync.macports.org/release/tarballs/ports/_resources/port1.0/variant_descriptions.conf
162:debug:main universal variant already exists, so not adding the default one
163:debug:main Running callback portconfigure::add_automatic_compiler_dependencies
164:debug:main Finished running callback portconfigure::add_automatic_compiler_dependencies
165:debug:main Running callback portbuild::add_automatic_buildsystem_dependencies
166:debug:main Finished running callback portbuild::add_automatic_buildsystem_dependencies
167:debug:main No need to upgrade! python27 2.7.8_3 >= python27 2.7.8_3
168:debug:main epoch: in tree: 2 installed: 2
169:debug:main gettext 0.19.3_0 exists in the ports tree
170:debug:main gettext 0.19.3_0  is the latest installed
171:debug:main gettext 0.19.3_0  is active
172:debug:main Merging existing variants '' into variants
173:debug:main new fully merged portvariants:
174:debug:main Changing to port directory: /opt/var/macports/sources/rsync.macports.org/release/tarballs/ports/devel/gettext
175:debug:main OS darwin/14.0.0 (Mac OS X 10.10) arch i386
176:debug:main Sourcing PortGroup compiler_blacklist_versions 1.0 from /opt/var/macports/sources/rsync.macports.org/release/tarballs/ports/_resources/port1.0/group/compiler_blacklist_versions-1.0.tcl
177:debug:main Reading variant descriptions from /opt/var/macports/sources/rsync.macports.org/release/tarballs/ports/_resources/port1.0/variant_descriptions.conf
178:debug:main Sourcing PortGroup muniversal 1.0 from /opt/var/macports/sources/rsync.macports.org/release/tarballs/ports/_resources/port1.0/group/muniversal-1.0.tcl
179:debug:main compiler clang 600.0.54 not blacklisted because it doesn't match {clang < 211.10.1}
180:debug:main universal variant already exists, so not adding the default one
181:debug:main Running callback portconfigure::add_automatic_compiler_dependencies
182:debug:main Finished running callback portconfigure::add_automatic_compiler_dependencies
183:debug:main Running callback portbuild::add_automatic_buildsystem_dependencies
184:debug:main Finished running callback portbuild::add_automatic_buildsystem_dependencies
185:debug:main No need to upgrade! gettext 0.19.3_0 >= gettext 0.19.3_0
186:debug:main epoch: in tree: 0 installed: 0
187:debug:main expat 2.1.0_0 exists in the ports tree
188:debug:main expat 2.1.0_0  is the latest installed
189:debug:main expat 2.1.0_0  is active
190:debug:main Merging existing variants '' into variants
191:debug:main new fully merged portvariants:
192:debug:main Changing to port directory: /opt/var/macports/sources/rsync.macports.org/release/tarballs/ports/textproc/expat
193:debug:main OS darwin/14.0.0 (Mac OS X 10.10) arch i386
194:debug:main adding the default universal variant
195:debug:main Reading variant descriptions from /opt/var/macports/sources/rsync.macports.org/release/tarballs/ports/_resources/port1.0/variant_descriptions.conf
196:debug:main Running callback portconfigure::add_automatic_compiler_dependencies
197:debug:main Finished running callback portconfigure::add_automatic_compiler_dependencies
198:debug:main Running callback portbuild::add_automatic_buildsystem_dependencies
199:debug:main Finished running callback portbuild::add_automatic_buildsystem_dependencies
200:debug:main No need to upgrade! expat 2.1.0_0 >= expat 2.1.0_0
201:debug:main epoch: in tree: 0 installed: 0
202:debug:main libiconv 1.14_0 exists in the ports tree
203:debug:main libiconv 1.14_0  is the latest installed
204:debug:main libiconv 1.14_0  is active
205:debug:main Merging existing variants '' into variants
206:debug:main new fully merged portvariants:
207:debug:main Changing to port directory: /opt/var/macports/sources/rsync.macports.org/release/tarballs/ports/textproc/libiconv
208:debug:main OS darwin/14.0.0 (Mac OS X 10.10) arch i386
209:debug:main Reading variant descriptions from /opt/var/macports/sources/rsync.macports.org/release/tarballs/ports/_resources/port1.0/variant_descriptions.conf
210:debug:main Sourcing PortGroup muniversal 1.0 from /opt/var/macports/sources/rsync.macports.org/release/tarballs/ports/_resources/port1.0/group/muniversal-1.0.tcl
211:debug:main universal variant already exists, so not adding the default one
212:debug:main Running callback portconfigure::add_automatic_compiler_dependencies
213:debug:main Finished running callback portconfigure::add_automatic_compiler_dependencies
214:debug:main Running callback portbuild::add_automatic_buildsystem_dependencies
215:debug:main Finished running callback portbuild::add_automatic_buildsystem_dependencies
216:debug:main No need to upgrade! libiconv 1.14_0 >= libiconv 1.14_0
217:debug:main epoch: in tree: 0 installed: 0
218:debug:main ncurses 5.9_2 exists in the ports tree
219:debug:main ncurses 5.9_2  is the latest installed
220:debug:main ncurses 5.9_2  is active
221:debug:main Merging existing variants '' into variants
222:debug:main new fully merged portvariants:
223:debug:main Changing to port directory: /opt/var/macports/sources/rsync.macports.org/release/tarballs/ports/devel/ncurses
224:debug:main OS darwin/14.0.0 (Mac OS X 10.10) arch i386
225:debug:main adding the default universal variant
226:debug:main Reading variant descriptions from /opt/var/macports/sources/rsync.macports.org/release/tarballs/ports/_resources/port1.0/variant_descriptions.conf
227:debug:main Running callback portconfigure::add_automatic_compiler_dependencies
228:debug:main Finished running callback portconfigure::add_automatic_compiler_dependencies
229:debug:main Running callback portbuild::add_automatic_buildsystem_dependencies
230:debug:main Finished running callback portbuild::add_automatic_buildsystem_dependencies
231:debug:main No need to upgrade! ncurses 5.9_2 >= ncurses 5.9_2
232:debug:main epoch: in tree: 0 installed: 0
233:debug:main zlib 1.2.8_0 exists in the ports tree
234:debug:main zlib 1.2.8_0  is the latest installed
235:debug:main zlib 1.2.8_0  is active
236:debug:main Merging existing variants '' into variants
237:debug:main new fully merged portvariants:
238:debug:main Changing to port directory: /opt/var/macports/sources/rsync.macports.org/release/tarballs/ports/archivers/zlib
239:debug:main OS darwin/14.0.0 (Mac OS X 10.10) arch i386
240:debug:main Sourcing PortGroup xcodeversion 1.0 from /opt/var/macports/sources/rsync.macports.org/release/tarballs/ports/_resources/port1.0/group/xcodeversion-1.0.tcl
241:debug:main adding the default universal variant
242:debug:main Reading variant descriptions from /opt/var/macports/sources/rsync.macports.org/release/tarballs/ports/_resources/port1.0/variant_descriptions.conf
243:debug:main Running callback portconfigure::add_automatic_compiler_dependencies
244:debug:main Finished running callback portconfigure::add_automatic_compiler_dependencies
245:debug:main Running callback portbuild::add_automatic_buildsystem_dependencies
246:debug:main Finished running callback portbuild::add_automatic_buildsystem_dependencies
247:debug:main No need to upgrade! zlib 1.2.8_0 >= zlib 1.2.8_0
248:debug:main epoch: in tree: 1 installed: 1
249:debug:main openssl 1.0.1j_0 exists in the ports tree
250:debug:main openssl 1.0.1j_0  is the latest installed
251:debug:main openssl 1.0.1j_0  is active
252:debug:main Merging existing variants '' into variants
253:debug:main new fully merged portvariants:
254:debug:main Changing to port directory: /opt/var/macports/sources/rsync.macports.org/release/tarballs/ports/devel/openssl
255:debug:main OS darwin/14.0.0 (Mac OS X 10.10) arch i386
256:debug:main Reading variant descriptions from /opt/var/macports/sources/rsync.macports.org/release/tarballs/ports/_resources/port1.0/variant_descriptions.conf
257:debug:main Sourcing PortGroup muniversal 1.0 from /opt/var/macports/sources/rsync.macports.org/release/tarballs/ports/_resources/port1.0/group/muniversal-1.0.tcl
258:debug:main universal variant already exists, so not adding the default one
259:debug:main Running callback portconfigure::add_automatic_compiler_dependencies
260:debug:main Finished running callback portconfigure::add_automatic_compiler_dependencies
261:debug:main Running callback portbuild::add_automatic_buildsystem_dependencies
262:debug:main Finished running callback portbuild::add_automatic_buildsystem_dependencies
263:debug:main No need to upgrade! openssl 1.0.1j_0 >= openssl 1.0.1j_0
264:debug:main epoch: in tree: 0 installed: 0
265:debug:main sqlite3 3.8.7_0 exists in the ports tree
266:debug:main sqlite3 3.8.7_0  is the latest installed
267:debug:main sqlite3 3.8.7_0  is active
268:debug:main Merging existing variants '' into variants
269:debug:main new fully merged portvariants:
270:debug:main Changing to port directory: /opt/var/macports/sources/rsync.macports.org/release/tarballs/ports/databases/sqlite3
271:debug:main OS darwin/14.0.0 (Mac OS X 10.10) arch i386
272:debug:main adding the default universal variant
273:debug:main Reading variant descriptions from /opt/var/macports/sources/rsync.macports.org/release/tarballs/ports/_resources/port1.0/variant_descriptions.conf
274:debug:main Running callback portconfigure::add_automatic_compiler_dependencies
275:debug:main Finished running callback portconfigure::add_automatic_compiler_dependencies
276:debug:main Running callback portbuild::add_automatic_buildsystem_dependencies
277:debug:main Finished running callback portbuild::add_automatic_buildsystem_dependencies
278:debug:main No need to upgrade! sqlite3 3.8.7_0 >= sqlite3 3.8.7_0
279:debug:main epoch: in tree: 20090923 installed: 20090923
280:debug:main libedit 20121213-3.0_0 exists in the ports tree
281:debug:main libedit 20121213-3.0_0  is the latest installed
282:debug:main libedit 20121213-3.0_0  is active
283:debug:main Merging existing variants '' into variants
284:debug:main new fully merged portvariants:
285:debug:main Changing to port directory: /opt/var/macports/sources/rsync.macports.org/release/tarballs/ports/devel/libedit
286:debug:main OS darwin/14.0.0 (Mac OS X 10.10) arch i386
287:debug:main Reading variant descriptions from /opt/var/macports/sources/rsync.macports.org/release/tarballs/ports/_resources/port1.0/variant_descriptions.conf
288:debug:main Sourcing PortGroup muniversal 1.0 from /opt/var/macports/sources/rsync.macports.org/release/tarballs/ports/_resources/port1.0/group/muniversal-1.0.tcl
289:debug:main universal variant already exists, so not adding the default one
290:debug:main Running callback portconfigure::add_automatic_compiler_dependencies
291:debug:main Finished running callback portconfigure::add_automatic_compiler_dependencies
292:debug:main Running callback portbuild::add_automatic_buildsystem_dependencies
293:debug:main Finished running callback portbuild::add_automatic_buildsystem_dependencies
294:debug:main No need to upgrade! libedit 20121213-3.0_0 >= libedit 20121213-3.0_0
295:debug:main epoch: in tree: 0 installed: 0
296:debug:main db48 4.8.30_3 exists in the ports tree
297:debug:main db48 4.8.30_3  is the latest installed
298:debug:main db48 4.8.30_3  is active
299:debug:main Merging existing variants '' into variants
300:debug:main new fully merged portvariants:
301:debug:main Changing to port directory: /opt/var/macports/sources/rsync.macports.org/release/tarballs/ports/databases/db48
302:debug:main OS darwin/14.0.0 (Mac OS X 10.10) arch i386
303:debug:main Reading variant descriptions from /opt/var/macports/sources/rsync.macports.org/release/tarballs/ports/_resources/port1.0/variant_descriptions.conf
304:debug:main Sourcing PortGroup muniversal 1.0 from /opt/var/macports/sources/rsync.macports.org/release/tarballs/ports/_resources/port1.0/group/muniversal-1.0.tcl
305:debug:main Sourcing PortGroup select 1.0 from /opt/var/macports/sources/rsync.macports.org/release/tarballs/ports/_resources/port1.0/group/select-1.0.tcl
306:debug:main universal variant already exists, so not adding the default one
307:debug:main Running callback portconfigure::add_automatic_compiler_dependencies
308:debug:main Finished running callback portconfigure::add_automatic_compiler_dependencies
309:debug:main Running callback portbuild::add_automatic_buildsystem_dependencies
310:debug:main Finished running callback portbuild::add_automatic_buildsystem_dependencies
311:debug:main No need to upgrade! db48 4.8.30_3 >= db48 4.8.30_3
312:debug:main epoch: in tree: 0 installed: 0
313:debug:main db_select 0.1_2 exists in the ports tree
314:debug:main db_select 0.1_2  is the latest installed
315:debug:main db_select 0.1_2  is active
316:debug:main Merging existing variants '' into variants
317:debug:main new fully merged portvariants:
318:debug:main Changing to port directory: /opt/var/macports/sources/rsync.macports.org/release/tarballs/ports/sysutils/db_select
319:debug:main OS darwin/14.0.0 (Mac OS X 10.10) arch i386
320:debug:main Sourcing PortGroup select 1.0 from /opt/var/macports/sources/rsync.macports.org/release/tarballs/ports/_resources/port1.0/group/select-1.0.tcl
321:debug:main universal_variant is false, so not adding the default universal variant
322:debug:main Running callback portconfigure::add_automatic_compiler_dependencies
323:debug:main Finished running callback portconfigure::add_automatic_compiler_dependencies
324:debug:main Running callback portbuild::add_automatic_buildsystem_dependencies
325:debug:main Finished running callback portbuild::add_automatic_buildsystem_dependencies
326:debug:main No need to upgrade! db_select 0.1_2 >= db_select 0.1_2
327:debug:main epoch: in tree: 0 installed: 0
328:debug:main bzip2 1.0.6_0 exists in the ports tree
329:debug:main bzip2 1.0.6_0  is the latest installed
330:debug:main bzip2 1.0.6_0  is active
331:debug:main Merging existing variants '' into variants
332:debug:main new fully merged portvariants:
333:debug:main Changing to port directory: /opt/var/macports/sources/rsync.macports.org/release/tarballs/ports/archivers/bzip2
334:debug:main OS darwin/14.0.0 (Mac OS X 10.10) arch i386
335:debug:main Reading variant descriptions from /opt/var/macports/sources/rsync.macports.org/release/tarballs/ports/_resources/port1.0/variant_descriptions.conf
336:debug:main universal variant already exists, so not adding the default one
337:debug:main Running callback portconfigure::add_automatic_compiler_dependencies
338:debug:main Finished running callback portconfigure::add_automatic_compiler_dependencies
339:debug:main Running callback portbuild::add_automatic_buildsystem_dependencies
340:debug:main Finished running callback portbuild::add_automatic_buildsystem_dependencies
341:debug:main No need to upgrade! bzip2 1.0.6_0 >= bzip2 1.0.6_0
342:debug:main epoch: in tree: 0 installed: 0
343:debug:main python_select 0.3_3 exists in the ports tree
344:debug:main python_select 0.3_3  is the latest installed
345:debug:main python_select 0.3_3  is active
346:debug:main Merging existing variants '' into variants
347:debug:main new fully merged portvariants:
348:debug:main Changing to port directory: /opt/var/macports/sources/rsync.macports.org/release/tarballs/ports/sysutils/python_select
349:debug:main OS darwin/14.0.0 (Mac OS X 10.10) arch i386
350:debug:main Sourcing PortGroup select 1.0 from /opt/var/macports/sources/rsync.macports.org/release/tarballs/ports/_resources/port1.0/group/select-1.0.tcl
351:debug:main universal_variant is false, so not adding the default universal variant
352:debug:main Running callback portconfigure::add_automatic_compiler_dependencies
353:debug:main Finished running callback portconfigure::add_automatic_compiler_dependencies
354:debug:main Running callback portbuild::add_automatic_buildsystem_dependencies
355:debug:main Finished running callback portbuild::add_automatic_buildsystem_dependencies
356:debug:main No need to upgrade! python_select 0.3_3 >= python_select 0.3_3
357:debug:main epoch: in tree: 0 installed: 0
358:debug:main libxml2 2.9.1_0 exists in the ports tree
359:debug:main libxml2 2.9.1_0  is the latest installed
360:debug:main libxml2 2.9.1_0  is active
361:debug:main Merging existing variants '' into variants
362:debug:main new fully merged portvariants:
363:debug:main Changing to port directory: /opt/var/macports/sources/rsync.macports.org/release/tarballs/ports/textproc/libxml2
364:debug:main OS darwin/14.0.0 (Mac OS X 10.10) arch i386
365:debug:main adding the default universal variant
366:debug:main Reading variant descriptions from /opt/var/macports/sources/rsync.macports.org/release/tarballs/ports/_resources/port1.0/variant_descriptions.conf
367:debug:main Running callback portconfigure::add_automatic_compiler_dependencies
368:debug:main Finished running callback portconfigure::add_automatic_compiler_dependencies
369:debug:main Running callback portbuild::add_automatic_buildsystem_dependencies
370:debug:main Finished running callback portbuild::add_automatic_buildsystem_dependencies
371:debug:main No need to upgrade! libxml2 2.9.1_0 >= libxml2 2.9.1_0
372:debug:main epoch: in tree: 0 installed: 0
373:debug:main xz 5.0.7_0 exists in the ports tree
374:debug:main xz 5.0.7_0  is the latest installed
375:debug:main xz 5.0.7_0  is active
376:debug:main Merging existing variants '' into variants
377:debug:main new fully merged portvariants:
378:debug:main Changing to port directory: /opt/var/macports/sources/rsync.macports.org/release/tarballs/ports/archivers/xz
379:debug:main OS darwin/14.0.0 (Mac OS X 10.10) arch i386
380:debug:main adding the default universal variant
381:debug:main Reading variant descriptions from /opt/var/macports/sources/rsync.macports.org/release/tarballs/ports/_resources/port1.0/variant_descriptions.conf
382:debug:main Running callback portconfigure::add_automatic_compiler_dependencies
383:debug:main Finished running callback portconfigure::add_automatic_compiler_dependencies
384:debug:main Running callback portbuild::add_automatic_buildsystem_dependencies
385:debug:main Finished running callback portbuild::add_automatic_buildsystem_dependencies
386:debug:main No need to upgrade! xz 5.0.7_0 >= xz 5.0.7_0
387:debug:main epoch: in tree: 0 installed: 0
388:debug:main xorg-libpthread-stubs 0.3_0 exists in the ports tree
389:debug:main xorg-libpthread-stubs 0.3_0  is the latest installed
390:debug:main xorg-libpthread-stubs 0.3_0  is active
391:debug:main Merging existing variants '' into variants
392:debug:main new fully merged portvariants:
393:debug:main Changing to port directory: /opt/var/macports/sources/rsync.macports.org/release/tarballs/ports/x11/xorg-libpthread-stubs
394:debug:main OS darwin/14.0.0 (Mac OS X 10.10) arch i386
395:debug:main only one arch supported, so not adding the default universal variant
396:debug:main Running callback portconfigure::add_automatic_compiler_dependencies
397:debug:main Finished running callback portconfigure::add_automatic_compiler_dependencies
398:debug:main Running callback portbuild::add_automatic_buildsystem_dependencies
399:debug:main Finished running callback portbuild::add_automatic_buildsystem_dependencies
400:debug:main No need to upgrade! xorg-libpthread-stubs 0.3_0 >= xorg-libpthread-stubs 0.3_0
401:debug:main epoch: in tree: 0 installed: 0
402:debug:main xorg-kbproto 1.0.6_0 exists in the ports tree
403:debug:main xorg-kbproto 1.0.6_0  is the latest installed
404:debug:main xorg-kbproto 1.0.6_0  is active
405:debug:main Merging existing variants '' into variants
406:debug:main new fully merged portvariants:
407:debug:main Changing to port directory: /opt/var/macports/sources/rsync.macports.org/release/tarballs/ports/x11/xorg-kbproto
408:debug:main OS darwin/14.0.0 (Mac OS X 10.10) arch i386
409:debug:main only one arch supported, so not adding the default universal variant
410:debug:main Running callback portconfigure::add_automatic_compiler_dependencies
411:debug:main Finished running callback portconfigure::add_automatic_compiler_dependencies
412:debug:main Running callback portbuild::add_automatic_buildsystem_dependencies
413:debug:main Finished running callback portbuild::add_automatic_buildsystem_dependencies
414:debug:main No need to upgrade! xorg-kbproto 1.0.6_0 >= xorg-kbproto 1.0.6_0
415:debug:main epoch: in tree: 0 installed: 0
416:debug:main xorg-xextproto 7.3.0_0 exists in the ports tree
417:debug:main xorg-xextproto 7.3.0_0  is the latest installed
418:debug:main xorg-xextproto 7.3.0_0  is active
419:debug:main Merging existing variants '' into variants
420:debug:main new fully merged portvariants:
421:debug:main Changing to port directory: /opt/var/macports/sources/rsync.macports.org/release/tarballs/ports/x11/xorg-xextproto
422:debug:main OS darwin/14.0.0 (Mac OS X 10.10) arch i386
423:debug:main only one arch supported, so not adding the default universal variant
424:debug:main Running callback portconfigure::add_automatic_compiler_dependencies
425:debug:main Finished running callback portconfigure::add_automatic_compiler_dependencies
426:debug:main Running callback portbuild::add_automatic_buildsystem_dependencies
427:debug:main Finished running callback portbuild::add_automatic_buildsystem_dependencies
428:debug:main No need to upgrade! xorg-xextproto 7.3.0_0 >= xorg-xextproto 7.3.0_0
429:debug:main epoch: in tree: 0 installed: 0
430:debug:main xorg-libXmu 1.1.2_0 exists in the ports tree
431:debug:main xorg-libXmu 1.1.2_0  is the latest installed
432:debug:main xorg-libXmu 1.1.2_0  is active
433:debug:main Merging existing variants '' into variants
434:debug:main new fully merged portvariants:
435:debug:main Changing to port directory: /opt/var/macports/sources/rsync.macports.org/release/tarballs/ports/x11/xorg-libXmu
436:debug:main OS darwin/14.0.0 (Mac OS X 10.10) arch i386
437:debug:main adding the default universal variant
438:debug:main Reading variant descriptions from /opt/var/macports/sources/rsync.macports.org/release/tarballs/ports/_resources/port1.0/variant_descriptions.conf
439:debug:main Running callback portconfigure::add_automatic_compiler_dependencies
440:debug:main Finished running callback portconfigure::add_automatic_compiler_dependencies
441:debug:main Running callback portbuild::add_automatic_buildsystem_dependencies
442:debug:main Finished running callback portbuild::add_automatic_buildsystem_dependencies
443:debug:main No need to upgrade! xorg-libXmu 1.1.2_0 >= xorg-libXmu 1.1.2_0
444:debug:main epoch: in tree: 0 installed: 0
445:debug:main xorg-libXt 1.1.4_0 exists in the ports tree
446:debug:main xorg-libXt 1.1.4_0  is the latest installed
447:debug:main xorg-libXt 1.1.4_0  is active
448:debug:main Merging existing variants '' into variants
449:debug:main new fully merged portvariants:
450:debug:main Changing to port directory: /opt/var/macports/sources/rsync.macports.org/release/tarballs/ports/x11/xorg-libXt
451:debug:main OS darwin/14.0.0 (Mac OS X 10.10) arch i386
452:debug:main adding the default universal variant
453:debug:main Reading variant descriptions from /opt/var/macports/sources/rsync.macports.org/release/tarballs/ports/_resources/port1.0/variant_descriptions.conf
454:debug:main Running callback portconfigure::add_automatic_compiler_dependencies
455:debug:main Finished running callback portconfigure::add_automatic_compiler_dependencies
456:debug:main Running callback portbuild::add_automatic_buildsystem_dependencies
457:debug:main Finished running callback portbuild::add_automatic_buildsystem_dependencies
458:debug:main No need to upgrade! xorg-libXt 1.1.4_0 >= xorg-libXt 1.1.4_0
459:debug:main epoch: in tree: 0 installed: 0
460:debug:main xpm 3.5.11_0 exists in the ports tree
461:debug:main xpm 3.5.11_0  is the latest installed
462:debug:main xpm 3.5.11_0  is active
463:debug:main Merging existing variants '' into variants
464:debug:main new fully merged portvariants:
465:debug:main Changing to port directory: /opt/var/macports/sources/rsync.macports.org/release/tarballs/ports/x11/xpm
466:debug:main OS darwin/14.0.0 (Mac OS X 10.10) arch i386
467:debug:main adding the default universal variant
468:debug:main Reading variant descriptions from /opt/var/macports/sources/rsync.macports.org/release/tarballs/ports/_resources/port1.0/variant_descriptions.conf
469:debug:main Running callback portconfigure::add_automatic_compiler_dependencies
470:debug:main Finished running callback portconfigure::add_automatic_compiler_dependencies
471:debug:main Running callback portbuild::add_automatic_buildsystem_dependencies
472:debug:main Finished running callback portbuild::add_automatic_buildsystem_dependencies
473:debug:main No need to upgrade! xpm 3.5.11_0 >= xpm 3.5.11_0
474:debug:main epoch: in tree: 0 installed: 0
475:debug:main xorg-libXp 1.0.2_0 exists in the ports tree
476:debug:main xorg-libXp 1.0.2_0  is the latest installed
477:debug:main xorg-libXp 1.0.2_0  is active
478:debug:main Merging existing variants '' into variants
479:debug:main new fully merged portvariants:
480:debug:main Changing to port directory: /opt/var/macports/sources/rsync.macports.org/release/tarballs/ports/x11/xorg-libXp
481:debug:main OS darwin/14.0.0 (Mac OS X 10.10) arch i386
482:debug:main adding the default universal variant
483:debug:main Reading variant descriptions from /opt/var/macports/sources/rsync.macports.org/release/tarballs/ports/_resources/port1.0/variant_descriptions.conf
484:debug:main Running callback portconfigure::add_automatic_compiler_dependencies
485:debug:main Finished running callback portconfigure::add_automatic_compiler_dependencies
486:debug:main Running callback portbuild::add_automatic_buildsystem_dependencies
487:debug:main Finished running callback portbuild::add_automatic_buildsystem_dependencies
488:debug:main No need to upgrade! xorg-libXp 1.0.2_0 >= xorg-libXp 1.0.2_0
489:debug:main epoch: in tree: 0 installed: 0
490:debug:main xorg-printproto 1.0.5_0 exists in the ports tree
491:debug:main xorg-printproto 1.0.5_0  is the latest installed
492:debug:main xorg-printproto 1.0.5_0  is active
493:debug:main Merging existing variants '' into variants
494:debug:main new fully merged portvariants:
495:debug:main Changing to port directory: /opt/var/macports/sources/rsync.macports.org/release/tarballs/ports/x11/xorg-printproto
496:debug:main OS darwin/14.0.0 (Mac OS X 10.10) arch i386
497:debug:main only one arch supported, so not adding the default universal variant
498:debug:main Running callback portconfigure::add_automatic_compiler_dependencies
499:debug:main Finished running callback portconfigure::add_automatic_compiler_dependencies
500:debug:main Running callback portbuild::add_automatic_buildsystem_dependencies
501:debug:main Finished running callback portbuild::add_automatic_buildsystem_dependencies
502:debug:main No need to upgrade! xorg-printproto 1.0.5_0 >= xorg-printproto 1.0.5_0
503:debug:main epoch: in tree: 0 installed: 0
504:debug:main jpeg 9a_1 exists in the ports tree
505:debug:main jpeg 9a_1  is the latest installed
506:debug:main jpeg 9a_1  is active
507:debug:main Merging existing variants '' into variants
508:debug:main new fully merged portvariants:
509:debug:main Changing to port directory: /opt/var/macports/sources/rsync.macports.org/release/tarballs/ports/graphics/jpeg
510:debug:main OS darwin/14.0.0 (Mac OS X 10.10) arch i386
511:debug:main adding the default universal variant
512:debug:main Reading variant descriptions from /opt/var/macports/sources/rsync.macports.org/release/tarballs/ports/_resources/port1.0/variant_descriptions.conf
513:debug:main Running callback portconfigure::add_automatic_compiler_dependencies
514:debug:main Finished running callback portconfigure::add_automatic_compiler_dependencies
515:debug:main Running callback portbuild::add_automatic_buildsystem_dependencies
516:debug:main Finished running callback portbuild::add_automatic_buildsystem_dependencies
517:debug:main No need to upgrade! jpeg 9a_1 >= jpeg 9a_1
518:debug:main epoch: in tree: 0 installed: 0
519:debug:main perl5 5.12.4_0 exists in the ports tree
520:debug:main perl5 5.12.4_0 +perl5_16 is the latest installed
521:debug:main perl5 5.12.4_0 +perl5_16 is active
522:debug:main Merging existing variants '+perl5_16' into variants
523:debug:main new fully merged portvariants: perl5_16 +
524:debug:main Changing to port directory: /opt/var/macports/sources/rsync.macports.org/release/tarballs/ports/lang/perl5
525:debug:main OS darwin/14.0.0 (Mac OS X 10.10) arch i386
526:debug:main universal_variant is false, so not adding the default universal variant
527:debug:main Executing variant perl5_16 provides perl5_16
528:debug:main Running callback portconfigure::add_automatic_compiler_dependencies
529:debug:main Finished running callback portconfigure::add_automatic_compiler_dependencies
530:debug:main Running callback portbuild::add_automatic_buildsystem_dependencies
531:debug:main Finished running callback portbuild::add_automatic_buildsystem_dependencies
532:debug:main No need to upgrade! perl5 5.12.4_0 >= perl5 5.12.4_0
533:debug:main epoch: in tree: 0 installed: 0
534:debug:main perl5.16 5.16.3_0 exists in the ports tree
535:debug:main perl5.16 5.16.3_0  is the latest installed
536:debug:main perl5.16 5.16.3_0  is active
537:debug:main Merging existing variants '' into variants
538:debug:main new fully merged portvariants:
539:debug:main Changing to port directory: /opt/var/macports/sources/rsync.macports.org/release/tarballs/ports/lang/perl5.16
540:debug:main OS darwin/14.0.0 (Mac OS X 10.10) arch i386
541:debug:main adding the default universal variant
542:debug:main Reading variant descriptions from /opt/var/macports/sources/rsync.macports.org/release/tarballs/ports/_resources/port1.0/variant_descriptions.conf
543:debug:main Running callback portconfigure::add_automatic_compiler_dependencies
544:debug:main Finished running callback portconfigure::add_automatic_compiler_dependencies
545:debug:main Running callback portbuild::add_automatic_buildsystem_dependencies
546:debug:main Finished running callback portbuild::add_automatic_buildsystem_dependencies
547:debug:main No need to upgrade! perl5.16 5.16.3_0 >= perl5.16 5.16.3_0
548:debug:main epoch: in tree: 0 installed: 0
549:debug:main gdbm 1.11_0 exists in the ports tree
550:debug:main gdbm 1.11_0  is the latest installed
551:debug:main gdbm 1.11_0  is active
552:debug:main Merging existing variants '' into variants
553:debug:main new fully merged portvariants:
554:debug:main Changing to port directory: /opt/var/macports/sources/rsync.macports.org/release/tarballs/ports/databases/gdbm
555:debug:main OS darwin/14.0.0 (Mac OS X 10.10) arch i386
556:debug:main adding the default universal variant
557:debug:main Reading variant descriptions from /opt/var/macports/sources/rsync.macports.org/release/tarballs/ports/_resources/port1.0/variant_descriptions.conf
558:debug:main Running callback portconfigure::add_automatic_compiler_dependencies
559:debug:main Finished running callback portconfigure::add_automatic_compiler_dependencies
560:debug:main Running callback portbuild::add_automatic_buildsystem_dependencies
561:debug:main Finished running callback portbuild::add_automatic_buildsystem_dependencies
562:debug:main No need to upgrade! gdbm 1.11_0 >= gdbm 1.11_0
563:msg:main --->  Computing dependencies for tightvnc:info:main .:debug:main Checking for conflicts against tightvnc
564:debug:main Searching for dependency: vnc
565:debug:main Didn't find receipt, going to depspec regex for: vnc
566:debug:main Searching for dependency: tigervnc
567:debug:main Didn't find receipt, going to depspec regex for: tigervnc
568:debug:main Searching for dependency: gccmakedep
569:debug:main Didn't find receipt, going to depspec regex for: gccmakedep
570:debug:main Changing to port directory: /opt/var/macports/sources/rsync.macports.org/release/tarballs/ports/x11/gccmakedep
571:debug:main OS darwin/14.0.0 (Mac OS X 10.10) arch i386
572:debug:main only one arch supported, so not adding the default universal variant
573:debug:main Running callback portconfigure::add_automatic_compiler_dependencies
574:debug:main Finished running callback portconfigure::add_automatic_compiler_dependencies
575:debug:main Running callback portbuild::add_automatic_buildsystem_dependencies
576:debug:main Finished running callback portbuild::add_automatic_buildsystem_dependencies
577:debug:main Searching for dependency: imake
578:debug:main Didn't find receipt, going to depspec regex for: imake
579:debug:main Changing to port directory: /opt/var/macports/sources/rsync.macports.org/release/tarballs/ports/x11/imake
580:debug:main OS darwin/14.0.0 (Mac OS X 10.10) arch i386
581:debug:main adding the default universal variant
582:debug:main Reading variant descriptions from /opt/var/macports/sources/rsync.macports.org/release/tarballs/ports/_resources/port1.0/variant_descriptions.conf
583:debug:main Running callback portconfigure::add_automatic_compiler_dependencies
584:debug:main Finished running callback portconfigure::add_automatic_compiler_dependencies
585:debug:main Running callback portbuild::add_automatic_buildsystem_dependencies
586:debug:main Finished running callback portbuild::add_automatic_buildsystem_dependencies
587:debug:main Searching for dependency: xorg-libXaw
588:debug:main Found Dependency: receipt exists for xorg-libXaw
589:debug:main Searching for dependency: xorg-libXp
590:debug:main Found Dependency: receipt exists for xorg-libXp
591:debug:main Searching for dependency: jpeg
592:debug:main Found Dependency: receipt exists for jpeg
593:debug:main Searching for dependency: zlib
594:debug:main Found Dependency: receipt exists for zlib
595:debug:main Searching for dependency: perl5
596:debug:main Found Dependency: receipt exists for perl5
597:info:main .:debug:main gccmakedep has no conflicts
598:info:main .:debug:main imake has no conflicts
599:debug:main Searching for dependency: pkgconfig
600:debug:main Found Dependency: receipt exists for pkgconfig
601:debug:main Searching for dependency: xorg-xproto
602:debug:main Found Dependency: receipt exists for xorg-xproto
603:debug:main Searching for dependency: xorg-cf-files
604:debug:main Didn't find receipt, going to depspec regex for: xorg-cf-files
605:debug:main Changing to port directory: /opt/var/macports/sources/rsync.macports.org/release/tarballs/ports/x11/xorg-cf-files
606:debug:main OS darwin/14.0.0 (Mac OS X 10.10) arch i386
607:debug:main only one arch supported, so not adding the default universal variant
608:debug:main Running callback portconfigure::add_automatic_compiler_dependencies
609:debug:main Finished running callback portconfigure::add_automatic_compiler_dependencies
610:debug:main Running callback portbuild::add_automatic_buildsystem_dependencies
611:debug:main Finished running callback portbuild::add_automatic_buildsystem_dependencies
612:debug:main Searching for dependency: tradcpp
613:debug:main Didn't find receipt, going to depspec regex for: tradcpp
614:debug:main Changing to port directory: /opt/var/macports/sources/rsync.macports.org/release/tarballs/ports/devel/tradcpp
615:debug:main OS darwin/14.0.0 (Mac OS X 10.10) arch i386
616:debug:main universal_variant is false, so not adding the default universal variant
617:debug:main Running callback portconfigure::add_automatic_compiler_dependencies
618:debug:main Finished running callback portconfigure::add_automatic_compiler_dependencies
619:debug:main Running callback portbuild::add_automatic_buildsystem_dependencies
620:debug:main build.type is BSD, adding bin:bsdmake:bsdmake build dependency
621:debug:main Finished running callback portbuild::add_automatic_buildsystem_dependencies
622:info:main .:debug:main xorg-cf-files has no conflicts
623:info:main .:debug:main tradcpp has no conflicts
624:debug:main Searching for dependency: bsdmake
625:debug:main Didn't find receipt, going to depspec regex for: bsdmake
626:debug:main Changing to port directory: /opt/var/macports/sources/rsync.macports.org/release/tarballs/ports/devel/bsdmake
627:debug:main OS darwin/14.0.0 (Mac OS X 10.10) arch i386
628:debug:main universal_variant is false, so not adding the default universal variant
629:debug:main Running callback portconfigure::add_automatic_compiler_dependencies
630:debug:main Finished running callback portconfigure::add_automatic_compiler_dependencies
631:debug:main Running callback portbuild::add_automatic_buildsystem_dependencies
632:debug:main Finished running callback portbuild::add_automatic_buildsystem_dependencies
633:info:main .:debug:main bsdmake has no conflicts
634:msg:main
635:msg:main --->  Dependencies to be installed: gccmakedep imake tradcpp bsdmake xorg-cf-files
636:debug:main Starting logging for gccmakedep
637:debug:clean Starting logging for bsdmake
638:debug:clean Starting logging for tradcpp
639:debug:clean Starting logging for xorg-cf-files
640:debug:clean Starting logging for imake
641:debug:main Executing org.macports.main (tightvnc)
642:debug:main changing euid/egid - current euid: 0 - current egid: 0
643:debug:main egid changed to: 501
644:debug:main euid changed to: 502
645:debug:archivefetch archivefetch phase started at Mon Oct 20 09:35:43 CEST 2014
646:debug:archivefetch Executing org.macports.archivefetch (tightvnc)
647:debug:archivefetch Privilege de-escalation not attempted as not running as root.
648:debug:fetch fetch phase started at Mon Oct 20 09:35:43 CEST 2014
649:notice:fetch --->  Fetching distfiles for tightvnc
650:debug:fetch Can't run fetch on this port without elevated privileges. Escalating privileges back to root.
651:debug:fetch euid changed to: 0. egid changed to: 0.
652:debug:fetch changing euid/egid - current euid: 0 - current egid: 0
653:debug:fetch egid changed to: 501
654:debug:fetch euid changed to: 502
655:debug:fetch Executing org.macports.fetch (tightvnc)
656:info:fetch --->  tightvnc-1.3.10_unixsrc.tar.bz2 doesn't seem to exist in /opt/var/macports/distfiles/tightvnc
657:notice:fetch --->  Attempting to fetch tightvnc-1.3.10_unixsrc.tar.bz2 from http://aarnet.dl.sourceforge.net/vnc-tight
658:debug:fetch Privilege de-escalation not attempted as not running as root.
659:debug:checksum checksum phase started at Mon Oct 20 09:35:47 CEST 2014
660:notice:checksum --->  Verifying checksums for tightvnc
661:debug:checksum Executing org.macports.checksum (tightvnc)
662:info:checksum --->  Checksumming tightvnc-1.3.10_unixsrc.tar.bz2
663:debug:checksum Calculated (md5) is 397b35faad32d5246b6d44b142f8304f
664:debug:checksum Correct (md5) checksum for tightvnc-1.3.10_unixsrc.tar.bz2
665:debug:checksum Calculated (sha1) is ab4ed3d8e9d5188edf0ff27fce3027495f1a8851
666:debug:checksum Correct (sha1) checksum for tightvnc-1.3.10_unixsrc.tar.bz2
667:debug:checksum Calculated (rmd160) is 0c24207ec13c1d41f445ccbdea16ce2b5d0729a7
668:debug:checksum Correct (rmd160) checksum for tightvnc-1.3.10_unixsrc.tar.bz2
669:debug:checksum Privilege de-escalation not attempted as not running as root.
670:debug:extract extract phase started at Mon Oct 20 09:35:47 CEST 2014
671:notice:extract --->  Extracting tightvnc
672:debug:extract setting option extract.cmd to /usr/bin/bzip2
673:debug:extract Executing org.macports.extract (tightvnc)
674:info:extract --->  Extracting tightvnc-1.3.10_unixsrc.tar.bz2
675:debug:extract setting option extract.args to '/opt/var/macports/distfiles/tightvnc/tightvnc-1.3.10_unixsrc.tar.bz2'
676:debug:extract Environment:
677CC_PRINT_OPTIONS='YES'
678CC_PRINT_OPTIONS_FILE='/opt/var/macports/build/_opt_var_macports_sources_rsync.macports.org_release_tarballs_ports_x11_tightvnc/tightvnc/work/.CC_PRINT_OPTIONS'
679CPATH='/opt/include'
680LIBRARY_PATH='/opt/lib'
681MACOSX_DEPLOYMENT_TARGET='10.10'
682:debug:extract Assembled command: 'cd "/opt/var/macports/build/_opt_var_macports_sources_rsync.macports.org_release_tarballs_ports_x11_tightvnc/tightvnc/work" && /usr/bin/bzip2 -dc '/opt/var/macports/distfiles/tightvnc/tightvnc-1.3.10_unixsrc.tar.bz2' | /usr/bin/tar -xf -'
683:debug:extract Executing command line:  cd "/opt/var/macports/build/_opt_var_macports_sources_rsync.macports.org_release_tarballs_ports_x11_tightvnc/tightvnc/work" && /usr/bin/bzip2 -dc '/opt/var/macports/distfiles/tightvnc/tightvnc-1.3.10_unixsrc.tar.bz2' | /usr/bin/tar -xf -
684:debug:extract euid/egid changed to: 0/0
685:debug:extract chowned /opt/var/macports/build/_opt_var_macports_sources_rsync.macports.org_release_tarballs_ports_x11_tightvnc/tightvnc/work to macports
686:debug:extract euid/egid changed to: 502/501
687:debug:extract Privilege de-escalation not attempted as not running as root.
688:debug:patch patch phase started at Mon Oct 20 09:35:48 CEST 2014
689:debug:patch Executing org.macports.patch (tightvnc)
690:notice:patch --->  Applying patches to tightvnc
691:info:patch --->  Applying patch-Xvnc.diff
692:debug:patch Environment:
693CC_PRINT_OPTIONS='YES'
694CC_PRINT_OPTIONS_FILE='/opt/var/macports/build/_opt_var_macports_sources_rsync.macports.org_release_tarballs_ports_x11_tightvnc/tightvnc/work/.CC_PRINT_OPTIONS'
695CPATH='/opt/include'
696LIBRARY_PATH='/opt/lib'
697MACOSX_DEPLOYMENT_TARGET='10.10'
698:debug:patch Assembled command: 'cd "/opt/var/macports/build/_opt_var_macports_sources_rsync.macports.org_release_tarballs_ports_x11_tightvnc/tightvnc/work/vnc_unixsrc" && /usr/bin/patch -p0'
699:debug:patch Executing command line:  cd "/opt/var/macports/build/_opt_var_macports_sources_rsync.macports.org_release_tarballs_ports_x11_tightvnc/tightvnc/work/vnc_unixsrc" && /usr/bin/patch -p0 < '/opt/var/macports/sources/rsync.macports.org/release/tarballs/ports/x11/tightvnc/files/patch-Xvnc.diff'
700:info:patch patching file Xvnc/config/cf/vnclibs.def
701:info:patch patching file Xvnc/config/imake/imakemdep.h
702:info:patch patching file Xvnc/lib/Xdmcp/Alloc.c
703:info:patch patching file Xvnc/lib/font/Type1/objects.c
704:info:patch patching file Xvnc/lib/font/Type1/spaces.c
705:info:patch patching file Xvnc/lib/font/Type1/t1malloc.c
706:info:patch patching file Xvnc/lib/font/Type1/t1stub.c
707:info:patch patching file Xvnc/programs/Xserver/include/os.h
708:info:patch patching file Xvnc/programs/Xserver/include/servermd.h
709:info:patch patching file Xvnc/programs/Xserver/os/access.c
710:info:patch --->  Applying patch-vncviewer.diff
711:debug:patch Environment:
712CC_PRINT_OPTIONS='YES'
713CC_PRINT_OPTIONS_FILE='/opt/var/macports/build/_opt_var_macports_sources_rsync.macports.org_release_tarballs_ports_x11_tightvnc/tightvnc/work/.CC_PRINT_OPTIONS'
714CPATH='/opt/include'
715LIBRARY_PATH='/opt/lib'
716MACOSX_DEPLOYMENT_TARGET='10.10'
717:debug:patch Assembled command: 'cd "/opt/var/macports/build/_opt_var_macports_sources_rsync.macports.org_release_tarballs_ports_x11_tightvnc/tightvnc/work/vnc_unixsrc" && /usr/bin/patch -p0'
718:debug:patch Executing command line:  cd "/opt/var/macports/build/_opt_var_macports_sources_rsync.macports.org_release_tarballs_ports_x11_tightvnc/tightvnc/work/vnc_unixsrc" && /usr/bin/patch -p0 < '/opt/var/macports/sources/rsync.macports.org/release/tarballs/ports/x11/tightvnc/files/patch-vncviewer.diff'
719:info:patch patching file ./vncviewer/Imakefile
720:info:patch --->  Applying patch-vncserver.diff
721:debug:patch Environment:
722CC_PRINT_OPTIONS='YES'
723CC_PRINT_OPTIONS_FILE='/opt/var/macports/build/_opt_var_macports_sources_rsync.macports.org_release_tarballs_ports_x11_tightvnc/tightvnc/work/.CC_PRINT_OPTIONS'
724CPATH='/opt/include'
725LIBRARY_PATH='/opt/lib'
726MACOSX_DEPLOYMENT_TARGET='10.10'
727:debug:patch Assembled command: 'cd "/opt/var/macports/build/_opt_var_macports_sources_rsync.macports.org_release_tarballs_ports_x11_tightvnc/tightvnc/work/vnc_unixsrc" && /usr/bin/patch -p0'
728:debug:patch Executing command line:  cd "/opt/var/macports/build/_opt_var_macports_sources_rsync.macports.org_release_tarballs_ports_x11_tightvnc/tightvnc/work/vnc_unixsrc" && /usr/bin/patch -p0 < '/opt/var/macports/sources/rsync.macports.org/release/tarballs/ports/x11/tightvnc/files/patch-vncserver.diff'
729:info:patch patching file vncserver
730:info:patch --->  Applying patch-vncconnect_vncconnect.c.diff
731:debug:patch Environment:
732CC_PRINT_OPTIONS='YES'
733CC_PRINT_OPTIONS_FILE='/opt/var/macports/build/_opt_var_macports_sources_rsync.macports.org_release_tarballs_ports_x11_tightvnc/tightvnc/work/.CC_PRINT_OPTIONS'
734CPATH='/opt/include'
735LIBRARY_PATH='/opt/lib'
736MACOSX_DEPLOYMENT_TARGET='10.10'
737:debug:patch Assembled command: 'cd "/opt/var/macports/build/_opt_var_macports_sources_rsync.macports.org_release_tarballs_ports_x11_tightvnc/tightvnc/work/vnc_unixsrc" && /usr/bin/patch -p0'
738:debug:patch Executing command line:  cd "/opt/var/macports/build/_opt_var_macports_sources_rsync.macports.org_release_tarballs_ports_x11_tightvnc/tightvnc/work/vnc_unixsrc" && /usr/bin/patch -p0 < '/opt/var/macports/sources/rsync.macports.org/release/tarballs/ports/x11/tightvnc/files/patch-vncconnect_vncconnect.c.diff'
739:info:patch patching file vncconnect/vncconnect.c
740:info:patch --->  Applying patch-include_vncauth.h.diff
741:debug:patch Environment:
742CC_PRINT_OPTIONS='YES'
743CC_PRINT_OPTIONS_FILE='/opt/var/macports/build/_opt_var_macports_sources_rsync.macports.org_release_tarballs_ports_x11_tightvnc/tightvnc/work/.CC_PRINT_OPTIONS'
744CPATH='/opt/include'
745LIBRARY_PATH='/opt/lib'
746MACOSX_DEPLOYMENT_TARGET='10.10'
747:debug:patch Assembled command: 'cd "/opt/var/macports/build/_opt_var_macports_sources_rsync.macports.org_release_tarballs_ports_x11_tightvnc/tightvnc/work/vnc_unixsrc" && /usr/bin/patch -p0'
748:debug:patch Executing command line:  cd "/opt/var/macports/build/_opt_var_macports_sources_rsync.macports.org_release_tarballs_ports_x11_tightvnc/tightvnc/work/vnc_unixsrc" && /usr/bin/patch -p0 < '/opt/var/macports/sources/rsync.macports.org/release/tarballs/ports/x11/tightvnc/files/patch-include_vncauth.h.diff'
749:info:patch patching file include/vncauth.h
750:debug:patch Executing proc-post-org.macports.patch-patch-0
751:info:patch --->  Patching vnclibs.def: s|@PREFIX@|/opt|g
752:debug:patch Executing reinplace: /usr/bin/sed s|@PREFIX@|/opt|g < /opt/var/macports/build/_opt_var_macports_sources_rsync.macports.org_release_tarballs_ports_x11_tightvnc/tightvnc/work/vnc_unixsrc/Xvnc/config/cf/vnclibs.def >@ file11 2>@stderr
753:debug:patch euid/egid changed to: 0/0
754:debug:patch chowned /opt/var/macports/build/_opt_var_macports_sources_rsync.macports.org_release_tarballs_ports_x11_tightvnc/tightvnc/work/vnc_unixsrc/Xvnc/config/cf/vnclibs.def to macports
755:debug:patch euid/egid changed to: 502/501
756:debug:patch euid/egid changed to: 0/0
757:debug:patch setting attributes on /opt/var/macports/build/_opt_var_macports_sources_rsync.macports.org_release_tarballs_ports_x11_tightvnc/tightvnc/work/vnc_unixsrc/Xvnc/config/cf/vnclibs.def
758:debug:patch euid/egid changed to: 502/501
759:info:patch --->  Patching vncserver: s|@PREFIX@|/opt|g
760:debug:patch Executing reinplace: /usr/bin/sed s|@PREFIX@|/opt|g < /opt/var/macports/build/_opt_var_macports_sources_rsync.macports.org_release_tarballs_ports_x11_tightvnc/tightvnc/work/vnc_unixsrc/vncserver >@ file11 2>@stderr
761:debug:patch euid/egid changed to: 0/0
762:debug:patch chowned /opt/var/macports/build/_opt_var_macports_sources_rsync.macports.org_release_tarballs_ports_x11_tightvnc/tightvnc/work/vnc_unixsrc/vncserver to macports
763:debug:patch euid/egid changed to: 502/501
764:debug:patch euid/egid changed to: 0/0
765:debug:patch setting attributes on /opt/var/macports/build/_opt_var_macports_sources_rsync.macports.org_release_tarballs_ports_x11_tightvnc/tightvnc/work/vnc_unixsrc/vncserver
766:debug:patch euid/egid changed to: 502/501
767:info:patch --->  Patching Imakefile: s|@PREFIX@|/opt|g
768:debug:patch Executing reinplace: /usr/bin/sed s|@PREFIX@|/opt|g < /opt/var/macports/build/_opt_var_macports_sources_rsync.macports.org_release_tarballs_ports_x11_tightvnc/tightvnc/work/vnc_unixsrc/vncviewer/Imakefile >@ file11 2>@stderr
769:debug:patch euid/egid changed to: 0/0
770:debug:patch chowned /opt/var/macports/build/_opt_var_macports_sources_rsync.macports.org_release_tarballs_ports_x11_tightvnc/tightvnc/work/vnc_unixsrc/vncviewer/Imakefile to macports
771:debug:patch euid/egid changed to: 502/501
772:debug:patch euid/egid changed to: 0/0
773:debug:patch setting attributes on /opt/var/macports/build/_opt_var_macports_sources_rsync.macports.org_release_tarballs_ports_x11_tightvnc/tightvnc/work/vnc_unixsrc/vncviewer/Imakefile
774:debug:patch euid/egid changed to: 502/501
775:info:patch --->  Patching vncserver: s|@PERL@|/opt/bin/perl|g
776:debug:patch Executing reinplace: /usr/bin/sed s|@PERL@|/opt/bin/perl|g < /opt/var/macports/build/_opt_var_macports_sources_rsync.macports.org_release_tarballs_ports_x11_tightvnc/tightvnc/work/vnc_unixsrc/vncserver >@ file11 2>@stderr
777:debug:patch euid/egid changed to: 0/0
778:debug:patch chowned /opt/var/macports/build/_opt_var_macports_sources_rsync.macports.org_release_tarballs_ports_x11_tightvnc/tightvnc/work/vnc_unixsrc/vncserver to macports
779:debug:patch euid/egid changed to: 502/501
780:debug:patch euid/egid changed to: 0/0
781:debug:patch setting attributes on /opt/var/macports/build/_opt_var_macports_sources_rsync.macports.org_release_tarballs_ports_x11_tightvnc/tightvnc/work/vnc_unixsrc/vncserver
782:debug:patch euid/egid changed to: 502/501
783:debug:patch Privilege de-escalation not attempted as not running as root.
784:debug:configure configure phase started at Mon Oct 20 09:35:48 CEST 2014
785:notice:configure --->  Configuring tightvnc
786:debug:configure Using compiler 'Xcode Clang'
787:debug:configure Executing org.macports.configure (tightvnc)
788:debug:configure Environment:
789CC_PRINT_OPTIONS='YES'
790CC_PRINT_OPTIONS_FILE='/opt/var/macports/build/_opt_var_macports_sources_rsync.macports.org_release_tarballs_ports_x11_tightvnc/tightvnc/work/.CC_PRINT_OPTIONS'
791CPATH='/opt/include'
792LIBRARY_PATH='/opt/lib'
793MACOSX_DEPLOYMENT_TARGET='10.10'
794:debug:configure Assembled command: 'cd "/opt/var/macports/build/_opt_var_macports_sources_rsync.macports.org_release_tarballs_ports_x11_tightvnc/tightvnc/work/vnc_unixsrc" && xmkmf'
795:debug:configure Executing command line:  cd "/opt/var/macports/build/_opt_var_macports_sources_rsync.macports.org_release_tarballs_ports_x11_tightvnc/tightvnc/work/vnc_unixsrc" && xmkmf
796:info:configure imake -DUseInstalled -I/opt/lib/X11/config
797:debug:configure Environment:
798CC_PRINT_OPTIONS='YES'
799CC_PRINT_OPTIONS_FILE='/opt/var/macports/build/_opt_var_macports_sources_rsync.macports.org_release_tarballs_ports_x11_tightvnc/tightvnc/work/.CC_PRINT_OPTIONS'
800CPATH='/opt/include'
801LIBRARY_PATH='/opt/lib'
802MACOSX_DEPLOYMENT_TARGET='10.10'
803:debug:configure Assembled command: ' cd /opt/var/macports/build/_opt_var_macports_sources_rsync.macports.org_release_tarballs_ports_x11_tightvnc/tightvnc/work/vnc_unixsrc && make Makefiles'
804:debug:configure Executing command line:   cd /opt/var/macports/build/_opt_var_macports_sources_rsync.macports.org_release_tarballs_ports_x11_tightvnc/tightvnc/work/vnc_unixsrc && make Makefiles
805:info:configure making Makefiles in libvncauth...
806:info:configure In file included from Imakefile.c:15:2:
807:info:configure In file included from /opt/lib/X11/config/Imake.tmpl:2157:2:
808:info:configure /opt/lib/X11/config/X11.tmpl:382:13: Warning: value of undefined symbol XF86Server is 0
809:info:configure In file included from Imakefile.c:15:2:
810:info:configure In file included from /opt/lib/X11/config/Imake.tmpl:2157:2:
811:info:configure /opt/lib/X11/config/X11.tmpl:783:10: Warning: value of undefined symbol HasCThreads is 0
812:info:configure In file included from Imakefile.c:15:2:
813:info:configure In file included from /opt/lib/X11/config/Imake.tmpl:2157:2:
814:info:configure /opt/lib/X11/config/X11.tmpl:3860:18: Warning: value of undefined symbol UseInstalledOnCrossCompile is 0
815:info:configure In file included from Imakefile.c:15:2:
816:info:configure In file included from /opt/lib/X11/config/Imake.tmpl:2157:2:
817:info:configure /opt/lib/X11/config/X11.tmpl:4077:13: Warning: value of undefined symbol UseInstalledOnCrossCompile is 0
818:info:configure In file included from Imakefile.c:15:2:
819:info:configure In file included from /opt/lib/X11/config/Imake.tmpl:2157:2:
820:info:configure /opt/lib/X11/config/X11.tmpl:4098:13: Warning: value of undefined symbol UseInstalledOnCrossCompile is 0
821:info:configure In file included from Imakefile.c:15:2:
822:info:configure In file included from /opt/lib/X11/config/Imake.tmpl:2157:2:
823:info:configure /opt/lib/X11/config/X11.tmpl:4120:12: Warning: value of undefined symbol UseInstalledOnCrossCompile is 0
824:info:configure In file included from Imakefile.c:15:2:
825:info:configure In file included from /opt/lib/X11/config/Imake.tmpl:2157:2:
826:info:configure /opt/lib/X11/config/X11.tmpl:4138:13: Warning: value of undefined symbol UseInstalledOnCrossCompile is 0
827:info:configure In file included from Imakefile.c:15:2:
828:info:configure In file included from /opt/lib/X11/config/Imake.tmpl:2157:2:
829:info:configure /opt/lib/X11/config/X11.tmpl:4159:12: Warning: value of undefined symbol UseInstalledOnCrossCompile is 0
830:info:configure In file included from Imakefile.c:15:2:
831:info:configure In file included from /opt/lib/X11/config/Imake.tmpl:2157:2:
832:info:configure /opt/lib/X11/config/X11.tmpl:4211:12: Warning: value of undefined symbol UseInstalledOnCrossCompile is 0
833:info:configure In file included from Imakefile.c:15:2:
834:info:configure In file included from /opt/lib/X11/config/Imake.tmpl:2157:2:
835:info:configure /opt/lib/X11/config/X11.tmpl:4230:12: Warning: value of undefined symbol UseInstalledOnCrossCompile is 0
836:info:configure In file included from Imakefile.c:15:2:
837:info:configure In file included from /opt/lib/X11/config/Imake.tmpl:2157:2:
838:info:configure /opt/lib/X11/config/X11.tmpl:4302:12: Warning: value of undefined symbol UseInstalledOnCrossCompile is 0
839:info:configure In file included from Imakefile.c:15:2:
840:info:configure In file included from /opt/lib/X11/config/Imake.tmpl:2157:2:
841:info:configure /opt/lib/X11/config/X11.tmpl:4332:12: Warning: value of undefined symbol UseInstalledOnCrossCompile is 0
842:info:configure In file included from Imakefile.c:15:2:
843:info:configure In file included from /opt/lib/X11/config/Imake.tmpl:2157:2:
844:info:configure /opt/lib/X11/config/X11.tmpl:4348:12: Warning: value of undefined symbol UseInstalledOnCrossCompile is 0
845:info:configure In file included from Imakefile.c:15:2:
846:info:configure In file included from /opt/lib/X11/config/Imake.tmpl:2157:2:
847:info:configure /opt/lib/X11/config/X11.tmpl:4419:12: Warning: value of undefined symbol UseInstalledOnCrossCompile is 0
848:info:configure make[1]: Nothing to be done for `Makefiles'.
849:info:configure making Makefiles in vncviewer...
850:info:configure In file included from Imakefile.c:15:2:
851:info:configure In file included from /opt/lib/X11/config/Imake.tmpl:2157:2:
852:info:configure /opt/lib/X11/config/X11.tmpl:382:13: Warning: value of undefined symbol XF86Server is 0
853:info:configure In file included from Imakefile.c:15:2:
854:info:configure In file included from /opt/lib/X11/config/Imake.tmpl:2157:2:
855:info:configure /opt/lib/X11/config/X11.tmpl:783:10: Warning: value of undefined symbol HasCThreads is 0
856:info:configure In file included from Imakefile.c:15:2:
857:info:configure In file included from /opt/lib/X11/config/Imake.tmpl:2157:2:
858:info:configure /opt/lib/X11/config/X11.tmpl:3860:18: Warning: value of undefined symbol UseInstalledOnCrossCompile is 0
859:info:configure In file included from Imakefile.c:15:2:
860:info:configure In file included from /opt/lib/X11/config/Imake.tmpl:2157:2:
861:info:configure /opt/lib/X11/config/X11.tmpl:4077:13: Warning: value of undefined symbol UseInstalledOnCrossCompile is 0
862:info:configure In file included from Imakefile.c:15:2:
863:info:configure In file included from /opt/lib/X11/config/Imake.tmpl:2157:2:
864:info:configure /opt/lib/X11/config/X11.tmpl:4098:13: Warning: value of undefined symbol UseInstalledOnCrossCompile is 0
865:info:configure In file included from Imakefile.c:15:2:
866:info:configure In file included from /opt/lib/X11/config/Imake.tmpl:2157:2:
867:info:configure /opt/lib/X11/config/X11.tmpl:4120:12: Warning: value of undefined symbol UseInstalledOnCrossCompile is 0
868:info:configure In file included from Imakefile.c:15:2:
869:info:configure In file included from /opt/lib/X11/config/Imake.tmpl:2157:2:
870:info:configure /opt/lib/X11/config/X11.tmpl:4138:13: Warning: value of undefined symbol UseInstalledOnCrossCompile is 0
871:info:configure In file included from Imakefile.c:15:2:
872:info:configure In file included from /opt/lib/X11/config/Imake.tmpl:2157:2:
873:info:configure /opt/lib/X11/config/X11.tmpl:4159:12: Warning: value of undefined symbol UseInstalledOnCrossCompile is 0
874:info:configure In file included from Imakefile.c:15:2:
875:info:configure In file included from /opt/lib/X11/config/Imake.tmpl:2157:2:
876:info:configure /opt/lib/X11/config/X11.tmpl:4211:12: Warning: value of undefined symbol UseInstalledOnCrossCompile is 0
877:info:configure In file included from Imakefile.c:15:2:
878:info:configure In file included from /opt/lib/X11/config/Imake.tmpl:2157:2:
879:info:configure /opt/lib/X11/config/X11.tmpl:4230:12: Warning: value of undefined symbol UseInstalledOnCrossCompile is 0
880:info:configure In file included from Imakefile.c:15:2:
881:info:configure In file included from /opt/lib/X11/config/Imake.tmpl:2157:2:
882:info:configure /opt/lib/X11/config/X11.tmpl:4302:12: Warning: value of undefined symbol UseInstalledOnCrossCompile is 0
883:info:configure In file included from Imakefile.c:15:2:
884:info:configure In file included from /opt/lib/X11/config/Imake.tmpl:2157:2:
885:info:configure /opt/lib/X11/config/X11.tmpl:4332:12: Warning: value of undefined symbol UseInstalledOnCrossCompile is 0
886:info:configure In file included from Imakefile.c:15:2:
887:info:configure In file included from /opt/lib/X11/config/Imake.tmpl:2157:2:
888:info:configure /opt/lib/X11/config/X11.tmpl:4348:12: Warning: value of undefined symbol UseInstalledOnCrossCompile is 0
889:info:configure In file included from Imakefile.c:15:2:
890:info:configure In file included from /opt/lib/X11/config/Imake.tmpl:2157:2:
891:info:configure /opt/lib/X11/config/X11.tmpl:4419:12: Warning: value of undefined symbol UseInstalledOnCrossCompile is 0
892:info:configure make[1]: Nothing to be done for `Makefiles'.
893:info:configure making Makefiles in vncpasswd...
894:info:configure In file included from Imakefile.c:15:2:
895:info:configure In file included from /opt/lib/X11/config/Imake.tmpl:2157:2:
896:info:configure /opt/lib/X11/config/X11.tmpl:382:13: Warning: value of undefined symbol XF86Server is 0
897:info:configure In file included from Imakefile.c:15:2:
898:info:configure In file included from /opt/lib/X11/config/Imake.tmpl:2157:2:
899:info:configure /opt/lib/X11/config/X11.tmpl:783:10: Warning: value of undefined symbol HasCThreads is 0
900:info:configure In file included from Imakefile.c:15:2:
901:info:configure In file included from /opt/lib/X11/config/Imake.tmpl:2157:2:
902:info:configure /opt/lib/X11/config/X11.tmpl:3860:18: Warning: value of undefined symbol UseInstalledOnCrossCompile is 0
903:info:configure In file included from Imakefile.c:15:2:
904:info:configure In file included from /opt/lib/X11/config/Imake.tmpl:2157:2:
905:info:configure /opt/lib/X11/config/X11.tmpl:4077:13: Warning: value of undefined symbol UseInstalledOnCrossCompile is 0
906:info:configure In file included from Imakefile.c:15:2:
907:info:configure In file included from /opt/lib/X11/config/Imake.tmpl:2157:2:
908:info:configure /opt/lib/X11/config/X11.tmpl:4098:13: Warning: value of undefined symbol UseInstalledOnCrossCompile is 0
909:info:configure In file included from Imakefile.c:15:2:
910:info:configure In file included from /opt/lib/X11/config/Imake.tmpl:2157:2:
911:info:configure /opt/lib/X11/config/X11.tmpl:4120:12: Warning: value of undefined symbol UseInstalledOnCrossCompile is 0
912:info:configure In file included from Imakefile.c:15:2:
913:info:configure In file included from /opt/lib/X11/config/Imake.tmpl:2157:2:
914:info:configure /opt/lib/X11/config/X11.tmpl:4138:13: Warning: value of undefined symbol UseInstalledOnCrossCompile is 0
915:info:configure In file included from Imakefile.c:15:2:
916:info:configure In file included from /opt/lib/X11/config/Imake.tmpl:2157:2:
917:info:configure /opt/lib/X11/config/X11.tmpl:4159:12: Warning: value of undefined symbol UseInstalledOnCrossCompile is 0
918:info:configure In file included from Imakefile.c:15:2:
919:info:configure In file included from /opt/lib/X11/config/Imake.tmpl:2157:2:
920:info:configure /opt/lib/X11/config/X11.tmpl:4211:12: Warning: value of undefined symbol UseInstalledOnCrossCompile is 0
921:info:configure In file included from Imakefile.c:15:2:
922:info:configure In file included from /opt/lib/X11/config/Imake.tmpl:2157:2:
923:info:configure /opt/lib/X11/config/X11.tmpl:4230:12: Warning: value of undefined symbol UseInstalledOnCrossCompile is 0
924:info:configure In file included from Imakefile.c:15:2:
925:info:configure In file included from /opt/lib/X11/config/Imake.tmpl:2157:2:
926:info:configure /opt/lib/X11/config/X11.tmpl:4302:12: Warning: value of undefined symbol UseInstalledOnCrossCompile is 0
927:info:configure In file included from Imakefile.c:15:2:
928:info:configure In file included from /opt/lib/X11/config/Imake.tmpl:2157:2:
929:info:configure /opt/lib/X11/config/X11.tmpl:4332:12: Warning: value of undefined symbol UseInstalledOnCrossCompile is 0
930:info:configure In file included from Imakefile.c:15:2:
931:info:configure In file included from /opt/lib/X11/config/Imake.tmpl:2157:2:
932:info:configure /opt/lib/X11/config/X11.tmpl:4348:12: Warning: value of undefined symbol UseInstalledOnCrossCompile is 0
933:info:configure In file included from Imakefile.c:15:2:
934:info:configure In file included from /opt/lib/X11/config/Imake.tmpl:2157:2:
935:info:configure /opt/lib/X11/config/X11.tmpl:4419:12: Warning: value of undefined symbol UseInstalledOnCrossCompile is 0
936:info:configure make[1]: Nothing to be done for `Makefiles'.
937:info:configure making Makefiles in vncconnect...
938:info:configure In file included from Imakefile.c:15:2:
939:info:configure In file included from /opt/lib/X11/config/Imake.tmpl:2157:2:
940:info:configure /opt/lib/X11/config/X11.tmpl:382:13: Warning: value of undefined symbol XF86Server is 0
941:info:configure In file included from Imakefile.c:15:2:
942:info:configure In file included from /opt/lib/X11/config/Imake.tmpl:2157:2:
943:info:configure /opt/lib/X11/config/X11.tmpl:783:10: Warning: value of undefined symbol HasCThreads is 0
944:info:configure In file included from Imakefile.c:15:2:
945:info:configure In file included from /opt/lib/X11/config/Imake.tmpl:2157:2:
946:info:configure /opt/lib/X11/config/X11.tmpl:3860:18: Warning: value of undefined symbol UseInstalledOnCrossCompile is 0
947:info:configure In file included from Imakefile.c:15:2:
948:info:configure In file included from /opt/lib/X11/config/Imake.tmpl:2157:2:
949:info:configure /opt/lib/X11/config/X11.tmpl:4077:13: Warning: value of undefined symbol UseInstalledOnCrossCompile is 0
950:info:configure In file included from Imakefile.c:15:2:
951:info:configure In file included from /opt/lib/X11/config/Imake.tmpl:2157:2:
952:info:configure /opt/lib/X11/config/X11.tmpl:4098:13: Warning: value of undefined symbol UseInstalledOnCrossCompile is 0
953:info:configure In file included from Imakefile.c:15:2:
954:info:configure In file included from /opt/lib/X11/config/Imake.tmpl:2157:2:
955:info:configure /opt/lib/X11/config/X11.tmpl:4120:12: Warning: value of undefined symbol UseInstalledOnCrossCompile is 0
956:info:configure In file included from Imakefile.c:15:2:
957:info:configure In file included from /opt/lib/X11/config/Imake.tmpl:2157:2:
958:info:configure /opt/lib/X11/config/X11.tmpl:4138:13: Warning: value of undefined symbol UseInstalledOnCrossCompile is 0
959:info:configure In file included from Imakefile.c:15:2:
960:info:configure In file included from /opt/lib/X11/config/Imake.tmpl:2157:2:
961:info:configure /opt/lib/X11/config/X11.tmpl:4159:12: Warning: value of undefined symbol UseInstalledOnCrossCompile is 0
962:info:configure In file included from Imakefile.c:15:2:
963:info:configure In file included from /opt/lib/X11/config/Imake.tmpl:2157:2:
964:info:configure /opt/lib/X11/config/X11.tmpl:4211:12: Warning: value of undefined symbol UseInstalledOnCrossCompile is 0
965:info:configure In file included from Imakefile.c:15:2:
966:info:configure In file included from /opt/lib/X11/config/Imake.tmpl:2157:2:
967:info:configure /opt/lib/X11/config/X11.tmpl:4230:12: Warning: value of undefined symbol UseInstalledOnCrossCompile is 0
968:info:configure In file included from Imakefile.c:15:2:
969:info:configure In file included from /opt/lib/X11/config/Imake.tmpl:2157:2:
970:info:configure /opt/lib/X11/config/X11.tmpl:4302:12: Warning: value of undefined symbol UseInstalledOnCrossCompile is 0
971:info:configure In file included from Imakefile.c:15:2:
972:info:configure In file included from /opt/lib/X11/config/Imake.tmpl:2157:2:
973:info:configure /opt/lib/X11/config/X11.tmpl:4332:12: Warning: value of undefined symbol UseInstalledOnCrossCompile is 0
974:info:configure In file included from Imakefile.c:15:2:
975:info:configure In file included from /opt/lib/X11/config/Imake.tmpl:2157:2:
976:info:configure /opt/lib/X11/config/X11.tmpl:4348:12: Warning: value of undefined symbol UseInstalledOnCrossCompile is 0
977:info:configure In file included from Imakefile.c:15:2:
978:info:configure In file included from /opt/lib/X11/config/Imake.tmpl:2157:2:
979:info:configure /opt/lib/X11/config/X11.tmpl:4419:12: Warning: value of undefined symbol UseInstalledOnCrossCompile is 0
980:info:configure make[1]: Nothing to be done for `Makefiles'.
981:debug:configure Privilege de-escalation not attempted as not running as root.
982:debug:build build phase started at Mon Oct 20 09:35:49 CEST 2014
983:notice:build --->  Building tightvnc
984:debug:build Executing org.macports.build (tightvnc)
985:debug:build Environment:
986CC_PRINT_OPTIONS='YES'
987CC_PRINT_OPTIONS_FILE='/opt/var/macports/build/_opt_var_macports_sources_rsync.macports.org_release_tarballs_ports_x11_tightvnc/tightvnc/work/.CC_PRINT_OPTIONS'
988CPATH='/opt/include'
989LIBRARY_PATH='/opt/lib'
990MACOSX_DEPLOYMENT_TARGET='10.10'
991:debug:build Assembled command: 'cd "/opt/var/macports/build/_opt_var_macports_sources_rsync.macports.org_release_tarballs_ports_x11_tightvnc/tightvnc/work/vnc_unixsrc" && /usr/bin/make -j4 -w World'
992:debug:build Executing command line:  cd "/opt/var/macports/build/_opt_var_macports_sources_rsync.macports.org_release_tarballs_ports_x11_tightvnc/tightvnc/work/vnc_unixsrc" && /usr/bin/make -j4 -w World
993:info:build make: Entering directory `/opt/var/macports/build/_opt_var_macports_sources_rsync.macports.org_release_tarballs_ports_x11_tightvnc/tightvnc/work/vnc_unixsrc'
994:info:build make Makefiles
995:info:build make[1]: Entering directory `/opt/var/macports/build/_opt_var_macports_sources_rsync.macports.org_release_tarballs_ports_x11_tightvnc/tightvnc/work/vnc_unixsrc'
996:info:build making Makefiles in libvncauth...
997:info:build     mv -f Makefile Makefile.bak
998:info:build make[2]: Entering directory `/opt/var/macports/build/_opt_var_macports_sources_rsync.macports.org_release_tarballs_ports_x11_tightvnc/tightvnc/work/vnc_unixsrc'
999:info:build In file included from Imakefile.c:15:2:
1000:info:build In file included from /opt/lib/X11/config/Imake.tmpl:2157:2:
1001:info:build /opt/lib/X11/config/X11.tmpl:382:13: Warning: value of undefined symbol XF86Server is 0
1002:info:build In file included from Imakefile.c:15:2:
1003:info:build In file included from /opt/lib/X11/config/Imake.tmpl:2157:2:
1004:info:build /opt/lib/X11/config/X11.tmpl:783:10: Warning: value of undefined symbol HasCThreads is 0
1005:info:build In file included from Imakefile.c:15:2:
1006:info:build In file included from /opt/lib/X11/config/Imake.tmpl:2157:2:
1007:info:build /opt/lib/X11/config/X11.tmpl:3860:18: Warning: value of undefined symbol UseInstalledOnCrossCompile is 0
1008:info:build In file included from Imakefile.c:15:2:
1009:info:build In file included from /opt/lib/X11/config/Imake.tmpl:2157:2:
1010:info:build /opt/lib/X11/config/X11.tmpl:4077:13: Warning: value of undefined symbol UseInstalledOnCrossCompile is 0
1011:info:build In file included from Imakefile.c:15:2:
1012:info:build In file included from /opt/lib/X11/config/Imake.tmpl:2157:2:
1013:info:build /opt/lib/X11/config/X11.tmpl:4098:13: Warning: value of undefined symbol UseInstalledOnCrossCompile is 0
1014:info:build In file included from Imakefile.c:15:2:
1015:info:build In file included from /opt/lib/X11/config/Imake.tmpl:2157:2:
1016:info:build /opt/lib/X11/config/X11.tmpl:4120:12: Warning: value of undefined symbol UseInstalledOnCrossCompile is 0
1017:info:build In file included from Imakefile.c:15:2:
1018:info:build In file included from /opt/lib/X11/config/Imake.tmpl:2157:2:
1019:info:build /opt/lib/X11/config/X11.tmpl:4138:13: Warning: value of undefined symbol UseInstalledOnCrossCompile is 0
1020:info:build In file included from Imakefile.c:15:2:
1021:info:build In file included from /opt/lib/X11/config/Imake.tmpl:2157:2:
1022:info:build /opt/lib/X11/config/X11.tmpl:4159:12: Warning: value of undefined symbol UseInstalledOnCrossCompile is 0
1023:info:build In file included from Imakefile.c:15:2:
1024:info:build In file included from /opt/lib/X11/config/Imake.tmpl:2157:2:
1025:info:build /opt/lib/X11/config/X11.tmpl:4211:12: Warning: value of undefined symbol UseInstalledOnCrossCompile is 0
1026:info:build In file included from Imakefile.c:15:2:
1027:info:build In file included from /opt/lib/X11/config/Imake.tmpl:2157:2:
1028:info:build /opt/lib/X11/config/X11.tmpl:4230:12: Warning: value of undefined symbol UseInstalledOnCrossCompile is 0
1029:info:build In file included from Imakefile.c:15:2:
1030:info:build In file included from /opt/lib/X11/config/Imake.tmpl:2157:2:
1031:info:build /opt/lib/X11/config/X11.tmpl:4302:12: Warning: value of undefined symbol UseInstalledOnCrossCompile is 0
1032:info:build In file included from Imakefile.c:15:2:
1033:info:build In file included from /opt/lib/X11/config/Imake.tmpl:2157:2:
1034:info:build /opt/lib/X11/config/X11.tmpl:4332:12: Warning: value of undefined symbol UseInstalledOnCrossCompile is 0
1035:info:build In file included from Imakefile.c:15:2:
1036:info:build In file included from /opt/lib/X11/config/Imake.tmpl:2157:2:
1037:info:build /opt/lib/X11/config/X11.tmpl:4348:12: Warning: value of undefined symbol UseInstalledOnCrossCompile is 0
1038:info:build In file included from Imakefile.c:15:2:
1039:info:build In file included from /opt/lib/X11/config/Imake.tmpl:2157:2:
1040:info:build /opt/lib/X11/config/X11.tmpl:4419:12: Warning: value of undefined symbol UseInstalledOnCrossCompile is 0
1041:info:build make[2]: Leaving directory `/opt/var/macports/build/_opt_var_macports_sources_rsync.macports.org_release_tarballs_ports_x11_tightvnc/tightvnc/work/vnc_unixsrc'
1042:info:build make[2]: Entering directory `/opt/var/macports/build/_opt_var_macports_sources_rsync.macports.org_release_tarballs_ports_x11_tightvnc/tightvnc/work/vnc_unixsrc/libvncauth'
1043:info:build make[2]: Nothing to be done for `Makefiles'.
1044:info:build make[2]: Leaving directory `/opt/var/macports/build/_opt_var_macports_sources_rsync.macports.org_release_tarballs_ports_x11_tightvnc/tightvnc/work/vnc_unixsrc/libvncauth'
1045:info:build making Makefiles in vncviewer...
1046:info:build     mv -f Makefile Makefile.bak
1047:info:build make[2]: Entering directory `/opt/var/macports/build/_opt_var_macports_sources_rsync.macports.org_release_tarballs_ports_x11_tightvnc/tightvnc/work/vnc_unixsrc'
1048:info:build In file included from Imakefile.c:15:2:
1049:info:build In file included from /opt/lib/X11/config/Imake.tmpl:2157:2:
1050:info:build /opt/lib/X11/config/X11.tmpl:382:13: Warning: value of undefined symbol XF86Server is 0
1051:info:build In file included from Imakefile.c:15:2:
1052:info:build In file included from /opt/lib/X11/config/Imake.tmpl:2157:2:
1053:info:build /opt/lib/X11/config/X11.tmpl:783:10: Warning: value of undefined symbol HasCThreads is 0
1054:info:build In file included from Imakefile.c:15:2:
1055:info:build In file included from /opt/lib/X11/config/Imake.tmpl:2157:2:
1056:info:build /opt/lib/X11/config/X11.tmpl:3860:18: Warning: value of undefined symbol UseInstalledOnCrossCompile is 0
1057:info:build In file included from Imakefile.c:15:2:
1058:info:build In file included from /opt/lib/X11/config/Imake.tmpl:2157:2:
1059:info:build /opt/lib/X11/config/X11.tmpl:4077:13: Warning: value of undefined symbol UseInstalledOnCrossCompile is 0
1060:info:build In file included from Imakefile.c:15:2:
1061:info:build In file included from /opt/lib/X11/config/Imake.tmpl:2157:2:
1062:info:build /opt/lib/X11/config/X11.tmpl:4098:13: Warning: value of undefined symbol UseInstalledOnCrossCompile is 0
1063:info:build In file included from Imakefile.c:15:2:
1064:info:build In file included from /opt/lib/X11/config/Imake.tmpl:2157:2:
1065:info:build /opt/lib/X11/config/X11.tmpl:4120:12: Warning: value of undefined symbol UseInstalledOnCrossCompile is 0
1066:info:build In file included from Imakefile.c:15:2:
1067:info:build In file included from /opt/lib/X11/config/Imake.tmpl:2157:2:
1068:info:build /opt/lib/X11/config/X11.tmpl:4138:13: Warning: value of undefined symbol UseInstalledOnCrossCompile is 0
1069:info:build In file included from Imakefile.c:15:2:
1070:info:build In file included from /opt/lib/X11/config/Imake.tmpl:2157:2:
1071:info:build /opt/lib/X11/config/X11.tmpl:4159:12: Warning: value of undefined symbol UseInstalledOnCrossCompile is 0
1072:info:build In file included from Imakefile.c:15:2:
1073:info:build In file included from /opt/lib/X11/config/Imake.tmpl:2157:2:
1074:info:build /opt/lib/X11/config/X11.tmpl:4211:12: Warning: value of undefined symbol UseInstalledOnCrossCompile is 0
1075:info:build In file included from Imakefile.c:15:2:
1076:info:build In file included from /opt/lib/X11/config/Imake.tmpl:2157:2:
1077:info:build /opt/lib/X11/config/X11.tmpl:4230:12: Warning: value of undefined symbol UseInstalledOnCrossCompile is 0
1078:info:build In file included from Imakefile.c:15:2:
1079:info:build In file included from /opt/lib/X11/config/Imake.tmpl:2157:2:
1080:info:build /opt/lib/X11/config/X11.tmpl:4302:12: Warning: value of undefined symbol UseInstalledOnCrossCompile is 0
1081:info:build In file included from Imakefile.c:15:2:
1082:info:build In file included from /opt/lib/X11/config/Imake.tmpl:2157:2:
1083:info:build /opt/lib/X11/config/X11.tmpl:4332:12: Warning: value of undefined symbol UseInstalledOnCrossCompile is 0
1084:info:build In file included from Imakefile.c:15:2:
1085:info:build In file included from /opt/lib/X11/config/Imake.tmpl:2157:2:
1086:info:build /opt/lib/X11/config/X11.tmpl:4348:12: Warning: value of undefined symbol UseInstalledOnCrossCompile is 0
1087:info:build In file included from Imakefile.c:15:2:
1088:info:build In file included from /opt/lib/X11/config/Imake.tmpl:2157:2:
1089:info:build /opt/lib/X11/config/X11.tmpl:4419:12: Warning: value of undefined symbol UseInstalledOnCrossCompile is 0
1090:info:build make[2]: Leaving directory `/opt/var/macports/build/_opt_var_macports_sources_rsync.macports.org_release_tarballs_ports_x11_tightvnc/tightvnc/work/vnc_unixsrc'
1091:info:build make[2]: Entering directory `/opt/var/macports/build/_opt_var_macports_sources_rsync.macports.org_release_tarballs_ports_x11_tightvnc/tightvnc/work/vnc_unixsrc/vncviewer'
1092:info:build make[2]: Nothing to be done for `Makefiles'.
1093:info:build make[2]: Leaving directory `/opt/var/macports/build/_opt_var_macports_sources_rsync.macports.org_release_tarballs_ports_x11_tightvnc/tightvnc/work/vnc_unixsrc/vncviewer'
1094:info:build making Makefiles in vncpasswd...
1095:info:build     mv -f Makefile Makefile.bak
1096:info:build make[2]: Entering directory `/opt/var/macports/build/_opt_var_macports_sources_rsync.macports.org_release_tarballs_ports_x11_tightvnc/tightvnc/work/vnc_unixsrc'
1097:info:build In file included from Imakefile.c:15:2:
1098:info:build In file included from /opt/lib/X11/config/Imake.tmpl:2157:2:
1099:info:build /opt/lib/X11/config/X11.tmpl:382:13: Warning: value of undefined symbol XF86Server is 0
1100:info:build In file included from Imakefile.c:15:2:
1101:info:build In file included from /opt/lib/X11/config/Imake.tmpl:2157:2:
1102:info:build /opt/lib/X11/config/X11.tmpl:783:10: Warning: value of undefined symbol HasCThreads is 0
1103:info:build In file included from Imakefile.c:15:2:
1104:info:build In file included from /opt/lib/X11/config/Imake.tmpl:2157:2:
1105:info:build /opt/lib/X11/config/X11.tmpl:3860:18: Warning: value of undefined symbol UseInstalledOnCrossCompile is 0
1106:info:build In file included from Imakefile.c:15:2:
1107:info:build In file included from /opt/lib/X11/config/Imake.tmpl:2157:2:
1108:info:build /opt/lib/X11/config/X11.tmpl:4077:13: Warning: value of undefined symbol UseInstalledOnCrossCompile is 0
1109:info:build In file included from Imakefile.c:15:2:
1110:info:build In file included from /opt/lib/X11/config/Imake.tmpl:2157:2:
1111:info:build /opt/lib/X11/config/X11.tmpl:4098:13: Warning: value of undefined symbol UseInstalledOnCrossCompile is 0
1112:info:build In file included from Imakefile.c:15:2:
1113:info:build In file included from /opt/lib/X11/config/Imake.tmpl:2157:2:
1114:info:build /opt/lib/X11/config/X11.tmpl:4120:12: Warning: value of undefined symbol UseInstalledOnCrossCompile is 0
1115:info:build In file included from Imakefile.c:15:2:
1116:info:build In file included from /opt/lib/X11/config/Imake.tmpl:2157:2:
1117:info:build /opt/lib/X11/config/X11.tmpl:4138:13: Warning: value of undefined symbol UseInstalledOnCrossCompile is 0
1118:info:build In file included from Imakefile.c:15:2:
1119:info:build In file included from /opt/lib/X11/config/Imake.tmpl:2157:2:
1120:info:build /opt/lib/X11/config/X11.tmpl:4159:12: Warning: value of undefined symbol UseInstalledOnCrossCompile is 0
1121:info:build In file included from Imakefile.c:15:2:
1122:info:build In file included from /opt/lib/X11/config/Imake.tmpl:2157:2:
1123:info:build /opt/lib/X11/config/X11.tmpl:4211:12: Warning: value of undefined symbol UseInstalledOnCrossCompile is 0
1124:info:build In file included from Imakefile.c:15:2:
1125:info:build In file included from /opt/lib/X11/config/Imake.tmpl:2157:2:
1126:info:build /opt/lib/X11/config/X11.tmpl:4230:12: Warning: value of undefined symbol UseInstalledOnCrossCompile is 0
1127:info:build In file included from Imakefile.c:15:2:
1128:info:build In file included from /opt/lib/X11/config/Imake.tmpl:2157:2:
1129:info:build /opt/lib/X11/config/X11.tmpl:4302:12: Warning: value of undefined symbol UseInstalledOnCrossCompile is 0
1130:info:build In file included from Imakefile.c:15:2:
1131:info:build In file included from /opt/lib/X11/config/Imake.tmpl:2157:2:
1132:info:build /opt/lib/X11/config/X11.tmpl:4332:12: Warning: value of undefined symbol UseInstalledOnCrossCompile is 0
1133:info:build In file included from Imakefile.c:15:2:
1134:info:build In file included from /opt/lib/X11/config/Imake.tmpl:2157:2:
1135:info:build /opt/lib/X11/config/X11.tmpl:4348:12: Warning: value of undefined symbol UseInstalledOnCrossCompile is 0
1136:info:build In file included from Imakefile.c:15:2:
1137:info:build In file included from /opt/lib/X11/config/Imake.tmpl:2157:2:
1138:info:build /opt/lib/X11/config/X11.tmpl:4419:12: Warning: value of undefined symbol UseInstalledOnCrossCompile is 0
1139:info:build make[2]: Leaving directory `/opt/var/macports/build/_opt_var_macports_sources_rsync.macports.org_release_tarballs_ports_x11_tightvnc/tightvnc/work/vnc_unixsrc'
1140:info:build make[2]: Entering directory `/opt/var/macports/build/_opt_var_macports_sources_rsync.macports.org_release_tarballs_ports_x11_tightvnc/tightvnc/work/vnc_unixsrc/vncpasswd'
1141:info:build make[2]: Nothing to be done for `Makefiles'.
1142:info:build make[2]: Leaving directory `/opt/var/macports/build/_opt_var_macports_sources_rsync.macports.org_release_tarballs_ports_x11_tightvnc/tightvnc/work/vnc_unixsrc/vncpasswd'
1143:info:build making Makefiles in vncconnect...
1144:info:build     mv -f Makefile Makefile.bak
1145:info:build make[2]: Entering directory `/opt/var/macports/build/_opt_var_macports_sources_rsync.macports.org_release_tarballs_ports_x11_tightvnc/tightvnc/work/vnc_unixsrc'
1146:info:build In file included from Imakefile.c:15:2:
1147:info:build In file included from /opt/lib/X11/config/Imake.tmpl:2157:2:
1148:info:build /opt/lib/X11/config/X11.tmpl:382:13: Warning: value of undefined symbol XF86Server is 0
1149:info:build In file included from Imakefile.c:15:2:
1150:info:build In file included from /opt/lib/X11/config/Imake.tmpl:2157:2:
1151:info:build /opt/lib/X11/config/X11.tmpl:783:10: Warning: value of undefined symbol HasCThreads is 0
1152:info:build In file included from Imakefile.c:15:2:
1153:info:build In file included from /opt/lib/X11/config/Imake.tmpl:2157:2:
1154:info:build /opt/lib/X11/config/X11.tmpl:3860:18: Warning: value of undefined symbol UseInstalledOnCrossCompile is 0
1155:info:build In file included from Imakefile.c:15:2:
1156:info:build In file included from /opt/lib/X11/config/Imake.tmpl:2157:2:
1157:info:build /opt/lib/X11/config/X11.tmpl:4077:13: Warning: value of undefined symbol UseInstalledOnCrossCompile is 0
1158:info:build In file included from Imakefile.c:15:2:
1159:info:build In file included from /opt/lib/X11/config/Imake.tmpl:2157:2:
1160:info:build /opt/lib/X11/config/X11.tmpl:4098:13: Warning: value of undefined symbol UseInstalledOnCrossCompile is 0
1161:info:build In file included from Imakefile.c:15:2:
1162:info:build In file included from /opt/lib/X11/config/Imake.tmpl:2157:2:
1163:info:build /opt/lib/X11/config/X11.tmpl:4120:12: Warning: value of undefined symbol UseInstalledOnCrossCompile is 0
1164:info:build In file included from Imakefile.c:15:2:
1165:info:build In file included from /opt/lib/X11/config/Imake.tmpl:2157:2:
1166:info:build /opt/lib/X11/config/X11.tmpl:4138:13: Warning: value of undefined symbol UseInstalledOnCrossCompile is 0
1167:info:build In file included from Imakefile.c:15:2:
1168:info:build In file included from /opt/lib/X11/config/Imake.tmpl:2157:2:
1169:info:build /opt/lib/X11/config/X11.tmpl:4159:12: Warning: value of undefined symbol UseInstalledOnCrossCompile is 0
1170:info:build In file included from Imakefile.c:15:2:
1171:info:build In file included from /opt/lib/X11/config/Imake.tmpl:2157:2:
1172:info:build /opt/lib/X11/config/X11.tmpl:4211:12: Warning: value of undefined symbol UseInstalledOnCrossCompile is 0
1173:info:build In file included from Imakefile.c:15:2:
1174:info:build In file included from /opt/lib/X11/config/Imake.tmpl:2157:2:
1175:info:build /opt/lib/X11/config/X11.tmpl:4230:12: Warning: value of undefined symbol UseInstalledOnCrossCompile is 0
1176:info:build In file included from Imakefile.c:15:2:
1177:info:build In file included from /opt/lib/X11/config/Imake.tmpl:2157:2:
1178:info:build /opt/lib/X11/config/X11.tmpl:4302:12: Warning: value of undefined symbol UseInstalledOnCrossCompile is 0
1179:info:build In file included from Imakefile.c:15:2:
1180:info:build In file included from /opt/lib/X11/config/Imake.tmpl:2157:2:
1181:info:build /opt/lib/X11/config/X11.tmpl:4332:12: Warning: value of undefined symbol UseInstalledOnCrossCompile is 0
1182:info:build In file included from Imakefile.c:15:2:
1183:info:build In file included from /opt/lib/X11/config/Imake.tmpl:2157:2:
1184:info:build /opt/lib/X11/config/X11.tmpl:4348:12: Warning: value of undefined symbol UseInstalledOnCrossCompile is 0
1185:info:build In file included from Imakefile.c:15:2:
1186:info:build In file included from /opt/lib/X11/config/Imake.tmpl:2157:2:
1187:info:build /opt/lib/X11/config/X11.tmpl:4419:12: Warning: value of undefined symbol UseInstalledOnCrossCompile is 0
1188:info:build make[2]: Leaving directory `/opt/var/macports/build/_opt_var_macports_sources_rsync.macports.org_release_tarballs_ports_x11_tightvnc/tightvnc/work/vnc_unixsrc'
1189:info:build make[2]: Entering directory `/opt/var/macports/build/_opt_var_macports_sources_rsync.macports.org_release_tarballs_ports_x11_tightvnc/tightvnc/work/vnc_unixsrc/vncconnect'
1190:info:build make[2]: Nothing to be done for `Makefiles'.
1191:info:build make[2]: Leaving directory `/opt/var/macports/build/_opt_var_macports_sources_rsync.macports.org_release_tarballs_ports_x11_tightvnc/tightvnc/work/vnc_unixsrc/vncconnect'
1192:info:build make[1]: Leaving directory `/opt/var/macports/build/_opt_var_macports_sources_rsync.macports.org_release_tarballs_ports_x11_tightvnc/tightvnc/work/vnc_unixsrc'
1193:info:build make depend
1194:info:build make[1]: Entering directory `/opt/var/macports/build/_opt_var_macports_sources_rsync.macports.org_release_tarballs_ports_x11_tightvnc/tightvnc/work/vnc_unixsrc'
1195:info:build depending in ./libvncauth...
1196:info:build make[2]: Entering directory `/opt/var/macports/build/_opt_var_macports_sources_rsync.macports.org_release_tarballs_ports_x11_tightvnc/tightvnc/work/vnc_unixsrc/libvncauth'
1197:info:build gccmakedep  -- -I. -I../include  -I/opt/include    -D__x86_64__ -D__DARWIN__                                 -DNO_ALLOCA -DCSRG_BASED         -- vncauth.c d3des.c
1198:info:build make[2]: Leaving directory `/opt/var/macports/build/_opt_var_macports_sources_rsync.macports.org_release_tarballs_ports_x11_tightvnc/tightvnc/work/vnc_unixsrc/libvncauth'
1199:info:build depending in ./vncviewer...
1200:info:build make[2]: Entering directory `/opt/var/macports/build/_opt_var_macports_sources_rsync.macports.org_release_tarballs_ports_x11_tightvnc/tightvnc/work/vnc_unixsrc/vncviewer'
1201:info:build gccmakedep  -- -I../include -I. -I/opt/include -I/opt/include -I/usr/include  -I/opt/include    -D__x86_64__ -D__DARWIN__                                 -DNO_ALLOCA -DCSRG_BASED         -- argsresources.c   caps.c   colour.c   cursor.c   desktop.c   dialogs.c   fullscreen.c   listen.c   misc.c   popup.c   rfbproto.c   selection.c   shm.c   sockets.c   tunnel.c   vncviewer.c
1202:info:build make[2]: Leaving directory `/opt/var/macports/build/_opt_var_macports_sources_rsync.macports.org_release_tarballs_ports_x11_tightvnc/tightvnc/work/vnc_unixsrc/vncviewer'
1203:info:build depending in ./vncpasswd...
1204:info:build make[2]: Entering directory `/opt/var/macports/build/_opt_var_macports_sources_rsync.macports.org_release_tarballs_ports_x11_tightvnc/tightvnc/work/vnc_unixsrc/vncpasswd'
1205:info:build gccmakedep  -- -I../include  -I/opt/include    -D__x86_64__ -D__DARWIN__                                 -DNO_ALLOCA -DCSRG_BASED         -- vncpasswd.c
1206:info:build make[2]: Leaving directory `/opt/var/macports/build/_opt_var_macports_sources_rsync.macports.org_release_tarballs_ports_x11_tightvnc/tightvnc/work/vnc_unixsrc/vncpasswd'
1207:info:build depending in ./vncconnect...
1208:info:build make[2]: Entering directory `/opt/var/macports/build/_opt_var_macports_sources_rsync.macports.org_release_tarballs_ports_x11_tightvnc/tightvnc/work/vnc_unixsrc/vncconnect'
1209:info:build gccmakedep  --   -I/opt/include    -D__x86_64__ -D__DARWIN__                                 -DNO_ALLOCA -DCSRG_BASED         --
1210:info:build make[2]: Leaving directory `/opt/var/macports/build/_opt_var_macports_sources_rsync.macports.org_release_tarballs_ports_x11_tightvnc/tightvnc/work/vnc_unixsrc/vncconnect'
1211:info:build make[1]: Leaving directory `/opt/var/macports/build/_opt_var_macports_sources_rsync.macports.org_release_tarballs_ports_x11_tightvnc/tightvnc/work/vnc_unixsrc'
1212:info:build make all
1213:info:build make[1]: Entering directory `/opt/var/macports/build/_opt_var_macports_sources_rsync.macports.org_release_tarballs_ports_x11_tightvnc/tightvnc/work/vnc_unixsrc'
1214:info:build making all in ./libvncauth...
1215:info:build make[2]: Entering directory `/opt/var/macports/build/_opt_var_macports_sources_rsync.macports.org_release_tarballs_ports_x11_tightvnc/tightvnc/work/vnc_unixsrc/libvncauth'
1216:info:build /usr/bin/cc -Os -Wall -Wpointer-arith -no-cpp-precomp   -I. -I../include  -I/opt/include    -D__x86_64__ -D__DARWIN__                                 -DNO_ALLOCA -DCSRG_BASED          -c -o vncauth.o vncauth.c
1217:info:build /usr/bin/cc -Os -Wall -Wpointer-arith -no-cpp-precomp   -I. -I../include  -I/opt/include    -D__x86_64__ -D__DARWIN__                                 -DNO_ALLOCA -DCSRG_BASED          -c -o d3des.o d3des.c
1218:info:build d3des.c:37:22: warning: unused variable 'KnR' [-Wunused-variable]
1219:info:build static unsigned long KnR[32] = { 0L };
1220:info:build                      ^
1221:info:build d3des.c:38:22: warning: unused variable 'Kn3' [-Wunused-variable]
1222:info:build static unsigned long Kn3[32] = { 0L };
1223:info:build                      ^
1224:info:build d3des.c:39:22: warning: unused variable 'Df_Key' [-Wunused-variable]
1225:info:build static unsigned char Df_Key[24] = {
1226:info:build                      ^
1227:info:build vncauth.c:92:13: warning: passing 'unsigned char [16]' to parameter of type 'char *' converts between pointers to integer types with different sign [-Wpointer-sign]
1228:info:build     strncpy(encryptedPasswd, passwd, 8);
1229:info:build             ^~~~~~~~~~~~~~~
1230:info:build /usr/include/secure/_string.h:119:28: note: expanded from macro 'strncpy'
1231:info:build   __builtin___strncpy_chk (dest, src, len, __darwin_obsz (dest))
1232:info:build                            ^
1233:info:build vncauth.c:94:10: warning: passing 'unsigned char *' to parameter of type 'char *' converts between pointers to integer types with different sign [-Wpointer-sign]
1234:info:build         strncpy(encryptedPasswd + 8, passwdViewOnly, 8);
1235:info:build                 ^~~~~~~~~~~~~~~~~~~
1236:info:build /usr/include/secure/_string.h:119:28: note: expanded from macro 'strncpy'
1237:info:build   __builtin___strncpy_chk (dest, src, len, __darwin_obsz (dest))
1238:info:build                            ^
1239:info:build vncauth.c:76:9: warning: unused variable 'i' [-Wunused-variable]
1240:info:build     int i, bytesToWrite, bytesWrote;
1241:info:build         ^
1242:info:build vncauth.c:131:6: warning: implicit declaration of function 'vncDecryptPasswdFromFile2' is invalid in C99 [-Wimplicit-function-declaration]
1243:info:build         if (vncDecryptPasswdFromFile2(fname, passwd, NULL) == 0) {
1244:info:build             ^
1245:info:build vncauth.c:180:6: warning: passing 'char [16]' to parameter of type 'unsigned char *' converts between pointers to integer types with different sign [-Wpointer-sign]
1246:info:build         des(passwd, passwd);
1247:info:build             ^~~~~~
1248:info:build ./d3des.h:43:32: note: passing argument to parameter here
1249:info:build extern void des(unsigned char *, unsigned char *);
1250:info:build                                ^
1251:info:build vncauth.c:180:14: warning: passing 'char [16]' to parameter of type 'unsigned char *' converts between pointers to integer types with different sign [-Wpointer-sign]
1252:info:build         des(passwd, passwd);
1253:info:build                     ^~~~~~
1254:info:build ./d3des.h:43:49: note: passing argument to parameter here
1255:info:build extern void des(unsigned char *, unsigned char *);
1256:info:build                                                 ^
1257:info:build vncauth.c:187:6: warning: passing 'char *' to parameter of type 'unsigned char *' converts between pointers to integer types with different sign [-Wpointer-sign]
1258:info:build         des(&passwd[8], &passwd[8]);
1259:info:build             ^~~~~~~~~~
1260:info:build ./d3des.h:43:32: note: passing argument to parameter here
1261:info:build extern void des(unsigned char *, unsigned char *);
1262:info:build                                ^
1263:info:build vncauth.c:187:18: warning: passing 'char *' to parameter of type 'unsigned char *' converts between pointers to integer types with different sign [-Wpointer-sign]
1264:info:build         des(&passwd[8], &passwd[8]);
1265:info:build                         ^~~~~~~~~~
1266:info:build ./d3des.h:43:49: note: passing argument to parameter here
1267:info:build extern void des(unsigned char *, unsigned char *);
1268:info:build                                                 ^
1269:info:build vncauth.c:211:28: warning: implicit declaration of function 'time' is invalid in C99 [-Wimplicit-function-declaration]
1270:info:build       seed = (unsigned int)time(0) ^ (unsigned int)getpid();
1271:info:build                            ^
1272:info:build 9 warnings generated.
1273:info:build 3 warnings generated.
1274:info:build rm -f libvncauth.a
1275:info:build ar clq libvncauth.a vncauth.o d3des.o
1276:info:build ranlib libvncauth.a
1277:info:build make[2]: Leaving directory `/opt/var/macports/build/_opt_var_macports_sources_rsync.macports.org_release_tarballs_ports_x11_tightvnc/tightvnc/work/vnc_unixsrc/libvncauth'
1278:info:build making all in ./vncviewer...
1279:info:build make[2]: Entering directory `/opt/var/macports/build/_opt_var_macports_sources_rsync.macports.org_release_tarballs_ports_x11_tightvnc/tightvnc/work/vnc_unixsrc/vncviewer'
1280:info:build /usr/bin/cc -Os -Wall -Wpointer-arith -no-cpp-precomp   -I../include -I. -I/opt/include -I/opt/include -I/usr/include  -I/opt/include    -D__x86_64__ -D__DARWIN__                                 -DNO_ALLOCA -DCSRG_BASED          -c -o argsresources.o argsresources.c
1281:info:build /usr/bin/cc -Os -Wall -Wpointer-arith -no-cpp-precomp   -I../include -I. -I/opt/include -I/opt/include -I/usr/include  -I/opt/include    -D__x86_64__ -D__DARWIN__                                 -DNO_ALLOCA -DCSRG_BASED          -c -o caps.o caps.c
1282:info:build /usr/bin/cc -Os -Wall -Wpointer-arith -no-cpp-precomp   -I../include -I. -I/opt/include -I/opt/include -I/usr/include  -I/opt/include    -D__x86_64__ -D__DARWIN__                                 -DNO_ALLOCA -DCSRG_BASED          -c -o colour.o colour.c
1283:info:build /usr/bin/cc -Os -Wall -Wpointer-arith -no-cpp-precomp   -I../include -I. -I/opt/include -I/opt/include -I/usr/include  -I/opt/include    -D__x86_64__ -D__DARWIN__                                 -DNO_ALLOCA -DCSRG_BASED          -c -o cursor.o cursor.c
1284:info:build argsresources.c:345:7: warning: unused variable 'i' [-Wunused-variable]
1285:info:build   int i;
1286:info:build       ^
1287:info:build argsresources.c:378:14: warning: variable 'vncServerName' is used uninitialized whenever 'if' condition is true [-Wsometimes-uninitialized]
1288:info:build   } else if (argc != 2) {
1289:info:build              ^~~~~~~~~
1290:info:build argsresources.c:389:14: note: uninitialized use occurs here
1291:info:build   if (strlen(vncServerName) > 255) {
1292:info:build              ^~~~~~~~~~~~~
1293:info:build argsresources.c:378:10: note: remove the 'if' if its condition is always false
1294:info:build   } else if (argc != 2) {
1295:info:build          ^~~~~~~~~~~~~~~~
1296:info:build argsresources.c:346:22: note: initialize the variable 'vncServerName' to silence this warning
1297:info:build   char *vncServerName, *colonPos;
1298:info:build                      ^
1299:info:build                       = NULL
1300:info:build 2 warnings generated.
1301:info:build /usr/bin/cc -Os -Wall -Wpointer-arith -no-cpp-precomp   -I../include -I. -I/opt/include -I/opt/include -I/usr/include  -I/opt/include    -D__x86_64__ -D__DARWIN__                                 -DNO_ALLOCA -DCSRG_BASED          -c -o desktop.o desktop.c
1302:info:build /usr/bin/cc -Os -Wall -Wpointer-arith -no-cpp-precomp   -I../include -I. -I/opt/include -I/opt/include -I/usr/include  -I/opt/include    -D__x86_64__ -D__DARWIN__                                 -DNO_ALLOCA -DCSRG_BASED          -c -o dialogs.o dialogs.c
1303:info:build /usr/bin/cc -Os -Wall -Wpointer-arith -no-cpp-precomp   -I../include -I. -I/opt/include -I/opt/include -I/usr/include  -I/opt/include    -D__x86_64__ -D__DARWIN__                                 -DNO_ALLOCA -DCSRG_BASED          -c -o fullscreen.o fullscreen.c
1304:info:build /usr/bin/cc -Os -Wall -Wpointer-arith -no-cpp-precomp   -I../include -I. -I/opt/include -I/opt/include -I/usr/include  -I/opt/include    -D__x86_64__ -D__DARWIN__                                 -DNO_ALLOCA -DCSRG_BASED          -c -o listen.o listen.c
1305:info:build desktop.c:182:15: warning: 'XKeycodeToKeysym' is deprecated [-Wdeprecated-declarations]
1306:info:build         SendKeyEvent(XKeycodeToKeysym(dpy, i, 0), False);
1307:info:build                      ^
1308:info:build /opt/include/X11/Xlib.h:1699:15: note: 'XKeycodeToKeysym' has been explicitly marked deprecated here
1309:info:build extern KeySym XKeycodeToKeysym(
1310:info:build               ^
1311:info:build desktop.c:315:12: warning: 'XKeycodeToKeysym' is deprecated [-Wdeprecated-declarations]
1312:info:build       ks = XKeycodeToKeysym(dpy, ev->xkey.keycode, 0);
1313:info:build            ^
1314:info:build /opt/include/X11/Xlib.h:1699:15: note: 'XKeycodeToKeysym' has been explicitly marked deprecated here
1315:info:build extern KeySym XKeycodeToKeysym(
1316:info:build               ^
1317:info:build /usr/bin/cc -Os -Wall -Wpointer-arith -no-cpp-precomp   -I../include -I. -I/opt/include -I/opt/include -I/usr/include  -I/opt/include    -D__x86_64__ -D__DARWIN__                                 -DNO_ALLOCA -DCSRG_BASED          -c -o misc.o misc.c
1318:info:build listen.c:48:21: warning: unused variable 'sock' [-Wunused-variable]
1319:info:build   int listenSocket, sock;
1320:info:build                     ^
1321:info:build listen.c:50:7: warning: unused variable 'n' [-Wunused-variable]
1322:info:build   int n;
1323:info:build       ^
1324:info:build 2 warnings generated.
1325:info:build /usr/bin/cc -Os -Wall -Wpointer-arith -no-cpp-precomp   -I../include -I. -I/opt/include -I/opt/include -I/usr/include  -I/opt/include    -D__x86_64__ -D__DARWIN__                                 -DNO_ALLOCA -DCSRG_BASED          -c -o popup.o popup.c
1326:info:build 2 warnings generated.
1327:info:build /usr/bin/cc -Os -Wall -Wpointer-arith -no-cpp-precomp   -I../include -I. -I/opt/include -I/opt/include -I/usr/include  -I/opt/include    -D__x86_64__ -D__DARWIN__                                 -DNO_ALLOCA -DCSRG_BASED          -c -o rfbproto.o rfbproto.c
1328:info:build /usr/bin/cc -Os -Wall -Wpointer-arith -no-cpp-precomp   -I../include -I. -I/opt/include -I/opt/include -I/usr/include  -I/opt/include    -D__x86_64__ -D__DARWIN__                                 -DNO_ALLOCA -DCSRG_BASED          -c -o selection.o selection.c
1329:info:build /usr/bin/cc -Os -Wall -Wpointer-arith -no-cpp-precomp   -I../include -I. -I/opt/include -I/opt/include -I/usr/include  -I/opt/include    -D__x86_64__ -D__DARWIN__                                 -DNO_ALLOCA -DCSRG_BASED          -c -o shm.o shm.c
1330:info:build /usr/bin/cc -Os -Wall -Wpointer-arith -no-cpp-precomp   -I../include -I. -I/opt/include -I/opt/include -I/usr/include  -I/opt/include    -D__x86_64__ -D__DARWIN__                                 -DNO_ALLOCA -DCSRG_BASED          -c -o sockets.o sockets.c
1331:info:build rfbproto.c:371:9: warning: unused variable 'secTypeNames' [-Wunused-variable]
1332:info:build   char *secTypeNames[] = {"None", "VncAuth"};
1333:info:build         ^
1334:info:build rfbproto.c:536:10: warning: unused variable 'authScheme' [-Wunused-variable]
1335:info:build   CARD32 authScheme;
1336:info:build          ^
1337:info:build rfbproto.c:994:7: warning: implicit declaration of function 'HandleCursorPos' is invalid in C99 [-Wimplicit-function-declaration]
1338:info:build         if (!HandleCursorPos(rect.r.x, rect.r.y)) {
1339:info:build              ^
1340:info:build rfbproto.c:963:9: warning: unused variable 'usecs' [-Wunused-variable]
1341:info:build     int usecs;
1342:info:build         ^
1343:info:build In file included from rfbproto.c:1262:
1344:info:build ./tight.c:98:12: warning: unused variable 'rawData' [-Wunused-variable]
1345:info:build   CARDBPP *rawData;
1346:info:build            ^
1347:info:build ./tight.c:464:7: warning: unused variable 'i' [-Wunused-variable]
1348:info:build   int i;
1349:info:build       ^
1350:info:build ./tight.c:466:12: warning: unused variable 'palette' [-Wunused-variable]
1351:info:build   CARDBPP *palette = (CARDBPP *)tightPalette;
1352:info:build            ^
1353:info:build /usr/bin/cc -Os -Wall -Wpointer-arith -no-cpp-precomp   -I../include -I. -I/opt/include -I/opt/include -I/usr/include  -I/opt/include    -D__x86_64__ -D__DARWIN__                                 -DNO_ALLOCA -DCSRG_BASED          -c -o tunnel.o tunnel.c
1354:info:build In file included from rfbproto.c:1269:
1355:info:build ./tight.c:98:12: warning: unused variable 'rawData' [-Wunused-variable]
1356:info:build   CARDBPP *rawData;
1357:info:build            ^
1358:info:build ./tight.c:464:7: warning: unused variable 'i' [-Wunused-variable]
1359:info:build   int i;
1360:info:build       ^
1361:info:build ./tight.c:466:12: warning: unused variable 'palette' [-Wunused-variable]
1362:info:build   CARDBPP *palette = (CARDBPP *)tightPalette;
1363:info:build            ^
1364:info:build In file included from rfbproto.c:1276:
1365:info:build ./tight.c:98:12: warning: unused variable 'rawData' [-Wunused-variable]
1366:info:build   CARDBPP *rawData;
1367:info:build            ^
1368:info:build In file included from rfbproto.c:1262:
1369:info:build ./tight.c:82:13: warning: unused function 'DecompressJpegRectBPP' [-Wunused-function]
1370:info:build static Bool DecompressJpegRectBPP(int x, int y, int w, int h);
1371:info:build             ^
1372:info:build /usr/bin/cc -Os -Wall -Wpointer-arith -no-cpp-precomp   -I../include -I. -I/opt/include -I/opt/include -I/usr/include  -I/opt/include    -D__x86_64__ -D__DARWIN__                                 -DNO_ALLOCA -DCSRG_BASED          -c -o vncviewer.o vncviewer.c
1373:info:build sockets.c:105:21: warning: format string is not a string literal (potentially insecure) [-Wformat-security]
1374:info:build             fprintf(stderr,programName);
1375:info:build                            ^~~~~~~~~~~
1376:info:build sockets.c:134:21: warning: format string is not a string literal (potentially insecure) [-Wformat-security]
1377:info:build             fprintf(stderr,programName);
1378:info:build                            ^~~~~~~~~~~
1379:info:build sockets.c:174:21: warning: format string is not a string literal (potentially insecure) [-Wformat-security]
1380:info:build             fprintf(stderr,programName);
1381:info:build                            ^~~~~~~~~~~
1382:info:build sockets.c:180:19: warning: format string is not a string literal (potentially insecure) [-Wformat-security]
1383:info:build           fprintf(stderr,programName);
1384:info:build                          ^~~~~~~~~~~
1385:info:build sockets.c:212:20: warning: format string is not a string literal (potentially insecure) [-Wformat-security]
1386:info:build     fprintf(stderr,programName);
1387:info:build                    ^~~~~~~~~~~
1388:info:build sockets.c:218:20: warning: format string is not a string literal (potentially insecure) [-Wformat-security]
1389:info:build     fprintf(stderr,programName);
1390:info:build                    ^~~~~~~~~~~
1391:info:build sockets.c:226:20: warning: format string is not a string literal (potentially insecure) [-Wformat-security]
1392:info:build     fprintf(stderr,programName);
1393:info:build                    ^~~~~~~~~~~
1394:info:build sockets.c:253:20: warning: format string is not a string literal (potentially insecure) [-Wformat-security]
1395:info:build     fprintf(stderr,programName);
1396:info:build                    ^~~~~~~~~~~
1397:info:build sockets.c:288:20: warning: format string is not a string literal (potentially insecure) [-Wformat-security]
1398:info:build     fprintf(stderr,programName);
1399:info:build                    ^~~~~~~~~~~
1400:info:build sockets.c:295:20: warning: format string is not a string literal (potentially insecure) [-Wformat-security]
1401:info:build     fprintf(stderr,programName);
1402:info:build                    ^~~~~~~~~~~
1403:info:build sockets.c:302:20: warning: format string is not a string literal (potentially insecure) [-Wformat-security]
1404:info:build     fprintf(stderr,programName);
1405:info:build                    ^~~~~~~~~~~
1406:info:build sockets.c:309:20: warning: format string is not a string literal (potentially insecure) [-Wformat-security]
1407:info:build     fprintf(stderr,programName);
1408:info:build                    ^~~~~~~~~~~
1409:info:build sockets.c:331:56: warning: passing 'int *' to parameter of type 'socklen_t *' (aka 'unsigned int *') converts between pointers to integer types with different sign [-Wpointer-sign]
1410:info:build   sock = accept(listenSock, (struct sockaddr *) &addr, &addrlen);
1411:info:build                                                        ^~~~~~~~
1412:info:build /usr/include/sys/socket.h:560:69: note: passing argument to parameter here
1413:info:build int     accept(int, struct sockaddr * __restrict, socklen_t * __restrict)
1414:info:build                                                                         ^
1415:info:build sockets.c:333:20: warning: format string is not a string literal (potentially insecure) [-Wformat-security]
1416:info:build     fprintf(stderr,programName);
1417:info:build                    ^~~~~~~~~~~
1418:info:build sockets.c:340:20: warning: format string is not a string literal (potentially insecure) [-Wformat-security]
1419:info:build     fprintf(stderr,programName);
1420:info:build                    ^~~~~~~~~~~
1421:info:build sockets.c:358:20: warning: format string is not a string literal (potentially insecure) [-Wformat-security]
1422:info:build     fprintf(stderr,programName);
1423:info:build                    ^~~~~~~~~~~
1424:info:build sockets.c:406:51: warning: passing 'int *' to parameter of type 'socklen_t *' (aka 'unsigned int *') converts between pointers to integer types with different sign [-Wpointer-sign]
1425:info:build   getpeername(sock, (struct sockaddr *)&peeraddr, &addrlen);
1426:info:build                                                   ^~~~~~~~
1427:info:build /usr/include/sys/socket.h:564:74: note: passing argument to parameter here
1428:info:build int     getpeername(int, struct sockaddr * __restrict, socklen_t * __restrict)
1429:info:build                                                                              ^
1430:info:build sockets.c:407:49: warning: passing 'int *' to parameter of type 'socklen_t *' (aka 'unsigned int *') converts between pointers to integer types with different sign [-Wpointer-sign]
1431:info:build   getsockname(sock, (struct sockaddr *)&myaddr, &addrlen);
1432:info:build                                                 ^~~~~~~~
1433:info:build /usr/include/sys/socket.h:566:74: note: passing argument to parameter here
1434:info:build int     getsockname(int, struct sockaddr * __restrict, socklen_t * __restrict)
1435:info:build                                                                              ^
1436:info:build tunnel.c:103:7: warning: unused variable 'port' [-Wunused-variable]
1437:info:build   int port;
1438:info:build       ^
1439:info:build 18 warnings generated.
1440:info:build rm -f vncviewer._man
1441:info:build if test -z "" ; then \
1442:info:build        cd `dirname vncviewer` && \
1443:info:build        ln -s `basename vncviewer.man` `basename vncviewer._man`; \
1444:info:build     else \
1445:info:build                  /usr/bin/cpp -undef -traditional -D__GNUC__  -D__apploaddir__=/opt/share/X11/app-defaults -D__appmansuffix__=1 -D__filemansuffix__=5 -D__libmansuffix__=3 -D__miscmansuffix__=7 -D__drivermansuffix__=4 -D__adminmansuffix__=8 -D__projectroot__=/opt -D__xconfigfile__=xorg.conf -D__xconfigdir__=/opt/lib/X11 -D__xlogfile__=Xorg -D__xservername__=Xorg -D__xorgversion__="\"`echo 7 6 0 | sed -e 's/ /./g' -e 's/^/Version\\\ /'`\" \"X Version 11\"" -D__vendorversion__="`echo 7 6 0 | sed -e 's/ /./g' -e 's/^/Version\\\ /'` X.Org"  \
1446:info:build          < vncviewer.man | sed -e '/^#  *[0-9][0-9]*  *.*$/d'                       -e '/^#line  *[0-9][0-9]*  *.*$/d'                      -e '/^[         ]*XCOMM$/s/XCOMM/#/'                    -e '/^[         ]*XCOMM[^a-zA-Z0-9_]/s/XCOMM/#/'                        -e '/^[         ]*XHASH/s/XHASH/#/'                     -e '/\@\@$/s/\@\@$/\\/' >vncviewer._man; \
1447:info:build     fi
1448:info:build 1 warning generated.
1449:info:build 12 warnings generated.
1450:info:build rm -f vncviewer
1451:info:build /usr/bin/cc -o vncviewer -Os -Wall -Wpointer-arith -no-cpp-precomp     -L/opt/lib   argsresources.o caps.o colour.o cursor.o desktop.o dialogs.o fullscreen.o listen.o misc.o popup.o rfbproto.o selection.o shm.o sockets.o tunnel.o vncviewer.o -lXaw -lXmu -lXt -lSM -lICE -lXpm  -lXext -lX11 ../libvncauth/libvncauth.a -L/opt/lib -lz -L/opt/lib -ljpeg     
1452:info:build make[2]: Leaving directory `/opt/var/macports/build/_opt_var_macports_sources_rsync.macports.org_release_tarballs_ports_x11_tightvnc/tightvnc/work/vnc_unixsrc/vncviewer'
1453:info:build making all in ./vncpasswd...
1454:info:build make[2]: Entering directory `/opt/var/macports/build/_opt_var_macports_sources_rsync.macports.org_release_tarballs_ports_x11_tightvnc/tightvnc/work/vnc_unixsrc/vncpasswd'
1455:info:build /usr/bin/cc -Os -Wall -Wpointer-arith -no-cpp-precomp   -I../include  -I/opt/include    -D__x86_64__ -D__DARWIN__                                 -DNO_ALLOCA -DCSRG_BASED          -c -o vncpasswd.o vncpasswd.c
1456:info:build vncpasswd.c:56:7: warning: unused variable 'i' [-Wunused-variable]
1457:info:build   int i;
1458:info:build       ^
1459:info:build vncpasswd.c:148:29: warning: data argument not used by format string [-Wformat-extra-args]
1460:info:build           argv[0], argv[0], argv[0]);
1461:info:build                             ^
1462:info:build 2 warnings generated.
1463:info:build rm -f vncpasswd
1464:info:build /usr/bin/cc -o vncpasswd -Os -Wall -Wpointer-arith -no-cpp-precomp     -L/opt/lib   vncpasswd.o ../libvncauth/libvncauth.a     
1465:info:build make[2]: Leaving directory `/opt/var/macports/build/_opt_var_macports_sources_rsync.macports.org_release_tarballs_ports_x11_tightvnc/tightvnc/work/vnc_unixsrc/vncpasswd'
1466:info:build making all in ./vncconnect...
1467:info:build make[2]: Entering directory `/opt/var/macports/build/_opt_var_macports_sources_rsync.macports.org_release_tarballs_ports_x11_tightvnc/tightvnc/work/vnc_unixsrc/vncconnect'
1468:info:build /usr/bin/cc -Os -Wall -Wpointer-arith -no-cpp-precomp     -I/opt/include    -D__x86_64__ -D__DARWIN__                                 -DNO_ALLOCA -DCSRG_BASED          -c -o vncconnect.o vncconnect.c
1469:info:build rm -f vncconnect
1470:info:build /usr/bin/cc -o vncconnect -Os -Wall -Wpointer-arith -no-cpp-precomp     -L/opt/lib   vncconnect.o -lXext -lX11     
1471:info:build make[2]: Leaving directory `/opt/var/macports/build/_opt_var_macports_sources_rsync.macports.org_release_tarballs_ports_x11_tightvnc/tightvnc/work/vnc_unixsrc/vncconnect'
1472:info:build make[1]: Leaving directory `/opt/var/macports/build/_opt_var_macports_sources_rsync.macports.org_release_tarballs_ports_x11_tightvnc/tightvnc/work/vnc_unixsrc'
1473:info:build
1474:info:build Built libvncauth vncviewer vncpasswd vncconnect.
1475:info:build To build Xvnc, do "cd Xvnc", followed by "./configure" then "make"
1476:info:build
1477:info:build make: Leaving directory `/opt/var/macports/build/_opt_var_macports_sources_rsync.macports.org_release_tarballs_ports_x11_tightvnc/tightvnc/work/vnc_unixsrc'
1478:debug:build Executing proc-post-org.macports.build-build-0
1479:info:build imake -I../..//config/cf -DTOPDIR=../../ -DCURDIR=.
1480:info:build In file included from Imakefile.c:15:2:
1481:info:build In file included from ../..//config/cf/Imake.tmpl:90:2:
1482:info:build ../..//config/cf/darwin.cf:43:9: Warning: non-identical redefinition of HasGcc2
1483:info:build Imakefile.c:8:9: Previous definition was here
1484:info:build gcc -O2 -ansi -Dasm=__asm  -I../..//include -I../..//exports/include/X11  -I../../ -I../..//exports/include  -DCSRG_BASED   -DFUNCPROTO=15 -DNARROWPROTO    -DCPP_PROGRAM="\"/usr/bin/cpp\""   -c -o imake.o imake.c
1485:info:build imake.c:474:8: warning: using the result of an assignment as a condition without parentheses [-Wparentheses]
1486:info:build         if (p = getenv("IMAKEINCLUDE")) {
1487:info:build             ~~^~~~~~~~~~~~~~~~~~~~~~~~
1488:info:build imake.c:474:8: note: place parentheses around the assignment to silence this warning
1489:info:build         if (p = getenv("IMAKEINCLUDE")) {
1490:info:build               ^
1491:info:build             (                         )
1492:info:build imake.c:474:8: note: use '==' to turn this assignment into an equality comparison
1493:info:build         if (p = getenv("IMAKEINCLUDE")) {
1494:info:build               ^
1495:info:build               ==
1496:info:build imake.c:485:8: warning: using the result of an assignment as a condition without parentheses [-Wparentheses]
1497:info:build         if (p = getenv("IMAKECPP"))
1498:info:build             ~~^~~~~~~~~~~~~~~~~~~~
1499:info:build imake.c:485:8: note: place parentheses around the assignment to silence this warning
1500:info:build         if (p = getenv("IMAKECPP"))
1501:info:build               ^
1502:info:build             (                     )
1503:info:build imake.c:485:8: note: use '==' to turn this assignment into an equality comparison
1504:info:build         if (p = getenv("IMAKECPP"))
1505:info:build               ^
1506:info:build               ==
1507:info:build imake.c:487:8: warning: using the result of an assignment as a condition without parentheses [-Wparentheses]
1508:info:build         if (p = getenv("IMAKEMAKE"))
1509:info:build             ~~^~~~~~~~~~~~~~~~~~~~~
1510:info:build imake.c:487:8: note: place parentheses around the assignment to silence this warning
1511:info:build         if (p = getenv("IMAKEMAKE"))
1512:info:build               ^
1513:info:build             (                      )
1514:info:build imake.c:487:8: note: use '==' to turn this assignment into an equality comparison
1515:info:build         if (p = getenv("IMAKEMAKE"))
1516:info:build               ^
1517:info:build               ==
1518:info:build imake.c:1212:14: warning: using the result of an assignment as a condition without parentheses [-Wparentheses]
1519:info:build         while(input = ReadLine(tmpfd, tmpfname)) {
1520:info:build               ~~~~~~^~~~~~~~~~~~~~~~~~~~~~~~~~~
1521:info:build imake.c:1212:14: note: place parentheses around the assignment to silence this warning
1522:info:build         while(input = ReadLine(tmpfd, tmpfname)) {
1523:info:build                     ^
1524:info:build               (                                )
1525:info:build imake.c:1212:14: note: use '==' to turn this assignment into an equality comparison
1526:info:build         while(input = ReadLine(tmpfd, tmpfname)) {
1527:info:build                     ^
1528:info:build                     ==
1529:info:build 4 warnings generated.
1530:info:build rm -f imake
1531:info:build gcc -o imake -O2 -ansi -Dasm=__asm      imake.o       
1532:info:build clang: warning: argument unused during compilation: '-ansi'
1533:info:build mv -f Makefile Makefile.bak
1534:info:build imake -I.//config/cf -DTOPDIR=./ -DCURDIR=.
1535:info:build In file included from Imakefile.c:15:2:
1536:info:build In file included from .//config/cf/Imake.tmpl:90:2:
1537:info:build .//config/cf/darwin.cf:43:9: Warning: non-identical redefinition of HasGcc2
1538:info:build Imakefile.c:8:9: Previous definition was here
1539:info:build make Makefiles
1540:info:build making Makefiles in include...
1541:info:build In file included from Imakefile.c:8:
1542:info:build In file included from .././/config/cf/Imake.tmpl:41:
1543:info:build In file included from .././/config/cf/site.def:56:
1544:info:build .././/config/cf/vnc.def:109:25: warning: missing terminating '"' character [-Winvalid-pp-token]
1545:info:build #define XVendorString           \"AT&T Laboratories Cambridge\"
1546:info:build                                  ^
1547:info:build .././/config/cf/vnc.def:111:23: warning: missing terminating '"' character [-Winvalid-pp-token]
1548:info:build #define XvncRelease             \"TightVNC-1.3.10\"
1549:info:build                                  ^
1550:info:build In file included from Imakefile.c:8:
1551:info:build In file included from .././/config/cf/Imake.tmpl:164:
1552:info:build .././/config/cf/Imake.rules:1298:27: warning: empty character constant [-Winvalid-pp-token]
1553:info:build         for flag in ${MAKEFLAGS} ''; do \                               @@\
1554:info:build                                  ^
1555:info:build In file included from Imakefile.c:8:
1556:info:build .././/config/cf/Imake.tmpl:1320:10: fatal error: ' X11 .rules' file not found
1557:info:build #include ProjectRulesFile
1558:info:build          ^
1559:info:build .././/config/cf/Imake.tmpl:1318:35: note: expanded from macro 'ProjectRulesFile'
1560:info:build # define ProjectRulesFile       Concat3(<,TopLevelProject,.rules>)
1561:info:build                                         ^
1562:info:build .././/config/cf/Imake.rules:233:23: note: expanded from macro 'Concat3'
1563:info:build #define Concat3(a,b,c)a/**/b/**/c
1564:info:build                       ^
1565:info:build 3 warnings and 1 error generated.
1566:info:build .././/config/imake/imake: Exit code 1.
1567:info:build   Stop.
1568:info:build make[1]: *** [include/Makefile] Error 1
1569:info:build Makefile:17: *** missing separator.  Stop.
1570:info:build making Makefiles in config...
1571:info:build In file included from Imakefile.c:8:
1572:info:build In file included from .././/config/cf/Imake.tmpl:41:
1573:info:build In file included from .././/config/cf/site.def:56:
1574:info:build .././/config/cf/vnc.def:109:25: warning: missing terminating '"' character [-Winvalid-pp-token]
1575:info:build #define XVendorString           \"AT&T Laboratories Cambridge\"
1576:info:build                                  ^
1577:info:build .././/config/cf/vnc.def:111:23: warning: missing terminating '"' character [-Winvalid-pp-token]
1578:info:build #define XvncRelease             \"TightVNC-1.3.10\"
1579:info:build                                  ^
1580:info:build In file included from Imakefile.c:8:
1581:info:build In file included from .././/config/cf/Imake.tmpl:164:
1582:info:build .././/config/cf/Imake.rules:1298:27: warning: empty character constant [-Winvalid-pp-token]
1583:info:build         for flag in ${MAKEFLAGS} ''; do \                               @@\
1584:info:build                                  ^
1585:info:build In file included from Imakefile.c:8:
1586:info:build .././/config/cf/Imake.tmpl:1320:10: fatal error: ' X11 .rules' file not found
1587:info:build #include ProjectRulesFile
1588:info:build          ^
1589:info:build .././/config/cf/Imake.tmpl:1318:35: note: expanded from macro 'ProjectRulesFile'
1590:info:build # define ProjectRulesFile       Concat3(<,TopLevelProject,.rules>)
1591:info:build                                         ^
1592:info:build .././/config/cf/Imake.rules:233:23: note: expanded from macro 'Concat3'
1593:info:build #define Concat3(a,b,c)a/**/b/**/c
1594:info:build                       ^
1595:info:build 3 warnings and 1 error generated.
1596:info:build .././/config/imake/imake: Exit code 1.
1597:info:build   Stop.
1598:info:build make[1]: *** [config/Makefile] Error 1
1599:info:build Makefile:17: *** missing separator.  Stop.
1600:info:build making Makefiles in lib...
1601:info:build In file included from Imakefile.c:8:
1602:info:build In file included from .././/config/cf/Imake.tmpl:41:
1603:info:build In file included from .././/config/cf/site.def:56:
1604:info:build .././/config/cf/vnc.def:109:25: warning: missing terminating '"' character [-Winvalid-pp-token]
1605:info:build #define XVendorString           \"AT&T Laboratories Cambridge\"
1606:info:build                                  ^
1607:info:build .././/config/cf/vnc.def:111:23: warning: missing terminating '"' character [-Winvalid-pp-token]
1608:info:build #define XvncRelease             \"TightVNC-1.3.10\"
1609:info:build                                  ^
1610:info:build In file included from Imakefile.c:8:
1611:info:build In file included from .././/config/cf/Imake.tmpl:164:
1612:info:build .././/config/cf/Imake.rules:1298:27: warning: empty character constant [-Winvalid-pp-token]
1613:info:build         for flag in ${MAKEFLAGS} ''; do \                               @@\
1614:info:build                                  ^
1615:info:build In file included from Imakefile.c:8:
1616:info:build .././/config/cf/Imake.tmpl:1320:10: fatal error: ' X11 .rules' file not found
1617:info:build #include ProjectRulesFile
1618:info:build          ^
1619:info:build .././/config/cf/Imake.tmpl:1318:35: note: expanded from macro 'ProjectRulesFile'
1620:info:build # define ProjectRulesFile       Concat3(<,TopLevelProject,.rules>)
1621:info:build                                         ^
1622:info:build .././/config/cf/Imake.rules:233:23: note: expanded from macro 'Concat3'
1623:info:build #define Concat3(a,b,c)a/**/b/**/c
1624:info:build                       ^
1625:info:build 3 warnings and 1 error generated.
1626:info:build .././/config/imake/imake: Exit code 1.
1627:info:build   Stop.
1628:info:build make[1]: *** [lib/Makefile] Error 1
1629:info:build Makefile:17: *** missing separator.  Stop.
1630:info:build making Makefiles in programs...
1631:info:build In file included from Imakefile.c:8:
1632:info:build In file included from .././/config/cf/Imake.tmpl:41:
1633:info:build In file included from .././/config/cf/site.def:56:
1634:info:build .././/config/cf/vnc.def:109:25: warning: missing terminating '"' character [-Winvalid-pp-token]
1635:info:build #define XVendorString           \"AT&T Laboratories Cambridge\"
1636:info:build                                  ^
1637:info:build .././/config/cf/vnc.def:111:23: warning: missing terminating '"' character [-Winvalid-pp-token]
1638:info:build #define XvncRelease             \"TightVNC-1.3.10\"
1639:info:build                                  ^
1640:info:build In file included from Imakefile.c:8:
1641:info:build In file included from .././/config/cf/Imake.tmpl:164:
1642:info:build .././/config/cf/Imake.rules:1298:27: warning: empty character constant [-Winvalid-pp-token]
1643:info:build         for flag in ${MAKEFLAGS} ''; do \                               @@\
1644:info:build                                  ^
1645:info:build In file included from Imakefile.c:8:
1646:info:build .././/config/cf/Imake.tmpl:1320:10: fatal error: ' X11 .rules' file not found
1647:info:build #include ProjectRulesFile
1648:info:build          ^
1649:info:build .././/config/cf/Imake.tmpl:1318:35: note: expanded from macro 'ProjectRulesFile'
1650:info:build # define ProjectRulesFile       Concat3(<,TopLevelProject,.rules>)
1651:info:build                                         ^
1652:info:build .././/config/cf/Imake.rules:233:23: note: expanded from macro 'Concat3'
1653:info:build #define Concat3(a,b,c)a/**/b/**/c
1654:info:build                       ^
1655:info:build 3 warnings and 1 error generated.
1656:info:build .././/config/imake/imake: Exit code 1.
1657:info:build   Stop.
1658:info:build make[1]: *** [programs/Makefile] Error 1
1659:info:build Makefile:17: *** missing separator.  Stop.
1660:info:build make includes
1661:info:build + mkdir -p .//exports/include
1662:info:build + mkdir -p .//exports/bin
1663:info:build including in ./include...
1664:info:build Makefile:17: *** missing separator.  Stop.
1665:info:build including in ./config...
1666:info:build Makefile:17: *** missing separator.  Stop.
1667:info:build including in ./lib...
1668:info:build Makefile:17: *** missing separator.  Stop.
1669:info:build including in ./programs...
1670:info:build Makefile:17: *** missing separator.  Stop.
1671:info:build make: *** [includes] Error 2
1672:info:build make    all
1673:info:build making all in ./include...
1674:info:build Makefile:17: *** missing separator.  Stop.
1675:info:build making all in ./config...
1676:info:build Makefile:17: *** missing separator.  Stop.
1677:info:build making all in ./lib...
1678:info:build Makefile:17: *** missing separator.  Stop.
1679:info:build making all in ./programs...
1680:info:build Makefile:17: *** missing separator.  Stop.
1681:info:build make[1]: *** [all] Error 2
1682:info:build make: *** [World] Error 2
1683:info:build Command failed: cd '/opt/var/macports/build/_opt_var_macports_sources_rsync.macports.org_release_tarballs_ports_x11_tightvnc/tightvnc/work/vnc_unixsrc/Xvnc' && make World
1684:info:build Exit code: 2
1685:error:build org.macports.build for port tightvnc returned: command execution failed
1686:debug:build Error code: NONE
1687:debug:build Backtrace: command execution failed
1688    while executing
1689"proc-post-org.macports.build-build-0 org.macports.build"
1690    ("eval" body line 1)
1691    invoked from within
1692"eval $post $targetname"
1693:info:build Warning: targets not executed for tightvnc: org.macports.activate org.macports.build org.macports.destroot org.macports.install
1694:notice:build Please see the log file for port tightvnc for details:
1695    /opt/var/macports/logs/_opt_var_macports_sources_rsync.macports.org_release_tarballs_ports_x11_tightvnc/tightvnc/main.log