Ticket #46132: main.log

File main.log, 167.3 KB (added by pilgrimaflame@…, 7 years ago)
Line 
1version:1
2:debug:main epoch: in tree: 0 installed: 0
3:debug:main opensp 1.5.2_2 exists in the ports tree
4:debug:main opensp 1.5.2_2 +universal is the latest installed
5:debug:main opensp 1.5.2_2 +universal is active
6:debug:main Merging existing variants '+universal' into variants
7:debug:main new fully merged portvariants: universal +
8:debug:main Changing to port directory: /opt/local/var/macports/sources/www.macports.org/files/ports/textproc/opensp
9:debug:main OS darwin/11.4.2 (Mac OS X 10.7) arch i386
10:debug:main adding the default universal variant
11:debug:main Reading variant descriptions from /opt/local/var/macports/sources/www.macports.org/files/ports/_resources/port1.0/variant_descriptions.conf
12:debug:main Executing variant universal provides universal
13:debug:main Running callback portconfigure::add_automatic_compiler_dependencies
14:debug:main Finished running callback portconfigure::add_automatic_compiler_dependencies
15:debug:main Running callback portbuild::add_automatic_buildsystem_dependencies
16:debug:main Finished running callback portbuild::add_automatic_buildsystem_dependencies
17:debug:main No need to upgrade! opensp 1.5.2_2 >= opensp 1.5.2_2
18:debug:main epoch: in tree: 2 installed: 2
19:debug:main gettext 0.19.3_1 exists in the ports tree
20:debug:main gettext 0.19.3_1 +universal is the latest installed
21:debug:main gettext 0.19.3_1 +universal is active
22:debug:main Merging existing variants '+universal' into variants
23:debug:main new fully merged portvariants: universal +
24:debug:main Changing to port directory: /opt/local/var/macports/sources/www.macports.org/files/ports/devel/gettext
25:debug:main OS darwin/11.4.2 (Mac OS X 10.7) arch i386
26:debug:main Sourcing PortGroup compiler_blacklist_versions 1.0 from /opt/local/var/macports/sources/www.macports.org/files/ports/_resources/port1.0/group/compiler_blacklist_versions-1.0.tcl
27:debug:main Reading variant descriptions from /opt/local/var/macports/sources/www.macports.org/files/ports/_resources/port1.0/variant_descriptions.conf
28:debug:main Sourcing PortGroup muniversal 1.0 from /opt/local/var/macports/sources/www.macports.org/files/ports/_resources/port1.0/group/muniversal-1.0.tcl
29:debug:main compiler clang 425.0.28 not blacklisted because it doesn't match {clang < 211.10.1}
30:debug:main universal variant already exists, so not adding the default one
31:debug:main Executing variant universal provides universal
32:debug:main Running callback portconfigure::add_automatic_compiler_dependencies
33:debug:main Finished running callback portconfigure::add_automatic_compiler_dependencies
34:debug:main Running callback portbuild::add_automatic_buildsystem_dependencies
35:debug:main Finished running callback portbuild::add_automatic_buildsystem_dependencies
36:debug:main No need to upgrade! gettext 0.19.3_1 >= gettext 0.19.3_1
37:debug:main epoch: in tree: 0 installed: 0
38:debug:main expat 2.1.0_0 exists in the ports tree
39:debug:main expat 2.1.0_0 +universal is the latest installed
40:debug:main expat 2.1.0_0 +universal is active
41:debug:main Merging existing variants '+universal' into variants
42:debug:main new fully merged portvariants: universal +
43:debug:main Changing to port directory: /opt/local/var/macports/sources/www.macports.org/files/ports/textproc/expat
44:debug:main OS darwin/11.4.2 (Mac OS X 10.7) arch i386
45:debug:main adding the default universal variant
46:debug:main Reading variant descriptions from /opt/local/var/macports/sources/www.macports.org/files/ports/_resources/port1.0/variant_descriptions.conf
47:debug:main Executing variant universal provides universal
48:debug:main Running callback portconfigure::add_automatic_compiler_dependencies
49:debug:main Finished running callback portconfigure::add_automatic_compiler_dependencies
50:debug:main Running callback portbuild::add_automatic_buildsystem_dependencies
51:debug:main Finished running callback portbuild::add_automatic_buildsystem_dependencies
52:debug:main No need to upgrade! expat 2.1.0_0 >= expat 2.1.0_0
53:debug:main epoch: in tree: 0 installed: 0
54:debug:main libiconv 1.14_0 exists in the ports tree
55:debug:main libiconv 1.14_0 +universal is the latest installed
56:debug:main libiconv 1.14_0 +universal is active
57:debug:main Merging existing variants '+universal' into variants
58:debug:main new fully merged portvariants: universal +
59:debug:main Changing to port directory: /opt/local/var/macports/sources/www.macports.org/files/ports/textproc/libiconv
60:debug:main OS darwin/11.4.2 (Mac OS X 10.7) arch i386
61:debug:main Reading variant descriptions from /opt/local/var/macports/sources/www.macports.org/files/ports/_resources/port1.0/variant_descriptions.conf
62:debug:main Sourcing PortGroup muniversal 1.0 from /opt/local/var/macports/sources/www.macports.org/files/ports/_resources/port1.0/group/muniversal-1.0.tcl
63:debug:main universal variant already exists, so not adding the default one
64:debug:main Executing variant universal provides universal
65:debug:main Running callback portconfigure::add_automatic_compiler_dependencies
66:debug:main Finished running callback portconfigure::add_automatic_compiler_dependencies
67:debug:main Running callback portbuild::add_automatic_buildsystem_dependencies
68:debug:main Finished running callback portbuild::add_automatic_buildsystem_dependencies
69:debug:main No need to upgrade! libiconv 1.14_0 >= libiconv 1.14_0
70:debug:main epoch: in tree: 0 installed: 0
71:debug:main ncurses 5.9_2 exists in the ports tree
72:debug:main ncurses 5.9_2 +universal is the latest installed
73:debug:main ncurses 5.9_2 +universal is active
74:debug:main Merging existing variants '+universal' into variants
75:debug:main new fully merged portvariants: universal +
76:debug:main Changing to port directory: /opt/local/var/macports/sources/www.macports.org/files/ports/devel/ncurses
77:debug:main OS darwin/11.4.2 (Mac OS X 10.7) arch i386
78:debug:main adding the default universal variant
79:debug:main Reading variant descriptions from /opt/local/var/macports/sources/www.macports.org/files/ports/_resources/port1.0/variant_descriptions.conf
80:debug:main Executing variant universal provides universal
81:debug:main Running callback portconfigure::add_automatic_compiler_dependencies
82:debug:main Finished running callback portconfigure::add_automatic_compiler_dependencies
83:debug:main Running callback portbuild::add_automatic_buildsystem_dependencies
84:debug:main Finished running callback portbuild::add_automatic_buildsystem_dependencies
85:debug:main No need to upgrade! ncurses 5.9_2 >= ncurses 5.9_2
86:debug:main epoch: in tree: 0 installed: 0
87:debug:main xmlcatmgr 2.2_1 exists in the ports tree
88:debug:main xmlcatmgr 2.2_1 +universal is the latest installed
89:debug:main xmlcatmgr 2.2_1 +universal is active
90:debug:main Merging existing variants '+universal' into variants
91:debug:main new fully merged portvariants: universal +
92:debug:main Changing to port directory: /opt/local/var/macports/sources/www.macports.org/files/ports/textproc/xmlcatmgr
93:debug:main OS darwin/11.4.2 (Mac OS X 10.7) arch i386
94:debug:main adding the default universal variant
95:debug:main Reading variant descriptions from /opt/local/var/macports/sources/www.macports.org/files/ports/_resources/port1.0/variant_descriptions.conf
96:debug:main Executing variant universal provides universal
97:debug:main Running callback portconfigure::add_automatic_compiler_dependencies
98:debug:main Finished running callback portconfigure::add_automatic_compiler_dependencies
99:debug:main Running callback portbuild::add_automatic_buildsystem_dependencies
100:debug:main Finished running callback portbuild::add_automatic_buildsystem_dependencies
101:debug:main No need to upgrade! xmlcatmgr 2.2_1 >= xmlcatmgr 2.2_1
102:msg:main --->  Computing dependencies for openjade:info:main .:debug:main openjade has no conflicts
103:debug:main Searching for dependency: opensp
104:debug:main Found Dependency: receipt exists for opensp
105:debug:main Searching for dependency: xmlcatmgr
106:debug:main Found Dependency: receipt exists for xmlcatmgr
107:msg:main
108:debug:main Executing org.macports.main (openjade)
109:debug:main changing euid/egid - current euid: 0 - current egid: 0
110:debug:main egid changed to: 500
111:debug:main euid changed to: 502
112:debug:archivefetch archivefetch phase started at Fri Dec  5 02:48:36 CST 2014
113:msg:archivefetch --->  Fetching archive for openjade
114:debug:archivefetch Executing org.macports.archivefetch (openjade)
115:debug:archivefetch euid/egid changed to: 0/0
116:debug:archivefetch chowned /opt/local/var/macports/incoming to macports
117:debug:archivefetch euid/egid changed to: 502/500
118:info:archivefetch --->  openjade-1.3.2_8+universal.darwin_11.i386-x86_64.tbz2 doesn't seem to exist in /opt/local/var/macports/incoming/verified
119:msg:archivefetch --->  Attempting to fetch openjade-1.3.2_8+universal.darwin_11.i386-x86_64.tbz2 from http://packages.macports.org/openjade
120:debug:archivefetch Fetching archive failed:: The requested URL returned error: 404
121:msg:archivefetch --->  Attempting to fetch openjade-1.3.2_8+universal.darwin_11.i386-x86_64.tbz2 from http://lil.fr.packages.macports.org/openjade
122:debug:archivefetch Fetching archive failed:: The requested URL returned error: 404
123:msg:archivefetch --->  Attempting to fetch openjade-1.3.2_8+universal.darwin_11.i386-x86_64.tbz2 from http://mse.uk.packages.macports.org/sites/packages.macports.org/openjade
124:debug:archivefetch Fetching archive failed:: The requested URL returned error: 404
125:debug:archivefetch Privilege de-escalation not attempted as not running as root.
126:debug:fetch fetch phase started at Fri Dec  5 02:48:38 CST 2014
127:notice:fetch --->  Fetching distfiles for openjade
128:debug:fetch Executing org.macports.fetch (openjade)
129:debug:fetch Privilege de-escalation not attempted as not running as root.
130:debug:checksum checksum phase started at Fri Dec  5 02:48:38 CST 2014
131:notice:checksum --->  Verifying checksums for openjade
132:debug:checksum Executing org.macports.checksum (openjade)
133:info:checksum --->  Checksumming openjade-1.3.2.tar.gz
134:debug:checksum Calculated (md5) is 7df692e3186109cc00db6825b777201e
135:debug:checksum Correct (md5) checksum for openjade-1.3.2.tar.gz
136:debug:checksum Privilege de-escalation not attempted as not running as root.
137:debug:extract extract phase started at Fri Dec  5 02:48:38 CST 2014
138:notice:extract --->  Extracting openjade
139:debug:extract Executing org.macports.extract (openjade)
140:info:extract --->  Extracting openjade-1.3.2.tar.gz
141:debug:extract setting option extract.args to '/opt/local/var/macports/distfiles/openjade/openjade-1.3.2.tar.gz'
142:debug:extract Environment:
143CC_PRINT_OPTIONS='YES'
144CC_PRINT_OPTIONS_FILE='/opt/local/var/macports/build/_opt_local_var_macports_sources_www.macports.org_files_ports_textproc_openjade/openjade/work/.CC_PRINT_OPTIONS'
145CPATH='/opt/local/include'
146LIBRARY_PATH='/opt/local/lib'
147MACOSX_DEPLOYMENT_TARGET='10.7'
148:debug:extract Assembled command: 'cd "/opt/local/var/macports/build/_opt_local_var_macports_sources_www.macports.org_files_ports_textproc_openjade/openjade/work" && /usr/bin/gzip -dc '/opt/local/var/macports/distfiles/openjade/openjade-1.3.2.tar.gz' | /usr/bin/gnutar --no-same-owner -xf -'
149:debug:extract Executing command line:  cd "/opt/local/var/macports/build/_opt_local_var_macports_sources_www.macports.org_files_ports_textproc_openjade/openjade/work" && /usr/bin/gzip -dc '/opt/local/var/macports/distfiles/openjade/openjade-1.3.2.tar.gz' | /usr/bin/gnutar --no-same-owner -xf -
150:debug:extract euid/egid changed to: 0/0
151:debug:extract chowned /opt/local/var/macports/build/_opt_local_var_macports_sources_www.macports.org_files_ports_textproc_openjade/openjade/work to macports
152:debug:extract euid/egid changed to: 502/500
153:debug:extract Privilege de-escalation not attempted as not running as root.
154:debug:patch patch phase started at Fri Dec  5 02:48:39 CST 2014
155:debug:patch Executing org.macports.patch (openjade)
156:notice:patch --->  Applying patches to openjade
157:info:patch --->  Applying clang.patch
158:debug:patch Environment:
159CC_PRINT_OPTIONS='YES'
160CC_PRINT_OPTIONS_FILE='/opt/local/var/macports/build/_opt_local_var_macports_sources_www.macports.org_files_ports_textproc_openjade/openjade/work/.CC_PRINT_OPTIONS'
161CPATH='/opt/local/include'
162LIBRARY_PATH='/opt/local/lib'
163MACOSX_DEPLOYMENT_TARGET='10.7'
164:debug:patch Assembled command: 'cd "/opt/local/var/macports/build/_opt_local_var_macports_sources_www.macports.org_files_ports_textproc_openjade/openjade/work/openjade-1.3.2" && /usr/bin/patch -p0'
165:debug:patch Executing command line:  cd "/opt/local/var/macports/build/_opt_local_var_macports_sources_www.macports.org_files_ports_textproc_openjade/openjade/work/openjade-1.3.2" && /usr/bin/patch -p0 < '/opt/local/var/macports/sources/www.macports.org/files/ports/textproc/openjade/files/clang.patch'
166:info:patch patching file Makefile.comm.in
167:info:patch patching file Makefile.lib.in
168:info:patch patching file Makefile.prog.in
169:info:patch patching file config/ltmain.sh
170:info:patch patching file configure
171:info:patch patching file spgrove/Makefile.sub
172:info:patch patching file style/Makefile.sub
173:info:patch patching file jade/TeXFOTBuilder.cxx
174:info:patch patching file jade/TransformFOTBuilder.cxx
175:info:patch --->  Applying patch-GroveApp.h
176:debug:patch Environment:
177CC_PRINT_OPTIONS='YES'
178CC_PRINT_OPTIONS_FILE='/opt/local/var/macports/build/_opt_local_var_macports_sources_www.macports.org_files_ports_textproc_openjade/openjade/work/.CC_PRINT_OPTIONS'
179CPATH='/opt/local/include'
180LIBRARY_PATH='/opt/local/lib'
181MACOSX_DEPLOYMENT_TARGET='10.7'
182:debug:patch Assembled command: 'cd "/opt/local/var/macports/build/_opt_local_var_macports_sources_www.macports.org_files_ports_textproc_openjade/openjade/work/openjade-1.3.2" && /usr/bin/patch -p0'
183:debug:patch Executing command line:  cd "/opt/local/var/macports/build/_opt_local_var_macports_sources_www.macports.org_files_ports_textproc_openjade/openjade/work/openjade-1.3.2" && /usr/bin/patch -p0 < '/opt/local/var/macports/sources/www.macports.org/files/ports/textproc/openjade/files/patch-GroveApp.h'
184:info:patch patching file spgrove/GroveApp.h
185:info:patch --->  Applying patch-GroveBuilder.cxx
186:debug:patch Environment:
187CC_PRINT_OPTIONS='YES'
188CC_PRINT_OPTIONS_FILE='/opt/local/var/macports/build/_opt_local_var_macports_sources_www.macports.org_files_ports_textproc_openjade/openjade/work/.CC_PRINT_OPTIONS'
189CPATH='/opt/local/include'
190LIBRARY_PATH='/opt/local/lib'
191MACOSX_DEPLOYMENT_TARGET='10.7'
192:debug:patch Assembled command: 'cd "/opt/local/var/macports/build/_opt_local_var_macports_sources_www.macports.org_files_ports_textproc_openjade/openjade/work/openjade-1.3.2" && /usr/bin/patch -p0'
193:debug:patch Executing command line:  cd "/opt/local/var/macports/build/_opt_local_var_macports_sources_www.macports.org_files_ports_textproc_openjade/openjade/work/openjade-1.3.2" && /usr/bin/patch -p0 < '/opt/local/var/macports/sources/www.macports.org/files/ports/textproc/openjade/files/patch-GroveBuilder.cxx'
194:info:patch patching file spgrove/GroveBuilder.cxx
195:info:patch --->  Applying patch-Node.h
196:debug:patch Environment:
197CC_PRINT_OPTIONS='YES'
198CC_PRINT_OPTIONS_FILE='/opt/local/var/macports/build/_opt_local_var_macports_sources_www.macports.org_files_ports_textproc_openjade/openjade/work/.CC_PRINT_OPTIONS'
199CPATH='/opt/local/include'
200LIBRARY_PATH='/opt/local/lib'
201MACOSX_DEPLOYMENT_TARGET='10.7'
202:debug:patch Assembled command: 'cd "/opt/local/var/macports/build/_opt_local_var_macports_sources_www.macports.org_files_ports_textproc_openjade/openjade/work/openjade-1.3.2" && /usr/bin/patch -p0'
203:debug:patch Executing command line:  cd "/opt/local/var/macports/build/_opt_local_var_macports_sources_www.macports.org_files_ports_textproc_openjade/openjade/work/openjade-1.3.2" && /usr/bin/patch -p0 < '/opt/local/var/macports/sources/www.macports.org/files/ports/textproc/openjade/files/patch-Node.h'
204:info:patch patching file grove/Node.h
205:info:patch --->  Applying openjade-getoptperl.patch
206:debug:patch Environment:
207CC_PRINT_OPTIONS='YES'
208CC_PRINT_OPTIONS_FILE='/opt/local/var/macports/build/_opt_local_var_macports_sources_www.macports.org_files_ports_textproc_openjade/openjade/work/.CC_PRINT_OPTIONS'
209CPATH='/opt/local/include'
210LIBRARY_PATH='/opt/local/lib'
211MACOSX_DEPLOYMENT_TARGET='10.7'
212:debug:patch Assembled command: 'cd "/opt/local/var/macports/build/_opt_local_var_macports_sources_www.macports.org_files_ports_textproc_openjade/openjade/work/openjade-1.3.2" && /usr/bin/patch -p0'
213:debug:patch Executing command line:  cd "/opt/local/var/macports/build/_opt_local_var_macports_sources_www.macports.org_files_ports_textproc_openjade/openjade/work/openjade-1.3.2" && /usr/bin/patch -p0 < '/opt/local/var/macports/sources/www.macports.org/files/ports/textproc/openjade/files/openjade-getoptperl.patch'
214:info:patch patching file ./msggen.pl
215:info:patch --->  Applying delete_la_files.patch
216:debug:patch Environment:
217CC_PRINT_OPTIONS='YES'
218CC_PRINT_OPTIONS_FILE='/opt/local/var/macports/build/_opt_local_var_macports_sources_www.macports.org_files_ports_textproc_openjade/openjade/work/.CC_PRINT_OPTIONS'
219CPATH='/opt/local/include'
220LIBRARY_PATH='/opt/local/lib'
221MACOSX_DEPLOYMENT_TARGET='10.7'
222:debug:patch Assembled command: 'cd "/opt/local/var/macports/build/_opt_local_var_macports_sources_www.macports.org_files_ports_textproc_openjade/openjade/work/openjade-1.3.2" && /usr/bin/patch -p0'
223:debug:patch Executing command line:  cd "/opt/local/var/macports/build/_opt_local_var_macports_sources_www.macports.org_files_ports_textproc_openjade/openjade/work/openjade-1.3.2" && /usr/bin/patch -p0 < '/opt/local/var/macports/sources/www.macports.org/files/ports/textproc/openjade/files/delete_la_files.patch'
224:info:patch patching file Makefile.prog.in
225:info:patch --->  Applying Makefile.prog.in.patch
226:debug:patch Environment:
227CC_PRINT_OPTIONS='YES'
228CC_PRINT_OPTIONS_FILE='/opt/local/var/macports/build/_opt_local_var_macports_sources_www.macports.org_files_ports_textproc_openjade/openjade/work/.CC_PRINT_OPTIONS'
229CPATH='/opt/local/include'
230LIBRARY_PATH='/opt/local/lib'
231MACOSX_DEPLOYMENT_TARGET='10.7'
232:debug:patch Assembled command: 'cd "/opt/local/var/macports/build/_opt_local_var_macports_sources_www.macports.org_files_ports_textproc_openjade/openjade/work/openjade-1.3.2" && /usr/bin/patch -p0'
233:debug:patch Executing command line:  cd "/opt/local/var/macports/build/_opt_local_var_macports_sources_www.macports.org_files_ports_textproc_openjade/openjade/work/openjade-1.3.2" && /usr/bin/patch -p0 < '/opt/local/var/macports/sources/www.macports.org/files/ports/textproc/openjade/files/Makefile.prog.in.patch'
234:info:patch patching file Makefile.prog.in
235:debug:patch Privilege de-escalation not attempted as not running as root.
236:debug:configure configure phase started at Fri Dec  5 02:48:39 CST 2014
237:notice:configure --->  Configuring openjade
238:debug:configure Using compiler 'Xcode LLVM-GCC 4.2'
239:debug:configure Executing org.macports.configure (openjade)
240:debug:configure Environment:
241CC='/usr/bin/llvm-gcc-4.2'
242CC_PRINT_OPTIONS='YES'
243CC_PRINT_OPTIONS_FILE='/opt/local/var/macports/build/_opt_local_var_macports_sources_www.macports.org_files_ports_textproc_openjade/openjade/work/.CC_PRINT_OPTIONS'
244CFLAGS='-pipe -Os -arch x86_64 -arch i386'
245CPATH='/opt/local/include'
246CPPFLAGS='-I/opt/local/include'
247CXX='/usr/bin/llvm-g++-4.2'
248CXXFLAGS='-pipe -Os -isystem /opt/local/include -fno-rtti -arch x86_64 -arch i386'
249F90FLAGS='-pipe -Os'
250FCFLAGS='-pipe -Os'
251FFLAGS='-pipe -Os'
252INSTALL='/usr/bin/install -c'
253LDFLAGS='-Wl,-headerpad_max_install_names -arch x86_64 -arch i386'
254LIBRARY_PATH='/opt/local/lib'
255LIBS='-L/opt/local/lib'
256MACOSX_DEPLOYMENT_TARGET='10.7'
257OBJC='/usr/bin/llvm-gcc-4.2'
258OBJCFLAGS='-pipe -Os -arch x86_64 -arch i386'
259OBJCXX='/usr/bin/llvm-g++-4.2'
260OBJCXXFLAGS='-pipe -Os -arch x86_64 -arch i386'
261:debug:configure Assembled command: 'cd "/opt/local/var/macports/build/_opt_local_var_macports_sources_www.macports.org_files_ports_textproc_openjade/openjade/work/openjade-1.3.2" && ./configure --prefix=/opt/local --disable-dependency-tracking --enable-http --enable-html --enable-mif --disable-dependency-tracking --enable-default-catalog=/opt/local/share/sgml/catalog --datadir=/opt/local/share/sgml/openjade --mandir=/opt/local/share/man'
262:debug:configure Executing command line:  cd "/opt/local/var/macports/build/_opt_local_var_macports_sources_www.macports.org_files_ports_textproc_openjade/openjade/work/openjade-1.3.2" && ./configure --prefix=/opt/local --disable-dependency-tracking --enable-http --enable-html --enable-mif --disable-dependency-tracking --enable-default-catalog=/opt/local/share/sgml/catalog --datadir=/opt/local/share/sgml/openjade --mandir=/opt/local/share/man
263:info:configure checking for a BSD-compatible install... /usr/bin/install -c
264:info:configure checking whether build environment is sane... yes
265:info:configure checking whether make sets ${MAKE}... no
266:info:configure checking for working aclocal... found
267:info:configure checking for working autoconf... found
268:info:configure checking for working automake... found
269:info:configure checking for working autoheader... found
270:info:configure checking for working makeinfo... found
271:info:configure checking location of OpenSP include files... checking for /opt/local/include/OpenSP... yes
272:info:configure checking location of OpenSP Library... /opt/local/lib
273:info:configure checking build system type... i386-apple-darwin11.4.2
274:info:configure checking host system type... i386-apple-darwin11.4.2
275:info:configure saving distribution makefiles...
276:info:configure checking for gcc... /usr/bin/llvm-gcc-4.2
277:info:configure checking for C compiler default output... a.out
278:info:configure checking whether the C compiler works... yes
279:info:configure checking whether we are cross compiling... no
280:info:configure checking for suffix of executables...
281:info:configure checking for suffix of object files... o
282:info:configure checking whether we are using the GNU C compiler... yes
283:info:configure checking whether /usr/bin/llvm-gcc-4.2 accepts -g... yes
284:info:configure checking for a BSD-compatible install... /usr/bin/install -c
285:info:configure checking whether ln -s works... yes
286:info:configure checking whether we are using the GNU C++ compiler... yes
287:info:configure checking whether /usr/bin/llvm-g++-4.2 accepts -g... yes
288:info:configure checking for perl... no
289:info:configure checking for ANSI C header files... no
290:info:configure checking for sys/types.h... yes
291:info:configure checking for sys/stat.h... yes
292:info:configure checking for stdlib.h... yes
293:info:configure checking for string.h... yes
294:info:configure checking for memory.h... yes
295:info:configure checking for strings.h... yes
296:info:configure checking for inttypes.h... yes
297:info:configure checking for stdint.h... yes
298:info:configure checking for unistd.h... yes
299:info:configure checking limits.h usability... yes
300:info:configure checking limits.h presence... no
301:info:configure configure: WARNING: limits.h: accepted by the compiler, rejected by the preprocessor!
302:info:configure configure: WARNING: limits.h: proceeding with the preprocessor's result
303:info:configure checking for limits.h... no
304:info:configure checking for /usr/bin/llvm-gcc-4.2 option to accept ANSI C... none needed
305:info:configure checking for an ANSI C-conforming const... yes
306:info:configure checking for inline... inline
307:info:configure checking for size_t... yes
308:info:configure checking for struct stat.st_blksize... yes
309:info:configure checking for sig_atomic_t in signal.h... yes
310:info:configure checking for size_t... (cached) yes
311:info:configure checking size of size_t... 8
312:info:configure checking for unsigned int... yes
313:info:configure checking size of unsigned int... 4
314:info:configure checking for setlocale... yes
315:info:configure checking for towupper... yes
316:info:configure checking for gettext... no
317:info:configure checking for gettext in -lintl... yes
318:info:configure checking for cthread_fork in -lthreads... no
319:info:configure checking whether size_t is unsigned int... no
320:info:configure checking support for bool... yes
321:info:configure checking for ANSI template instantiation... yes
322:info:configure checking whether to include support for http... checking how to run the C++ preprocessor... /usr/bin/llvm-g++-4.2 -E
323:info:configure yes
324:info:configure checking for main in -lnsl... no
325:info:configure checking for main in -lsocket... no
326:info:configure checking h_errno in netdb.h... yes
327:info:configure checking whether to enable support for FrameMaker MIF output... yes
328:info:configure checking whether to enable support for HTML+CSS output... yes
329:info:configure checking for default catalog... /opt/local/share/sgml/catalog
330:info:configure checking for default search path... none
331:info:configure checking for ld used by GCC... /usr/llvm-gcc-4.2/libexec/gcc/i686-apple-darwin11/4.2.1/ld
332:info:configure checking if the linker (/usr/llvm-gcc-4.2/libexec/gcc/i686-apple-darwin11/4.2.1/ld) is GNU ld... no
333:info:configure checking for /usr/llvm-gcc-4.2/libexec/gcc/i686-apple-darwin11/4.2.1/ld option to reload object files... -r
334:info:configure checking for BSD-compatible nm... nm
335:info:configure checking how to recognise dependant libraries... file_magic Mach-O dynamically linked shared library
336:info:configure checking command to parse nm output... ok
337:info:configure checking dlfcn.h usability... yes
338:info:configure checking dlfcn.h presence... yes
339:info:configure checking for dlfcn.h... yes
340:info:configure checking for ranlib... :
341:info:configure checking for strip... :
342:info:configure checking for objdir... .libs
343:info:configure checking for /usr/bin/llvm-gcc-4.2 option to produce PIC... -fno-common
344:info:configure checking if /usr/bin/llvm-gcc-4.2 PIC flag -fno-common works... yes
345:info:configure checking if /usr/bin/llvm-gcc-4.2 static flag -static works... no
346:info:configure checking if /usr/bin/llvm-gcc-4.2 supports -c -o file.o... no
347:info:configure checking if we can lock with hard links... yes
348:info:configure checking if /usr/bin/llvm-gcc-4.2 supports -fno-rtti -fno-exceptions... yes
349:info:configure checking whether the linker (/usr/llvm-gcc-4.2/libexec/gcc/i686-apple-darwin11/4.2.1/ld) supports shared libraries... yes
350:info:configure checking how to hardcode library paths into programs... unsupported
351:info:configure checking whether stripping libraries is possible... no
352:info:configure checking dynamic linker characteristics... darwin11.4.2 dyld
353:info:configure checking if libtool supports shared libraries... yes
354:info:configure creating libtool
355:info:configure configure: creating ./config.status
356:info:configure config.status: creating Makefile
357:info:configure config.status: creating Makefile.lib
358:info:configure config.status: creating Makefile.prog
359:info:configure config.status: creating Makefile.comm
360:info:configure config.status: creating include/config.h
361:debug:configure Executing proc-post-org.macports.configure-configure-0
362:info:configure --->  Patching Node.cxx: s|^#pragma implementation||g
363:debug:configure Executing reinplace: /usr/bin/sed {s|^#pragma implementation||g} < /opt/local/var/macports/build/_opt_local_var_macports_sources_www.macports.org_files_ports_textproc_openjade/openjade/work/openjade-1.3.2/grove/Node.cxx >@ file10 2>@stderr
364:debug:configure euid/egid changed to: 0/0
365:debug:configure chowned /opt/local/var/macports/build/_opt_local_var_macports_sources_www.macports.org_files_ports_textproc_openjade/openjade/work/openjade-1.3.2/grove/Node.cxx to macports
366:debug:configure euid/egid changed to: 502/500
367:debug:configure euid/egid changed to: 0/0
368:debug:configure setting attributes on /opt/local/var/macports/build/_opt_local_var_macports_sources_www.macports.org_files_ports_textproc_openjade/openjade/work/openjade-1.3.2/grove/Node.cxx
369:debug:configure euid/egid changed to: 502/500
370:info:configure --->  Patching msggen.pl: s|^#pragma implementation||g
371:debug:configure Executing reinplace: /usr/bin/sed {s|^#pragma implementation||g} < /opt/local/var/macports/build/_opt_local_var_macports_sources_www.macports.org_files_ports_textproc_openjade/openjade/work/openjade-1.3.2/msggen.pl >@ file10 2>@stderr
372:debug:configure euid/egid changed to: 0/0
373:debug:configure chowned /opt/local/var/macports/build/_opt_local_var_macports_sources_www.macports.org_files_ports_textproc_openjade/openjade/work/openjade-1.3.2/msggen.pl to macports
374:debug:configure euid/egid changed to: 502/500
375:debug:configure euid/egid changed to: 0/0
376:debug:configure setting attributes on /opt/local/var/macports/build/_opt_local_var_macports_sources_www.macports.org_files_ports_textproc_openjade/openjade/work/openjade-1.3.2/msggen.pl
377:debug:configure euid/egid changed to: 502/500
378:info:configure --->  Patching GroveApp.cxx: s|^#pragma implementation||g
379:debug:configure Executing reinplace: /usr/bin/sed {s|^#pragma implementation||g} < /opt/local/var/macports/build/_opt_local_var_macports_sources_www.macports.org_files_ports_textproc_openjade/openjade/work/openjade-1.3.2/spgrove/GroveApp.cxx >@ file10 2>@stderr
380:debug:configure euid/egid changed to: 0/0
381:debug:configure chowned /opt/local/var/macports/build/_opt_local_var_macports_sources_www.macports.org_files_ports_textproc_openjade/openjade/work/openjade-1.3.2/spgrove/GroveApp.cxx to macports
382:debug:configure euid/egid changed to: 502/500
383:debug:configure euid/egid changed to: 0/0
384:debug:configure setting attributes on /opt/local/var/macports/build/_opt_local_var_macports_sources_www.macports.org_files_ports_textproc_openjade/openjade/work/openjade-1.3.2/spgrove/GroveApp.cxx
385:debug:configure euid/egid changed to: 502/500
386:info:configure --->  Patching MessageModule.cxx: s|^#pragma implementation||g
387:debug:configure Executing reinplace: /usr/bin/sed {s|^#pragma implementation||g} < /opt/local/var/macports/build/_opt_local_var_macports_sources_www.macports.org_files_ports_textproc_openjade/openjade/work/openjade-1.3.2/style/MessageModule.cxx >@ file10 2>@stderr
388:debug:configure euid/egid changed to: 0/0
389:debug:configure chowned /opt/local/var/macports/build/_opt_local_var_macports_sources_www.macports.org_files_ports_textproc_openjade/openjade/work/openjade-1.3.2/style/MessageModule.cxx to macports
390:debug:configure euid/egid changed to: 502/500
391:debug:configure euid/egid changed to: 0/0
392:debug:configure setting attributes on /opt/local/var/macports/build/_opt_local_var_macports_sources_www.macports.org_files_ports_textproc_openjade/openjade/work/openjade-1.3.2/style/MessageModule.cxx
393:debug:configure euid/egid changed to: 502/500
394:info:configure --->  Patching EventGenerator.h: s|^#pragma interface||g
395:debug:configure Executing reinplace: /usr/bin/sed {s|^#pragma interface||g} < /opt/local/var/macports/build/_opt_local_var_macports_sources_www.macports.org_files_ports_textproc_openjade/openjade/work/openjade-1.3.2/generic/EventGenerator.h >@ file10 2>@stderr
396:debug:configure euid/egid changed to: 0/0
397:debug:configure chowned /opt/local/var/macports/build/_opt_local_var_macports_sources_www.macports.org_files_ports_textproc_openjade/openjade/work/openjade-1.3.2/generic/EventGenerator.h to macports
398:debug:configure euid/egid changed to: 502/500
399:debug:configure euid/egid changed to: 0/0
400:debug:configure setting attributes on /opt/local/var/macports/build/_opt_local_var_macports_sources_www.macports.org_files_ports_textproc_openjade/openjade/work/openjade-1.3.2/generic/EventGenerator.h
401:debug:configure euid/egid changed to: 502/500
402:info:configure --->  Patching ParserEventGeneratorKit.h: s|^#pragma interface||g
403:debug:configure Executing reinplace: /usr/bin/sed {s|^#pragma interface||g} < /opt/local/var/macports/build/_opt_local_var_macports_sources_www.macports.org_files_ports_textproc_openjade/openjade/work/openjade-1.3.2/generic/ParserEventGeneratorKit.h >@ file10 2>@stderr
404:debug:configure euid/egid changed to: 0/0
405:debug:configure chowned /opt/local/var/macports/build/_opt_local_var_macports_sources_www.macports.org_files_ports_textproc_openjade/openjade/work/openjade-1.3.2/generic/ParserEventGeneratorKit.h to macports
406:debug:configure euid/egid changed to: 502/500
407:debug:configure euid/egid changed to: 0/0
408:debug:configure setting attributes on /opt/local/var/macports/build/_opt_local_var_macports_sources_www.macports.org_files_ports_textproc_openjade/openjade/work/openjade-1.3.2/generic/ParserEventGeneratorKit.h
409:debug:configure euid/egid changed to: 502/500
410:info:configure --->  Patching SGMLApplication.h: s|^#pragma interface||g
411:debug:configure Executing reinplace: /usr/bin/sed {s|^#pragma interface||g} < /opt/local/var/macports/build/_opt_local_var_macports_sources_www.macports.org_files_ports_textproc_openjade/openjade/work/openjade-1.3.2/generic/SGMLApplication.h >@ file10 2>@stderr
412:debug:configure euid/egid changed to: 0/0
413:debug:configure chowned /opt/local/var/macports/build/_opt_local_var_macports_sources_www.macports.org_files_ports_textproc_openjade/openjade/work/openjade-1.3.2/generic/SGMLApplication.h to macports
414:debug:configure euid/egid changed to: 502/500
415:debug:configure euid/egid changed to: 0/0
416:debug:configure setting attributes on /opt/local/var/macports/build/_opt_local_var_macports_sources_www.macports.org_files_ports_textproc_openjade/openjade/work/openjade-1.3.2/generic/SGMLApplication.h
417:debug:configure euid/egid changed to: 502/500
418:info:configure --->  Patching Node.h: s|^#pragma interface||g
419:debug:configure Executing reinplace: /usr/bin/sed {s|^#pragma interface||g} < /opt/local/var/macports/build/_opt_local_var_macports_sources_www.macports.org_files_ports_textproc_openjade/openjade/work/openjade-1.3.2/grove/Node.h >@ file10 2>@stderr
420:debug:configure euid/egid changed to: 0/0
421:debug:configure chowned /opt/local/var/macports/build/_opt_local_var_macports_sources_www.macports.org_files_ports_textproc_openjade/openjade/work/openjade-1.3.2/grove/Node.h to macports
422:debug:configure euid/egid changed to: 502/500
423:debug:configure euid/egid changed to: 0/0
424:debug:configure setting attributes on /opt/local/var/macports/build/_opt_local_var_macports_sources_www.macports.org_files_ports_textproc_openjade/openjade/work/openjade-1.3.2/grove/Node.h
425:debug:configure euid/egid changed to: 502/500
426:info:configure --->  Patching msggen.pl: s|^#pragma interface||g
427:debug:configure Executing reinplace: /usr/bin/sed {s|^#pragma interface||g} < /opt/local/var/macports/build/_opt_local_var_macports_sources_www.macports.org_files_ports_textproc_openjade/openjade/work/openjade-1.3.2/msggen.pl >@ file10 2>@stderr
428:debug:configure euid/egid changed to: 0/0
429:debug:configure chowned /opt/local/var/macports/build/_opt_local_var_macports_sources_www.macports.org_files_ports_textproc_openjade/openjade/work/openjade-1.3.2/msggen.pl to macports
430:debug:configure euid/egid changed to: 502/500
431:debug:configure euid/egid changed to: 0/0
432:debug:configure setting attributes on /opt/local/var/macports/build/_opt_local_var_macports_sources_www.macports.org_files_ports_textproc_openjade/openjade/work/openjade-1.3.2/msggen.pl
433:debug:configure euid/egid changed to: 502/500
434:info:configure --->  Patching GroveApp.h: s|^#pragma interface||g
435:debug:configure Executing reinplace: /usr/bin/sed {s|^#pragma interface||g} < /opt/local/var/macports/build/_opt_local_var_macports_sources_www.macports.org_files_ports_textproc_openjade/openjade/work/openjade-1.3.2/spgrove/GroveApp.h >@ file10 2>@stderr
436:debug:configure euid/egid changed to: 0/0
437:debug:configure chowned /opt/local/var/macports/build/_opt_local_var_macports_sources_www.macports.org_files_ports_textproc_openjade/openjade/work/openjade-1.3.2/spgrove/GroveApp.h to macports
438:debug:configure euid/egid changed to: 502/500
439:debug:configure euid/egid changed to: 0/0
440:debug:configure setting attributes on /opt/local/var/macports/build/_opt_local_var_macports_sources_www.macports.org_files_ports_textproc_openjade/openjade/work/openjade-1.3.2/spgrove/GroveApp.h
441:debug:configure euid/egid changed to: 502/500
442:info:configure --->  Patching libtool: s|^CXX=.*$|CXX='/usr/bin/llvm-g++-4.2 -arch x86_64 -arch i386'|g
443:debug:configure Executing reinplace: /usr/bin/sed {s|^CXX=.*$|CXX='/usr/bin/llvm-g++-4.2 -arch x86_64 -arch i386'|g} < /opt/local/var/macports/build/_opt_local_var_macports_sources_www.macports.org_files_ports_textproc_openjade/openjade/work/openjade-1.3.2/libtool >@ file10 2>@stderr
444:debug:configure euid/egid changed to: 0/0
445:debug:configure chowned /opt/local/var/macports/build/_opt_local_var_macports_sources_www.macports.org_files_ports_textproc_openjade/openjade/work/openjade-1.3.2/libtool to macports
446:debug:configure euid/egid changed to: 502/500
447:debug:configure euid/egid changed to: 0/0
448:debug:configure setting attributes on /opt/local/var/macports/build/_opt_local_var_macports_sources_www.macports.org_files_ports_textproc_openjade/openjade/work/openjade-1.3.2/libtool
449:debug:configure euid/egid changed to: 502/500
450:info:configure --->  Patching libtool: s|^CC=.*$|CC='/usr/bin/llvm-gcc-4.2 -arch x86_64 -arch i386'|g
451:debug:configure Executing reinplace: /usr/bin/sed {s|^CC=.*$|CC='/usr/bin/llvm-gcc-4.2 -arch x86_64 -arch i386'|g} < /opt/local/var/macports/build/_opt_local_var_macports_sources_www.macports.org_files_ports_textproc_openjade/openjade/work/openjade-1.3.2/libtool >@ file10 2>@stderr
452:debug:configure euid/egid changed to: 0/0
453:debug:configure chowned /opt/local/var/macports/build/_opt_local_var_macports_sources_www.macports.org_files_ports_textproc_openjade/openjade/work/openjade-1.3.2/libtool to macports
454:debug:configure euid/egid changed to: 502/500
455:debug:configure euid/egid changed to: 0/0
456:debug:configure setting attributes on /opt/local/var/macports/build/_opt_local_var_macports_sources_www.macports.org_files_ports_textproc_openjade/openjade/work/openjade-1.3.2/libtool
457:debug:configure euid/egid changed to: 502/500
458:debug:configure Privilege de-escalation not attempted as not running as root.
459:debug:build build phase started at Fri Dec  5 02:48:48 CST 2014
460:notice:build --->  Building openjade
461:debug:build Executing org.macports.build (openjade)
462:debug:build Environment:
463CC_PRINT_OPTIONS='YES'
464CC_PRINT_OPTIONS_FILE='/opt/local/var/macports/build/_opt_local_var_macports_sources_www.macports.org_files_ports_textproc_openjade/openjade/work/.CC_PRINT_OPTIONS'
465CPATH='/opt/local/include'
466LIBRARY_PATH='/opt/local/lib'
467MACOSX_DEPLOYMENT_TARGET='10.7'
468:debug:build Assembled command: 'cd "/opt/local/var/macports/build/_opt_local_var_macports_sources_www.macports.org_files_ports_textproc_openjade/openjade/work/openjade-1.3.2" && /usr/bin/make -j2 -w all'
469:debug:build Executing command line:  cd "/opt/local/var/macports/build/_opt_local_var_macports_sources_www.macports.org_files_ports_textproc_openjade/openjade/work/openjade-1.3.2" && /usr/bin/make -j2 -w all
470:info:build make: Entering directory `/opt/local/var/macports/build/_opt_local_var_macports_sources_www.macports.org_files_ports_textproc_openjade/openjade/work/openjade-1.3.2'
471:info:build make[1]: Entering directory `/opt/local/var/macports/build/_opt_local_var_macports_sources_www.macports.org_files_ports_textproc_openjade/openjade/work/openjade-1.3.2'
472:info:build make[2]: Entering directory `/opt/local/var/macports/build/_opt_local_var_macports_sources_www.macports.org_files_ports_textproc_openjade/openjade/work/openjade-1.3.2/grove'
473:info:build echo 'LT_OBJS='`echo Node.o LocNode.o|sed 's/\.o/.lo/g'` >Makefile.lt
474:info:build make[2]: Leaving directory `/opt/local/var/macports/build/_opt_local_var_macports_sources_www.macports.org_files_ports_textproc_openjade/openjade/work/openjade-1.3.2/grove'
475:info:build make[2]: Entering directory `/opt/local/var/macports/build/_opt_local_var_macports_sources_www.macports.org_files_ports_textproc_openjade/openjade/work/openjade-1.3.2/grove'
476:info:build mkdir .libs
477:info:build /usr/bin/llvm-g++-4.2 -pipe -Os -isystem /opt/local/include -fno-rtti -arch x86_64 -arch i386 -I. -I./../include -I/opt/local/include/OpenSP -I/opt/local/include/OpenSP/.. "-DPACKAGE_NAME=\"\"" "-DPACKAGE_TARNAME=\"\"" "-DPACKAGE_VERSION=\"\"" "-DPACKAGE_STRING=\"\"" "-DPACKAGE_BUGREPORT=\"\"" "-DPACKAGE=\"openjade\"" "-DVERSION=\"1.3.2\"" -DHAVE_SYS_TYPES_H=1 -DHAVE_SYS_STAT_H=1 -DHAVE_STDLIB_H=1 -DHAVE_STRING_H=1 -DHAVE_MEMORY_H=1 -DHAVE_STRINGS_H=1 -DHAVE_INTTYPES_H=1 -DHAVE_STDINT_H=1 -DHAVE_UNISTD_H=1 -DHAVE_STRUCT_STAT_ST_BLKSIZE=1 -DHAVE_ST_BLKSIZE=1 -DSIZEOF_SIZE_T=8 -DSIZEOF_UNSIGNED_INT=4 -DSP_HAVE_LOCALE=1 -DSP_HAVE_WCHAR=1 -DSP_HAVE_GETTEXT=1 -DSP_HAVE_BOOL=1 -DSP_ANSI_CLASS_INST=1 -DSP_HAVE_SOCKET=1 -DJADE_MIF=1 -DJADE_HTML=1 -DSP_MULTI_BYTE=1 "-DSGML_CATALOG_FILES_DEFAULT=\"/opt/local/share/sgml/catalog\"" -DHAVE_DLFCN_H=1 "-DDEFAULT_SCHEME_BUILTINS=\"/opt/local/share/sgml/openjade/builtins.dsl\"" -c LocNode.cxx  -fno-common -DPIC
478:info:build rm -f .libs/Node.lo
479:info:build /usr/bin/llvm-g++-4.2 -pipe -Os -isystem /opt/local/include -fno-rtti -arch x86_64 -arch i386 -I. -I./../include -I/opt/local/include/OpenSP -I/opt/local/include/OpenSP/.. "-DPACKAGE_NAME=\"\"" "-DPACKAGE_TARNAME=\"\"" "-DPACKAGE_VERSION=\"\"" "-DPACKAGE_STRING=\"\"" "-DPACKAGE_BUGREPORT=\"\"" "-DPACKAGE=\"openjade\"" "-DVERSION=\"1.3.2\"" -DHAVE_SYS_TYPES_H=1 -DHAVE_SYS_STAT_H=1 -DHAVE_STDLIB_H=1 -DHAVE_STRING_H=1 -DHAVE_MEMORY_H=1 -DHAVE_STRINGS_H=1 -DHAVE_INTTYPES_H=1 -DHAVE_STDINT_H=1 -DHAVE_UNISTD_H=1 -DHAVE_STRUCT_STAT_ST_BLKSIZE=1 -DHAVE_ST_BLKSIZE=1 -DSIZEOF_SIZE_T=8 -DSIZEOF_UNSIGNED_INT=4 -DSP_HAVE_LOCALE=1 -DSP_HAVE_WCHAR=1 -DSP_HAVE_GETTEXT=1 -DSP_HAVE_BOOL=1 -DSP_ANSI_CLASS_INST=1 -DSP_HAVE_SOCKET=1 -DJADE_MIF=1 -DJADE_HTML=1 -DSP_MULTI_BYTE=1 "-DSGML_CATALOG_FILES_DEFAULT=\"/opt/local/share/sgml/catalog\"" -DHAVE_DLFCN_H=1 "-DDEFAULT_SCHEME_BUILTINS=\"/opt/local/share/sgml/openjade/builtins.dsl\"" -c Node.cxx  -fno-common -DPIC
480:info:build In file included from LocNode.cxx:5:
481:info:build ./../include/config.h:39:1: warning: "SP_DEFINE_TEMPLATES" redefined
482:info:build In file included from ./../include/config.h:10,
483:info:build                  from LocNode.cxx:5:
484:info:build /opt/local/include/OpenSP/config.h:367:1: warning: this is the location of the previous definition
485:info:build In file included from Node.cxx:8:
486:info:build ./../include/config.h:39:1: warning: "SP_DEFINE_TEMPLATES" redefined
487:info:build In file included from ./../include/config.h:10,
488:info:build                  from Node.cxx:8:
489:info:build /opt/local/include/OpenSP/config.h:367:1: warning: this is the location of the previous definition
490:info:build In file included from LocNode.cxx:5:
491:info:build ./../include/config.h:39:1: warning: "SP_DEFINE_TEMPLATES" redefined
492:info:build In file included from ./../include/config.h:10,
493:info:build                  from LocNode.cxx:5:
494:info:build /opt/local/include/OpenSP/config.h:367:1: warning: this is the location of the previous definition
495:info:build mv -f LocNode.o .libs/LocNode.lo
496:info:build /usr/bin/llvm-g++-4.2 -pipe -Os -isystem /opt/local/include -fno-rtti -arch x86_64 -arch i386 -I. -I./../include -I/opt/local/include/OpenSP -I/opt/local/include/OpenSP/.. "-DPACKAGE_NAME=\"\"" "-DPACKAGE_TARNAME=\"\"" "-DPACKAGE_VERSION=\"\"" "-DPACKAGE_STRING=\"\"" "-DPACKAGE_BUGREPORT=\"\"" "-DPACKAGE=\"openjade\"" "-DVERSION=\"1.3.2\"" -DHAVE_SYS_TYPES_H=1 -DHAVE_SYS_STAT_H=1 -DHAVE_STDLIB_H=1 -DHAVE_STRING_H=1 -DHAVE_MEMORY_H=1 -DHAVE_STRINGS_H=1 -DHAVE_INTTYPES_H=1 -DHAVE_STDINT_H=1 -DHAVE_UNISTD_H=1 -DHAVE_STRUCT_STAT_ST_BLKSIZE=1 -DHAVE_ST_BLKSIZE=1 -DSIZEOF_SIZE_T=8 -DSIZEOF_UNSIGNED_INT=4 -DSP_HAVE_LOCALE=1 -DSP_HAVE_WCHAR=1 -DSP_HAVE_GETTEXT=1 -DSP_HAVE_BOOL=1 -DSP_ANSI_CLASS_INST=1 -DSP_HAVE_SOCKET=1 -DJADE_MIF=1 -DJADE_HTML=1 -DSP_MULTI_BYTE=1 "-DSGML_CATALOG_FILES_DEFAULT=\"/opt/local/share/sgml/catalog\"" -DHAVE_DLFCN_H=1 "-DDEFAULT_SCHEME_BUILTINS=\"/opt/local/share/sgml/openjade/builtins.dsl\"" -c LocNode.cxx >/dev/null 2>&1
497:info:build mv -f .libs/LocNode.lo LocNode.lo
498:info:build In file included from Node.cxx:8:
499:info:build ./../include/config.h:39:1: warning: "SP_DEFINE_TEMPLATES" redefined
500:info:build In file included from ./../include/config.h:10,
501:info:build                  from Node.cxx:8:
502:info:build /opt/local/include/OpenSP/config.h:367:1: warning: this is the location of the previous definition
503:info:build mv -f Node.o .libs/Node.lo
504:info:build /usr/bin/llvm-g++-4.2 -pipe -Os -isystem /opt/local/include -fno-rtti -arch x86_64 -arch i386 -I. -I./../include -I/opt/local/include/OpenSP -I/opt/local/include/OpenSP/.. "-DPACKAGE_NAME=\"\"" "-DPACKAGE_TARNAME=\"\"" "-DPACKAGE_VERSION=\"\"" "-DPACKAGE_STRING=\"\"" "-DPACKAGE_BUGREPORT=\"\"" "-DPACKAGE=\"openjade\"" "-DVERSION=\"1.3.2\"" -DHAVE_SYS_TYPES_H=1 -DHAVE_SYS_STAT_H=1 -DHAVE_STDLIB_H=1 -DHAVE_STRING_H=1 -DHAVE_MEMORY_H=1 -DHAVE_STRINGS_H=1 -DHAVE_INTTYPES_H=1 -DHAVE_STDINT_H=1 -DHAVE_UNISTD_H=1 -DHAVE_STRUCT_STAT_ST_BLKSIZE=1 -DHAVE_ST_BLKSIZE=1 -DSIZEOF_SIZE_T=8 -DSIZEOF_UNSIGNED_INT=4 -DSP_HAVE_LOCALE=1 -DSP_HAVE_WCHAR=1 -DSP_HAVE_GETTEXT=1 -DSP_HAVE_BOOL=1 -DSP_ANSI_CLASS_INST=1 -DSP_HAVE_SOCKET=1 -DJADE_MIF=1 -DJADE_HTML=1 -DSP_MULTI_BYTE=1 "-DSGML_CATALOG_FILES_DEFAULT=\"/opt/local/share/sgml/catalog\"" -DHAVE_DLFCN_H=1 "-DDEFAULT_SCHEME_BUILTINS=\"/opt/local/share/sgml/openjade/builtins.dsl\"" -c Node.cxx >/dev/null 2>&1
505:info:build mv -f .libs/Node.lo Node.lo
506:info:build /bin/sh /opt/local/var/macports/build/_opt_local_var_macports_sources_www.macports.org_files_ports_textproc_openjade/openjade/work/openjade-1.3.2/libtool --mode=link /usr/bin/llvm-g++-4.2 -allow-undefined -o libogrove.la Node.lo LocNode.lo \
507:info:build         -rpath /opt/local/lib -version-info 0:1:0 -lm
508:info:build libtool: link: `-allow-undefined' is deprecated because it is the default
509:info:build rm -fr .libs/libogrove.la .libs/libogrove.* .libs/libogrove.*
510:info:build /usr/bin/llvm-g++-4.2 -arch x86_64 -arch i386 -dynamiclib -undefined suppress -flat_namespace -o .libs/libogrove.0.0.1.dylib  -lm  Node.lo LocNode.lo  -lm -lc -install_name  /opt/local/lib/libogrove.0.dylib -compatibility_version 1 -current_version 1.1
511:info:build (cd .libs && rm -f libogrove.0.dylib && ln -s libogrove.0.0.1.dylib libogrove.0.dylib)
512:info:build (cd .libs && rm -f libogrove.dylib && ln -s libogrove.0.0.1.dylib libogrove.dylib)
513:info:build ar cru .libs/libogrove.a  Node.o LocNode.o
514:info:build : .libs/libogrove.a
515:info:build creating libogrove.la
516:info:build (cd .libs && rm -f libogrove.la && ln -s ../libogrove.la libogrove.la)
517:info:build make[2]: Leaving directory `/opt/local/var/macports/build/_opt_local_var_macports_sources_www.macports.org_files_ports_textproc_openjade/openjade/work/openjade-1.3.2/grove'
518:info:build make[2]: Entering directory `/opt/local/var/macports/build/_opt_local_var_macports_sources_www.macports.org_files_ports_textproc_openjade/openjade/work/openjade-1.3.2/spgrove'
519:info:build echo 'LT_OBJS='`echo GroveApp.o GroveBuilder.o SdNode.o|sed 's/\.o/.lo/g'` >Makefile.lt
520:info:build make[2]: Leaving directory `/opt/local/var/macports/build/_opt_local_var_macports_sources_www.macports.org_files_ports_textproc_openjade/openjade/work/openjade-1.3.2/spgrove'
521:info:build make[2]: Entering directory `/opt/local/var/macports/build/_opt_local_var_macports_sources_www.macports.org_files_ports_textproc_openjade/openjade/work/openjade-1.3.2/spgrove'
522:info:build rm -f grove_inst.cxx
523:info:build perl ./../instmac.pl grove_inst.m4 >grove_inst.cxx
524:info:build chmod -w grove_inst.cxx
525:info:build mkdir .libs
526:info:build /usr/bin/llvm-g++-4.2 -pipe -Os -isystem /opt/local/include -fno-rtti -arch x86_64 -arch i386 -I. -I./../include -I./../grove -I/opt/local/include/OpenSP -I/opt/local/include/OpenSP/.. "-DPACKAGE_NAME=\"\"" "-DPACKAGE_TARNAME=\"\"" "-DPACKAGE_VERSION=\"\"" "-DPACKAGE_STRING=\"\"" "-DPACKAGE_BUGREPORT=\"\"" "-DPACKAGE=\"openjade\"" "-DVERSION=\"1.3.2\"" -DHAVE_SYS_TYPES_H=1 -DHAVE_SYS_STAT_H=1 -DHAVE_STDLIB_H=1 -DHAVE_STRING_H=1 -DHAVE_MEMORY_H=1 -DHAVE_STRINGS_H=1 -DHAVE_INTTYPES_H=1 -DHAVE_STDINT_H=1 -DHAVE_UNISTD_H=1 -DHAVE_STRUCT_STAT_ST_BLKSIZE=1 -DHAVE_ST_BLKSIZE=1 -DSIZEOF_SIZE_T=8 -DSIZEOF_UNSIGNED_INT=4 -DSP_HAVE_LOCALE=1 -DSP_HAVE_WCHAR=1 -DSP_HAVE_GETTEXT=1 -DSP_HAVE_BOOL=1 -DSP_ANSI_CLASS_INST=1 -DSP_HAVE_SOCKET=1 -DJADE_MIF=1 -DJADE_HTML=1 -DSP_MULTI_BYTE=1 "-DSGML_CATALOG_FILES_DEFAULT=\"/opt/local/share/sgml/catalog\"" -DHAVE_DLFCN_H=1 "-DDEFAULT_SCHEME_BUILTINS=\"/opt/local/share/sgml/openjade/builtins.dsl\"" -c GroveApp.cxx  -fno-common -DPIC
527:info:build In file included from GroveApp.cxx:8:
528:info:build ./../include/config.h:39:1: warning: "SP_DEFINE_TEMPLATES" redefined
529:info:build In file included from ./../include/config.h:10,
530:info:build                  from GroveApp.cxx:8:
531:info:build /opt/local/include/OpenSP/config.h:367:1: warning: this is the location of the previous definition
532:info:build rm -f .libs/SdNode.lo
533:info:build /usr/bin/llvm-g++-4.2 -pipe -Os -isystem /opt/local/include -fno-rtti -arch x86_64 -arch i386 -I. -I./../include -I./../grove -I/opt/local/include/OpenSP -I/opt/local/include/OpenSP/.. "-DPACKAGE_NAME=\"\"" "-DPACKAGE_TARNAME=\"\"" "-DPACKAGE_VERSION=\"\"" "-DPACKAGE_STRING=\"\"" "-DPACKAGE_BUGREPORT=\"\"" "-DPACKAGE=\"openjade\"" "-DVERSION=\"1.3.2\"" -DHAVE_SYS_TYPES_H=1 -DHAVE_SYS_STAT_H=1 -DHAVE_STDLIB_H=1 -DHAVE_STRING_H=1 -DHAVE_MEMORY_H=1 -DHAVE_STRINGS_H=1 -DHAVE_INTTYPES_H=1 -DHAVE_STDINT_H=1 -DHAVE_UNISTD_H=1 -DHAVE_STRUCT_STAT_ST_BLKSIZE=1 -DHAVE_ST_BLKSIZE=1 -DSIZEOF_SIZE_T=8 -DSIZEOF_UNSIGNED_INT=4 -DSP_HAVE_LOCALE=1 -DSP_HAVE_WCHAR=1 -DSP_HAVE_GETTEXT=1 -DSP_HAVE_BOOL=1 -DSP_ANSI_CLASS_INST=1 -DSP_HAVE_SOCKET=1 -DJADE_MIF=1 -DJADE_HTML=1 -DSP_MULTI_BYTE=1 "-DSGML_CATALOG_FILES_DEFAULT=\"/opt/local/share/sgml/catalog\"" -DHAVE_DLFCN_H=1 "-DDEFAULT_SCHEME_BUILTINS=\"/opt/local/share/sgml/openjade/builtins.dsl\"" -c SdNode.cxx  -fno-common -DPIC
534:info:build In file included from SdNode.cxx:5:
535:info:build ./../include/config.h:39:1: warning: "SP_DEFINE_TEMPLATES" redefined
536:info:build In file included from ./../include/config.h:10,
537:info:build                  from SdNode.cxx:5:
538:info:build /opt/local/include/OpenSP/config.h:367:1: warning: this is the location of the previous definition
539:info:build In file included from SdNode.cxx:5:
540:info:build ./../include/config.h:39:1: warning: "SP_DEFINE_TEMPLATES" redefined
541:info:build In file included from ./../include/config.h:10,
542:info:build                  from SdNode.cxx:5:
543:info:build /opt/local/include/OpenSP/config.h:367:1: warning: this is the location of the previous definition
544:info:build mv -f SdNode.o .libs/SdNode.lo
545:info:build /usr/bin/llvm-g++-4.2 -pipe -Os -isystem /opt/local/include -fno-rtti -arch x86_64 -arch i386 -I. -I./../include -I./../grove -I/opt/local/include/OpenSP -I/opt/local/include/OpenSP/.. "-DPACKAGE_NAME=\"\"" "-DPACKAGE_TARNAME=\"\"" "-DPACKAGE_VERSION=\"\"" "-DPACKAGE_STRING=\"\"" "-DPACKAGE_BUGREPORT=\"\"" "-DPACKAGE=\"openjade\"" "-DVERSION=\"1.3.2\"" -DHAVE_SYS_TYPES_H=1 -DHAVE_SYS_STAT_H=1 -DHAVE_STDLIB_H=1 -DHAVE_STRING_H=1 -DHAVE_MEMORY_H=1 -DHAVE_STRINGS_H=1 -DHAVE_INTTYPES_H=1 -DHAVE_STDINT_H=1 -DHAVE_UNISTD_H=1 -DHAVE_STRUCT_STAT_ST_BLKSIZE=1 -DHAVE_ST_BLKSIZE=1 -DSIZEOF_SIZE_T=8 -DSIZEOF_UNSIGNED_INT=4 -DSP_HAVE_LOCALE=1 -DSP_HAVE_WCHAR=1 -DSP_HAVE_GETTEXT=1 -DSP_HAVE_BOOL=1 -DSP_ANSI_CLASS_INST=1 -DSP_HAVE_SOCKET=1 -DJADE_MIF=1 -DJADE_HTML=1 -DSP_MULTI_BYTE=1 "-DSGML_CATALOG_FILES_DEFAULT=\"/opt/local/share/sgml/catalog\"" -DHAVE_DLFCN_H=1 "-DDEFAULT_SCHEME_BUILTINS=\"/opt/local/share/sgml/openjade/builtins.dsl\"" -c SdNode.cxx >/dev/null 2>&1
546:info:build mv -f .libs/SdNode.lo SdNode.lo
547:info:build In file included from GroveApp.cxx:8:
548:info:build ./../include/config.h:39:1: warning: "SP_DEFINE_TEMPLATES" redefined
549:info:build In file included from ./../include/config.h:10,
550:info:build                  from GroveApp.cxx:8:
551:info:build /opt/local/include/OpenSP/config.h:367:1: warning: this is the location of the previous definition
552:info:build rm -f .libs/GroveBuilder.lo
553:info:build /usr/bin/llvm-g++-4.2 -pipe -Os -isystem /opt/local/include -fno-rtti -arch x86_64 -arch i386 -I. -I./../include -I./../grove -I/opt/local/include/OpenSP -I/opt/local/include/OpenSP/.. "-DPACKAGE_NAME=\"\"" "-DPACKAGE_TARNAME=\"\"" "-DPACKAGE_VERSION=\"\"" "-DPACKAGE_STRING=\"\"" "-DPACKAGE_BUGREPORT=\"\"" "-DPACKAGE=\"openjade\"" "-DVERSION=\"1.3.2\"" -DHAVE_SYS_TYPES_H=1 -DHAVE_SYS_STAT_H=1 -DHAVE_STDLIB_H=1 -DHAVE_STRING_H=1 -DHAVE_MEMORY_H=1 -DHAVE_STRINGS_H=1 -DHAVE_INTTYPES_H=1 -DHAVE_STDINT_H=1 -DHAVE_UNISTD_H=1 -DHAVE_STRUCT_STAT_ST_BLKSIZE=1 -DHAVE_ST_BLKSIZE=1 -DSIZEOF_SIZE_T=8 -DSIZEOF_UNSIGNED_INT=4 -DSP_HAVE_LOCALE=1 -DSP_HAVE_WCHAR=1 -DSP_HAVE_GETTEXT=1 -DSP_HAVE_BOOL=1 -DSP_ANSI_CLASS_INST=1 -DSP_HAVE_SOCKET=1 -DJADE_MIF=1 -DJADE_HTML=1 -DSP_MULTI_BYTE=1 "-DSGML_CATALOG_FILES_DEFAULT=\"/opt/local/share/sgml/catalog\"" -DHAVE_DLFCN_H=1 "-DDEFAULT_SCHEME_BUILTINS=\"/opt/local/share/sgml/openjade/builtins.dsl\"" -c GroveBuilder.cxx  -fno-common -DPIC
554:info:build In file included from GroveBuilder.cxx:6:
555:info:build ./../include/config.h:39:1: warning: "SP_DEFINE_TEMPLATES" redefined
556:info:build In file included from ./../include/config.h:10,
557:info:build                  from GroveBuilder.cxx:6:
558:info:build /opt/local/include/OpenSP/config.h:367:1: warning: this is the location of the previous definition
559:info:build mv -f GroveApp.o .libs/GroveApp.lo
560:info:build /usr/bin/llvm-g++-4.2 -pipe -Os -isystem /opt/local/include -fno-rtti -arch x86_64 -arch i386 -I. -I./../include -I./../grove -I/opt/local/include/OpenSP -I/opt/local/include/OpenSP/.. "-DPACKAGE_NAME=\"\"" "-DPACKAGE_TARNAME=\"\"" "-DPACKAGE_VERSION=\"\"" "-DPACKAGE_STRING=\"\"" "-DPACKAGE_BUGREPORT=\"\"" "-DPACKAGE=\"openjade\"" "-DVERSION=\"1.3.2\"" -DHAVE_SYS_TYPES_H=1 -DHAVE_SYS_STAT_H=1 -DHAVE_STDLIB_H=1 -DHAVE_STRING_H=1 -DHAVE_MEMORY_H=1 -DHAVE_STRINGS_H=1 -DHAVE_INTTYPES_H=1 -DHAVE_STDINT_H=1 -DHAVE_UNISTD_H=1 -DHAVE_STRUCT_STAT_ST_BLKSIZE=1 -DHAVE_ST_BLKSIZE=1 -DSIZEOF_SIZE_T=8 -DSIZEOF_UNSIGNED_INT=4 -DSP_HAVE_LOCALE=1 -DSP_HAVE_WCHAR=1 -DSP_HAVE_GETTEXT=1 -DSP_HAVE_BOOL=1 -DSP_ANSI_CLASS_INST=1 -DSP_HAVE_SOCKET=1 -DJADE_MIF=1 -DJADE_HTML=1 -DSP_MULTI_BYTE=1 "-DSGML_CATALOG_FILES_DEFAULT=\"/opt/local/share/sgml/catalog\"" -DHAVE_DLFCN_H=1 "-DDEFAULT_SCHEME_BUILTINS=\"/opt/local/share/sgml/openjade/builtins.dsl\"" -c GroveApp.cxx >/dev/null 2>&1
561:info:build mv -f .libs/GroveApp.lo GroveApp.lo
562:info:build In file included from GroveBuilder.cxx:6:
563:info:build ./../include/config.h:39:1: warning: "SP_DEFINE_TEMPLATES" redefined
564:info:build In file included from ./../include/config.h:10,
565:info:build                  from GroveBuilder.cxx:6:
566:info:build /opt/local/include/OpenSP/config.h:367:1: warning: this is the location of the previous definition
567:info:build mv -f GroveBuilder.o .libs/GroveBuilder.lo
568:info:build /usr/bin/llvm-g++-4.2 -pipe -Os -isystem /opt/local/include -fno-rtti -arch x86_64 -arch i386 -I. -I./../include -I./../grove -I/opt/local/include/OpenSP -I/opt/local/include/OpenSP/.. "-DPACKAGE_NAME=\"\"" "-DPACKAGE_TARNAME=\"\"" "-DPACKAGE_VERSION=\"\"" "-DPACKAGE_STRING=\"\"" "-DPACKAGE_BUGREPORT=\"\"" "-DPACKAGE=\"openjade\"" "-DVERSION=\"1.3.2\"" -DHAVE_SYS_TYPES_H=1 -DHAVE_SYS_STAT_H=1 -DHAVE_STDLIB_H=1 -DHAVE_STRING_H=1 -DHAVE_MEMORY_H=1 -DHAVE_STRINGS_H=1 -DHAVE_INTTYPES_H=1 -DHAVE_STDINT_H=1 -DHAVE_UNISTD_H=1 -DHAVE_STRUCT_STAT_ST_BLKSIZE=1 -DHAVE_ST_BLKSIZE=1 -DSIZEOF_SIZE_T=8 -DSIZEOF_UNSIGNED_INT=4 -DSP_HAVE_LOCALE=1 -DSP_HAVE_WCHAR=1 -DSP_HAVE_GETTEXT=1 -DSP_HAVE_BOOL=1 -DSP_ANSI_CLASS_INST=1 -DSP_HAVE_SOCKET=1 -DJADE_MIF=1 -DJADE_HTML=1 -DSP_MULTI_BYTE=1 "-DSGML_CATALOG_FILES_DEFAULT=\"/opt/local/share/sgml/catalog\"" -DHAVE_DLFCN_H=1 "-DDEFAULT_SCHEME_BUILTINS=\"/opt/local/share/sgml/openjade/builtins.dsl\"" -c GroveBuilder.cxx >/dev/null 2>&1
569:info:build mv -f .libs/GroveBuilder.lo GroveBuilder.lo
570:info:build /bin/sh /opt/local/var/macports/build/_opt_local_var_macports_sources_www.macports.org_files_ports_textproc_openjade/openjade/work/openjade-1.3.2/libtool --mode=link /usr/bin/llvm-g++-4.2 -allow-undefined -o libospgrove.la GroveApp.lo GroveBuilder.lo SdNode.lo \
571:info:build         -rpath /opt/local/lib -version-info 0:1:0 -lm
572:info:build libtool: link: `-allow-undefined' is deprecated because it is the default
573:info:build rm -fr .libs/libospgrove.la .libs/libospgrove.* .libs/libospgrove.*
574:info:build /usr/bin/llvm-g++-4.2 -arch x86_64 -arch i386 -dynamiclib -undefined suppress -flat_namespace -o .libs/libospgrove.0.0.1.dylib  -lm  GroveApp.lo GroveBuilder.lo SdNode.lo  -lm -lc -install_name  /opt/local/lib/libospgrove.0.dylib -compatibility_version 1 -current_version 1.1
575:info:build (cd .libs && rm -f libospgrove.0.dylib && ln -s libospgrove.0.0.1.dylib libospgrove.0.dylib)
576:info:build (cd .libs && rm -f libospgrove.dylib && ln -s libospgrove.0.0.1.dylib libospgrove.dylib)
577:info:build ar cru .libs/libospgrove.a  GroveApp.o GroveBuilder.o SdNode.o
578:info:build : .libs/libospgrove.a
579:info:build creating libospgrove.la
580:info:build (cd .libs && rm -f libospgrove.la && ln -s ../libospgrove.la libospgrove.la)
581:info:build make[2]: Leaving directory `/opt/local/var/macports/build/_opt_local_var_macports_sources_www.macports.org_files_ports_textproc_openjade/openjade/work/openjade-1.3.2/spgrove'
582:info:build make[2]: Entering directory `/opt/local/var/macports/build/_opt_local_var_macports_sources_www.macports.org_files_ports_textproc_openjade/openjade/work/openjade-1.3.2/style'
583:info:build echo 'LT_OBJS='`echo LangObj.o Collector.o DssslApp.o InterpreterMessages.o DssslSpecEventHandler.o ELObj.o ELObjMessageArg.o Expression.o FOTBuilder.o FlowObj.o InheritedC.o Insn.o Interpreter.o NumberCache.o ProcessContext.o ProcessingMode.o SchemeParser.o Style.o StyleEngine.o primitive.o GroveManager.o Pattern.o MacroFlowObj.o style_inst.o MessageModule.o |sed 's/\.o/.lo/g'` >Makefile.lt
584:info:build make[2]: Leaving directory `/opt/local/var/macports/build/_opt_local_var_macports_sources_www.macports.org_files_ports_textproc_openjade/openjade/work/openjade-1.3.2/style'
585:info:build make[2]: Entering directory `/opt/local/var/macports/build/_opt_local_var_macports_sources_www.macports.org_files_ports_textproc_openjade/openjade/work/openjade-1.3.2/style'
586:info:build mkdir .libs
587:info:build /usr/bin/llvm-g++-4.2 -pipe -Os -isystem /opt/local/include -fno-rtti -arch x86_64 -arch i386 -I. -I./../include -I./../grove -I./../spgrove -I/opt/local/include/OpenSP -I/opt/local/include/OpenSP/.. "-DPACKAGE_NAME=\"\"" "-DPACKAGE_TARNAME=\"\"" "-DPACKAGE_VERSION=\"\"" "-DPACKAGE_STRING=\"\"" "-DPACKAGE_BUGREPORT=\"\"" "-DPACKAGE=\"openjade\"" "-DVERSION=\"1.3.2\"" -DHAVE_SYS_TYPES_H=1 -DHAVE_SYS_STAT_H=1 -DHAVE_STDLIB_H=1 -DHAVE_STRING_H=1 -DHAVE_MEMORY_H=1 -DHAVE_STRINGS_H=1 -DHAVE_INTTYPES_H=1 -DHAVE_STDINT_H=1 -DHAVE_UNISTD_H=1 -DHAVE_STRUCT_STAT_ST_BLKSIZE=1 -DHAVE_ST_BLKSIZE=1 -DSIZEOF_SIZE_T=8 -DSIZEOF_UNSIGNED_INT=4 -DSP_HAVE_LOCALE=1 -DSP_HAVE_WCHAR=1 -DSP_HAVE_GETTEXT=1 -DSP_HAVE_BOOL=1 -DSP_ANSI_CLASS_INST=1 -DSP_HAVE_SOCKET=1 -DJADE_MIF=1 -DJADE_HTML=1 -DSP_MULTI_BYTE=1 "-DSGML_CATALOG_FILES_DEFAULT=\"/opt/local/share/sgml/catalog\"" -DHAVE_DLFCN_H=1 "-DDEFAULT_SCHEME_BUILTINS=\"/opt/local/share/sgml/openjade/builtins.dsl\"" -c LangObj.cxx  -fno-common -DPIC
588:info:build rm -f .libs/Collector.lo
589:info:build /usr/bin/llvm-g++-4.2 -pipe -Os -isystem /opt/local/include -fno-rtti -arch x86_64 -arch i386 -I. -I./../include -I./../grove -I./../spgrove -I/opt/local/include/OpenSP -I/opt/local/include/OpenSP/.. "-DPACKAGE_NAME=\"\"" "-DPACKAGE_TARNAME=\"\"" "-DPACKAGE_VERSION=\"\"" "-DPACKAGE_STRING=\"\"" "-DPACKAGE_BUGREPORT=\"\"" "-DPACKAGE=\"openjade\"" "-DVERSION=\"1.3.2\"" -DHAVE_SYS_TYPES_H=1 -DHAVE_SYS_STAT_H=1 -DHAVE_STDLIB_H=1 -DHAVE_STRING_H=1 -DHAVE_MEMORY_H=1 -DHAVE_STRINGS_H=1 -DHAVE_INTTYPES_H=1 -DHAVE_STDINT_H=1 -DHAVE_UNISTD_H=1 -DHAVE_STRUCT_STAT_ST_BLKSIZE=1 -DHAVE_ST_BLKSIZE=1 -DSIZEOF_SIZE_T=8 -DSIZEOF_UNSIGNED_INT=4 -DSP_HAVE_LOCALE=1 -DSP_HAVE_WCHAR=1 -DSP_HAVE_GETTEXT=1 -DSP_HAVE_BOOL=1 -DSP_ANSI_CLASS_INST=1 -DSP_HAVE_SOCKET=1 -DJADE_MIF=1 -DJADE_HTML=1 -DSP_MULTI_BYTE=1 "-DSGML_CATALOG_FILES_DEFAULT=\"/opt/local/share/sgml/catalog\"" -DHAVE_DLFCN_H=1 "-DDEFAULT_SCHEME_BUILTINS=\"/opt/local/share/sgml/openjade/builtins.dsl\"" -c Collector.cxx  -fno-common -DPIC
590:info:build In file included from stylelib.h:6,
591:info:build                  from LangObj.cxx:4:
592:info:build ./../include/config.h:39:1: warning: "SP_DEFINE_TEMPLATES" redefined
593:info:build In file included from ./../include/config.h:10,
594:info:build                  from stylelib.h:6,
595:info:build                  from LangObj.cxx:4:
596:info:build /opt/local/include/OpenSP/config.h:367:1: warning: this is the location of the previous definition
597:info:build In file included from Collector.cxx:4:
598:info:build ./../include/config.h:39:1: warning: "SP_DEFINE_TEMPLATES" redefined
599:info:build In file included from ./../include/config.h:10,
600:info:build                  from Collector.cxx:4:
601:info:build /opt/local/include/OpenSP/config.h:367:1: warning: this is the location of the previous definition
602:info:build In file included from Collector.cxx:4:
603:info:build ./../include/config.h:39:1: warning: "SP_DEFINE_TEMPLATES" redefined
604:info:build In file included from ./../include/config.h:10,
605:info:build                  from Collector.cxx:4:
606:info:build /opt/local/include/OpenSP/config.h:367:1: warning: this is the location of the previous definition
607:info:build mv -f Collector.o .libs/Collector.lo
608:info:build /usr/bin/llvm-g++-4.2 -pipe -Os -isystem /opt/local/include -fno-rtti -arch x86_64 -arch i386 -I. -I./../include -I./../grove -I./../spgrove -I/opt/local/include/OpenSP -I/opt/local/include/OpenSP/.. "-DPACKAGE_NAME=\"\"" "-DPACKAGE_TARNAME=\"\"" "-DPACKAGE_VERSION=\"\"" "-DPACKAGE_STRING=\"\"" "-DPACKAGE_BUGREPORT=\"\"" "-DPACKAGE=\"openjade\"" "-DVERSION=\"1.3.2\"" -DHAVE_SYS_TYPES_H=1 -DHAVE_SYS_STAT_H=1 -DHAVE_STDLIB_H=1 -DHAVE_STRING_H=1 -DHAVE_MEMORY_H=1 -DHAVE_STRINGS_H=1 -DHAVE_INTTYPES_H=1 -DHAVE_STDINT_H=1 -DHAVE_UNISTD_H=1 -DHAVE_STRUCT_STAT_ST_BLKSIZE=1 -DHAVE_ST_BLKSIZE=1 -DSIZEOF_SIZE_T=8 -DSIZEOF_UNSIGNED_INT=4 -DSP_HAVE_LOCALE=1 -DSP_HAVE_WCHAR=1 -DSP_HAVE_GETTEXT=1 -DSP_HAVE_BOOL=1 -DSP_ANSI_CLASS_INST=1 -DSP_HAVE_SOCKET=1 -DJADE_MIF=1 -DJADE_HTML=1 -DSP_MULTI_BYTE=1 "-DSGML_CATALOG_FILES_DEFAULT=\"/opt/local/share/sgml/catalog\"" -DHAVE_DLFCN_H=1 "-DDEFAULT_SCHEME_BUILTINS=\"/opt/local/share/sgml/openjade/builtins.dsl\"" -c Collector.cxx >/dev/null 2>&1
609:info:build mv -f .libs/Collector.lo Collector.lo
610:info:build perl -w ./../msggen.pl -l jstyleModule DssslAppMessages.msg
611:info:build perl -w ./../msggen.pl -l jstyleModule InterpreterMessages.msg
612:info:build In file included from stylelib.h:6,
613:info:build                  from LangObj.cxx:4:
614:info:build ./../include/config.h:39:1: warning: "SP_DEFINE_TEMPLATES" redefined
615:info:build In file included from ./../include/config.h:10,
616:info:build                  from stylelib.h:6,
617:info:build                  from LangObj.cxx:4:
618:info:build /opt/local/include/OpenSP/config.h:367:1: warning: this is the location of the previous definition
619:info:build rm -f .libs/DssslSpecEventHandler.lo
620:info:build /usr/bin/llvm-g++-4.2 -pipe -Os -isystem /opt/local/include -fno-rtti -arch x86_64 -arch i386 -I. -I./../include -I./../grove -I./../spgrove -I/opt/local/include/OpenSP -I/opt/local/include/OpenSP/.. "-DPACKAGE_NAME=\"\"" "-DPACKAGE_TARNAME=\"\"" "-DPACKAGE_VERSION=\"\"" "-DPACKAGE_STRING=\"\"" "-DPACKAGE_BUGREPORT=\"\"" "-DPACKAGE=\"openjade\"" "-DVERSION=\"1.3.2\"" -DHAVE_SYS_TYPES_H=1 -DHAVE_SYS_STAT_H=1 -DHAVE_STDLIB_H=1 -DHAVE_STRING_H=1 -DHAVE_MEMORY_H=1 -DHAVE_STRINGS_H=1 -DHAVE_INTTYPES_H=1 -DHAVE_STDINT_H=1 -DHAVE_UNISTD_H=1 -DHAVE_STRUCT_STAT_ST_BLKSIZE=1 -DHAVE_ST_BLKSIZE=1 -DSIZEOF_SIZE_T=8 -DSIZEOF_UNSIGNED_INT=4 -DSP_HAVE_LOCALE=1 -DSP_HAVE_WCHAR=1 -DSP_HAVE_GETTEXT=1 -DSP_HAVE_BOOL=1 -DSP_ANSI_CLASS_INST=1 -DSP_HAVE_SOCKET=1 -DJADE_MIF=1 -DJADE_HTML=1 -DSP_MULTI_BYTE=1 "-DSGML_CATALOG_FILES_DEFAULT=\"/opt/local/share/sgml/catalog\"" -DHAVE_DLFCN_H=1 "-DDEFAULT_SCHEME_BUILTINS=\"/opt/local/share/sgml/openjade/builtins.dsl\"" -c DssslSpecEventHandler.cxx  -fno-common -DPIC
621:info:build In file included from stylelib.h:6,
622:info:build                  from DssslSpecEventHandler.cxx:4:
623:info:build ./../include/config.h:39:1: warning: "SP_DEFINE_TEMPLATES" redefined
624:info:build In file included from ./../include/config.h:10,
625:info:build                  from stylelib.h:6,
626:info:build                  from DssslSpecEventHandler.cxx:4:
627:info:build /opt/local/include/OpenSP/config.h:367:1: warning: this is the location of the previous definition
628:info:build mv -f LangObj.o .libs/LangObj.lo
629:info:build /usr/bin/llvm-g++-4.2 -pipe -Os -isystem /opt/local/include -fno-rtti -arch x86_64 -arch i386 -I. -I./../include -I./../grove -I./../spgrove -I/opt/local/include/OpenSP -I/opt/local/include/OpenSP/.. "-DPACKAGE_NAME=\"\"" "-DPACKAGE_TARNAME=\"\"" "-DPACKAGE_VERSION=\"\"" "-DPACKAGE_STRING=\"\"" "-DPACKAGE_BUGREPORT=\"\"" "-DPACKAGE=\"openjade\"" "-DVERSION=\"1.3.2\"" -DHAVE_SYS_TYPES_H=1 -DHAVE_SYS_STAT_H=1 -DHAVE_STDLIB_H=1 -DHAVE_STRING_H=1 -DHAVE_MEMORY_H=1 -DHAVE_STRINGS_H=1 -DHAVE_INTTYPES_H=1 -DHAVE_STDINT_H=1 -DHAVE_UNISTD_H=1 -DHAVE_STRUCT_STAT_ST_BLKSIZE=1 -DHAVE_ST_BLKSIZE=1 -DSIZEOF_SIZE_T=8 -DSIZEOF_UNSIGNED_INT=4 -DSP_HAVE_LOCALE=1 -DSP_HAVE_WCHAR=1 -DSP_HAVE_GETTEXT=1 -DSP_HAVE_BOOL=1 -DSP_ANSI_CLASS_INST=1 -DSP_HAVE_SOCKET=1 -DJADE_MIF=1 -DJADE_HTML=1 -DSP_MULTI_BYTE=1 "-DSGML_CATALOG_FILES_DEFAULT=\"/opt/local/share/sgml/catalog\"" -DHAVE_DLFCN_H=1 "-DDEFAULT_SCHEME_BUILTINS=\"/opt/local/share/sgml/openjade/builtins.dsl\"" -c LangObj.cxx >/dev/null 2>&1
630:info:build In file included from stylelib.h:6,
631:info:build                  from DssslSpecEventHandler.cxx:4:
632:info:build ./../include/config.h:39:1: warning: "SP_DEFINE_TEMPLATES" redefined
633:info:build In file included from ./../include/config.h:10,
634:info:build                  from stylelib.h:6,
635:info:build                  from DssslSpecEventHandler.cxx:4:
636:info:build /opt/local/include/OpenSP/config.h:367:1: warning: this is the location of the previous definition
637:info:build mv -f .libs/LangObj.lo LangObj.lo
638:info:build rm -f .libs/ELObj.lo
639:info:build /usr/bin/llvm-g++-4.2 -pipe -Os -isystem /opt/local/include -fno-rtti -arch x86_64 -arch i386 -I. -I./../include -I./../grove -I./../spgrove -I/opt/local/include/OpenSP -I/opt/local/include/OpenSP/.. "-DPACKAGE_NAME=\"\"" "-DPACKAGE_TARNAME=\"\"" "-DPACKAGE_VERSION=\"\"" "-DPACKAGE_STRING=\"\"" "-DPACKAGE_BUGREPORT=\"\"" "-DPACKAGE=\"openjade\"" "-DVERSION=\"1.3.2\"" -DHAVE_SYS_TYPES_H=1 -DHAVE_SYS_STAT_H=1 -DHAVE_STDLIB_H=1 -DHAVE_STRING_H=1 -DHAVE_MEMORY_H=1 -DHAVE_STRINGS_H=1 -DHAVE_INTTYPES_H=1 -DHAVE_STDINT_H=1 -DHAVE_UNISTD_H=1 -DHAVE_STRUCT_STAT_ST_BLKSIZE=1 -DHAVE_ST_BLKSIZE=1 -DSIZEOF_SIZE_T=8 -DSIZEOF_UNSIGNED_INT=4 -DSP_HAVE_LOCALE=1 -DSP_HAVE_WCHAR=1 -DSP_HAVE_GETTEXT=1 -DSP_HAVE_BOOL=1 -DSP_ANSI_CLASS_INST=1 -DSP_HAVE_SOCKET=1 -DJADE_MIF=1 -DJADE_HTML=1 -DSP_MULTI_BYTE=1 "-DSGML_CATALOG_FILES_DEFAULT=\"/opt/local/share/sgml/catalog\"" -DHAVE_DLFCN_H=1 "-DDEFAULT_SCHEME_BUILTINS=\"/opt/local/share/sgml/openjade/builtins.dsl\"" -c ELObj.cxx  -fno-common -DPIC
640:info:build In file included from stylelib.h:6,
641:info:build                  from ELObj.cxx:4:
642:info:build ./../include/config.h:39:1: warning: "SP_DEFINE_TEMPLATES" redefined
643:info:build In file included from ./../include/config.h:10,
644:info:build                  from stylelib.h:6,
645:info:build                  from ELObj.cxx:4:
646:info:build /opt/local/include/OpenSP/config.h:367:1: warning: this is the location of the previous definition
647:info:build mv -f DssslSpecEventHandler.o .libs/DssslSpecEventHandler.lo
648:info:build /usr/bin/llvm-g++-4.2 -pipe -Os -isystem /opt/local/include -fno-rtti -arch x86_64 -arch i386 -I. -I./../include -I./../grove -I./../spgrove -I/opt/local/include/OpenSP -I/opt/local/include/OpenSP/.. "-DPACKAGE_NAME=\"\"" "-DPACKAGE_TARNAME=\"\"" "-DPACKAGE_VERSION=\"\"" "-DPACKAGE_STRING=\"\"" "-DPACKAGE_BUGREPORT=\"\"" "-DPACKAGE=\"openjade\"" "-DVERSION=\"1.3.2\"" -DHAVE_SYS_TYPES_H=1 -DHAVE_SYS_STAT_H=1 -DHAVE_STDLIB_H=1 -DHAVE_STRING_H=1 -DHAVE_MEMORY_H=1 -DHAVE_STRINGS_H=1 -DHAVE_INTTYPES_H=1 -DHAVE_STDINT_H=1 -DHAVE_UNISTD_H=1 -DHAVE_STRUCT_STAT_ST_BLKSIZE=1 -DHAVE_ST_BLKSIZE=1 -DSIZEOF_SIZE_T=8 -DSIZEOF_UNSIGNED_INT=4 -DSP_HAVE_LOCALE=1 -DSP_HAVE_WCHAR=1 -DSP_HAVE_GETTEXT=1 -DSP_HAVE_BOOL=1 -DSP_ANSI_CLASS_INST=1 -DSP_HAVE_SOCKET=1 -DJADE_MIF=1 -DJADE_HTML=1 -DSP_MULTI_BYTE=1 "-DSGML_CATALOG_FILES_DEFAULT=\"/opt/local/share/sgml/catalog\"" -DHAVE_DLFCN_H=1 "-DDEFAULT_SCHEME_BUILTINS=\"/opt/local/share/sgml/openjade/builtins.dsl\"" -c DssslSpecEventHandler.cxx >/dev/null 2>&1
649:info:build In file included from stylelib.h:6,
650:info:build                  from ELObj.cxx:4:
651:info:build ./../include/config.h:39:1: warning: "SP_DEFINE_TEMPLATES" redefined
652:info:build In file included from ./../include/config.h:10,
653:info:build                  from stylelib.h:6,
654:info:build                  from ELObj.cxx:4:
655:info:build /opt/local/include/OpenSP/config.h:367:1: warning: this is the location of the previous definition
656:info:build mv -f .libs/DssslSpecEventHandler.lo DssslSpecEventHandler.lo
657:info:build mv -f ELObj.o .libs/ELObj.lo
658:info:build /usr/bin/llvm-g++-4.2 -pipe -Os -isystem /opt/local/include -fno-rtti -arch x86_64 -arch i386 -I. -I./../include -I./../grove -I./../spgrove -I/opt/local/include/OpenSP -I/opt/local/include/OpenSP/.. "-DPACKAGE_NAME=\"\"" "-DPACKAGE_TARNAME=\"\"" "-DPACKAGE_VERSION=\"\"" "-DPACKAGE_STRING=\"\"" "-DPACKAGE_BUGREPORT=\"\"" "-DPACKAGE=\"openjade\"" "-DVERSION=\"1.3.2\"" -DHAVE_SYS_TYPES_H=1 -DHAVE_SYS_STAT_H=1 -DHAVE_STDLIB_H=1 -DHAVE_STRING_H=1 -DHAVE_MEMORY_H=1 -DHAVE_STRINGS_H=1 -DHAVE_INTTYPES_H=1 -DHAVE_STDINT_H=1 -DHAVE_UNISTD_H=1 -DHAVE_STRUCT_STAT_ST_BLKSIZE=1 -DHAVE_ST_BLKSIZE=1 -DSIZEOF_SIZE_T=8 -DSIZEOF_UNSIGNED_INT=4 -DSP_HAVE_LOCALE=1 -DSP_HAVE_WCHAR=1 -DSP_HAVE_GETTEXT=1 -DSP_HAVE_BOOL=1 -DSP_ANSI_CLASS_INST=1 -DSP_HAVE_SOCKET=1 -DJADE_MIF=1 -DJADE_HTML=1 -DSP_MULTI_BYTE=1 "-DSGML_CATALOG_FILES_DEFAULT=\"/opt/local/share/sgml/catalog\"" -DHAVE_DLFCN_H=1 "-DDEFAULT_SCHEME_BUILTINS=\"/opt/local/share/sgml/openjade/builtins.dsl\"" -c ELObj.cxx >/dev/null 2>&1
659:info:build rm -f .libs/ELObjMessageArg.lo
660:info:build /usr/bin/llvm-g++-4.2 -pipe -Os -isystem /opt/local/include -fno-rtti -arch x86_64 -arch i386 -I. -I./../include -I./../grove -I./../spgrove -I/opt/local/include/OpenSP -I/opt/local/include/OpenSP/.. "-DPACKAGE_NAME=\"\"" "-DPACKAGE_TARNAME=\"\"" "-DPACKAGE_VERSION=\"\"" "-DPACKAGE_STRING=\"\"" "-DPACKAGE_BUGREPORT=\"\"" "-DPACKAGE=\"openjade\"" "-DVERSION=\"1.3.2\"" -DHAVE_SYS_TYPES_H=1 -DHAVE_SYS_STAT_H=1 -DHAVE_STDLIB_H=1 -DHAVE_STRING_H=1 -DHAVE_MEMORY_H=1 -DHAVE_STRINGS_H=1 -DHAVE_INTTYPES_H=1 -DHAVE_STDINT_H=1 -DHAVE_UNISTD_H=1 -DHAVE_STRUCT_STAT_ST_BLKSIZE=1 -DHAVE_ST_BLKSIZE=1 -DSIZEOF_SIZE_T=8 -DSIZEOF_UNSIGNED_INT=4 -DSP_HAVE_LOCALE=1 -DSP_HAVE_WCHAR=1 -DSP_HAVE_GETTEXT=1 -DSP_HAVE_BOOL=1 -DSP_ANSI_CLASS_INST=1 -DSP_HAVE_SOCKET=1 -DJADE_MIF=1 -DJADE_HTML=1 -DSP_MULTI_BYTE=1 "-DSGML_CATALOG_FILES_DEFAULT=\"/opt/local/share/sgml/catalog\"" -DHAVE_DLFCN_H=1 "-DDEFAULT_SCHEME_BUILTINS=\"/opt/local/share/sgml/openjade/builtins.dsl\"" -c ELObjMessageArg.cxx  -fno-common -DPIC
661:info:build In file included from stylelib.h:6,
662:info:build                  from ELObjMessageArg.cxx:4:
663:info:build ./../include/config.h:39:1: warning: "SP_DEFINE_TEMPLATES" redefined
664:info:build In file included from ./../include/config.h:10,
665:info:build                  from stylelib.h:6,
666:info:build                  from ELObjMessageArg.cxx:4:
667:info:build /opt/local/include/OpenSP/config.h:367:1: warning: this is the location of the previous definition
668:info:build In file included from stylelib.h:6,
669:info:build                  from ELObjMessageArg.cxx:4:
670:info:build ./../include/config.h:39:1: warning: "SP_DEFINE_TEMPLATES" redefined
671:info:build In file included from ./../include/config.h:10,
672:info:build                  from stylelib.h:6,
673:info:build                  from ELObjMessageArg.cxx:4:
674:info:build /opt/local/include/OpenSP/config.h:367:1: warning: this is the location of the previous definition
675:info:build mv -f ELObjMessageArg.o .libs/ELObjMessageArg.lo
676:info:build /usr/bin/llvm-g++-4.2 -pipe -Os -isystem /opt/local/include -fno-rtti -arch x86_64 -arch i386 -I. -I./../include -I./../grove -I./../spgrove -I/opt/local/include/OpenSP -I/opt/local/include/OpenSP/.. "-DPACKAGE_NAME=\"\"" "-DPACKAGE_TARNAME=\"\"" "-DPACKAGE_VERSION=\"\"" "-DPACKAGE_STRING=\"\"" "-DPACKAGE_BUGREPORT=\"\"" "-DPACKAGE=\"openjade\"" "-DVERSION=\"1.3.2\"" -DHAVE_SYS_TYPES_H=1 -DHAVE_SYS_STAT_H=1 -DHAVE_STDLIB_H=1 -DHAVE_STRING_H=1 -DHAVE_MEMORY_H=1 -DHAVE_STRINGS_H=1 -DHAVE_INTTYPES_H=1 -DHAVE_STDINT_H=1 -DHAVE_UNISTD_H=1 -DHAVE_STRUCT_STAT_ST_BLKSIZE=1 -DHAVE_ST_BLKSIZE=1 -DSIZEOF_SIZE_T=8 -DSIZEOF_UNSIGNED_INT=4 -DSP_HAVE_LOCALE=1 -DSP_HAVE_WCHAR=1 -DSP_HAVE_GETTEXT=1 -DSP_HAVE_BOOL=1 -DSP_ANSI_CLASS_INST=1 -DSP_HAVE_SOCKET=1 -DJADE_MIF=1 -DJADE_HTML=1 -DSP_MULTI_BYTE=1 "-DSGML_CATALOG_FILES_DEFAULT=\"/opt/local/share/sgml/catalog\"" -DHAVE_DLFCN_H=1 "-DDEFAULT_SCHEME_BUILTINS=\"/opt/local/share/sgml/openjade/builtins.dsl\"" -c ELObjMessageArg.cxx >/dev/null 2>&1
677:info:build mv -f .libs/ELObjMessageArg.lo ELObjMessageArg.lo
678:info:build rm -f .libs/Expression.lo
679:info:build /usr/bin/llvm-g++-4.2 -pipe -Os -isystem /opt/local/include -fno-rtti -arch x86_64 -arch i386 -I. -I./../include -I./../grove -I./../spgrove -I/opt/local/include/OpenSP -I/opt/local/include/OpenSP/.. "-DPACKAGE_NAME=\"\"" "-DPACKAGE_TARNAME=\"\"" "-DPACKAGE_VERSION=\"\"" "-DPACKAGE_STRING=\"\"" "-DPACKAGE_BUGREPORT=\"\"" "-DPACKAGE=\"openjade\"" "-DVERSION=\"1.3.2\"" -DHAVE_SYS_TYPES_H=1 -DHAVE_SYS_STAT_H=1 -DHAVE_STDLIB_H=1 -DHAVE_STRING_H=1 -DHAVE_MEMORY_H=1 -DHAVE_STRINGS_H=1 -DHAVE_INTTYPES_H=1 -DHAVE_STDINT_H=1 -DHAVE_UNISTD_H=1 -DHAVE_STRUCT_STAT_ST_BLKSIZE=1 -DHAVE_ST_BLKSIZE=1 -DSIZEOF_SIZE_T=8 -DSIZEOF_UNSIGNED_INT=4 -DSP_HAVE_LOCALE=1 -DSP_HAVE_WCHAR=1 -DSP_HAVE_GETTEXT=1 -DSP_HAVE_BOOL=1 -DSP_ANSI_CLASS_INST=1 -DSP_HAVE_SOCKET=1 -DJADE_MIF=1 -DJADE_HTML=1 -DSP_MULTI_BYTE=1 "-DSGML_CATALOG_FILES_DEFAULT=\"/opt/local/share/sgml/catalog\"" -DHAVE_DLFCN_H=1 "-DDEFAULT_SCHEME_BUILTINS=\"/opt/local/share/sgml/openjade/builtins.dsl\"" -c Expression.cxx  -fno-common -DPIC
680:info:build In file included from stylelib.h:6,
681:info:build                  from Expression.cxx:4:
682:info:build ./../include/config.h:39:1: warning: "SP_DEFINE_TEMPLATES" redefined
683:info:build In file included from ./../include/config.h:10,
684:info:build                  from stylelib.h:6,
685:info:build                  from Expression.cxx:4:
686:info:build /opt/local/include/OpenSP/config.h:367:1: warning: this is the location of the previous definition
687:info:build mv -f .libs/ELObj.lo ELObj.lo
688:info:build rm -f .libs/FOTBuilder.lo
689:info:build /usr/bin/llvm-g++-4.2 -pipe -Os -isystem /opt/local/include -fno-rtti -arch x86_64 -arch i386 -I. -I./../include -I./../grove -I./../spgrove -I/opt/local/include/OpenSP -I/opt/local/include/OpenSP/.. "-DPACKAGE_NAME=\"\"" "-DPACKAGE_TARNAME=\"\"" "-DPACKAGE_VERSION=\"\"" "-DPACKAGE_STRING=\"\"" "-DPACKAGE_BUGREPORT=\"\"" "-DPACKAGE=\"openjade\"" "-DVERSION=\"1.3.2\"" -DHAVE_SYS_TYPES_H=1 -DHAVE_SYS_STAT_H=1 -DHAVE_STDLIB_H=1 -DHAVE_STRING_H=1 -DHAVE_MEMORY_H=1 -DHAVE_STRINGS_H=1 -DHAVE_INTTYPES_H=1 -DHAVE_STDINT_H=1 -DHAVE_UNISTD_H=1 -DHAVE_STRUCT_STAT_ST_BLKSIZE=1 -DHAVE_ST_BLKSIZE=1 -DSIZEOF_SIZE_T=8 -DSIZEOF_UNSIGNED_INT=4 -DSP_HAVE_LOCALE=1 -DSP_HAVE_WCHAR=1 -DSP_HAVE_GETTEXT=1 -DSP_HAVE_BOOL=1 -DSP_ANSI_CLASS_INST=1 -DSP_HAVE_SOCKET=1 -DJADE_MIF=1 -DJADE_HTML=1 -DSP_MULTI_BYTE=1 "-DSGML_CATALOG_FILES_DEFAULT=\"/opt/local/share/sgml/catalog\"" -DHAVE_DLFCN_H=1 "-DDEFAULT_SCHEME_BUILTINS=\"/opt/local/share/sgml/openjade/builtins.dsl\"" -c FOTBuilder.cxx  -fno-common -DPIC
690:info:build In file included from stylelib.h:6,
691:info:build                  from FOTBuilder.cxx:4:
692:info:build ./../include/config.h:39:1: warning: "SP_DEFINE_TEMPLATES" redefined
693:info:build In file included from ./../include/config.h:10,
694:info:build                  from stylelib.h:6,
695:info:build                  from FOTBuilder.cxx:4:
696:info:build /opt/local/include/OpenSP/config.h:367:1: warning: this is the location of the previous definition
697:info:build In file included from stylelib.h:6,
698:info:build                  from Expression.cxx:4:
699:info:build ./../include/config.h:39:1: warning: "SP_DEFINE_TEMPLATES" redefined
700:info:build In file included from ./../include/config.h:10,
701:info:build                  from stylelib.h:6,
702:info:build                  from Expression.cxx:4:
703:info:build /opt/local/include/OpenSP/config.h:367:1: warning: this is the location of the previous definition
704:info:build In file included from stylelib.h:6,
705:info:build                  from FOTBuilder.cxx:4:
706:info:build ./../include/config.h:39:1: warning: "SP_DEFINE_TEMPLATES" redefined
707:info:build In file included from ./../include/config.h:10,
708:info:build                  from stylelib.h:6,
709:info:build                  from FOTBuilder.cxx:4:
710:info:build /opt/local/include/OpenSP/config.h:367:1: warning: this is the location of the previous definition
711:info:build mv -f Expression.o .libs/Expression.lo
712:info:build /usr/bin/llvm-g++-4.2 -pipe -Os -isystem /opt/local/include -fno-rtti -arch x86_64 -arch i386 -I. -I./../include -I./../grove -I./../spgrove -I/opt/local/include/OpenSP -I/opt/local/include/OpenSP/.. "-DPACKAGE_NAME=\"\"" "-DPACKAGE_TARNAME=\"\"" "-DPACKAGE_VERSION=\"\"" "-DPACKAGE_STRING=\"\"" "-DPACKAGE_BUGREPORT=\"\"" "-DPACKAGE=\"openjade\"" "-DVERSION=\"1.3.2\"" -DHAVE_SYS_TYPES_H=1 -DHAVE_SYS_STAT_H=1 -DHAVE_STDLIB_H=1 -DHAVE_STRING_H=1 -DHAVE_MEMORY_H=1 -DHAVE_STRINGS_H=1 -DHAVE_INTTYPES_H=1 -DHAVE_STDINT_H=1 -DHAVE_UNISTD_H=1 -DHAVE_STRUCT_STAT_ST_BLKSIZE=1 -DHAVE_ST_BLKSIZE=1 -DSIZEOF_SIZE_T=8 -DSIZEOF_UNSIGNED_INT=4 -DSP_HAVE_LOCALE=1 -DSP_HAVE_WCHAR=1 -DSP_HAVE_GETTEXT=1 -DSP_HAVE_BOOL=1 -DSP_ANSI_CLASS_INST=1 -DSP_HAVE_SOCKET=1 -DJADE_MIF=1 -DJADE_HTML=1 -DSP_MULTI_BYTE=1 "-DSGML_CATALOG_FILES_DEFAULT=\"/opt/local/share/sgml/catalog\"" -DHAVE_DLFCN_H=1 "-DDEFAULT_SCHEME_BUILTINS=\"/opt/local/share/sgml/openjade/builtins.dsl\"" -c Expression.cxx >/dev/null 2>&1
713:info:build mv -f FOTBuilder.o .libs/FOTBuilder.lo
714:info:build /usr/bin/llvm-g++-4.2 -pipe -Os -isystem /opt/local/include -fno-rtti -arch x86_64 -arch i386 -I. -I./../include -I./../grove -I./../spgrove -I/opt/local/include/OpenSP -I/opt/local/include/OpenSP/.. "-DPACKAGE_NAME=\"\"" "-DPACKAGE_TARNAME=\"\"" "-DPACKAGE_VERSION=\"\"" "-DPACKAGE_STRING=\"\"" "-DPACKAGE_BUGREPORT=\"\"" "-DPACKAGE=\"openjade\"" "-DVERSION=\"1.3.2\"" -DHAVE_SYS_TYPES_H=1 -DHAVE_SYS_STAT_H=1 -DHAVE_STDLIB_H=1 -DHAVE_STRING_H=1 -DHAVE_MEMORY_H=1 -DHAVE_STRINGS_H=1 -DHAVE_INTTYPES_H=1 -DHAVE_STDINT_H=1 -DHAVE_UNISTD_H=1 -DHAVE_STRUCT_STAT_ST_BLKSIZE=1 -DHAVE_ST_BLKSIZE=1 -DSIZEOF_SIZE_T=8 -DSIZEOF_UNSIGNED_INT=4 -DSP_HAVE_LOCALE=1 -DSP_HAVE_WCHAR=1 -DSP_HAVE_GETTEXT=1 -DSP_HAVE_BOOL=1 -DSP_ANSI_CLASS_INST=1 -DSP_HAVE_SOCKET=1 -DJADE_MIF=1 -DJADE_HTML=1 -DSP_MULTI_BYTE=1 "-DSGML_CATALOG_FILES_DEFAULT=\"/opt/local/share/sgml/catalog\"" -DHAVE_DLFCN_H=1 "-DDEFAULT_SCHEME_BUILTINS=\"/opt/local/share/sgml/openjade/builtins.dsl\"" -c FOTBuilder.cxx >/dev/null 2>&1
715:info:build mv -f .libs/Expression.lo Expression.lo
716:info:build rm -f FlowObj_inst.cxx
717:info:build perl ./../instmac.pl FlowObj_inst.m4 >FlowObj_inst.cxx
718:info:build chmod -w FlowObj_inst.cxx
719:info:build rm -f .libs/InheritedC.lo
720:info:build /usr/bin/llvm-g++-4.2 -pipe -Os -isystem /opt/local/include -fno-rtti -arch x86_64 -arch i386 -I. -I./../include -I./../grove -I./../spgrove -I/opt/local/include/OpenSP -I/opt/local/include/OpenSP/.. "-DPACKAGE_NAME=\"\"" "-DPACKAGE_TARNAME=\"\"" "-DPACKAGE_VERSION=\"\"" "-DPACKAGE_STRING=\"\"" "-DPACKAGE_BUGREPORT=\"\"" "-DPACKAGE=\"openjade\"" "-DVERSION=\"1.3.2\"" -DHAVE_SYS_TYPES_H=1 -DHAVE_SYS_STAT_H=1 -DHAVE_STDLIB_H=1 -DHAVE_STRING_H=1 -DHAVE_MEMORY_H=1 -DHAVE_STRINGS_H=1 -DHAVE_INTTYPES_H=1 -DHAVE_STDINT_H=1 -DHAVE_UNISTD_H=1 -DHAVE_STRUCT_STAT_ST_BLKSIZE=1 -DHAVE_ST_BLKSIZE=1 -DSIZEOF_SIZE_T=8 -DSIZEOF_UNSIGNED_INT=4 -DSP_HAVE_LOCALE=1 -DSP_HAVE_WCHAR=1 -DSP_HAVE_GETTEXT=1 -DSP_HAVE_BOOL=1 -DSP_ANSI_CLASS_INST=1 -DSP_HAVE_SOCKET=1 -DJADE_MIF=1 -DJADE_HTML=1 -DSP_MULTI_BYTE=1 "-DSGML_CATALOG_FILES_DEFAULT=\"/opt/local/share/sgml/catalog\"" -DHAVE_DLFCN_H=1 "-DDEFAULT_SCHEME_BUILTINS=\"/opt/local/share/sgml/openjade/builtins.dsl\"" -c InheritedC.cxx  -fno-common -DPIC
721:info:build In file included from stylelib.h:6,
722:info:build                  from InheritedC.cxx:4:
723:info:build ./../include/config.h:39:1: warning: "SP_DEFINE_TEMPLATES" redefined
724:info:build In file included from ./../include/config.h:10,
725:info:build                  from stylelib.h:6,
726:info:build                  from InheritedC.cxx:4:
727:info:build /opt/local/include/OpenSP/config.h:367:1: warning: this is the location of the previous definition
728:info:build mv -f .libs/FOTBuilder.lo FOTBuilder.lo
729:info:build rm -f .libs/Insn.lo
730:info:build /usr/bin/llvm-g++-4.2 -pipe -Os -isystem /opt/local/include -fno-rtti -arch x86_64 -arch i386 -I. -I./../include -I./../grove -I./../spgrove -I/opt/local/include/OpenSP -I/opt/local/include/OpenSP/.. "-DPACKAGE_NAME=\"\"" "-DPACKAGE_TARNAME=\"\"" "-DPACKAGE_VERSION=\"\"" "-DPACKAGE_STRING=\"\"" "-DPACKAGE_BUGREPORT=\"\"" "-DPACKAGE=\"openjade\"" "-DVERSION=\"1.3.2\"" -DHAVE_SYS_TYPES_H=1 -DHAVE_SYS_STAT_H=1 -DHAVE_STDLIB_H=1 -DHAVE_STRING_H=1 -DHAVE_MEMORY_H=1 -DHAVE_STRINGS_H=1 -DHAVE_INTTYPES_H=1 -DHAVE_STDINT_H=1 -DHAVE_UNISTD_H=1 -DHAVE_STRUCT_STAT_ST_BLKSIZE=1 -DHAVE_ST_BLKSIZE=1 -DSIZEOF_SIZE_T=8 -DSIZEOF_UNSIGNED_INT=4 -DSP_HAVE_LOCALE=1 -DSP_HAVE_WCHAR=1 -DSP_HAVE_GETTEXT=1 -DSP_HAVE_BOOL=1 -DSP_ANSI_CLASS_INST=1 -DSP_HAVE_SOCKET=1 -DJADE_MIF=1 -DJADE_HTML=1 -DSP_MULTI_BYTE=1 "-DSGML_CATALOG_FILES_DEFAULT=\"/opt/local/share/sgml/catalog\"" -DHAVE_DLFCN_H=1 "-DDEFAULT_SCHEME_BUILTINS=\"/opt/local/share/sgml/openjade/builtins.dsl\"" -c Insn.cxx  -fno-common -DPIC
731:info:build In file included from stylelib.h:6,
732:info:build                  from Insn.cxx:4:
733:info:build ./../include/config.h:39:1: warning: "SP_DEFINE_TEMPLATES" redefined
734:info:build In file included from ./../include/config.h:10,
735:info:build                  from stylelib.h:6,
736:info:build                  from Insn.cxx:4:
737:info:build /opt/local/include/OpenSP/config.h:367:1: warning: this is the location of the previous definition
738:info:build In file included from stylelib.h:6,
739:info:build                  from InheritedC.cxx:4:
740:info:build ./../include/config.h:39:1: warning: "SP_DEFINE_TEMPLATES" redefined
741:info:build In file included from ./../include/config.h:10,
742:info:build                  from stylelib.h:6,
743:info:build                  from InheritedC.cxx:4:
744:info:build /opt/local/include/OpenSP/config.h:367:1: warning: this is the location of the previous definition
745:info:build In file included from stylelib.h:6,
746:info:build                  from Insn.cxx:4:
747:info:build ./../include/config.h:39:1: warning: "SP_DEFINE_TEMPLATES" redefined
748:info:build In file included from ./../include/config.h:10,
749:info:build                  from stylelib.h:6,
750:info:build                  from Insn.cxx:4:
751:info:build /opt/local/include/OpenSP/config.h:367:1: warning: this is the location of the previous definition
752:info:build mv -f InheritedC.o .libs/InheritedC.lo
753:info:build /usr/bin/llvm-g++-4.2 -pipe -Os -isystem /opt/local/include -fno-rtti -arch x86_64 -arch i386 -I. -I./../include -I./../grove -I./../spgrove -I/opt/local/include/OpenSP -I/opt/local/include/OpenSP/.. "-DPACKAGE_NAME=\"\"" "-DPACKAGE_TARNAME=\"\"" "-DPACKAGE_VERSION=\"\"" "-DPACKAGE_STRING=\"\"" "-DPACKAGE_BUGREPORT=\"\"" "-DPACKAGE=\"openjade\"" "-DVERSION=\"1.3.2\"" -DHAVE_SYS_TYPES_H=1 -DHAVE_SYS_STAT_H=1 -DHAVE_STDLIB_H=1 -DHAVE_STRING_H=1 -DHAVE_MEMORY_H=1 -DHAVE_STRINGS_H=1 -DHAVE_INTTYPES_H=1 -DHAVE_STDINT_H=1 -DHAVE_UNISTD_H=1 -DHAVE_STRUCT_STAT_ST_BLKSIZE=1 -DHAVE_ST_BLKSIZE=1 -DSIZEOF_SIZE_T=8 -DSIZEOF_UNSIGNED_INT=4 -DSP_HAVE_LOCALE=1 -DSP_HAVE_WCHAR=1 -DSP_HAVE_GETTEXT=1 -DSP_HAVE_BOOL=1 -DSP_ANSI_CLASS_INST=1 -DSP_HAVE_SOCKET=1 -DJADE_MIF=1 -DJADE_HTML=1 -DSP_MULTI_BYTE=1 "-DSGML_CATALOG_FILES_DEFAULT=\"/opt/local/share/sgml/catalog\"" -DHAVE_DLFCN_H=1 "-DDEFAULT_SCHEME_BUILTINS=\"/opt/local/share/sgml/openjade/builtins.dsl\"" -c InheritedC.cxx >/dev/null 2>&1
754:info:build mv -f Insn.o .libs/Insn.lo
755:info:build /usr/bin/llvm-g++-4.2 -pipe -Os -isystem /opt/local/include -fno-rtti -arch x86_64 -arch i386 -I. -I./../include -I./../grove -I./../spgrove -I/opt/local/include/OpenSP -I/opt/local/include/OpenSP/.. "-DPACKAGE_NAME=\"\"" "-DPACKAGE_TARNAME=\"\"" "-DPACKAGE_VERSION=\"\"" "-DPACKAGE_STRING=\"\"" "-DPACKAGE_BUGREPORT=\"\"" "-DPACKAGE=\"openjade\"" "-DVERSION=\"1.3.2\"" -DHAVE_SYS_TYPES_H=1 -DHAVE_SYS_STAT_H=1 -DHAVE_STDLIB_H=1 -DHAVE_STRING_H=1 -DHAVE_MEMORY_H=1 -DHAVE_STRINGS_H=1 -DHAVE_INTTYPES_H=1 -DHAVE_STDINT_H=1 -DHAVE_UNISTD_H=1 -DHAVE_STRUCT_STAT_ST_BLKSIZE=1 -DHAVE_ST_BLKSIZE=1 -DSIZEOF_SIZE_T=8 -DSIZEOF_UNSIGNED_INT=4 -DSP_HAVE_LOCALE=1 -DSP_HAVE_WCHAR=1 -DSP_HAVE_GETTEXT=1 -DSP_HAVE_BOOL=1 -DSP_ANSI_CLASS_INST=1 -DSP_HAVE_SOCKET=1 -DJADE_MIF=1 -DJADE_HTML=1 -DSP_MULTI_BYTE=1 "-DSGML_CATALOG_FILES_DEFAULT=\"/opt/local/share/sgml/catalog\"" -DHAVE_DLFCN_H=1 "-DDEFAULT_SCHEME_BUILTINS=\"/opt/local/share/sgml/openjade/builtins.dsl\"" -c Insn.cxx >/dev/null 2>&1
756:info:build mv -f .libs/InheritedC.lo InheritedC.lo
757:info:build rm -f .libs/Interpreter.lo
758:info:build /usr/bin/llvm-g++-4.2 -pipe -Os -isystem /opt/local/include -fno-rtti -arch x86_64 -arch i386 -I. -I./../include -I./../grove -I./../spgrove -I/opt/local/include/OpenSP -I/opt/local/include/OpenSP/.. "-DPACKAGE_NAME=\"\"" "-DPACKAGE_TARNAME=\"\"" "-DPACKAGE_VERSION=\"\"" "-DPACKAGE_STRING=\"\"" "-DPACKAGE_BUGREPORT=\"\"" "-DPACKAGE=\"openjade\"" "-DVERSION=\"1.3.2\"" -DHAVE_SYS_TYPES_H=1 -DHAVE_SYS_STAT_H=1 -DHAVE_STDLIB_H=1 -DHAVE_STRING_H=1 -DHAVE_MEMORY_H=1 -DHAVE_STRINGS_H=1 -DHAVE_INTTYPES_H=1 -DHAVE_STDINT_H=1 -DHAVE_UNISTD_H=1 -DHAVE_STRUCT_STAT_ST_BLKSIZE=1 -DHAVE_ST_BLKSIZE=1 -DSIZEOF_SIZE_T=8 -DSIZEOF_UNSIGNED_INT=4 -DSP_HAVE_LOCALE=1 -DSP_HAVE_WCHAR=1 -DSP_HAVE_GETTEXT=1 -DSP_HAVE_BOOL=1 -DSP_ANSI_CLASS_INST=1 -DSP_HAVE_SOCKET=1 -DJADE_MIF=1 -DJADE_HTML=1 -DSP_MULTI_BYTE=1 "-DSGML_CATALOG_FILES_DEFAULT=\"/opt/local/share/sgml/catalog\"" -DHAVE_DLFCN_H=1 "-DDEFAULT_SCHEME_BUILTINS=\"/opt/local/share/sgml/openjade/builtins.dsl\"" -c Interpreter.cxx  -fno-common -DPIC
759:info:build In file included from stylelib.h:6,
760:info:build                  from Interpreter.cxx:4:
761:info:build ./../include/config.h:39:1: warning: "SP_DEFINE_TEMPLATES" redefined
762:info:build In file included from ./../include/config.h:10,
763:info:build                  from stylelib.h:6,
764:info:build                  from Interpreter.cxx:4:
765:info:build /opt/local/include/OpenSP/config.h:367:1: warning: this is the location of the previous definition
766:info:build Interpreter.cxx: In member function 'void OpenJade_DSSSL::Interpreter::installCharProperties()':
767:info:build Interpreter.cxx:2196: warning: deprecated conversion from string constant to 'char*'
768:info:build Interpreter.cxx:2196: warning: deprecated conversion from string constant to 'char*'
769:info:build Interpreter.cxx:2196: warning: deprecated conversion from string constant to 'char*'
770:info:build Interpreter.cxx:2196: warning: deprecated conversion from string constant to 'char*'
771:info:build Interpreter.cxx:2196: warning: deprecated conversion from string constant to 'char*'
772:info:build Interpreter.cxx:2196: warning: deprecated conversion from string constant to 'char*'
773:info:build Interpreter.cxx:2196: warning: deprecated conversion from string constant to 'char*'
774:info:build Interpreter.cxx:2196: warning: deprecated conversion from string constant to 'char*'
775:info:build Interpreter.cxx:2196: warning: deprecated conversion from string constant to 'char*'
776:info:build Interpreter.cxx:2196: warning: deprecated conversion from string constant to 'char*'
777:info:build Interpreter.cxx:2196: warning: deprecated conversion from string constant to 'char*'
778:info:build Interpreter.cxx:2196: warning: deprecated conversion from string constant to 'char*'
779:info:build Interpreter.cxx:2196: warning: deprecated conversion from string constant to 'char*'
780:info:build Interpreter.cxx:2196: warning: deprecated conversion from string constant to 'char*'
781:info:build Interpreter.cxx:2196: warning: deprecated conversion from string constant to 'char*'
782:info:build Interpreter.cxx:2196: warning: deprecated conversion from string constant to 'char*'
783:info:build Interpreter.cxx:2196: warning: deprecated conversion from string constant to 'char*'
784:info:build Interpreter.cxx:2196: warning: deprecated conversion from string constant to 'char*'
785:info:build Interpreter.cxx:2196: warning: deprecated conversion from string constant to 'char*'
786:info:build Interpreter.cxx:2196: warning: deprecated conversion from string constant to 'char*'
787:info:build Interpreter.cxx:2196: warning: deprecated conversion from string constant to 'char*'
788:info:build Interpreter.cxx:2196: warning: deprecated conversion from string constant to 'char*'
789:info:build Interpreter.cxx:2196: warning: deprecated conversion from string constant to 'char*'
790:info:build Interpreter.cxx:2196: warning: deprecated conversion from string constant to 'char*'
791:info:build Interpreter.cxx:2196: warning: deprecated conversion from string constant to 'char*'
792:info:build Interpreter.cxx:2196: warning: deprecated conversion from string constant to 'char*'
793:info:build Interpreter.cxx:2196: warning: deprecated conversion from string constant to 'char*'
794:info:build Interpreter.cxx:2196: warning: deprecated conversion from string constant to 'char*'
795:info:build Interpreter.cxx:2196: warning: deprecated conversion from string constant to 'char*'
796:info:build Interpreter.cxx:2196: warning: deprecated conversion from string constant to 'char*'
797:info:build Interpreter.cxx:2196: warning: deprecated conversion from string constant to 'char*'
798:info:build Interpreter.cxx:2196: warning: deprecated conversion from string constant to 'char*'
799:info:build Interpreter.cxx:2196: warning: deprecated conversion from string constant to 'char*'
800:info:build Interpreter.cxx:2196: warning: deprecated conversion from string constant to 'char*'
801:info:build Interpreter.cxx:2196: warning: deprecated conversion from string constant to 'char*'
802:info:build Interpreter.cxx:2196: warning: deprecated conversion from string constant to 'char*'
803:info:build Interpreter.cxx:2196: warning: deprecated conversion from string constant to 'char*'
804:info:build Interpreter.cxx:2196: warning: deprecated conversion from string constant to 'char*'
805:info:build mv -f .libs/Insn.lo Insn.lo
806:info:build rm -f .libs/NumberCache.lo
807:info:build /usr/bin/llvm-g++-4.2 -pipe -Os -isystem /opt/local/include -fno-rtti -arch x86_64 -arch i386 -I. -I./../include -I./../grove -I./../spgrove -I/opt/local/include/OpenSP -I/opt/local/include/OpenSP/.. "-DPACKAGE_NAME=\"\"" "-DPACKAGE_TARNAME=\"\"" "-DPACKAGE_VERSION=\"\"" "-DPACKAGE_STRING=\"\"" "-DPACKAGE_BUGREPORT=\"\"" "-DPACKAGE=\"openjade\"" "-DVERSION=\"1.3.2\"" -DHAVE_SYS_TYPES_H=1 -DHAVE_SYS_STAT_H=1 -DHAVE_STDLIB_H=1 -DHAVE_STRING_H=1 -DHAVE_MEMORY_H=1 -DHAVE_STRINGS_H=1 -DHAVE_INTTYPES_H=1 -DHAVE_STDINT_H=1 -DHAVE_UNISTD_H=1 -DHAVE_STRUCT_STAT_ST_BLKSIZE=1 -DHAVE_ST_BLKSIZE=1 -DSIZEOF_SIZE_T=8 -DSIZEOF_UNSIGNED_INT=4 -DSP_HAVE_LOCALE=1 -DSP_HAVE_WCHAR=1 -DSP_HAVE_GETTEXT=1 -DSP_HAVE_BOOL=1 -DSP_ANSI_CLASS_INST=1 -DSP_HAVE_SOCKET=1 -DJADE_MIF=1 -DJADE_HTML=1 -DSP_MULTI_BYTE=1 "-DSGML_CATALOG_FILES_DEFAULT=\"/opt/local/share/sgml/catalog\"" -DHAVE_DLFCN_H=1 "-DDEFAULT_SCHEME_BUILTINS=\"/opt/local/share/sgml/openjade/builtins.dsl\"" -c NumberCache.cxx  -fno-common -DPIC
808:info:build In file included from stylelib.h:6,
809:info:build                  from NumberCache.cxx:4:
810:info:build ./../include/config.h:39:1: warning: "SP_DEFINE_TEMPLATES" redefined
811:info:build In file included from ./../include/config.h:10,
812:info:build                  from stylelib.h:6,
813:info:build                  from NumberCache.cxx:4:
814:info:build /opt/local/include/OpenSP/config.h:367:1: warning: this is the location of the previous definition
815:info:build In file included from stylelib.h:6,
816:info:build                  from NumberCache.cxx:4:
817:info:build ./../include/config.h:39:1: warning: "SP_DEFINE_TEMPLATES" redefined
818:info:build In file included from ./../include/config.h:10,
819:info:build                  from stylelib.h:6,
820:info:build                  from NumberCache.cxx:4:
821:info:build /opt/local/include/OpenSP/config.h:367:1: warning: this is the location of the previous definition
822:info:build mv -f NumberCache.o .libs/NumberCache.lo
823:info:build /usr/bin/llvm-g++-4.2 -pipe -Os -isystem /opt/local/include -fno-rtti -arch x86_64 -arch i386 -I. -I./../include -I./../grove -I./../spgrove -I/opt/local/include/OpenSP -I/opt/local/include/OpenSP/.. "-DPACKAGE_NAME=\"\"" "-DPACKAGE_TARNAME=\"\"" "-DPACKAGE_VERSION=\"\"" "-DPACKAGE_STRING=\"\"" "-DPACKAGE_BUGREPORT=\"\"" "-DPACKAGE=\"openjade\"" "-DVERSION=\"1.3.2\"" -DHAVE_SYS_TYPES_H=1 -DHAVE_SYS_STAT_H=1 -DHAVE_STDLIB_H=1 -DHAVE_STRING_H=1 -DHAVE_MEMORY_H=1 -DHAVE_STRINGS_H=1 -DHAVE_INTTYPES_H=1 -DHAVE_STDINT_H=1 -DHAVE_UNISTD_H=1 -DHAVE_STRUCT_STAT_ST_BLKSIZE=1 -DHAVE_ST_BLKSIZE=1 -DSIZEOF_SIZE_T=8 -DSIZEOF_UNSIGNED_INT=4 -DSP_HAVE_LOCALE=1 -DSP_HAVE_WCHAR=1 -DSP_HAVE_GETTEXT=1 -DSP_HAVE_BOOL=1 -DSP_ANSI_CLASS_INST=1 -DSP_HAVE_SOCKET=1 -DJADE_MIF=1 -DJADE_HTML=1 -DSP_MULTI_BYTE=1 "-DSGML_CATALOG_FILES_DEFAULT=\"/opt/local/share/sgml/catalog\"" -DHAVE_DLFCN_H=1 "-DDEFAULT_SCHEME_BUILTINS=\"/opt/local/share/sgml/openjade/builtins.dsl\"" -c NumberCache.cxx >/dev/null 2>&1
824:info:build In file included from stylelib.h:6,
825:info:build                  from Interpreter.cxx:4:
826:info:build ./../include/config.h:39:1: warning: "SP_DEFINE_TEMPLATES" redefined
827:info:build In file included from ./../include/config.h:10,
828:info:build                  from stylelib.h:6,
829:info:build                  from Interpreter.cxx:4:
830:info:build /opt/local/include/OpenSP/config.h:367:1: warning: this is the location of the previous definition
831:info:build Interpreter.cxx: In member function 'void OpenJade_DSSSL::Interpreter::installCharProperties()':
832:info:build Interpreter.cxx:2196: warning: deprecated conversion from string constant to 'char*'
833:info:build Interpreter.cxx:2196: warning: deprecated conversion from string constant to 'char*'
834:info:build Interpreter.cxx:2196: warning: deprecated conversion from string constant to 'char*'
835:info:build Interpreter.cxx:2196: warning: deprecated conversion from string constant to 'char*'
836:info:build Interpreter.cxx:2196: warning: deprecated conversion from string constant to 'char*'
837:info:build Interpreter.cxx:2196: warning: deprecated conversion from string constant to 'char*'
838:info:build Interpreter.cxx:2196: warning: deprecated conversion from string constant to 'char*'
839:info:build Interpreter.cxx:2196: warning: deprecated conversion from string constant to 'char*'
840:info:build Interpreter.cxx:2196: warning: deprecated conversion from string constant to 'char*'
841:info:build Interpreter.cxx:2196: warning: deprecated conversion from string constant to 'char*'
842:info:build Interpreter.cxx:2196: warning: deprecated conversion from string constant to 'char*'
843:info:build Interpreter.cxx:2196: warning: deprecated conversion from string constant to 'char*'
844:info:build Interpreter.cxx:2196: warning: deprecated conversion from string constant to 'char*'
845:info:build Interpreter.cxx:2196: warning: deprecated conversion from string constant to 'char*'
846:info:build Interpreter.cxx:2196: warning: deprecated conversion from string constant to 'char*'
847:info:build Interpreter.cxx:2196: warning: deprecated conversion from string constant to 'char*'
848:info:build Interpreter.cxx:2196: warning: deprecated conversion from string constant to 'char*'
849:info:build Interpreter.cxx:2196: warning: deprecated conversion from string constant to 'char*'
850:info:build Interpreter.cxx:2196: warning: deprecated conversion from string constant to 'char*'
851:info:build Interpreter.cxx:2196: warning: deprecated conversion from string constant to 'char*'
852:info:build Interpreter.cxx:2196: warning: deprecated conversion from string constant to 'char*'
853:info:build Interpreter.cxx:2196: warning: deprecated conversion from string constant to 'char*'
854:info:build Interpreter.cxx:2196: warning: deprecated conversion from string constant to 'char*'
855:info:build Interpreter.cxx:2196: warning: deprecated conversion from string constant to 'char*'
856:info:build Interpreter.cxx:2196: warning: deprecated conversion from string constant to 'char*'
857:info:build Interpreter.cxx:2196: warning: deprecated conversion from string constant to 'char*'
858:info:build Interpreter.cxx:2196: warning: deprecated conversion from string constant to 'char*'
859:info:build Interpreter.cxx:2196: warning: deprecated conversion from string constant to 'char*'
860:info:build Interpreter.cxx:2196: warning: deprecated conversion from string constant to 'char*'
861:info:build Interpreter.cxx:2196: warning: deprecated conversion from string constant to 'char*'
862:info:build Interpreter.cxx:2196: warning: deprecated conversion from string constant to 'char*'
863:info:build Interpreter.cxx:2196: warning: deprecated conversion from string constant to 'char*'
864:info:build Interpreter.cxx:2196: warning: deprecated conversion from string constant to 'char*'
865:info:build Interpreter.cxx:2196: warning: deprecated conversion from string constant to 'char*'
866:info:build Interpreter.cxx:2196: warning: deprecated conversion from string constant to 'char*'
867:info:build Interpreter.cxx:2196: warning: deprecated conversion from string constant to 'char*'
868:info:build Interpreter.cxx:2196: warning: deprecated conversion from string constant to 'char*'
869:info:build Interpreter.cxx:2196: warning: deprecated conversion from string constant to 'char*'
870:info:build mv -f .libs/NumberCache.lo NumberCache.lo
871:info:build rm -f .libs/ProcessContext.lo
872:info:build /usr/bin/llvm-g++-4.2 -pipe -Os -isystem /opt/local/include -fno-rtti -arch x86_64 -arch i386 -I. -I./../include -I./../grove -I./../spgrove -I/opt/local/include/OpenSP -I/opt/local/include/OpenSP/.. "-DPACKAGE_NAME=\"\"" "-DPACKAGE_TARNAME=\"\"" "-DPACKAGE_VERSION=\"\"" "-DPACKAGE_STRING=\"\"" "-DPACKAGE_BUGREPORT=\"\"" "-DPACKAGE=\"openjade\"" "-DVERSION=\"1.3.2\"" -DHAVE_SYS_TYPES_H=1 -DHAVE_SYS_STAT_H=1 -DHAVE_STDLIB_H=1 -DHAVE_STRING_H=1 -DHAVE_MEMORY_H=1 -DHAVE_STRINGS_H=1 -DHAVE_INTTYPES_H=1 -DHAVE_STDINT_H=1 -DHAVE_UNISTD_H=1 -DHAVE_STRUCT_STAT_ST_BLKSIZE=1 -DHAVE_ST_BLKSIZE=1 -DSIZEOF_SIZE_T=8 -DSIZEOF_UNSIGNED_INT=4 -DSP_HAVE_LOCALE=1 -DSP_HAVE_WCHAR=1 -DSP_HAVE_GETTEXT=1 -DSP_HAVE_BOOL=1 -DSP_ANSI_CLASS_INST=1 -DSP_HAVE_SOCKET=1 -DJADE_MIF=1 -DJADE_HTML=1 -DSP_MULTI_BYTE=1 "-DSGML_CATALOG_FILES_DEFAULT=\"/opt/local/share/sgml/catalog\"" -DHAVE_DLFCN_H=1 "-DDEFAULT_SCHEME_BUILTINS=\"/opt/local/share/sgml/openjade/builtins.dsl\"" -c ProcessContext.cxx  -fno-common -DPIC
873:info:build In file included from stylelib.h:6,
874:info:build                  from ProcessContext.cxx:4:
875:info:build ./../include/config.h:39:1: warning: "SP_DEFINE_TEMPLATES" redefined
876:info:build In file included from ./../include/config.h:10,
877:info:build                  from stylelib.h:6,
878:info:build                  from ProcessContext.cxx:4:
879:info:build /opt/local/include/OpenSP/config.h:367:1: warning: this is the location of the previous definition
880:info:build In file included from stylelib.h:6,
881:info:build                  from ProcessContext.cxx:4:
882:info:build ./../include/config.h:39:1: warning: "SP_DEFINE_TEMPLATES" redefined
883:info:build In file included from ./../include/config.h:10,
884:info:build                  from stylelib.h:6,
885:info:build                  from ProcessContext.cxx:4:
886:info:build /opt/local/include/OpenSP/config.h:367:1: warning: this is the location of the previous definition
887:info:build mv -f Interpreter.o .libs/Interpreter.lo
888:info:build /usr/bin/llvm-g++-4.2 -pipe -Os -isystem /opt/local/include -fno-rtti -arch x86_64 -arch i386 -I. -I./../include -I./../grove -I./../spgrove -I/opt/local/include/OpenSP -I/opt/local/include/OpenSP/.. "-DPACKAGE_NAME=\"\"" "-DPACKAGE_TARNAME=\"\"" "-DPACKAGE_VERSION=\"\"" "-DPACKAGE_STRING=\"\"" "-DPACKAGE_BUGREPORT=\"\"" "-DPACKAGE=\"openjade\"" "-DVERSION=\"1.3.2\"" -DHAVE_SYS_TYPES_H=1 -DHAVE_SYS_STAT_H=1 -DHAVE_STDLIB_H=1 -DHAVE_STRING_H=1 -DHAVE_MEMORY_H=1 -DHAVE_STRINGS_H=1 -DHAVE_INTTYPES_H=1 -DHAVE_STDINT_H=1 -DHAVE_UNISTD_H=1 -DHAVE_STRUCT_STAT_ST_BLKSIZE=1 -DHAVE_ST_BLKSIZE=1 -DSIZEOF_SIZE_T=8 -DSIZEOF_UNSIGNED_INT=4 -DSP_HAVE_LOCALE=1 -DSP_HAVE_WCHAR=1 -DSP_HAVE_GETTEXT=1 -DSP_HAVE_BOOL=1 -DSP_ANSI_CLASS_INST=1 -DSP_HAVE_SOCKET=1 -DJADE_MIF=1 -DJADE_HTML=1 -DSP_MULTI_BYTE=1 "-DSGML_CATALOG_FILES_DEFAULT=\"/opt/local/share/sgml/catalog\"" -DHAVE_DLFCN_H=1 "-DDEFAULT_SCHEME_BUILTINS=\"/opt/local/share/sgml/openjade/builtins.dsl\"" -c Interpreter.cxx >/dev/null 2>&1
889:info:build mv -f ProcessContext.o .libs/ProcessContext.lo
890:info:build /usr/bin/llvm-g++-4.2 -pipe -Os -isystem /opt/local/include -fno-rtti -arch x86_64 -arch i386 -I. -I./../include -I./../grove -I./../spgrove -I/opt/local/include/OpenSP -I/opt/local/include/OpenSP/.. "-DPACKAGE_NAME=\"\"" "-DPACKAGE_TARNAME=\"\"" "-DPACKAGE_VERSION=\"\"" "-DPACKAGE_STRING=\"\"" "-DPACKAGE_BUGREPORT=\"\"" "-DPACKAGE=\"openjade\"" "-DVERSION=\"1.3.2\"" -DHAVE_SYS_TYPES_H=1 -DHAVE_SYS_STAT_H=1 -DHAVE_STDLIB_H=1 -DHAVE_STRING_H=1 -DHAVE_MEMORY_H=1 -DHAVE_STRINGS_H=1 -DHAVE_INTTYPES_H=1 -DHAVE_STDINT_H=1 -DHAVE_UNISTD_H=1 -DHAVE_STRUCT_STAT_ST_BLKSIZE=1 -DHAVE_ST_BLKSIZE=1 -DSIZEOF_SIZE_T=8 -DSIZEOF_UNSIGNED_INT=4 -DSP_HAVE_LOCALE=1 -DSP_HAVE_WCHAR=1 -DSP_HAVE_GETTEXT=1 -DSP_HAVE_BOOL=1 -DSP_ANSI_CLASS_INST=1 -DSP_HAVE_SOCKET=1 -DJADE_MIF=1 -DJADE_HTML=1 -DSP_MULTI_BYTE=1 "-DSGML_CATALOG_FILES_DEFAULT=\"/opt/local/share/sgml/catalog\"" -DHAVE_DLFCN_H=1 "-DDEFAULT_SCHEME_BUILTINS=\"/opt/local/share/sgml/openjade/builtins.dsl\"" -c ProcessContext.cxx >/dev/null 2>&1
891:info:build mv -f .libs/ProcessContext.lo ProcessContext.lo
892:info:build rm -f .libs/ProcessingMode.lo
893:info:build /usr/bin/llvm-g++-4.2 -pipe -Os -isystem /opt/local/include -fno-rtti -arch x86_64 -arch i386 -I. -I./../include -I./../grove -I./../spgrove -I/opt/local/include/OpenSP -I/opt/local/include/OpenSP/.. "-DPACKAGE_NAME=\"\"" "-DPACKAGE_TARNAME=\"\"" "-DPACKAGE_VERSION=\"\"" "-DPACKAGE_STRING=\"\"" "-DPACKAGE_BUGREPORT=\"\"" "-DPACKAGE=\"openjade\"" "-DVERSION=\"1.3.2\"" -DHAVE_SYS_TYPES_H=1 -DHAVE_SYS_STAT_H=1 -DHAVE_STDLIB_H=1 -DHAVE_STRING_H=1 -DHAVE_MEMORY_H=1 -DHAVE_STRINGS_H=1 -DHAVE_INTTYPES_H=1 -DHAVE_STDINT_H=1 -DHAVE_UNISTD_H=1 -DHAVE_STRUCT_STAT_ST_BLKSIZE=1 -DHAVE_ST_BLKSIZE=1 -DSIZEOF_SIZE_T=8 -DSIZEOF_UNSIGNED_INT=4 -DSP_HAVE_LOCALE=1 -DSP_HAVE_WCHAR=1 -DSP_HAVE_GETTEXT=1 -DSP_HAVE_BOOL=1 -DSP_ANSI_CLASS_INST=1 -DSP_HAVE_SOCKET=1 -DJADE_MIF=1 -DJADE_HTML=1 -DSP_MULTI_BYTE=1 "-DSGML_CATALOG_FILES_DEFAULT=\"/opt/local/share/sgml/catalog\"" -DHAVE_DLFCN_H=1 "-DDEFAULT_SCHEME_BUILTINS=\"/opt/local/share/sgml/openjade/builtins.dsl\"" -c ProcessingMode.cxx  -fno-common -DPIC
894:info:build In file included from stylelib.h:6,
895:info:build                  from ProcessingMode.cxx:4:
896:info:build ./../include/config.h:39:1: warning: "SP_DEFINE_TEMPLATES" redefined
897:info:build In file included from ./../include/config.h:10,
898:info:build                  from stylelib.h:6,
899:info:build                  from ProcessingMode.cxx:4:
900:info:build /opt/local/include/OpenSP/config.h:367:1: warning: this is the location of the previous definition
901:info:build In file included from stylelib.h:6,
902:info:build                  from ProcessingMode.cxx:4:
903:info:build ./../include/config.h:39:1: warning: "SP_DEFINE_TEMPLATES" redefined
904:info:build In file included from ./../include/config.h:10,
905:info:build                  from stylelib.h:6,
906:info:build                  from ProcessingMode.cxx:4:
907:info:build /opt/local/include/OpenSP/config.h:367:1: warning: this is the location of the previous definition
908:info:build mv -f ProcessingMode.o .libs/ProcessingMode.lo
909:info:build /usr/bin/llvm-g++-4.2 -pipe -Os -isystem /opt/local/include -fno-rtti -arch x86_64 -arch i386 -I. -I./../include -I./../grove -I./../spgrove -I/opt/local/include/OpenSP -I/opt/local/include/OpenSP/.. "-DPACKAGE_NAME=\"\"" "-DPACKAGE_TARNAME=\"\"" "-DPACKAGE_VERSION=\"\"" "-DPACKAGE_STRING=\"\"" "-DPACKAGE_BUGREPORT=\"\"" "-DPACKAGE=\"openjade\"" "-DVERSION=\"1.3.2\"" -DHAVE_SYS_TYPES_H=1 -DHAVE_SYS_STAT_H=1 -DHAVE_STDLIB_H=1 -DHAVE_STRING_H=1 -DHAVE_MEMORY_H=1 -DHAVE_STRINGS_H=1 -DHAVE_INTTYPES_H=1 -DHAVE_STDINT_H=1 -DHAVE_UNISTD_H=1 -DHAVE_STRUCT_STAT_ST_BLKSIZE=1 -DHAVE_ST_BLKSIZE=1 -DSIZEOF_SIZE_T=8 -DSIZEOF_UNSIGNED_INT=4 -DSP_HAVE_LOCALE=1 -DSP_HAVE_WCHAR=1 -DSP_HAVE_GETTEXT=1 -DSP_HAVE_BOOL=1 -DSP_ANSI_CLASS_INST=1 -DSP_HAVE_SOCKET=1 -DJADE_MIF=1 -DJADE_HTML=1 -DSP_MULTI_BYTE=1 "-DSGML_CATALOG_FILES_DEFAULT=\"/opt/local/share/sgml/catalog\"" -DHAVE_DLFCN_H=1 "-DDEFAULT_SCHEME_BUILTINS=\"/opt/local/share/sgml/openjade/builtins.dsl\"" -c ProcessingMode.cxx >/dev/null 2>&1
910:info:build mv -f .libs/Interpreter.lo Interpreter.lo
911:info:build rm -f .libs/SchemeParser.lo
912:info:build /usr/bin/llvm-g++-4.2 -pipe -Os -isystem /opt/local/include -fno-rtti -arch x86_64 -arch i386 -I. -I./../include -I./../grove -I./../spgrove -I/opt/local/include/OpenSP -I/opt/local/include/OpenSP/.. "-DPACKAGE_NAME=\"\"" "-DPACKAGE_TARNAME=\"\"" "-DPACKAGE_VERSION=\"\"" "-DPACKAGE_STRING=\"\"" "-DPACKAGE_BUGREPORT=\"\"" "-DPACKAGE=\"openjade\"" "-DVERSION=\"1.3.2\"" -DHAVE_SYS_TYPES_H=1 -DHAVE_SYS_STAT_H=1 -DHAVE_STDLIB_H=1 -DHAVE_STRING_H=1 -DHAVE_MEMORY_H=1 -DHAVE_STRINGS_H=1 -DHAVE_INTTYPES_H=1 -DHAVE_STDINT_H=1 -DHAVE_UNISTD_H=1 -DHAVE_STRUCT_STAT_ST_BLKSIZE=1 -DHAVE_ST_BLKSIZE=1 -DSIZEOF_SIZE_T=8 -DSIZEOF_UNSIGNED_INT=4 -DSP_HAVE_LOCALE=1 -DSP_HAVE_WCHAR=1 -DSP_HAVE_GETTEXT=1 -DSP_HAVE_BOOL=1 -DSP_ANSI_CLASS_INST=1 -DSP_HAVE_SOCKET=1 -DJADE_MIF=1 -DJADE_HTML=1 -DSP_MULTI_BYTE=1 "-DSGML_CATALOG_FILES_DEFAULT=\"/opt/local/share/sgml/catalog\"" -DHAVE_DLFCN_H=1 "-DDEFAULT_SCHEME_BUILTINS=\"/opt/local/share/sgml/openjade/builtins.dsl\"" -c SchemeParser.cxx  -fno-common -DPIC
913:info:build In file included from stylelib.h:6,
914:info:build                  from SchemeParser.cxx:4:
915:info:build ./../include/config.h:39:1: warning: "SP_DEFINE_TEMPLATES" redefined
916:info:build In file included from ./../include/config.h:10,
917:info:build                  from stylelib.h:6,
918:info:build                  from SchemeParser.cxx:4:
919:info:build /opt/local/include/OpenSP/config.h:367:1: warning: this is the location of the previous definition
920:info:build mv -f .libs/ProcessingMode.lo ProcessingMode.lo
921:info:build rm -f .libs/Style.lo
922:info:build /usr/bin/llvm-g++-4.2 -pipe -Os -isystem /opt/local/include -fno-rtti -arch x86_64 -arch i386 -I. -I./../include -I./../grove -I./../spgrove -I/opt/local/include/OpenSP -I/opt/local/include/OpenSP/.. "-DPACKAGE_NAME=\"\"" "-DPACKAGE_TARNAME=\"\"" "-DPACKAGE_VERSION=\"\"" "-DPACKAGE_STRING=\"\"" "-DPACKAGE_BUGREPORT=\"\"" "-DPACKAGE=\"openjade\"" "-DVERSION=\"1.3.2\"" -DHAVE_SYS_TYPES_H=1 -DHAVE_SYS_STAT_H=1 -DHAVE_STDLIB_H=1 -DHAVE_STRING_H=1 -DHAVE_MEMORY_H=1 -DHAVE_STRINGS_H=1 -DHAVE_INTTYPES_H=1 -DHAVE_STDINT_H=1 -DHAVE_UNISTD_H=1 -DHAVE_STRUCT_STAT_ST_BLKSIZE=1 -DHAVE_ST_BLKSIZE=1 -DSIZEOF_SIZE_T=8 -DSIZEOF_UNSIGNED_INT=4 -DSP_HAVE_LOCALE=1 -DSP_HAVE_WCHAR=1 -DSP_HAVE_GETTEXT=1 -DSP_HAVE_BOOL=1 -DSP_ANSI_CLASS_INST=1 -DSP_HAVE_SOCKET=1 -DJADE_MIF=1 -DJADE_HTML=1 -DSP_MULTI_BYTE=1 "-DSGML_CATALOG_FILES_DEFAULT=\"/opt/local/share/sgml/catalog\"" -DHAVE_DLFCN_H=1 "-DDEFAULT_SCHEME_BUILTINS=\"/opt/local/share/sgml/openjade/builtins.dsl\"" -c Style.cxx  -fno-common -DPIC
923:info:build In file included from stylelib.h:6,
924:info:build                  from Style.cxx:4:
925:info:build ./../include/config.h:39:1: warning: "SP_DEFINE_TEMPLATES" redefined
926:info:build In file included from ./../include/config.h:10,
927:info:build                  from stylelib.h:6,
928:info:build                  from Style.cxx:4:
929:info:build /opt/local/include/OpenSP/config.h:367:1: warning: this is the location of the previous definition
930:info:build In file included from stylelib.h:6,
931:info:build                  from SchemeParser.cxx:4:
932:info:build ./../include/config.h:39:1: warning: "SP_DEFINE_TEMPLATES" redefined
933:info:build In file included from ./../include/config.h:10,
934:info:build                  from stylelib.h:6,
935:info:build                  from SchemeParser.cxx:4:
936:info:build /opt/local/include/OpenSP/config.h:367:1: warning: this is the location of the previous definition
937:info:build In file included from stylelib.h:6,
938:info:build                  from Style.cxx:4:
939:info:build ./../include/config.h:39:1: warning: "SP_DEFINE_TEMPLATES" redefined
940:info:build In file included from ./../include/config.h:10,
941:info:build                  from stylelib.h:6,
942:info:build                  from Style.cxx:4:
943:info:build /opt/local/include/OpenSP/config.h:367:1: warning: this is the location of the previous definition
944:info:build mv -f Style.o .libs/Style.lo
945:info:build /usr/bin/llvm-g++-4.2 -pipe -Os -isystem /opt/local/include -fno-rtti -arch x86_64 -arch i386 -I. -I./../include -I./../grove -I./../spgrove -I/opt/local/include/OpenSP -I/opt/local/include/OpenSP/.. "-DPACKAGE_NAME=\"\"" "-DPACKAGE_TARNAME=\"\"" "-DPACKAGE_VERSION=\"\"" "-DPACKAGE_STRING=\"\"" "-DPACKAGE_BUGREPORT=\"\"" "-DPACKAGE=\"openjade\"" "-DVERSION=\"1.3.2\"" -DHAVE_SYS_TYPES_H=1 -DHAVE_SYS_STAT_H=1 -DHAVE_STDLIB_H=1 -DHAVE_STRING_H=1 -DHAVE_MEMORY_H=1 -DHAVE_STRINGS_H=1 -DHAVE_INTTYPES_H=1 -DHAVE_STDINT_H=1 -DHAVE_UNISTD_H=1 -DHAVE_STRUCT_STAT_ST_BLKSIZE=1 -DHAVE_ST_BLKSIZE=1 -DSIZEOF_SIZE_T=8 -DSIZEOF_UNSIGNED_INT=4 -DSP_HAVE_LOCALE=1 -DSP_HAVE_WCHAR=1 -DSP_HAVE_GETTEXT=1 -DSP_HAVE_BOOL=1 -DSP_ANSI_CLASS_INST=1 -DSP_HAVE_SOCKET=1 -DJADE_MIF=1 -DJADE_HTML=1 -DSP_MULTI_BYTE=1 "-DSGML_CATALOG_FILES_DEFAULT=\"/opt/local/share/sgml/catalog\"" -DHAVE_DLFCN_H=1 "-DDEFAULT_SCHEME_BUILTINS=\"/opt/local/share/sgml/openjade/builtins.dsl\"" -c Style.cxx >/dev/null 2>&1
946:info:build mv -f SchemeParser.o .libs/SchemeParser.lo
947:info:build /usr/bin/llvm-g++-4.2 -pipe -Os -isystem /opt/local/include -fno-rtti -arch x86_64 -arch i386 -I. -I./../include -I./../grove -I./../spgrove -I/opt/local/include/OpenSP -I/opt/local/include/OpenSP/.. "-DPACKAGE_NAME=\"\"" "-DPACKAGE_TARNAME=\"\"" "-DPACKAGE_VERSION=\"\"" "-DPACKAGE_STRING=\"\"" "-DPACKAGE_BUGREPORT=\"\"" "-DPACKAGE=\"openjade\"" "-DVERSION=\"1.3.2\"" -DHAVE_SYS_TYPES_H=1 -DHAVE_SYS_STAT_H=1 -DHAVE_STDLIB_H=1 -DHAVE_STRING_H=1 -DHAVE_MEMORY_H=1 -DHAVE_STRINGS_H=1 -DHAVE_INTTYPES_H=1 -DHAVE_STDINT_H=1 -DHAVE_UNISTD_H=1 -DHAVE_STRUCT_STAT_ST_BLKSIZE=1 -DHAVE_ST_BLKSIZE=1 -DSIZEOF_SIZE_T=8 -DSIZEOF_UNSIGNED_INT=4 -DSP_HAVE_LOCALE=1 -DSP_HAVE_WCHAR=1 -DSP_HAVE_GETTEXT=1 -DSP_HAVE_BOOL=1 -DSP_ANSI_CLASS_INST=1 -DSP_HAVE_SOCKET=1 -DJADE_MIF=1 -DJADE_HTML=1 -DSP_MULTI_BYTE=1 "-DSGML_CATALOG_FILES_DEFAULT=\"/opt/local/share/sgml/catalog\"" -DHAVE_DLFCN_H=1 "-DDEFAULT_SCHEME_BUILTINS=\"/opt/local/share/sgml/openjade/builtins.dsl\"" -c SchemeParser.cxx >/dev/null 2>&1
948:info:build mv -f .libs/Style.lo Style.lo
949:info:build rm -f .libs/StyleEngine.lo
950:info:build /usr/bin/llvm-g++-4.2 -pipe -Os -isystem /opt/local/include -fno-rtti -arch x86_64 -arch i386 -I. -I./../include -I./../grove -I./../spgrove -I/opt/local/include/OpenSP -I/opt/local/include/OpenSP/.. "-DPACKAGE_NAME=\"\"" "-DPACKAGE_TARNAME=\"\"" "-DPACKAGE_VERSION=\"\"" "-DPACKAGE_STRING=\"\"" "-DPACKAGE_BUGREPORT=\"\"" "-DPACKAGE=\"openjade\"" "-DVERSION=\"1.3.2\"" -DHAVE_SYS_TYPES_H=1 -DHAVE_SYS_STAT_H=1 -DHAVE_STDLIB_H=1 -DHAVE_STRING_H=1 -DHAVE_MEMORY_H=1 -DHAVE_STRINGS_H=1 -DHAVE_INTTYPES_H=1 -DHAVE_STDINT_H=1 -DHAVE_UNISTD_H=1 -DHAVE_STRUCT_STAT_ST_BLKSIZE=1 -DHAVE_ST_BLKSIZE=1 -DSIZEOF_SIZE_T=8 -DSIZEOF_UNSIGNED_INT=4 -DSP_HAVE_LOCALE=1 -DSP_HAVE_WCHAR=1 -DSP_HAVE_GETTEXT=1 -DSP_HAVE_BOOL=1 -DSP_ANSI_CLASS_INST=1 -DSP_HAVE_SOCKET=1 -DJADE_MIF=1 -DJADE_HTML=1 -DSP_MULTI_BYTE=1 "-DSGML_CATALOG_FILES_DEFAULT=\"/opt/local/share/sgml/catalog\"" -DHAVE_DLFCN_H=1 "-DDEFAULT_SCHEME_BUILTINS=\"/opt/local/share/sgml/openjade/builtins.dsl\"" -c StyleEngine.cxx  -fno-common -DPIC
951:info:build In file included from stylelib.h:6,
952:info:build                  from StyleEngine.cxx:4:
953:info:build ./../include/config.h:39:1: warning: "SP_DEFINE_TEMPLATES" redefined
954:info:build In file included from ./../include/config.h:10,
955:info:build                  from stylelib.h:6,
956:info:build                  from StyleEngine.cxx:4:
957:info:build /opt/local/include/OpenSP/config.h:367:1: warning: this is the location of the previous definition
958:info:build In file included from stylelib.h:6,
959:info:build                  from StyleEngine.cxx:4:
960:info:build ./../include/config.h:39:1: warning: "SP_DEFINE_TEMPLATES" redefined
961:info:build In file included from ./../include/config.h:10,
962:info:build                  from stylelib.h:6,
963:info:build                  from StyleEngine.cxx:4:
964:info:build /opt/local/include/OpenSP/config.h:367:1: warning: this is the location of the previous definition
965:info:build mv -f StyleEngine.o .libs/StyleEngine.lo
966:info:build /usr/bin/llvm-g++-4.2 -pipe -Os -isystem /opt/local/include -fno-rtti -arch x86_64 -arch i386 -I. -I./../include -I./../grove -I./../spgrove -I/opt/local/include/OpenSP -I/opt/local/include/OpenSP/.. "-DPACKAGE_NAME=\"\"" "-DPACKAGE_TARNAME=\"\"" "-DPACKAGE_VERSION=\"\"" "-DPACKAGE_STRING=\"\"" "-DPACKAGE_BUGREPORT=\"\"" "-DPACKAGE=\"openjade\"" "-DVERSION=\"1.3.2\"" -DHAVE_SYS_TYPES_H=1 -DHAVE_SYS_STAT_H=1 -DHAVE_STDLIB_H=1 -DHAVE_STRING_H=1 -DHAVE_MEMORY_H=1 -DHAVE_STRINGS_H=1 -DHAVE_INTTYPES_H=1 -DHAVE_STDINT_H=1 -DHAVE_UNISTD_H=1 -DHAVE_STRUCT_STAT_ST_BLKSIZE=1 -DHAVE_ST_BLKSIZE=1 -DSIZEOF_SIZE_T=8 -DSIZEOF_UNSIGNED_INT=4 -DSP_HAVE_LOCALE=1 -DSP_HAVE_WCHAR=1 -DSP_HAVE_GETTEXT=1 -DSP_HAVE_BOOL=1 -DSP_ANSI_CLASS_INST=1 -DSP_HAVE_SOCKET=1 -DJADE_MIF=1 -DJADE_HTML=1 -DSP_MULTI_BYTE=1 "-DSGML_CATALOG_FILES_DEFAULT=\"/opt/local/share/sgml/catalog\"" -DHAVE_DLFCN_H=1 "-DDEFAULT_SCHEME_BUILTINS=\"/opt/local/share/sgml/openjade/builtins.dsl\"" -c StyleEngine.cxx >/dev/null 2>&1
967:info:build mv -f .libs/SchemeParser.lo SchemeParser.lo
968:info:build rm -f primitive_inst.cxx
969:info:build perl ./../instmac.pl primitive_inst.m4 >primitive_inst.cxx
970:info:build chmod -w primitive_inst.cxx
971:info:build rm -f .libs/GroveManager.lo
972:info:build /usr/bin/llvm-g++-4.2 -pipe -Os -isystem /opt/local/include -fno-rtti -arch x86_64 -arch i386 -I. -I./../include -I./../grove -I./../spgrove -I/opt/local/include/OpenSP -I/opt/local/include/OpenSP/.. "-DPACKAGE_NAME=\"\"" "-DPACKAGE_TARNAME=\"\"" "-DPACKAGE_VERSION=\"\"" "-DPACKAGE_STRING=\"\"" "-DPACKAGE_BUGREPORT=\"\"" "-DPACKAGE=\"openjade\"" "-DVERSION=\"1.3.2\"" -DHAVE_SYS_TYPES_H=1 -DHAVE_SYS_STAT_H=1 -DHAVE_STDLIB_H=1 -DHAVE_STRING_H=1 -DHAVE_MEMORY_H=1 -DHAVE_STRINGS_H=1 -DHAVE_INTTYPES_H=1 -DHAVE_STDINT_H=1 -DHAVE_UNISTD_H=1 -DHAVE_STRUCT_STAT_ST_BLKSIZE=1 -DHAVE_ST_BLKSIZE=1 -DSIZEOF_SIZE_T=8 -DSIZEOF_UNSIGNED_INT=4 -DSP_HAVE_LOCALE=1 -DSP_HAVE_WCHAR=1 -DSP_HAVE_GETTEXT=1 -DSP_HAVE_BOOL=1 -DSP_ANSI_CLASS_INST=1 -DSP_HAVE_SOCKET=1 -DJADE_MIF=1 -DJADE_HTML=1 -DSP_MULTI_BYTE=1 "-DSGML_CATALOG_FILES_DEFAULT=\"/opt/local/share/sgml/catalog\"" -DHAVE_DLFCN_H=1 "-DDEFAULT_SCHEME_BUILTINS=\"/opt/local/share/sgml/openjade/builtins.dsl\"" -c GroveManager.cxx  -fno-common -DPIC
973:info:build In file included from stylelib.h:6,
974:info:build                  from GroveManager.cxx:4:
975:info:build ./../include/config.h:39:1: warning: "SP_DEFINE_TEMPLATES" redefined
976:info:build In file included from ./../include/config.h:10,
977:info:build                  from stylelib.h:6,
978:info:build                  from GroveManager.cxx:4:
979:info:build /opt/local/include/OpenSP/config.h:367:1: warning: this is the location of the previous definition
980:info:build In file included from stylelib.h:6,
981:info:build                  from GroveManager.cxx:4:
982:info:build ./../include/config.h:39:1: warning: "SP_DEFINE_TEMPLATES" redefined
983:info:build In file included from ./../include/config.h:10,
984:info:build                  from stylelib.h:6,
985:info:build                  from GroveManager.cxx:4:
986:info:build /opt/local/include/OpenSP/config.h:367:1: warning: this is the location of the previous definition
987:info:build mv -f GroveManager.o .libs/GroveManager.lo
988:info:build /usr/bin/llvm-g++-4.2 -pipe -Os -isystem /opt/local/include -fno-rtti -arch x86_64 -arch i386 -I. -I./../include -I./../grove -I./../spgrove -I/opt/local/include/OpenSP -I/opt/local/include/OpenSP/.. "-DPACKAGE_NAME=\"\"" "-DPACKAGE_TARNAME=\"\"" "-DPACKAGE_VERSION=\"\"" "-DPACKAGE_STRING=\"\"" "-DPACKAGE_BUGREPORT=\"\"" "-DPACKAGE=\"openjade\"" "-DVERSION=\"1.3.2\"" -DHAVE_SYS_TYPES_H=1 -DHAVE_SYS_STAT_H=1 -DHAVE_STDLIB_H=1 -DHAVE_STRING_H=1 -DHAVE_MEMORY_H=1 -DHAVE_STRINGS_H=1 -DHAVE_INTTYPES_H=1 -DHAVE_STDINT_H=1 -DHAVE_UNISTD_H=1 -DHAVE_STRUCT_STAT_ST_BLKSIZE=1 -DHAVE_ST_BLKSIZE=1 -DSIZEOF_SIZE_T=8 -DSIZEOF_UNSIGNED_INT=4 -DSP_HAVE_LOCALE=1 -DSP_HAVE_WCHAR=1 -DSP_HAVE_GETTEXT=1 -DSP_HAVE_BOOL=1 -DSP_ANSI_CLASS_INST=1 -DSP_HAVE_SOCKET=1 -DJADE_MIF=1 -DJADE_HTML=1 -DSP_MULTI_BYTE=1 "-DSGML_CATALOG_FILES_DEFAULT=\"/opt/local/share/sgml/catalog\"" -DHAVE_DLFCN_H=1 "-DDEFAULT_SCHEME_BUILTINS=\"/opt/local/share/sgml/openjade/builtins.dsl\"" -c GroveManager.cxx >/dev/null 2>&1
989:info:build mv -f .libs/GroveManager.lo GroveManager.lo
990:info:build rm -f .libs/Pattern.lo
991:info:build /usr/bin/llvm-g++-4.2 -pipe -Os -isystem /opt/local/include -fno-rtti -arch x86_64 -arch i386 -I. -I./../include -I./../grove -I./../spgrove -I/opt/local/include/OpenSP -I/opt/local/include/OpenSP/.. "-DPACKAGE_NAME=\"\"" "-DPACKAGE_TARNAME=\"\"" "-DPACKAGE_VERSION=\"\"" "-DPACKAGE_STRING=\"\"" "-DPACKAGE_BUGREPORT=\"\"" "-DPACKAGE=\"openjade\"" "-DVERSION=\"1.3.2\"" -DHAVE_SYS_TYPES_H=1 -DHAVE_SYS_STAT_H=1 -DHAVE_STDLIB_H=1 -DHAVE_STRING_H=1 -DHAVE_MEMORY_H=1 -DHAVE_STRINGS_H=1 -DHAVE_INTTYPES_H=1 -DHAVE_STDINT_H=1 -DHAVE_UNISTD_H=1 -DHAVE_STRUCT_STAT_ST_BLKSIZE=1 -DHAVE_ST_BLKSIZE=1 -DSIZEOF_SIZE_T=8 -DSIZEOF_UNSIGNED_INT=4 -DSP_HAVE_LOCALE=1 -DSP_HAVE_WCHAR=1 -DSP_HAVE_GETTEXT=1 -DSP_HAVE_BOOL=1 -DSP_ANSI_CLASS_INST=1 -DSP_HAVE_SOCKET=1 -DJADE_MIF=1 -DJADE_HTML=1 -DSP_MULTI_BYTE=1 "-DSGML_CATALOG_FILES_DEFAULT=\"/opt/local/share/sgml/catalog\"" -DHAVE_DLFCN_H=1 "-DDEFAULT_SCHEME_BUILTINS=\"/opt/local/share/sgml/openjade/builtins.dsl\"" -c Pattern.cxx  -fno-common -DPIC
992:info:build In file included from stylelib.h:6,
993:info:build                  from Pattern.cxx:4:
994:info:build ./../include/config.h:39:1: warning: "SP_DEFINE_TEMPLATES" redefined
995:info:build In file included from ./../include/config.h:10,
996:info:build                  from stylelib.h:6,
997:info:build                  from Pattern.cxx:4:
998:info:build /opt/local/include/OpenSP/config.h:367:1: warning: this is the location of the previous definition
999:info:build mv -f .libs/StyleEngine.lo StyleEngine.lo
1000:info:build rm -f .libs/MacroFlowObj.lo
1001:info:build /usr/bin/llvm-g++-4.2 -pipe -Os -isystem /opt/local/include -fno-rtti -arch x86_64 -arch i386 -I. -I./../include -I./../grove -I./../spgrove -I/opt/local/include/OpenSP -I/opt/local/include/OpenSP/.. "-DPACKAGE_NAME=\"\"" "-DPACKAGE_TARNAME=\"\"" "-DPACKAGE_VERSION=\"\"" "-DPACKAGE_STRING=\"\"" "-DPACKAGE_BUGREPORT=\"\"" "-DPACKAGE=\"openjade\"" "-DVERSION=\"1.3.2\"" -DHAVE_SYS_TYPES_H=1 -DHAVE_SYS_STAT_H=1 -DHAVE_STDLIB_H=1 -DHAVE_STRING_H=1 -DHAVE_MEMORY_H=1 -DHAVE_STRINGS_H=1 -DHAVE_INTTYPES_H=1 -DHAVE_STDINT_H=1 -DHAVE_UNISTD_H=1 -DHAVE_STRUCT_STAT_ST_BLKSIZE=1 -DHAVE_ST_BLKSIZE=1 -DSIZEOF_SIZE_T=8 -DSIZEOF_UNSIGNED_INT=4 -DSP_HAVE_LOCALE=1 -DSP_HAVE_WCHAR=1 -DSP_HAVE_GETTEXT=1 -DSP_HAVE_BOOL=1 -DSP_ANSI_CLASS_INST=1 -DSP_HAVE_SOCKET=1 -DJADE_MIF=1 -DJADE_HTML=1 -DSP_MULTI_BYTE=1 "-DSGML_CATALOG_FILES_DEFAULT=\"/opt/local/share/sgml/catalog\"" -DHAVE_DLFCN_H=1 "-DDEFAULT_SCHEME_BUILTINS=\"/opt/local/share/sgml/openjade/builtins.dsl\"" -c MacroFlowObj.cxx  -fno-common -DPIC
1002:info:build In file included from stylelib.h:6,
1003:info:build                  from MacroFlowObj.cxx:4:
1004:info:build ./../include/config.h:39:1: warning: "SP_DEFINE_TEMPLATES" redefined
1005:info:build In file included from ./../include/config.h:10,
1006:info:build                  from stylelib.h:6,
1007:info:build                  from MacroFlowObj.cxx:4:
1008:info:build /opt/local/include/OpenSP/config.h:367:1: warning: this is the location of the previous definition
1009:info:build In file included from stylelib.h:6,
1010:info:build                  from Pattern.cxx:4:
1011:info:build ./../include/config.h:39:1: warning: "SP_DEFINE_TEMPLATES" redefined
1012:info:build In file included from ./../include/config.h:10,
1013:info:build                  from stylelib.h:6,
1014:info:build                  from Pattern.cxx:4:
1015:info:build /opt/local/include/OpenSP/config.h:367:1: warning: this is the location of the previous definition
1016:info:build In file included from stylelib.h:6,
1017:info:build                  from MacroFlowObj.cxx:4:
1018:info:build ./../include/config.h:39:1: warning: "SP_DEFINE_TEMPLATES" redefined
1019:info:build In file included from ./../include/config.h:10,
1020:info:build                  from stylelib.h:6,
1021:info:build                  from MacroFlowObj.cxx:4:
1022:info:build /opt/local/include/OpenSP/config.h:367:1: warning: this is the location of the previous definition
1023:info:build mv -f Pattern.o .libs/Pattern.lo
1024:info:build /usr/bin/llvm-g++-4.2 -pipe -Os -isystem /opt/local/include -fno-rtti -arch x86_64 -arch i386 -I. -I./../include -I./../grove -I./../spgrove -I/opt/local/include/OpenSP -I/opt/local/include/OpenSP/.. "-DPACKAGE_NAME=\"\"" "-DPACKAGE_TARNAME=\"\"" "-DPACKAGE_VERSION=\"\"" "-DPACKAGE_STRING=\"\"" "-DPACKAGE_BUGREPORT=\"\"" "-DPACKAGE=\"openjade\"" "-DVERSION=\"1.3.2\"" -DHAVE_SYS_TYPES_H=1 -DHAVE_SYS_STAT_H=1 -DHAVE_STDLIB_H=1 -DHAVE_STRING_H=1 -DHAVE_MEMORY_H=1 -DHAVE_STRINGS_H=1 -DHAVE_INTTYPES_H=1 -DHAVE_STDINT_H=1 -DHAVE_UNISTD_H=1 -DHAVE_STRUCT_STAT_ST_BLKSIZE=1 -DHAVE_ST_BLKSIZE=1 -DSIZEOF_SIZE_T=8 -DSIZEOF_UNSIGNED_INT=4 -DSP_HAVE_LOCALE=1 -DSP_HAVE_WCHAR=1 -DSP_HAVE_GETTEXT=1 -DSP_HAVE_BOOL=1 -DSP_ANSI_CLASS_INST=1 -DSP_HAVE_SOCKET=1 -DJADE_MIF=1 -DJADE_HTML=1 -DSP_MULTI_BYTE=1 "-DSGML_CATALOG_FILES_DEFAULT=\"/opt/local/share/sgml/catalog\"" -DHAVE_DLFCN_H=1 "-DDEFAULT_SCHEME_BUILTINS=\"/opt/local/share/sgml/openjade/builtins.dsl\"" -c Pattern.cxx >/dev/null 2>&1
1025:info:build mv -f MacroFlowObj.o .libs/MacroFlowObj.lo
1026:info:build /usr/bin/llvm-g++-4.2 -pipe -Os -isystem /opt/local/include -fno-rtti -arch x86_64 -arch i386 -I. -I./../include -I./../grove -I./../spgrove -I/opt/local/include/OpenSP -I/opt/local/include/OpenSP/.. "-DPACKAGE_NAME=\"\"" "-DPACKAGE_TARNAME=\"\"" "-DPACKAGE_VERSION=\"\"" "-DPACKAGE_STRING=\"\"" "-DPACKAGE_BUGREPORT=\"\"" "-DPACKAGE=\"openjade\"" "-DVERSION=\"1.3.2\"" -DHAVE_SYS_TYPES_H=1 -DHAVE_SYS_STAT_H=1 -DHAVE_STDLIB_H=1 -DHAVE_STRING_H=1 -DHAVE_MEMORY_H=1 -DHAVE_STRINGS_H=1 -DHAVE_INTTYPES_H=1 -DHAVE_STDINT_H=1 -DHAVE_UNISTD_H=1 -DHAVE_STRUCT_STAT_ST_BLKSIZE=1 -DHAVE_ST_BLKSIZE=1 -DSIZEOF_SIZE_T=8 -DSIZEOF_UNSIGNED_INT=4 -DSP_HAVE_LOCALE=1 -DSP_HAVE_WCHAR=1 -DSP_HAVE_GETTEXT=1 -DSP_HAVE_BOOL=1 -DSP_ANSI_CLASS_INST=1 -DSP_HAVE_SOCKET=1 -DJADE_MIF=1 -DJADE_HTML=1 -DSP_MULTI_BYTE=1 "-DSGML_CATALOG_FILES_DEFAULT=\"/opt/local/share/sgml/catalog\"" -DHAVE_DLFCN_H=1 "-DDEFAULT_SCHEME_BUILTINS=\"/opt/local/share/sgml/openjade/builtins.dsl\"" -c MacroFlowObj.cxx >/dev/null 2>&1
1027:info:build mv -f .libs/Pattern.lo Pattern.lo
1028:info:build rm -f style_inst.cxx
1029:info:build perl ./../instmac.pl style_inst.m4 >style_inst.cxx
1030:info:build chmod -w style_inst.cxx
1031:info:build rm -f .libs/MessageModule.lo
1032:info:build /usr/bin/llvm-g++-4.2 -pipe -Os -isystem /opt/local/include -fno-rtti -arch x86_64 -arch i386 -I. -I./../include -I./../grove -I./../spgrove -I/opt/local/include/OpenSP -I/opt/local/include/OpenSP/.. "-DPACKAGE_NAME=\"\"" "-DPACKAGE_TARNAME=\"\"" "-DPACKAGE_VERSION=\"\"" "-DPACKAGE_STRING=\"\"" "-DPACKAGE_BUGREPORT=\"\"" "-DPACKAGE=\"openjade\"" "-DVERSION=\"1.3.2\"" -DHAVE_SYS_TYPES_H=1 -DHAVE_SYS_STAT_H=1 -DHAVE_STDLIB_H=1 -DHAVE_STRING_H=1 -DHAVE_MEMORY_H=1 -DHAVE_STRINGS_H=1 -DHAVE_INTTYPES_H=1 -DHAVE_STDINT_H=1 -DHAVE_UNISTD_H=1 -DHAVE_STRUCT_STAT_ST_BLKSIZE=1 -DHAVE_ST_BLKSIZE=1 -DSIZEOF_SIZE_T=8 -DSIZEOF_UNSIGNED_INT=4 -DSP_HAVE_LOCALE=1 -DSP_HAVE_WCHAR=1 -DSP_HAVE_GETTEXT=1 -DSP_HAVE_BOOL=1 -DSP_ANSI_CLASS_INST=1 -DSP_HAVE_SOCKET=1 -DJADE_MIF=1 -DJADE_HTML=1 -DSP_MULTI_BYTE=1 "-DSGML_CATALOG_FILES_DEFAULT=\"/opt/local/share/sgml/catalog\"" -DHAVE_DLFCN_H=1 "-DDEFAULT_SCHEME_BUILTINS=\"/opt/local/share/sgml/openjade/builtins.dsl\"" -c MessageModule.cxx  -fno-common -DPIC
1033:info:build In file included from stylelib.h:6,
1034:info:build                  from MessageModule.cxx:11:
1035:info:build ./../include/config.h:39:1: warning: "SP_DEFINE_TEMPLATES" redefined
1036:info:build In file included from ./../include/config.h:10,
1037:info:build                  from stylelib.h:6,
1038:info:build                  from MessageModule.cxx:11:
1039:info:build /opt/local/include/OpenSP/config.h:367:1: warning: this is the location of the previous definition
1040:info:build In file included from stylelib.h:6,
1041:info:build                  from MessageModule.cxx:11:
1042:info:build ./../include/config.h:39:1: warning: "SP_DEFINE_TEMPLATES" redefined
1043:info:build In file included from ./../include/config.h:10,
1044:info:build                  from stylelib.h:6,
1045:info:build                  from MessageModule.cxx:11:
1046:info:build /opt/local/include/OpenSP/config.h:367:1: warning: this is the location of the previous definition
1047:info:build mv -f MessageModule.o .libs/MessageModule.lo
1048:info:build /usr/bin/llvm-g++-4.2 -pipe -Os -isystem /opt/local/include -fno-rtti -arch x86_64 -arch i386 -I. -I./../include -I./../grove -I./../spgrove -I/opt/local/include/OpenSP -I/opt/local/include/OpenSP/.. "-DPACKAGE_NAME=\"\"" "-DPACKAGE_TARNAME=\"\"" "-DPACKAGE_VERSION=\"\"" "-DPACKAGE_STRING=\"\"" "-DPACKAGE_BUGREPORT=\"\"" "-DPACKAGE=\"openjade\"" "-DVERSION=\"1.3.2\"" -DHAVE_SYS_TYPES_H=1 -DHAVE_SYS_STAT_H=1 -DHAVE_STDLIB_H=1 -DHAVE_STRING_H=1 -DHAVE_MEMORY_H=1 -DHAVE_STRINGS_H=1 -DHAVE_INTTYPES_H=1 -DHAVE_STDINT_H=1 -DHAVE_UNISTD_H=1 -DHAVE_STRUCT_STAT_ST_BLKSIZE=1 -DHAVE_ST_BLKSIZE=1 -DSIZEOF_SIZE_T=8 -DSIZEOF_UNSIGNED_INT=4 -DSP_HAVE_LOCALE=1 -DSP_HAVE_WCHAR=1 -DSP_HAVE_GETTEXT=1 -DSP_HAVE_BOOL=1 -DSP_ANSI_CLASS_INST=1 -DSP_HAVE_SOCKET=1 -DJADE_MIF=1 -DJADE_HTML=1 -DSP_MULTI_BYTE=1 "-DSGML_CATALOG_FILES_DEFAULT=\"/opt/local/share/sgml/catalog\"" -DHAVE_DLFCN_H=1 "-DDEFAULT_SCHEME_BUILTINS=\"/opt/local/share/sgml/openjade/builtins.dsl\"" -c MessageModule.cxx >/dev/null 2>&1
1049:info:build mv -f .libs/MessageModule.lo MessageModule.lo
1050:info:build mv -f .libs/MacroFlowObj.lo MacroFlowObj.lo
1051:info:build rm -f .libs/DssslApp.lo
1052:info:build /usr/bin/llvm-g++-4.2 -pipe -Os -isystem /opt/local/include -fno-rtti -arch x86_64 -arch i386 -I. -I./../include -I./../grove -I./../spgrove -I/opt/local/include/OpenSP -I/opt/local/include/OpenSP/.. "-DPACKAGE_NAME=\"\"" "-DPACKAGE_TARNAME=\"\"" "-DPACKAGE_VERSION=\"\"" "-DPACKAGE_STRING=\"\"" "-DPACKAGE_BUGREPORT=\"\"" "-DPACKAGE=\"openjade\"" "-DVERSION=\"1.3.2\"" -DHAVE_SYS_TYPES_H=1 -DHAVE_SYS_STAT_H=1 -DHAVE_STDLIB_H=1 -DHAVE_STRING_H=1 -DHAVE_MEMORY_H=1 -DHAVE_STRINGS_H=1 -DHAVE_INTTYPES_H=1 -DHAVE_STDINT_H=1 -DHAVE_UNISTD_H=1 -DHAVE_STRUCT_STAT_ST_BLKSIZE=1 -DHAVE_ST_BLKSIZE=1 -DSIZEOF_SIZE_T=8 -DSIZEOF_UNSIGNED_INT=4 -DSP_HAVE_LOCALE=1 -DSP_HAVE_WCHAR=1 -DSP_HAVE_GETTEXT=1 -DSP_HAVE_BOOL=1 -DSP_ANSI_CLASS_INST=1 -DSP_HAVE_SOCKET=1 -DJADE_MIF=1 -DJADE_HTML=1 -DSP_MULTI_BYTE=1 "-DSGML_CATALOG_FILES_DEFAULT=\"/opt/local/share/sgml/catalog\"" -DHAVE_DLFCN_H=1 "-DDEFAULT_SCHEME_BUILTINS=\"/opt/local/share/sgml/openjade/builtins.dsl\"" -c DssslApp.cxx  -fno-common -DPIC
1053:info:build In file included from stylelib.h:6,
1054:info:build                  from DssslApp.cxx:4:
1055:info:build ./../include/config.h:39:1: warning: "SP_DEFINE_TEMPLATES" redefined
1056:info:build In file included from ./../include/config.h:10,
1057:info:build                  from stylelib.h:6,
1058:info:build                  from DssslApp.cxx:4:
1059:info:build /opt/local/include/OpenSP/config.h:367:1: warning: this is the location of the previous definition
1060:info:build rm -f .libs/InterpreterMessages.lo
1061:info:build /usr/bin/llvm-g++-4.2 -pipe -Os -isystem /opt/local/include -fno-rtti -arch x86_64 -arch i386 -I. -I./../include -I./../grove -I./../spgrove -I/opt/local/include/OpenSP -I/opt/local/include/OpenSP/.. "-DPACKAGE_NAME=\"\"" "-DPACKAGE_TARNAME=\"\"" "-DPACKAGE_VERSION=\"\"" "-DPACKAGE_STRING=\"\"" "-DPACKAGE_BUGREPORT=\"\"" "-DPACKAGE=\"openjade\"" "-DVERSION=\"1.3.2\"" -DHAVE_SYS_TYPES_H=1 -DHAVE_SYS_STAT_H=1 -DHAVE_STDLIB_H=1 -DHAVE_STRING_H=1 -DHAVE_MEMORY_H=1 -DHAVE_STRINGS_H=1 -DHAVE_INTTYPES_H=1 -DHAVE_STDINT_H=1 -DHAVE_UNISTD_H=1 -DHAVE_STRUCT_STAT_ST_BLKSIZE=1 -DHAVE_ST_BLKSIZE=1 -DSIZEOF_SIZE_T=8 -DSIZEOF_UNSIGNED_INT=4 -DSP_HAVE_LOCALE=1 -DSP_HAVE_WCHAR=1 -DSP_HAVE_GETTEXT=1 -DSP_HAVE_BOOL=1 -DSP_ANSI_CLASS_INST=1 -DSP_HAVE_SOCKET=1 -DJADE_MIF=1 -DJADE_HTML=1 -DSP_MULTI_BYTE=1 "-DSGML_CATALOG_FILES_DEFAULT=\"/opt/local/share/sgml/catalog\"" -DHAVE_DLFCN_H=1 "-DDEFAULT_SCHEME_BUILTINS=\"/opt/local/share/sgml/openjade/builtins.dsl\"" -c InterpreterMessages.cxx  -fno-common -DPIC
1062:info:build In file included from stylelib.h:6,
1063:info:build                  from InterpreterMessages.cxx:7:
1064:info:build ./../include/config.h:39:1: warning: "SP_DEFINE_TEMPLATES" redefined
1065:info:build In file included from ./../include/config.h:10,
1066:info:build                  from stylelib.h:6,
1067:info:build                  from InterpreterMessages.cxx:7:
1068:info:build /opt/local/include/OpenSP/config.h:367:1: warning: this is the location of the previous definition
1069:info:build DssslApp.cxx: In member function 'virtual int OpenJade_DSSSL::DssslApp::init(int, char**)':
1070:info:build DssslApp.cxx:55: warning: deprecated conversion from string constant to 'char*'
1071:info:build DssslApp.cxx:55: warning: deprecated conversion from string constant to 'char*'
1072:info:build In file included from stylelib.h:6,
1073:info:build                  from InterpreterMessages.cxx:7:
1074:info:build ./../include/config.h:39:1: warning: "SP_DEFINE_TEMPLATES" redefined
1075:info:build In file included from ./../include/config.h:10,
1076:info:build                  from stylelib.h:6,
1077:info:build                  from InterpreterMessages.cxx:7:
1078:info:build /opt/local/include/OpenSP/config.h:367:1: warning: this is the location of the previous definition
1079:info:build mv -f InterpreterMessages.o .libs/InterpreterMessages.lo
1080:info:build /usr/bin/llvm-g++-4.2 -pipe -Os -isystem /opt/local/include -fno-rtti -arch x86_64 -arch i386 -I. -I./../include -I./../grove -I./../spgrove -I/opt/local/include/OpenSP -I/opt/local/include/OpenSP/.. "-DPACKAGE_NAME=\"\"" "-DPACKAGE_TARNAME=\"\"" "-DPACKAGE_VERSION=\"\"" "-DPACKAGE_STRING=\"\"" "-DPACKAGE_BUGREPORT=\"\"" "-DPACKAGE=\"openjade\"" "-DVERSION=\"1.3.2\"" -DHAVE_SYS_TYPES_H=1 -DHAVE_SYS_STAT_H=1 -DHAVE_STDLIB_H=1 -DHAVE_STRING_H=1 -DHAVE_MEMORY_H=1 -DHAVE_STRINGS_H=1 -DHAVE_INTTYPES_H=1 -DHAVE_STDINT_H=1 -DHAVE_UNISTD_H=1 -DHAVE_STRUCT_STAT_ST_BLKSIZE=1 -DHAVE_ST_BLKSIZE=1 -DSIZEOF_SIZE_T=8 -DSIZEOF_UNSIGNED_INT=4 -DSP_HAVE_LOCALE=1 -DSP_HAVE_WCHAR=1 -DSP_HAVE_GETTEXT=1 -DSP_HAVE_BOOL=1 -DSP_ANSI_CLASS_INST=1 -DSP_HAVE_SOCKET=1 -DJADE_MIF=1 -DJADE_HTML=1 -DSP_MULTI_BYTE=1 "-DSGML_CATALOG_FILES_DEFAULT=\"/opt/local/share/sgml/catalog\"" -DHAVE_DLFCN_H=1 "-DDEFAULT_SCHEME_BUILTINS=\"/opt/local/share/sgml/openjade/builtins.dsl\"" -c InterpreterMessages.cxx >/dev/null 2>&1
1081:info:build In file included from stylelib.h:6,
1082:info:build                  from DssslApp.cxx:4:
1083:info:build ./../include/config.h:39:1: warning: "SP_DEFINE_TEMPLATES" redefined
1084:info:build In file included from ./../include/config.h:10,
1085:info:build                  from stylelib.h:6,
1086:info:build                  from DssslApp.cxx:4:
1087:info:build /opt/local/include/OpenSP/config.h:367:1: warning: this is the location of the previous definition
1088:info:build mv -f .libs/InterpreterMessages.lo InterpreterMessages.lo
1089:info:build DssslApp.cxx: In member function 'virtual int OpenJade_DSSSL::DssslApp::init(int, char**)':
1090:info:build DssslApp.cxx:55: warning: deprecated conversion from string constant to 'char*'
1091:info:build DssslApp.cxx:55: warning: deprecated conversion from string constant to 'char*'
1092:info:build rm -f .libs/FlowObj.lo
1093:info:build /usr/bin/llvm-g++-4.2 -pipe -Os -isystem /opt/local/include -fno-rtti -arch x86_64 -arch i386 -I. -I./../include -I./../grove -I./../spgrove -I/opt/local/include/OpenSP -I/opt/local/include/OpenSP/.. "-DPACKAGE_NAME=\"\"" "-DPACKAGE_TARNAME=\"\"" "-DPACKAGE_VERSION=\"\"" "-DPACKAGE_STRING=\"\"" "-DPACKAGE_BUGREPORT=\"\"" "-DPACKAGE=\"openjade\"" "-DVERSION=\"1.3.2\"" -DHAVE_SYS_TYPES_H=1 -DHAVE_SYS_STAT_H=1 -DHAVE_STDLIB_H=1 -DHAVE_STRING_H=1 -DHAVE_MEMORY_H=1 -DHAVE_STRINGS_H=1 -DHAVE_INTTYPES_H=1 -DHAVE_STDINT_H=1 -DHAVE_UNISTD_H=1 -DHAVE_STRUCT_STAT_ST_BLKSIZE=1 -DHAVE_ST_BLKSIZE=1 -DSIZEOF_SIZE_T=8 -DSIZEOF_UNSIGNED_INT=4 -DSP_HAVE_LOCALE=1 -DSP_HAVE_WCHAR=1 -DSP_HAVE_GETTEXT=1 -DSP_HAVE_BOOL=1 -DSP_ANSI_CLASS_INST=1 -DSP_HAVE_SOCKET=1 -DJADE_MIF=1 -DJADE_HTML=1 -DSP_MULTI_BYTE=1 "-DSGML_CATALOG_FILES_DEFAULT=\"/opt/local/share/sgml/catalog\"" -DHAVE_DLFCN_H=1 "-DDEFAULT_SCHEME_BUILTINS=\"/opt/local/share/sgml/openjade/builtins.dsl\"" -c FlowObj.cxx  -fno-common -DPIC
1094:info:build In file included from stylelib.h:6,
1095:info:build                  from FlowObj.cxx:4:
1096:info:build ./../include/config.h:39:1: warning: "SP_DEFINE_TEMPLATES" redefined
1097:info:build In file included from ./../include/config.h:10,
1098:info:build                  from stylelib.h:6,
1099:info:build                  from FlowObj.cxx:4:
1100:info:build /opt/local/include/OpenSP/config.h:367:1: warning: this is the location of the previous definition
1101:info:build mv -f DssslApp.o .libs/DssslApp.lo
1102:info:build /usr/bin/llvm-g++-4.2 -pipe -Os -isystem /opt/local/include -fno-rtti -arch x86_64 -arch i386 -I. -I./../include -I./../grove -I./../spgrove -I/opt/local/include/OpenSP -I/opt/local/include/OpenSP/.. "-DPACKAGE_NAME=\"\"" "-DPACKAGE_TARNAME=\"\"" "-DPACKAGE_VERSION=\"\"" "-DPACKAGE_STRING=\"\"" "-DPACKAGE_BUGREPORT=\"\"" "-DPACKAGE=\"openjade\"" "-DVERSION=\"1.3.2\"" -DHAVE_SYS_TYPES_H=1 -DHAVE_SYS_STAT_H=1 -DHAVE_STDLIB_H=1 -DHAVE_STRING_H=1 -DHAVE_MEMORY_H=1 -DHAVE_STRINGS_H=1 -DHAVE_INTTYPES_H=1 -DHAVE_STDINT_H=1 -DHAVE_UNISTD_H=1 -DHAVE_STRUCT_STAT_ST_BLKSIZE=1 -DHAVE_ST_BLKSIZE=1 -DSIZEOF_SIZE_T=8 -DSIZEOF_UNSIGNED_INT=4 -DSP_HAVE_LOCALE=1 -DSP_HAVE_WCHAR=1 -DSP_HAVE_GETTEXT=1 -DSP_HAVE_BOOL=1 -DSP_ANSI_CLASS_INST=1 -DSP_HAVE_SOCKET=1 -DJADE_MIF=1 -DJADE_HTML=1 -DSP_MULTI_BYTE=1 "-DSGML_CATALOG_FILES_DEFAULT=\"/opt/local/share/sgml/catalog\"" -DHAVE_DLFCN_H=1 "-DDEFAULT_SCHEME_BUILTINS=\"/opt/local/share/sgml/openjade/builtins.dsl\"" -c DssslApp.cxx >/dev/null 2>&1
1103:info:build In file included from stylelib.h:6,
1104:info:build                  from FlowObj.cxx:4:
1105:info:build ./../include/config.h:39:1: warning: "SP_DEFINE_TEMPLATES" redefined
1106:info:build In file included from ./../include/config.h:10,
1107:info:build                  from stylelib.h:6,
1108:info:build                  from FlowObj.cxx:4:
1109:info:build /opt/local/include/OpenSP/config.h:367:1: warning: this is the location of the previous definition
1110:info:build mv -f .libs/DssslApp.lo DssslApp.lo
1111:info:build rm -f .libs/primitive.lo
1112:info:build /usr/bin/llvm-g++-4.2 -pipe -Os -isystem /opt/local/include -fno-rtti -arch x86_64 -arch i386 -I. -I./../include -I./../grove -I./../spgrove -I/opt/local/include/OpenSP -I/opt/local/include/OpenSP/.. "-DPACKAGE_NAME=\"\"" "-DPACKAGE_TARNAME=\"\"" "-DPACKAGE_VERSION=\"\"" "-DPACKAGE_STRING=\"\"" "-DPACKAGE_BUGREPORT=\"\"" "-DPACKAGE=\"openjade\"" "-DVERSION=\"1.3.2\"" -DHAVE_SYS_TYPES_H=1 -DHAVE_SYS_STAT_H=1 -DHAVE_STDLIB_H=1 -DHAVE_STRING_H=1 -DHAVE_MEMORY_H=1 -DHAVE_STRINGS_H=1 -DHAVE_INTTYPES_H=1 -DHAVE_STDINT_H=1 -DHAVE_UNISTD_H=1 -DHAVE_STRUCT_STAT_ST_BLKSIZE=1 -DHAVE_ST_BLKSIZE=1 -DSIZEOF_SIZE_T=8 -DSIZEOF_UNSIGNED_INT=4 -DSP_HAVE_LOCALE=1 -DSP_HAVE_WCHAR=1 -DSP_HAVE_GETTEXT=1 -DSP_HAVE_BOOL=1 -DSP_ANSI_CLASS_INST=1 -DSP_HAVE_SOCKET=1 -DJADE_MIF=1 -DJADE_HTML=1 -DSP_MULTI_BYTE=1 "-DSGML_CATALOG_FILES_DEFAULT=\"/opt/local/share/sgml/catalog\"" -DHAVE_DLFCN_H=1 "-DDEFAULT_SCHEME_BUILTINS=\"/opt/local/share/sgml/openjade/builtins.dsl\"" -c primitive.cxx  -fno-common -DPIC
1113:info:build In file included from stylelib.h:6,
1114:info:build                  from primitive.cxx:4:
1115:info:build ./../include/config.h:39:1: warning: "SP_DEFINE_TEMPLATES" redefined
1116:info:build In file included from ./../include/config.h:10,
1117:info:build                  from stylelib.h:6,
1118:info:build                  from primitive.cxx:4:
1119:info:build /opt/local/include/OpenSP/config.h:367:1: warning: this is the location of the previous definition
1120:info:build mv -f FlowObj.o .libs/FlowObj.lo
1121:info:build /usr/bin/llvm-g++-4.2 -pipe -Os -isystem /opt/local/include -fno-rtti -arch x86_64 -arch i386 -I. -I./../include -I./../grove -I./../spgrove -I/opt/local/include/OpenSP -I/opt/local/include/OpenSP/.. "-DPACKAGE_NAME=\"\"" "-DPACKAGE_TARNAME=\"\"" "-DPACKAGE_VERSION=\"\"" "-DPACKAGE_STRING=\"\"" "-DPACKAGE_BUGREPORT=\"\"" "-DPACKAGE=\"openjade\"" "-DVERSION=\"1.3.2\"" -DHAVE_SYS_TYPES_H=1 -DHAVE_SYS_STAT_H=1 -DHAVE_STDLIB_H=1 -DHAVE_STRING_H=1 -DHAVE_MEMORY_H=1 -DHAVE_STRINGS_H=1 -DHAVE_INTTYPES_H=1 -DHAVE_STDINT_H=1 -DHAVE_UNISTD_H=1 -DHAVE_STRUCT_STAT_ST_BLKSIZE=1 -DHAVE_ST_BLKSIZE=1 -DSIZEOF_SIZE_T=8 -DSIZEOF_UNSIGNED_INT=4 -DSP_HAVE_LOCALE=1 -DSP_HAVE_WCHAR=1 -DSP_HAVE_GETTEXT=1 -DSP_HAVE_BOOL=1 -DSP_ANSI_CLASS_INST=1 -DSP_HAVE_SOCKET=1 -DJADE_MIF=1 -DJADE_HTML=1 -DSP_MULTI_BYTE=1 "-DSGML_CATALOG_FILES_DEFAULT=\"/opt/local/share/sgml/catalog\"" -DHAVE_DLFCN_H=1 "-DDEFAULT_SCHEME_BUILTINS=\"/opt/local/share/sgml/openjade/builtins.dsl\"" -c FlowObj.cxx >/dev/null 2>&1
1122:info:build In file included from stylelib.h:6,
1123:info:build                  from primitive.cxx:4:
1124:info:build ./../include/config.h:39:1: warning: "SP_DEFINE_TEMPLATES" redefined
1125:info:build In file included from ./../include/config.h:10,
1126:info:build                  from stylelib.h:6,
1127:info:build                  from primitive.cxx:4:
1128:info:build /opt/local/include/OpenSP/config.h:367:1: warning: this is the location of the previous definition
1129:info:build mv -f .libs/FlowObj.lo FlowObj.lo
1130:info:build rm -f .libs/style_inst.lo
1131:info:build /usr/bin/llvm-g++-4.2 -pipe -Os -isystem /opt/local/include -fno-rtti -arch x86_64 -arch i386 -I. -I./../include -I./../grove -I./../spgrove -I/opt/local/include/OpenSP -I/opt/local/include/OpenSP/.. "-DPACKAGE_NAME=\"\"" "-DPACKAGE_TARNAME=\"\"" "-DPACKAGE_VERSION=\"\"" "-DPACKAGE_STRING=\"\"" "-DPACKAGE_BUGREPORT=\"\"" "-DPACKAGE=\"openjade\"" "-DVERSION=\"1.3.2\"" -DHAVE_SYS_TYPES_H=1 -DHAVE_SYS_STAT_H=1 -DHAVE_STDLIB_H=1 -DHAVE_STRING_H=1 -DHAVE_MEMORY_H=1 -DHAVE_STRINGS_H=1 -DHAVE_INTTYPES_H=1 -DHAVE_STDINT_H=1 -DHAVE_UNISTD_H=1 -DHAVE_STRUCT_STAT_ST_BLKSIZE=1 -DHAVE_ST_BLKSIZE=1 -DSIZEOF_SIZE_T=8 -DSIZEOF_UNSIGNED_INT=4 -DSP_HAVE_LOCALE=1 -DSP_HAVE_WCHAR=1 -DSP_HAVE_GETTEXT=1 -DSP_HAVE_BOOL=1 -DSP_ANSI_CLASS_INST=1 -DSP_HAVE_SOCKET=1 -DJADE_MIF=1 -DJADE_HTML=1 -DSP_MULTI_BYTE=1 "-DSGML_CATALOG_FILES_DEFAULT=\"/opt/local/share/sgml/catalog\"" -DHAVE_DLFCN_H=1 "-DDEFAULT_SCHEME_BUILTINS=\"/opt/local/share/sgml/openjade/builtins.dsl\"" -c style_inst.cxx  -fno-common -DPIC
1132:info:build In file included from stylelib.h:6,
1133:info:build                  from style_inst.cxx:12:
1134:info:build ./../include/config.h:39:1: warning: "SP_DEFINE_TEMPLATES" redefined
1135:info:build In file included from ./../include/config.h:10,
1136:info:build                  from stylelib.h:6,
1137:info:build                  from style_inst.cxx:12:
1138:info:build /opt/local/include/OpenSP/config.h:367:1: warning: this is the location of the previous definition
1139:info:build In file included from stylelib.h:6,
1140:info:build                  from style_inst.cxx:12:
1141:info:build ./../include/config.h:39:1: warning: "SP_DEFINE_TEMPLATES" redefined
1142:info:build In file included from ./../include/config.h:10,
1143:info:build                  from stylelib.h:6,
1144:info:build                  from style_inst.cxx:12:
1145:info:build /opt/local/include/OpenSP/config.h:367:1: warning: this is the location of the previous definition
1146:info:build mv -f style_inst.o .libs/style_inst.lo
1147:info:build /usr/bin/llvm-g++-4.2 -pipe -Os -isystem /opt/local/include -fno-rtti -arch x86_64 -arch i386 -I. -I./../include -I./../grove -I./../spgrove -I/opt/local/include/OpenSP -I/opt/local/include/OpenSP/.. "-DPACKAGE_NAME=\"\"" "-DPACKAGE_TARNAME=\"\"" "-DPACKAGE_VERSION=\"\"" "-DPACKAGE_STRING=\"\"" "-DPACKAGE_BUGREPORT=\"\"" "-DPACKAGE=\"openjade\"" "-DVERSION=\"1.3.2\"" -DHAVE_SYS_TYPES_H=1 -DHAVE_SYS_STAT_H=1 -DHAVE_STDLIB_H=1 -DHAVE_STRING_H=1 -DHAVE_MEMORY_H=1 -DHAVE_STRINGS_H=1 -DHAVE_INTTYPES_H=1 -DHAVE_STDINT_H=1 -DHAVE_UNISTD_H=1 -DHAVE_STRUCT_STAT_ST_BLKSIZE=1 -DHAVE_ST_BLKSIZE=1 -DSIZEOF_SIZE_T=8 -DSIZEOF_UNSIGNED_INT=4 -DSP_HAVE_LOCALE=1 -DSP_HAVE_WCHAR=1 -DSP_HAVE_GETTEXT=1 -DSP_HAVE_BOOL=1 -DSP_ANSI_CLASS_INST=1 -DSP_HAVE_SOCKET=1 -DJADE_MIF=1 -DJADE_HTML=1 -DSP_MULTI_BYTE=1 "-DSGML_CATALOG_FILES_DEFAULT=\"/opt/local/share/sgml/catalog\"" -DHAVE_DLFCN_H=1 "-DDEFAULT_SCHEME_BUILTINS=\"/opt/local/share/sgml/openjade/builtins.dsl\"" -c style_inst.cxx >/dev/null 2>&1
1148:info:build mv -f .libs/style_inst.lo style_inst.lo
1149:info:build mv -f primitive.o .libs/primitive.lo
1150:info:build /usr/bin/llvm-g++-4.2 -pipe -Os -isystem /opt/local/include -fno-rtti -arch x86_64 -arch i386 -I. -I./../include -I./../grove -I./../spgrove -I/opt/local/include/OpenSP -I/opt/local/include/OpenSP/.. "-DPACKAGE_NAME=\"\"" "-DPACKAGE_TARNAME=\"\"" "-DPACKAGE_VERSION=\"\"" "-DPACKAGE_STRING=\"\"" "-DPACKAGE_BUGREPORT=\"\"" "-DPACKAGE=\"openjade\"" "-DVERSION=\"1.3.2\"" -DHAVE_SYS_TYPES_H=1 -DHAVE_SYS_STAT_H=1 -DHAVE_STDLIB_H=1 -DHAVE_STRING_H=1 -DHAVE_MEMORY_H=1 -DHAVE_STRINGS_H=1 -DHAVE_INTTYPES_H=1 -DHAVE_STDINT_H=1 -DHAVE_UNISTD_H=1 -DHAVE_STRUCT_STAT_ST_BLKSIZE=1 -DHAVE_ST_BLKSIZE=1 -DSIZEOF_SIZE_T=8 -DSIZEOF_UNSIGNED_INT=4 -DSP_HAVE_LOCALE=1 -DSP_HAVE_WCHAR=1 -DSP_HAVE_GETTEXT=1 -DSP_HAVE_BOOL=1 -DSP_ANSI_CLASS_INST=1 -DSP_HAVE_SOCKET=1 -DJADE_MIF=1 -DJADE_HTML=1 -DSP_MULTI_BYTE=1 "-DSGML_CATALOG_FILES_DEFAULT=\"/opt/local/share/sgml/catalog\"" -DHAVE_DLFCN_H=1 "-DDEFAULT_SCHEME_BUILTINS=\"/opt/local/share/sgml/openjade/builtins.dsl\"" -c primitive.cxx >/dev/null 2>&1
1151:info:build mv -f .libs/primitive.lo primitive.lo
1152:info:build /bin/sh /opt/local/var/macports/build/_opt_local_var_macports_sources_www.macports.org_files_ports_textproc_openjade/openjade/work/openjade-1.3.2/libtool --mode=link /usr/bin/llvm-g++-4.2 -allow-undefined -o libostyle.la LangObj.lo Collector.lo DssslApp.lo InterpreterMessages.lo DssslSpecEventHandler.lo ELObj.lo ELObjMessageArg.lo Expression.lo FOTBuilder.lo FlowObj.lo InheritedC.lo Insn.lo Interpreter.lo NumberCache.lo ProcessContext.lo ProcessingMode.lo SchemeParser.lo Style.lo StyleEngine.lo primitive.lo GroveManager.lo Pattern.lo MacroFlowObj.lo style_inst.lo MessageModule.lo \
1153:info:build         -rpath /opt/local/lib -version-info 0:1:0 -lm
1154:info:build libtool: link: `-allow-undefined' is deprecated because it is the default
1155:info:build rm -fr .libs/libostyle.la .libs/libostyle.* .libs/libostyle.*
1156:info:build /usr/bin/llvm-g++-4.2 -arch x86_64 -arch i386 -dynamiclib -undefined suppress -flat_namespace -o .libs/libostyle.0.0.1.dylib  -lm  LangObj.lo Collector.lo DssslApp.lo InterpreterMessages.lo DssslSpecEventHandler.lo ELObj.lo ELObjMessageArg.lo Expression.lo FOTBuilder.lo FlowObj.lo InheritedC.lo Insn.lo Interpreter.lo NumberCache.lo ProcessContext.lo ProcessingMode.lo SchemeParser.lo Style.lo StyleEngine.lo primitive.lo GroveManager.lo Pattern.lo MacroFlowObj.lo style_inst.lo MessageModule.lo  -lm -lc -install_name  /opt/local/lib/libostyle.0.dylib -compatibility_version 1 -current_version 1.1
1157:info:build (cd .libs && rm -f libostyle.0.dylib && ln -s libostyle.0.0.1.dylib libostyle.0.dylib)
1158:info:build (cd .libs && rm -f libostyle.dylib && ln -s libostyle.0.0.1.dylib libostyle.dylib)
1159:info:build ar cru .libs/libostyle.a  LangObj.o Collector.o DssslApp.o InterpreterMessages.o DssslSpecEventHandler.o ELObj.o ELObjMessageArg.o Expression.o FOTBuilder.o FlowObj.o InheritedC.o Insn.o Interpreter.o NumberCache.o ProcessContext.o ProcessingMode.o SchemeParser.o Style.o StyleEngine.o primitive.o GroveManager.o Pattern.o MacroFlowObj.o style_inst.o MessageModule.o
1160:info:build : .libs/libostyle.a
1161:info:build creating libostyle.la
1162:info:build (cd .libs && rm -f libostyle.la && ln -s ../libostyle.la libostyle.la)
1163:info:build rm InterpreterMessages.cxx
1164:info:build make[2]: Leaving directory `/opt/local/var/macports/build/_opt_local_var_macports_sources_www.macports.org_files_ports_textproc_openjade/openjade/work/openjade-1.3.2/style'
1165:info:build make[2]: Entering directory `/opt/local/var/macports/build/_opt_local_var_macports_sources_www.macports.org_files_ports_textproc_openjade/openjade/work/openjade-1.3.2/jade'
1166:info:build echo 'LT_LIBS='`echo ../style/libostyle.a ../spgrove/libospgrove.a ../grove/libogrove.a /opt/local/lib/libosp.a|perl -pe 's/\.a\b/.la/g'|sed 's|libosp\.la|libosp.dylib|'` >Makefile.lt
1167:info:build make[2]: Leaving directory `/opt/local/var/macports/build/_opt_local_var_macports_sources_www.macports.org_files_ports_textproc_openjade/openjade/work/openjade-1.3.2/jade'
1168:info:build make[2]: Entering directory `/opt/local/var/macports/build/_opt_local_var_macports_sources_www.macports.org_files_ports_textproc_openjade/openjade/work/openjade-1.3.2/jade'
1169:info:build perl -w ./../msggen.pl -l jstyleModule JadeMessages.msg
1170:info:build /usr/bin/llvm-g++-4.2 -pipe -Os -isystem /opt/local/include -fno-rtti -arch x86_64 -arch i386 -I. -I./../include -I./../grove -I./../spgrove -I./../style -I/opt/local/include/OpenSP -I/opt/local/include/OpenSP/..  -DPACKAGE_NAME=\"\" -DPACKAGE_TARNAME=\"\" -DPACKAGE_VERSION=\"\" -DPACKAGE_STRING=\"\" -DPACKAGE_BUGREPORT=\"\" -DPACKAGE=\"openjade\" -DVERSION=\"1.3.2\" -DHAVE_SYS_TYPES_H=1 -DHAVE_SYS_STAT_H=1 -DHAVE_STDLIB_H=1 -DHAVE_STRING_H=1 -DHAVE_MEMORY_H=1 -DHAVE_STRINGS_H=1 -DHAVE_INTTYPES_H=1 -DHAVE_STDINT_H=1 -DHAVE_UNISTD_H=1 -DHAVE_STRUCT_STAT_ST_BLKSIZE=1 -DHAVE_ST_BLKSIZE=1 -DSIZEOF_SIZE_T=8 -DSIZEOF_UNSIGNED_INT=4 -DSP_HAVE_LOCALE=1 -DSP_HAVE_WCHAR=1 -DSP_HAVE_GETTEXT=1 -DSP_HAVE_BOOL=1 -DSP_ANSI_CLASS_INST=1 -DSP_HAVE_SOCKET=1 -DJADE_MIF=1 -DJADE_HTML=1 -DSP_MULTI_BYTE=1 -DSGML_CATALOG_FILES_DEFAULT=\"/opt/local/share/sgml/catalog\" -DHAVE_DLFCN_H=1  -DDEFAULT_SCHEME_BUILTINS=\"/opt/local/share/sgml/openjade/builtins.dsl\" -c SgmlFOTBuilder.cxx
1171:info:build In file included from SgmlFOTBuilder.cxx:12:
1172:info:build ./../include/config.h:39:1: warning: "SP_DEFINE_TEMPLATES" redefined
1173:info:build In file included from ./../include/config.h:10,
1174:info:build                  from SgmlFOTBuilder.cxx:12:
1175:info:build /opt/local/include/OpenSP/config.h:367:1: warning: this is the location of the previous definition
1176:info:build rm -f RtfFOTBuilder_inst.cxx
1177:info:build perl ./../instmac.pl RtfFOTBuilder_inst.m4 >RtfFOTBuilder_inst.cxx
1178:info:build chmod -w RtfFOTBuilder_inst.cxx
1179:info:build perl -w ./../msggen.pl -l jstyleModule RtfMessages.msg
1180:info:build rm -f HtmlFOTBuilder_inst.cxx
1181:info:build perl ./../instmac.pl HtmlFOTBuilder_inst.m4 >HtmlFOTBuilder_inst.cxx
1182:info:build chmod -w HtmlFOTBuilder_inst.cxx
1183:info:build perl -w ./../msggen.pl -l jstyleModule HtmlMessages.msg
1184:info:build rm -f TeXFOTBuilder_inst.cxx
1185:info:build perl ./../instmac.pl TeXFOTBuilder_inst.m4 >TeXFOTBuilder_inst.cxx
1186:info:build chmod -w TeXFOTBuilder_inst.cxx
1187:info:build perl -w ./../msggen.pl -l jstyleModule TeXMessages.msg
1188:info:build SgmlFOTBuilder.cxx: In function ‘OpenSP::OutputCharStream& OpenJade_DSSSL::operator<<(OpenSP::OutputCharStream&, OpenJade_DSSSL::Units)’:
1189:info:build SgmlFOTBuilder.cxx:396: warning: format ‘%03d’ expects type ‘int’, but argument 3 has type ‘long int’
1190:info:build SgmlFOTBuilder.cxx:396: warning: format ‘%03d’ expects type ‘int’, but argument 3 has type ‘long int’
1191:info:build rm -f TransformFOTBuilder_inst.cxx
1192:info:build perl ./../instmac.pl TransformFOTBuilder_inst.m4 >TransformFOTBuilder_inst.cxx
1193:info:build chmod -w TransformFOTBuilder_inst.cxx
1194:info:build rm -f MifFOTBuilder_inst.cxx
1195:info:build perl ./../instmac.pl MifFOTBuilder_inst.m4 >MifFOTBuilder_inst.cxx
1196:info:build chmod -w MifFOTBuilder_inst.cxx
1197:info:build perl -w ./../msggen.pl -l jstyleModule MifMessages.msg
1198:info:build /usr/bin/llvm-g++-4.2 -pipe -Os -isystem /opt/local/include -fno-rtti -arch x86_64 -arch i386 -I. -I./../include -I./../grove -I./../spgrove -I./../style -I/opt/local/include/OpenSP -I/opt/local/include/OpenSP/..  -DPACKAGE_NAME=\"\" -DPACKAGE_TARNAME=\"\" -DPACKAGE_VERSION=\"\" -DPACKAGE_STRING=\"\" -DPACKAGE_BUGREPORT=\"\" -DPACKAGE=\"openjade\" -DVERSION=\"1.3.2\" -DHAVE_SYS_TYPES_H=1 -DHAVE_SYS_STAT_H=1 -DHAVE_STDLIB_H=1 -DHAVE_STRING_H=1 -DHAVE_MEMORY_H=1 -DHAVE_STRINGS_H=1 -DHAVE_INTTYPES_H=1 -DHAVE_STDINT_H=1 -DHAVE_UNISTD_H=1 -DHAVE_STRUCT_STAT_ST_BLKSIZE=1 -DHAVE_ST_BLKSIZE=1 -DSIZEOF_SIZE_T=8 -DSIZEOF_UNSIGNED_INT=4 -DSP_HAVE_LOCALE=1 -DSP_HAVE_WCHAR=1 -DSP_HAVE_GETTEXT=1 -DSP_HAVE_BOOL=1 -DSP_ANSI_CLASS_INST=1 -DSP_HAVE_SOCKET=1 -DJADE_MIF=1 -DJADE_HTML=1 -DSP_MULTI_BYTE=1 -DSGML_CATALOG_FILES_DEFAULT=\"/opt/local/share/sgml/catalog\" -DHAVE_DLFCN_H=1  -DDEFAULT_SCHEME_BUILTINS=\"/opt/local/share/sgml/openjade/builtins.dsl\" -c jade.cxx
1199:info:build In file included from jade.cxx:4:
1200:info:build ./../include/config.h:39:1: warning: "SP_DEFINE_TEMPLATES" redefined
1201:info:build In file included from ./../include/config.h:10,
1202:info:build                  from jade.cxx:4:
1203:info:build /opt/local/include/OpenSP/config.h:367:1: warning: this is the location of the previous definition
1204:info:build In file included from SgmlFOTBuilder.cxx:12:
1205:info:build ./../include/config.h:39:1: warning: "SP_DEFINE_TEMPLATES" redefined
1206:info:build In file included from ./../include/config.h:10,
1207:info:build                  from SgmlFOTBuilder.cxx:12:
1208:info:build /opt/local/include/OpenSP/config.h:367:1: warning: this is the location of the previous definition
1209:info:build SgmlFOTBuilder.cxx: In function ‘OpenSP::OutputCharStream& OpenJade_DSSSL::operator<<(OpenSP::OutputCharStream&, OpenJade_DSSSL::Units)’:
1210:info:build SgmlFOTBuilder.cxx:396: warning: format ‘%03d’ expects type ‘int’, but argument 3 has type ‘long int’
1211:info:build SgmlFOTBuilder.cxx:396: warning: format ‘%03d’ expects type ‘int’, but argument 3 has type ‘long int’
1212:info:build In file included from jade.cxx:4:
1213:info:build ./../include/config.h:39:1: warning: "SP_DEFINE_TEMPLATES" redefined
1214:info:build In file included from ./../include/config.h:10,
1215:info:build                  from jade.cxx:4:
1216:info:build /opt/local/include/OpenSP/config.h:367:1: warning: this is the location of the previous definition
1217:info:build /usr/bin/llvm-g++-4.2 -pipe -Os -isystem /opt/local/include -fno-rtti -arch x86_64 -arch i386 -I. -I./../include -I./../grove -I./../spgrove -I./../style -I/opt/local/include/OpenSP -I/opt/local/include/OpenSP/..  -DPACKAGE_NAME=\"\" -DPACKAGE_TARNAME=\"\" -DPACKAGE_VERSION=\"\" -DPACKAGE_STRING=\"\" -DPACKAGE_BUGREPORT=\"\" -DPACKAGE=\"openjade\" -DVERSION=\"1.3.2\" -DHAVE_SYS_TYPES_H=1 -DHAVE_SYS_STAT_H=1 -DHAVE_STDLIB_H=1 -DHAVE_STRING_H=1 -DHAVE_MEMORY_H=1 -DHAVE_STRINGS_H=1 -DHAVE_INTTYPES_H=1 -DHAVE_STDINT_H=1 -DHAVE_UNISTD_H=1 -DHAVE_STRUCT_STAT_ST_BLKSIZE=1 -DHAVE_ST_BLKSIZE=1 -DSIZEOF_SIZE_T=8 -DSIZEOF_UNSIGNED_INT=4 -DSP_HAVE_LOCALE=1 -DSP_HAVE_WCHAR=1 -DSP_HAVE_GETTEXT=1 -DSP_HAVE_BOOL=1 -DSP_ANSI_CLASS_INST=1 -DSP_HAVE_SOCKET=1 -DJADE_MIF=1 -DJADE_HTML=1 -DSP_MULTI_BYTE=1 -DSGML_CATALOG_FILES_DEFAULT=\"/opt/local/share/sgml/catalog\" -DHAVE_DLFCN_H=1  -DDEFAULT_SCHEME_BUILTINS=\"/opt/local/share/sgml/openjade/builtins.dsl\" -c RtfFOTBuilder.cxx
1218:info:build /usr/bin/llvm-g++-4.2 -pipe -Os -isystem /opt/local/include -fno-rtti -arch x86_64 -arch i386 -I. -I./../include -I./../grove -I./../spgrove -I./../style -I/opt/local/include/OpenSP -I/opt/local/include/OpenSP/..  -DPACKAGE_NAME=\"\" -DPACKAGE_TARNAME=\"\" -DPACKAGE_VERSION=\"\" -DPACKAGE_STRING=\"\" -DPACKAGE_BUGREPORT=\"\" -DPACKAGE=\"openjade\" -DVERSION=\"1.3.2\" -DHAVE_SYS_TYPES_H=1 -DHAVE_SYS_STAT_H=1 -DHAVE_STDLIB_H=1 -DHAVE_STRING_H=1 -DHAVE_MEMORY_H=1 -DHAVE_STRINGS_H=1 -DHAVE_INTTYPES_H=1 -DHAVE_STDINT_H=1 -DHAVE_UNISTD_H=1 -DHAVE_STRUCT_STAT_ST_BLKSIZE=1 -DHAVE_ST_BLKSIZE=1 -DSIZEOF_SIZE_T=8 -DSIZEOF_UNSIGNED_INT=4 -DSP_HAVE_LOCALE=1 -DSP_HAVE_WCHAR=1 -DSP_HAVE_GETTEXT=1 -DSP_HAVE_BOOL=1 -DSP_ANSI_CLASS_INST=1 -DSP_HAVE_SOCKET=1 -DJADE_MIF=1 -DJADE_HTML=1 -DSP_MULTI_BYTE=1 -DSGML_CATALOG_FILES_DEFAULT=\"/opt/local/share/sgml/catalog\" -DHAVE_DLFCN_H=1  -DDEFAULT_SCHEME_BUILTINS=\"/opt/local/share/sgml/openjade/builtins.dsl\" -c HtmlFOTBuilder.cxx
1219:info:build In file included from RtfFOTBuilder.cxx:4:
1220:info:build ./../include/config.h:39:1: warning: "SP_DEFINE_TEMPLATES" redefined
1221:info:build In file included from ./../include/config.h:10,
1222:info:build                  from RtfFOTBuilder.cxx:4:
1223:info:build /opt/local/include/OpenSP/config.h:367:1: warning: this is the location of the previous definition
1224:info:build In file included from HtmlFOTBuilder.cxx:4:
1225:info:build ./../include/config.h:39:1: warning: "SP_DEFINE_TEMPLATES" redefined
1226:info:build In file included from ./../include/config.h:10,
1227:info:build                  from HtmlFOTBuilder.cxx:4:
1228:info:build /opt/local/include/OpenSP/config.h:367:1: warning: this is the location of the previous definition
1229:info:build In file included from HtmlFOTBuilder.cxx:4:
1230:info:build ./../include/config.h:39:1: warning: "SP_DEFINE_TEMPLATES" redefined
1231:info:build In file included from ./../include/config.h:10,
1232:info:build                  from HtmlFOTBuilder.cxx:4:
1233:info:build /opt/local/include/OpenSP/config.h:367:1: warning: this is the location of the previous definition
1234:info:build In file included from RtfFOTBuilder.cxx:4:
1235:info:build ./../include/config.h:39:1: warning: "SP_DEFINE_TEMPLATES" redefined
1236:info:build In file included from ./../include/config.h:10,
1237:info:build                  from RtfFOTBuilder.cxx:4:
1238:info:build /opt/local/include/OpenSP/config.h:367:1: warning: this is the location of the previous definition
1239:info:build /usr/bin/llvm-g++-4.2 -pipe -Os -isystem /opt/local/include -fno-rtti -arch x86_64 -arch i386 -I. -I./../include -I./../grove -I./../spgrove -I./../style -I/opt/local/include/OpenSP -I/opt/local/include/OpenSP/..  -DPACKAGE_NAME=\"\" -DPACKAGE_TARNAME=\"\" -DPACKAGE_VERSION=\"\" -DPACKAGE_STRING=\"\" -DPACKAGE_BUGREPORT=\"\" -DPACKAGE=\"openjade\" -DVERSION=\"1.3.2\" -DHAVE_SYS_TYPES_H=1 -DHAVE_SYS_STAT_H=1 -DHAVE_STDLIB_H=1 -DHAVE_STRING_H=1 -DHAVE_MEMORY_H=1 -DHAVE_STRINGS_H=1 -DHAVE_INTTYPES_H=1 -DHAVE_STDINT_H=1 -DHAVE_UNISTD_H=1 -DHAVE_STRUCT_STAT_ST_BLKSIZE=1 -DHAVE_ST_BLKSIZE=1 -DSIZEOF_SIZE_T=8 -DSIZEOF_UNSIGNED_INT=4 -DSP_HAVE_LOCALE=1 -DSP_HAVE_WCHAR=1 -DSP_HAVE_GETTEXT=1 -DSP_HAVE_BOOL=1 -DSP_ANSI_CLASS_INST=1 -DSP_HAVE_SOCKET=1 -DJADE_MIF=1 -DJADE_HTML=1 -DSP_MULTI_BYTE=1 -DSGML_CATALOG_FILES_DEFAULT=\"/opt/local/share/sgml/catalog\" -DHAVE_DLFCN_H=1  -DDEFAULT_SCHEME_BUILTINS=\"/opt/local/share/sgml/openjade/builtins.dsl\" -c TeXFOTBuilder.cxx
1240:info:build In file included from TeXFOTBuilder.cxx:10:
1241:info:build ./../include/config.h:39:1: warning: "SP_DEFINE_TEMPLATES" redefined
1242:info:build In file included from ./../include/config.h:10,
1243:info:build                  from TeXFOTBuilder.cxx:10:
1244:info:build /opt/local/include/OpenSP/config.h:367:1: warning: this is the location of the previous definition
1245:info:build In file included from TeXFOTBuilder.cxx:10:
1246:info:build ./../include/config.h:39:1: warning: "SP_DEFINE_TEMPLATES" redefined
1247:info:build In file included from ./../include/config.h:10,
1248:info:build                  from TeXFOTBuilder.cxx:10:
1249:info:build /opt/local/include/OpenSP/config.h:367:1: warning: this is the location of the previous definition
1250:info:build /usr/bin/llvm-g++-4.2 -pipe -Os -isystem /opt/local/include -fno-rtti -arch x86_64 -arch i386 -I. -I./../include -I./../grove -I./../spgrove -I./../style -I/opt/local/include/OpenSP -I/opt/local/include/OpenSP/..  -DPACKAGE_NAME=\"\" -DPACKAGE_TARNAME=\"\" -DPACKAGE_VERSION=\"\" -DPACKAGE_STRING=\"\" -DPACKAGE_BUGREPORT=\"\" -DPACKAGE=\"openjade\" -DVERSION=\"1.3.2\" -DHAVE_SYS_TYPES_H=1 -DHAVE_SYS_STAT_H=1 -DHAVE_STDLIB_H=1 -DHAVE_STRING_H=1 -DHAVE_MEMORY_H=1 -DHAVE_STRINGS_H=1 -DHAVE_INTTYPES_H=1 -DHAVE_STDINT_H=1 -DHAVE_UNISTD_H=1 -DHAVE_STRUCT_STAT_ST_BLKSIZE=1 -DHAVE_ST_BLKSIZE=1 -DSIZEOF_SIZE_T=8 -DSIZEOF_UNSIGNED_INT=4 -DSP_HAVE_LOCALE=1 -DSP_HAVE_WCHAR=1 -DSP_HAVE_GETTEXT=1 -DSP_HAVE_BOOL=1 -DSP_ANSI_CLASS_INST=1 -DSP_HAVE_SOCKET=1 -DJADE_MIF=1 -DJADE_HTML=1 -DSP_MULTI_BYTE=1 -DSGML_CATALOG_FILES_DEFAULT=\"/opt/local/share/sgml/catalog\" -DHAVE_DLFCN_H=1  -DDEFAULT_SCHEME_BUILTINS=\"/opt/local/share/sgml/openjade/builtins.dsl\" -c TransformFOTBuilder.cxx
1251:info:build In file included from TransformFOTBuilder.cxx:4:
1252:info:build ./../include/config.h:39:1: warning: "SP_DEFINE_TEMPLATES" redefined
1253:info:build In file included from ./../include/config.h:10,
1254:info:build                  from TransformFOTBuilder.cxx:4:
1255:info:build /opt/local/include/OpenSP/config.h:367:1: warning: this is the location of the previous definition
1256:info:build In file included from TransformFOTBuilder.cxx:4:
1257:info:build ./../include/config.h:39:1: warning: "SP_DEFINE_TEMPLATES" redefined
1258:info:build In file included from ./../include/config.h:10,
1259:info:build                  from TransformFOTBuilder.cxx:4:
1260:info:build /opt/local/include/OpenSP/config.h:367:1: warning: this is the location of the previous definition
1261:info:build /usr/bin/llvm-g++-4.2 -pipe -Os -isystem /opt/local/include -fno-rtti -arch x86_64 -arch i386 -I. -I./../include -I./../grove -I./../spgrove -I./../style -I/opt/local/include/OpenSP -I/opt/local/include/OpenSP/..  -DPACKAGE_NAME=\"\" -DPACKAGE_TARNAME=\"\" -DPACKAGE_VERSION=\"\" -DPACKAGE_STRING=\"\" -DPACKAGE_BUGREPORT=\"\" -DPACKAGE=\"openjade\" -DVERSION=\"1.3.2\" -DHAVE_SYS_TYPES_H=1 -DHAVE_SYS_STAT_H=1 -DHAVE_STDLIB_H=1 -DHAVE_STRING_H=1 -DHAVE_MEMORY_H=1 -DHAVE_STRINGS_H=1 -DHAVE_INTTYPES_H=1 -DHAVE_STDINT_H=1 -DHAVE_UNISTD_H=1 -DHAVE_STRUCT_STAT_ST_BLKSIZE=1 -DHAVE_ST_BLKSIZE=1 -DSIZEOF_SIZE_T=8 -DSIZEOF_UNSIGNED_INT=4 -DSP_HAVE_LOCALE=1 -DSP_HAVE_WCHAR=1 -DSP_HAVE_GETTEXT=1 -DSP_HAVE_BOOL=1 -DSP_ANSI_CLASS_INST=1 -DSP_HAVE_SOCKET=1 -DJADE_MIF=1 -DJADE_HTML=1 -DSP_MULTI_BYTE=1 -DSGML_CATALOG_FILES_DEFAULT=\"/opt/local/share/sgml/catalog\" -DHAVE_DLFCN_H=1  -DDEFAULT_SCHEME_BUILTINS=\"/opt/local/share/sgml/openjade/builtins.dsl\" -c MifFOTBuilder.cxx
1262:info:build In file included from MifFOTBuilder.cxx:29:
1263:info:build ./../include/config.h:39:1: warning: "SP_DEFINE_TEMPLATES" redefined
1264:info:build In file included from ./../include/config.h:10,
1265:info:build                  from MifFOTBuilder.cxx:29:
1266:info:build /opt/local/include/OpenSP/config.h:367:1: warning: this is the location of the previous definition
1267:info:build MifFOTBuilder.cxx: In member function ‘void OpenJade_DSSSL::MifDoc::commit()’:
1268:info:build MifFOTBuilder.cxx:5751: warning: format ‘%u’ expects type ‘unsigned int’, but argument 3 has type ‘long unsigned int’
1269:info:build MifFOTBuilder.cxx:5751: warning: format ‘%u’ expects type ‘unsigned int’, but argument 3 has type ‘long unsigned int’
1270:info:build In file included from MifFOTBuilder.cxx:29:
1271:info:build ./../include/config.h:39:1: warning: "SP_DEFINE_TEMPLATES" redefined
1272:info:build In file included from ./../include/config.h:10,
1273:info:build                  from MifFOTBuilder.cxx:29:
1274:info:build /opt/local/include/OpenSP/config.h:367:1: warning: this is the location of the previous definition
1275:info:build MifFOTBuilder.cxx: In member function ‘void OpenJade_DSSSL::MifDoc::commit()’:
1276:info:build MifFOTBuilder.cxx:5751: warning: format ‘%u’ expects type ‘unsigned int’, but argument 3 has type ‘long unsigned int’
1277:info:build MifFOTBuilder.cxx:5751: warning: format ‘%u’ expects type ‘unsigned int’, but argument 3 has type ‘long unsigned int’
1278:info:build /bin/sh /opt/local/var/macports/build/_opt_local_var_macports_sources_www.macports.org_files_ports_textproc_openjade/openjade/work/openjade-1.3.2/libtool --mode=link /usr/bin/llvm-g++-4.2 -allow-undefined -pipe -Os -isystem /opt/local/include -fno-rtti -arch x86_64 -arch i386 -I. -I./../include -I./../grove -I./../spgrove -I./../style -I/opt/local/include/OpenSP -I/opt/local/include/OpenSP/..  -DPACKAGE_NAME=\"\" -DPACKAGE_TARNAME=\"\" -DPACKAGE_VERSION=\"\" -DPACKAGE_STRING=\"\" -DPACKAGE_BUGREPORT=\"\" -DPACKAGE=\"openjade\" -DVERSION=\"1.3.2\" -DHAVE_SYS_TYPES_H=1 -DHAVE_SYS_STAT_H=1 -DHAVE_STDLIB_H=1 -DHAVE_STRING_H=1 -DHAVE_MEMORY_H=1 -DHAVE_STRINGS_H=1 -DHAVE_INTTYPES_H=1 -DHAVE_STDINT_H=1 -DHAVE_UNISTD_H=1 -DHAVE_STRUCT_STAT_ST_BLKSIZE=1 -DHAVE_ST_BLKSIZE=1 -DSIZEOF_SIZE_T=8 -DSIZEOF_UNSIGNED_INT=4 -DSP_HAVE_LOCALE=1 -DSP_HAVE_WCHAR=1 -DSP_HAVE_GETTEXT=1 -DSP_HAVE_BOOL=1 -DSP_ANSI_CLASS_INST=1 -DSP_HAVE_SOCKET=1 -DJADE_MIF=1 -DJADE_HTML=1 -DSP_MULTI_BYTE=1 -DSGML_CATALOG_FILES_DEFAULT=\"/opt/local/share/sgml/catalog\" -DHAVE_DLFCN_H=1  -DDEFAULT_SCHEME_BUILTINS=\"/opt/local/share/sgml/openjade/builtins.dsl\" -Wl,-headerpad_max_install_names -arch x86_64 -arch i386 -o openjade jade.o SgmlFOTBuilder.o RtfFOTBuilder.o HtmlFOTBuilder.o TeXFOTBuilder.o TransformFOTBuilder.o MifFOTBuilder.o  ../style/libostyle.la ../spgrove/libospgrove.la ../grove/libogrove.la /opt/local/lib/libosp.dylib -L/opt/local/lib -lintl
1279:info:build libtool: link: `-allow-undefined' is deprecated because it is the default
1280:info:build mkdir .libs
1281:info:build /usr/bin/llvm-g++-4.2 -pipe -Os -isystem /opt/local/include -fno-rtti -arch x86_64 -arch i386 -I. -I./../include -I./../grove -I./../spgrove -I./../style -I/opt/local/include/OpenSP -I/opt/local/include/OpenSP/.. "-DPACKAGE_NAME=\"\"" "-DPACKAGE_TARNAME=\"\"" "-DPACKAGE_VERSION=\"\"" "-DPACKAGE_STRING=\"\"" "-DPACKAGE_BUGREPORT=\"\"" "-DPACKAGE=\"openjade\"" "-DVERSION=\"1.3.2\"" -DHAVE_SYS_TYPES_H=1 -DHAVE_SYS_STAT_H=1 -DHAVE_STDLIB_H=1 -DHAVE_STRING_H=1 -DHAVE_MEMORY_H=1 -DHAVE_STRINGS_H=1 -DHAVE_INTTYPES_H=1 -DHAVE_STDINT_H=1 -DHAVE_UNISTD_H=1 -DHAVE_STRUCT_STAT_ST_BLKSIZE=1 -DHAVE_ST_BLKSIZE=1 -DSIZEOF_SIZE_T=8 -DSIZEOF_UNSIGNED_INT=4 -DSP_HAVE_LOCALE=1 -DSP_HAVE_WCHAR=1 -DSP_HAVE_GETTEXT=1 -DSP_HAVE_BOOL=1 -DSP_ANSI_CLASS_INST=1 -DSP_HAVE_SOCKET=1 -DJADE_MIF=1 -DJADE_HTML=1 -DSP_MULTI_BYTE=1 "-DSGML_CATALOG_FILES_DEFAULT=\"/opt/local/share/sgml/catalog\"" -DHAVE_DLFCN_H=1 "-DDEFAULT_SCHEME_BUILTINS=\"/opt/local/share/sgml/openjade/builtins.dsl\"" -Wl,-headerpad_max_install_names -arch x86_64 -arch i386 -o .libs/openjade jade.o SgmlFOTBuilder.o RtfFOTBuilder.o HtmlFOTBuilder.o TeXFOTBuilder.o TransformFOTBuilder.o MifFOTBuilder.o /opt/local/lib/libosp.dylib  -L../style/.libs -lostyle -L../spgrove/.libs -lospgrove -L../grove/.libs -logrove -lm -L/opt/local/lib -L/usr/local/lib -lintl -liconv -lc
1282:info:build Undefined symbols for architecture x86_64:
1283:info:build   "OpenSP::CmdLineApp::codingSystem()", referenced from:
1284:info:build       OpenJade_DSSSL::JadeApp::makeFOTBuilder(OpenJade_DSSSL::FOTBuilder::Extension const*&)in jade.o
1285:info:build       OpenJade_DSSSL::TransformFOTBuilder::startEntity(OpenSP::String<unsigned int> const&)in TransformFOTBuilder.o
1286:info:build   "OpenSP::CmdLineApp::systemCharset()", referenced from:
1287:info:build       OpenJade_DSSSL::JadeApp::makeFOTBuilder(OpenJade_DSSSL::FOTBuilder::Extension const*&)in jade.o
1288:info:build       OpenJade_DSSSL::TransformFOTBuilder::TransformFOTBuilder(OpenSP::CmdLineApp*, bool, OpenSP::Vector<OpenSP::String<unsigned int> > const&)in TransformFOTBuilder.o
1289:info:build   "OpenSP::CmdLineApp::outputCodingSystem()", referenced from:
1290:info:build       OpenJade_DSSSL::HtmlFOTBuilder::Document::output(OpenSP::OutputCharStream&, OpenJade_DSSSL::HtmlFOTBuilder::OutputState&)in HtmlFOTBuilder.o
1291:info:build       OpenJade_DSSSL::HtmlFOTBuilder::outputStyleSheet(OpenSP::String<unsigned int>&)in HtmlFOTBuilder.o
1292:info:build       OpenJade_DSSSL::TransformFOTBuilder::startEntity(OpenSP::String<unsigned int> const&)in TransformFOTBuilder.o
1293:info:build   "OpenSP::InputSource::get(OpenSP::Messenger&)", referenced from:
1294:info:build       OpenJade_DSSSL::RtfFOTBuilder::systemIdFilename1(OpenSP::String<unsigned int> const&, OpenSP::String<unsigned int>&)in RtfFOTBuilder.o
1295:info:build       OpenJade_DSSSL::MifFOTBuilder::systemIdFilename(OpenSP::String<unsigned int> const&, OpenSP::String<unsigned int>&)in MifFOTBuilder.o
1296:info:build   "OpenSP::InputSource::accessError() const", referenced from:
1297:info:build       OpenJade_DSSSL::RtfFOTBuilder::systemIdFilename1(OpenSP::String<unsigned int> const&, OpenSP::String<unsigned int>&)in RtfFOTBuilder.o
1298:info:build       OpenJade_DSSSL::MifFOTBuilder::systemIdFilename(OpenSP::String<unsigned int> const&, OpenSP::String<unsigned int>&)in MifFOTBuilder.o
1299:info:build   "OpenSP::InputSource::currentLocation() const", referenced from:
1300:info:build       OpenJade_DSSSL::RtfFOTBuilder::systemIdFilename1(OpenSP::String<unsigned int> const&, OpenSP::String<unsigned int>&)in RtfFOTBuilder.o
1301:info:build       OpenJade_DSSSL::MifFOTBuilder::systemIdFilename(OpenSP::String<unsigned int> const&, OpenSP::String<unsigned int>&)in MifFOTBuilder.o
1302:info:build   "OpenSP::Location::origin() const", referenced from:
1303:info:build       OpenJade_DSSSL::RtfFOTBuilder::systemIdFilename1(OpenSP::String<unsigned int> const&, OpenSP::String<unsigned int>&)in RtfFOTBuilder.o
1304:info:build       OpenJade_DSSSL::MifFOTBuilder::systemIdFilename(OpenSP::String<unsigned int> const&, OpenSP::String<unsigned int>&)in MifFOTBuilder.o
1305:info:build ld: symbol(s) not found for architecture x86_64
1306:info:build collect2: ld returned 1 exit status
1307:info:build Undefined symbols for architecture i386:
1308:info:build   "OpenSP::CmdLineApp::codingSystem()", referenced from:
1309:info:build       OpenJade_DSSSL::JadeApp::makeFOTBuilder(OpenJade_DSSSL::FOTBuilder::Extension const*&)in jade.o
1310:info:build       OpenJade_DSSSL::TransformFOTBuilder::startEntity(OpenSP::String<unsigned int> const&)in TransformFOTBuilder.o
1311:info:build   "OpenSP::CmdLineApp::systemCharset()", referenced from:
1312:info:build       OpenJade_DSSSL::JadeApp::makeFOTBuilder(OpenJade_DSSSL::FOTBuilder::Extension const*&)in jade.o
1313:info:build       OpenJade_DSSSL::TransformFOTBuilder::TransformFOTBuilder(OpenSP::CmdLineApp*, bool, OpenSP::Vector<OpenSP::String<unsigned int> > const&)in TransformFOTBuilder.o
1314:info:build   "OpenSP::CmdLineApp::outputCodingSystem()", referenced from:
1315:info:build       OpenJade_DSSSL::HtmlFOTBuilder::Document::output(OpenSP::OutputCharStream&, OpenJade_DSSSL::HtmlFOTBuilder::OutputState&)in HtmlFOTBuilder.o
1316:info:build       OpenJade_DSSSL::HtmlFOTBuilder::outputStyleSheet(OpenSP::String<unsigned int>&)in HtmlFOTBuilder.o
1317:info:build       OpenJade_DSSSL::TransformFOTBuilder::startEntity(OpenSP::String<unsigned int> const&)in TransformFOTBuilder.o
1318:info:build   "OpenSP::InputSource::get(OpenSP::Messenger&)", referenced from:
1319:info:build       OpenJade_DSSSL::RtfFOTBuilder::systemIdFilename1(OpenSP::String<unsigned int> const&, OpenSP::String<unsigned int>&)in RtfFOTBuilder.o
1320:info:build       OpenJade_DSSSL::MifFOTBuilder::systemIdFilename(OpenSP::String<unsigned int> const&, OpenSP::String<unsigned int>&)in MifFOTBuilder.o
1321:info:build   "OpenSP::InputSource::accessError() const", referenced from:
1322:info:build       OpenJade_DSSSL::RtfFOTBuilder::systemIdFilename1(OpenSP::String<unsigned int> const&, OpenSP::String<unsigned int>&)in RtfFOTBuilder.o
1323:info:build       OpenJade_DSSSL::MifFOTBuilder::systemIdFilename(OpenSP::String<unsigned int> const&, OpenSP::String<unsigned int>&)in MifFOTBuilder.o
1324:info:build   "OpenSP::InputSource::currentLocation() const", referenced from:
1325:info:build       OpenJade_DSSSL::RtfFOTBuilder::systemIdFilename1(OpenSP::String<unsigned int> const&, OpenSP::String<unsigned int>&)in RtfFOTBuilder.o
1326:info:build       OpenJade_DSSSL::MifFOTBuilder::systemIdFilename(OpenSP::String<unsigned int> const&, OpenSP::String<unsigned int>&)in MifFOTBuilder.o
1327:info:build   "OpenSP::Location::origin() const", referenced from:
1328:info:build       OpenJade_DSSSL::RtfFOTBuilder::systemIdFilename1(OpenSP::String<unsigned int> const&, OpenSP::String<unsigned int>&)in RtfFOTBuilder.o
1329:info:build       OpenJade_DSSSL::MifFOTBuilder::systemIdFilename(OpenSP::String<unsigned int> const&, OpenSP::String<unsigned int>&)in MifFOTBuilder.o
1330:info:build ld: symbol(s) not found for architecture i386
1331:info:build collect2: ld returned 1 exit status
1332:info:build lipo: can't open input file: /opt/local/var/macports/build/_opt_local_var_macports_sources_www.macports.org_files_ports_textproc_openjade/openjade/work/.tmp/ccP1sMwE.out (No such file or directory)
1333:info:build make[2]: *** [openjade] Error 1
1334:info:build make[2]: Leaving directory `/opt/local/var/macports/build/_opt_local_var_macports_sources_www.macports.org_files_ports_textproc_openjade/openjade/work/openjade-1.3.2/jade'
1335:info:build make[1]: *** [jade] Error 2
1336:info:build make[1]: Leaving directory `/opt/local/var/macports/build/_opt_local_var_macports_sources_www.macports.org_files_ports_textproc_openjade/openjade/work/openjade-1.3.2'
1337:info:build make: *** [all] Error 2
1338:info:build make: Leaving directory `/opt/local/var/macports/build/_opt_local_var_macports_sources_www.macports.org_files_ports_textproc_openjade/openjade/work/openjade-1.3.2'
1339:info:build Command failed:  cd "/opt/local/var/macports/build/_opt_local_var_macports_sources_www.macports.org_files_ports_textproc_openjade/openjade/work/openjade-1.3.2" && /usr/bin/make -j2 -w all
1340:info:build Exit code: 2
1341:error:build org.macports.build for port openjade returned: command execution failed
1342:debug:build Error code: CHILDSTATUS 95937 2
1343:debug:build Backtrace: command execution failed
1344    while executing
1345"system -nice 0 $fullcmdstring"
1346    ("eval" body line 1)
1347    invoked from within
1348"eval system $notty $nice \$fullcmdstring"
1349    invoked from within
1350"command_exec build"
1351    (procedure "portbuild::build_main" line 8)
1352    invoked from within
1353"portbuild::build_main org.macports.build"
1354    ("eval" body line 1)
1355    invoked from within
1356"eval $procedure $targetname"
1357:info:build Warning: targets not executed for openjade: org.macports.activate org.macports.build org.macports.destroot org.macports.install
1358:notice:build Please see the log file for port openjade for details:
1359    /opt/local/var/macports/logs/_opt_local_var_macports_sources_www.macports.org_files_ports_textproc_openjade/openjade/main.log