Ticket #47412: main.log

File main.log, 65.3 KB (added by vmagditch@…, 6 years ago)

log

Line 
1version:1
2:warn:main The Xcode Command Line Tools don't appear to be installed; most ports will likely fail to build.
3:warn:main Install them by running `xcode-select --install'.
4:debug:main epoch: in tree: 0 installed: 0
5:debug:main cmake 3.2.1_0 exists in the ports tree
6:debug:main cmake 3.2.1_0  is the latest installed
7:debug:main cmake 3.2.1_0  is active
8:debug:main Merging existing variants '' into variants
9:debug:main new fully merged portvariants:
10:debug:main Changing to port directory: /opt/local/var/macports/sources/rsync.macports.org/release/tarballs/ports/devel/cmake
11:debug:main OS darwin/14.3.0 (Mac OS X 10.10) arch i386
12:debug:main Reading variant descriptions from /opt/local/var/macports/sources/rsync.macports.org/release/tarballs/ports/_resources/port1.0/variant_descriptions.conf
13:debug:main Sourcing PortGroup muniversal 1.0 from /opt/local/var/macports/sources/rsync.macports.org/release/tarballs/ports/_resources/port1.0/group/muniversal-1.0.tcl
14:debug:main universal variant already exists, so not adding the default one
15:debug:main Running callback portconfigure::add_automatic_compiler_dependencies
16:debug:main Finished running callback portconfigure::add_automatic_compiler_dependencies
17:debug:main Running callback portbuild::add_automatic_buildsystem_dependencies
18:debug:main Finished running callback portbuild::add_automatic_buildsystem_dependencies
19:debug:main No need to upgrade! cmake 3.2.1_0 >= cmake 3.2.1_0
20:debug:main epoch: in tree: 0 installed: 0
21:debug:main curl 7.41.0_0 exists in the ports tree
22:debug:main curl 7.41.0_0 +ssl is the latest installed
23:debug:main curl 7.41.0_0 +ssl is active
24:debug:main Merging existing variants '+ssl' into variants
25:debug:main new fully merged portvariants: ssl +
26:debug:main Changing to port directory: /opt/local/var/macports/sources/rsync.macports.org/release/tarballs/ports/net/curl
27:debug:main OS darwin/14.3.0 (Mac OS X 10.10) arch i386
28:debug:main Reading variant descriptions from /opt/local/var/macports/sources/rsync.macports.org/release/tarballs/ports/_resources/port1.0/variant_descriptions.conf
29:debug:main Sourcing PortGroup muniversal 1.0 from /opt/local/var/macports/sources/rsync.macports.org/release/tarballs/ports/_resources/port1.0/group/muniversal-1.0.tcl
30:debug:main universal variant already exists, so not adding the default one
31:debug:main Executing variant ssl provides ssl
32:debug:main Running callback portconfigure::add_automatic_compiler_dependencies
33:debug:main Finished running callback portconfigure::add_automatic_compiler_dependencies
34:debug:main Running callback portbuild::add_automatic_buildsystem_dependencies
35:debug:main Finished running callback portbuild::add_automatic_buildsystem_dependencies
36:debug:main No need to upgrade! curl 7.41.0_0 >= curl 7.41.0_0
37:debug:main epoch: in tree: 0 installed: 0
38:debug:main libidn 1.29_0 exists in the ports tree
39:debug:main libidn 1.29_0  is the latest installed
40:debug:main libidn 1.29_0  is active
41:debug:main Merging existing variants '' into variants
42:debug:main new fully merged portvariants:
43:debug:main Changing to port directory: /opt/local/var/macports/sources/rsync.macports.org/release/tarballs/ports/mail/libidn
44:debug:main OS darwin/14.3.0 (Mac OS X 10.10) arch i386
45:debug:main Sourcing PortGroup conflicts_build 1.0 from /opt/local/var/macports/sources/rsync.macports.org/release/tarballs/ports/_resources/port1.0/group/conflicts_build-1.0.tcl
46:debug:main adding the default universal variant
47:debug:main Reading variant descriptions from /opt/local/var/macports/sources/rsync.macports.org/release/tarballs/ports/_resources/port1.0/variant_descriptions.conf
48:debug:main Running callback portconfigure::add_automatic_compiler_dependencies
49:debug:main Finished running callback portconfigure::add_automatic_compiler_dependencies
50:debug:main Running callback portbuild::add_automatic_buildsystem_dependencies
51:debug:main Finished running callback portbuild::add_automatic_buildsystem_dependencies
52:debug:main No need to upgrade! libidn 1.29_0 >= libidn 1.29_0
53:debug:main epoch: in tree: 0 installed: 0
54:debug:main libiconv 1.14_0 exists in the ports tree
55:debug:main libiconv 1.14_0  is the latest installed
56:debug:main libiconv 1.14_0  is active
57:debug:main Merging existing variants '' into variants
58:debug:main new fully merged portvariants:
59:debug:main Changing to port directory: /opt/local/var/macports/sources/rsync.macports.org/release/tarballs/ports/textproc/libiconv
60:debug:main OS darwin/14.3.0 (Mac OS X 10.10) arch i386
61:debug:main Reading variant descriptions from /opt/local/var/macports/sources/rsync.macports.org/release/tarballs/ports/_resources/port1.0/variant_descriptions.conf
62:debug:main Sourcing PortGroup muniversal 1.0 from /opt/local/var/macports/sources/rsync.macports.org/release/tarballs/ports/_resources/port1.0/group/muniversal-1.0.tcl
63:debug:main universal variant already exists, so not adding the default one
64:debug:main Running callback portconfigure::add_automatic_compiler_dependencies
65:debug:main Finished running callback portconfigure::add_automatic_compiler_dependencies
66:debug:main Running callback portbuild::add_automatic_buildsystem_dependencies
67:debug:main Finished running callback portbuild::add_automatic_buildsystem_dependencies
68:debug:main No need to upgrade! libiconv 1.14_0 >= libiconv 1.14_0
69:debug:main epoch: in tree: 2 installed: 2
70:debug:main gettext 0.19.4_0 exists in the ports tree
71:debug:main gettext 0.19.4_0  is the latest installed
72:debug:main gettext 0.19.4_0  is active
73:debug:main Merging existing variants '' into variants
74:debug:main new fully merged portvariants:
75:debug:main Changing to port directory: /opt/local/var/macports/sources/rsync.macports.org/release/tarballs/ports/devel/gettext
76:debug:main OS darwin/14.3.0 (Mac OS X 10.10) arch i386
77:debug:main Sourcing PortGroup compiler_blacklist_versions 1.0 from /opt/local/var/macports/sources/rsync.macports.org/release/tarballs/ports/_resources/port1.0/group/compiler_blacklist_versions-1.0.tcl
78:debug:main Reading variant descriptions from /opt/local/var/macports/sources/rsync.macports.org/release/tarballs/ports/_resources/port1.0/variant_descriptions.conf
79:debug:main Sourcing PortGroup muniversal 1.0 from /opt/local/var/macports/sources/rsync.macports.org/release/tarballs/ports/_resources/port1.0/group/muniversal-1.0.tcl
80:debug:main compiler clang 602.0.49 not blacklisted because it doesn't match {clang < 211.10.1}
81:debug:main universal variant already exists, so not adding the default one
82:debug:main Running callback portconfigure::add_automatic_compiler_dependencies
83:debug:main Finished running callback portconfigure::add_automatic_compiler_dependencies
84:debug:main Running callback portbuild::add_automatic_buildsystem_dependencies
85:debug:main Finished running callback portbuild::add_automatic_buildsystem_dependencies
86:debug:main No need to upgrade! gettext 0.19.4_0 >= gettext 0.19.4_0
87:debug:main epoch: in tree: 0 installed: 0
88:debug:main expat 2.1.0_0 exists in the ports tree
89:debug:main expat 2.1.0_0  is the latest installed
90:debug:main expat 2.1.0_0  is active
91:debug:main Merging existing variants '' into variants
92:debug:main new fully merged portvariants:
93:debug:main Changing to port directory: /opt/local/var/macports/sources/rsync.macports.org/release/tarballs/ports/textproc/expat
94:debug:main OS darwin/14.3.0 (Mac OS X 10.10) arch i386
95:debug:main adding the default universal variant
96:debug:main Reading variant descriptions from /opt/local/var/macports/sources/rsync.macports.org/release/tarballs/ports/_resources/port1.0/variant_descriptions.conf
97:debug:main Running callback portconfigure::add_automatic_compiler_dependencies
98:debug:main Finished running callback portconfigure::add_automatic_compiler_dependencies
99:debug:main Running callback portbuild::add_automatic_buildsystem_dependencies
100:debug:main Finished running callback portbuild::add_automatic_buildsystem_dependencies
101:debug:main No need to upgrade! expat 2.1.0_0 >= expat 2.1.0_0
102:debug:main epoch: in tree: 0 installed: 0
103:debug:main ncurses 5.9_2 exists in the ports tree
104:debug:main ncurses 5.9_2  is the latest installed
105:debug:main ncurses 5.9_2  is active
106:debug:main Merging existing variants '' into variants
107:debug:main new fully merged portvariants:
108:debug:main Changing to port directory: /opt/local/var/macports/sources/rsync.macports.org/release/tarballs/ports/devel/ncurses
109:debug:main OS darwin/14.3.0 (Mac OS X 10.10) arch i386
110:debug:main adding the default universal variant
111:debug:main Reading variant descriptions from /opt/local/var/macports/sources/rsync.macports.org/release/tarballs/ports/_resources/port1.0/variant_descriptions.conf
112:debug:main Running callback portconfigure::add_automatic_compiler_dependencies
113:debug:main Finished running callback portconfigure::add_automatic_compiler_dependencies
114:debug:main Running callback portbuild::add_automatic_buildsystem_dependencies
115:debug:main Finished running callback portbuild::add_automatic_buildsystem_dependencies
116:debug:main No need to upgrade! ncurses 5.9_2 >= ncurses 5.9_2
117:debug:main epoch: in tree: 0 installed: 0
118:debug:main zlib 1.2.8_0 exists in the ports tree
119:debug:main zlib 1.2.8_0  is the latest installed
120:debug:main zlib 1.2.8_0  is active
121:debug:main Merging existing variants '' into variants
122:debug:main new fully merged portvariants:
123:debug:main Changing to port directory: /opt/local/var/macports/sources/rsync.macports.org/release/tarballs/ports/archivers/zlib
124:debug:main OS darwin/14.3.0 (Mac OS X 10.10) arch i386
125:debug:main Sourcing PortGroup xcodeversion 1.0 from /opt/local/var/macports/sources/rsync.macports.org/release/tarballs/ports/_resources/port1.0/group/xcodeversion-1.0.tcl
126:debug:main adding the default universal variant
127:debug:main Reading variant descriptions from /opt/local/var/macports/sources/rsync.macports.org/release/tarballs/ports/_resources/port1.0/variant_descriptions.conf
128:debug:main Running callback portconfigure::add_automatic_compiler_dependencies
129:debug:main Finished running callback portconfigure::add_automatic_compiler_dependencies
130:debug:main Running callback portbuild::add_automatic_buildsystem_dependencies
131:debug:main Finished running callback portbuild::add_automatic_buildsystem_dependencies
132:debug:main No need to upgrade! zlib 1.2.8_0 >= zlib 1.2.8_0
133:debug:main epoch: in tree: 1 installed: 1
134:debug:main openssl 1.0.2a_0 exists in the ports tree
135:debug:main openssl 1.0.2a_0  is the latest installed
136:debug:main openssl 1.0.2a_0  is active
137:debug:main Merging existing variants '' into variants
138:debug:main new fully merged portvariants:
139:debug:main Changing to port directory: /opt/local/var/macports/sources/rsync.macports.org/release/tarballs/ports/devel/openssl
140:debug:main OS darwin/14.3.0 (Mac OS X 10.10) arch i386
141:debug:main Reading variant descriptions from /opt/local/var/macports/sources/rsync.macports.org/release/tarballs/ports/_resources/port1.0/variant_descriptions.conf
142:debug:main Sourcing PortGroup muniversal 1.0 from /opt/local/var/macports/sources/rsync.macports.org/release/tarballs/ports/_resources/port1.0/group/muniversal-1.0.tcl
143:debug:main universal variant already exists, so not adding the default one
144:debug:main Running callback portconfigure::add_automatic_compiler_dependencies
145:debug:main Finished running callback portconfigure::add_automatic_compiler_dependencies
146:debug:main Running callback portbuild::add_automatic_buildsystem_dependencies
147:debug:main Finished running callback portbuild::add_automatic_buildsystem_dependencies
148:debug:main No need to upgrade! openssl 1.0.2a_0 >= openssl 1.0.2a_0
149:debug:main epoch: in tree: 0 installed: 0
150:debug:main curl-ca-bundle 7.41.0_0 exists in the ports tree
151:debug:main curl-ca-bundle 7.41.0_0  is the latest installed
152:debug:main curl-ca-bundle 7.41.0_0  is active
153:debug:main Merging existing variants '' into variants
154:debug:main new fully merged portvariants:
155:debug:main Changing to port directory: /opt/local/var/macports/sources/rsync.macports.org/release/tarballs/ports/net/curl
156:debug:main OS darwin/14.3.0 (Mac OS X 10.10) arch i386
157:debug:main universal_variant is false, so not adding the default universal variant
158:debug:main Running callback portconfigure::add_automatic_compiler_dependencies
159:debug:main Finished running callback portconfigure::add_automatic_compiler_dependencies
160:debug:main Running callback portbuild::add_automatic_buildsystem_dependencies
161:debug:main Finished running callback portbuild::add_automatic_buildsystem_dependencies
162:debug:main No need to upgrade! curl-ca-bundle 7.41.0_0 >= curl-ca-bundle 7.41.0_0
163:debug:main epoch: in tree: 0 installed: 0
164:debug:main bzip2 1.0.6_0 exists in the ports tree
165:debug:main bzip2 1.0.6_0  is the latest installed
166:debug:main bzip2 1.0.6_0  is active
167:debug:main Merging existing variants '' into variants
168:debug:main new fully merged portvariants:
169:debug:main Changing to port directory: /opt/local/var/macports/sources/rsync.macports.org/release/tarballs/ports/archivers/bzip2
170:debug:main OS darwin/14.3.0 (Mac OS X 10.10) arch i386
171:debug:main Reading variant descriptions from /opt/local/var/macports/sources/rsync.macports.org/release/tarballs/ports/_resources/port1.0/variant_descriptions.conf
172:debug:main universal variant already exists, so not adding the default one
173:debug:main Running callback portconfigure::add_automatic_compiler_dependencies
174:debug:main Finished running callback portconfigure::add_automatic_compiler_dependencies
175:debug:main Running callback portbuild::add_automatic_buildsystem_dependencies
176:debug:main Finished running callback portbuild::add_automatic_buildsystem_dependencies
177:debug:main No need to upgrade! bzip2 1.0.6_0 >= bzip2 1.0.6_0
178:debug:main epoch: in tree: 0 installed: 0
179:debug:main libarchive 3.1.2_1 exists in the ports tree
180:debug:main libarchive 3.1.2_1  is the latest installed
181:debug:main libarchive 3.1.2_1  is active
182:debug:main Merging existing variants '' into variants
183:debug:main new fully merged portvariants:
184:debug:main Changing to port directory: /opt/local/var/macports/sources/rsync.macports.org/release/tarballs/ports/archivers/libarchive
185:debug:main OS darwin/14.3.0 (Mac OS X 10.10) arch i386
186:debug:main adding the default universal variant
187:debug:main Reading variant descriptions from /opt/local/var/macports/sources/rsync.macports.org/release/tarballs/ports/_resources/port1.0/variant_descriptions.conf
188:debug:main Running callback portconfigure::add_automatic_compiler_dependencies
189:debug:main Finished running callback portconfigure::add_automatic_compiler_dependencies
190:debug:main Running callback portbuild::add_automatic_buildsystem_dependencies
191:debug:main Finished running callback portbuild::add_automatic_buildsystem_dependencies
192:debug:main No need to upgrade! libarchive 3.1.2_1 >= libarchive 3.1.2_1
193:debug:main epoch: in tree: 0 installed: 0
194:debug:main libxml2 2.9.2_2 exists in the ports tree
195:debug:main libxml2 2.9.2_2  is the latest installed
196:debug:main libxml2 2.9.2_2  is active
197:debug:main Merging existing variants '' into variants
198:debug:main new fully merged portvariants:
199:debug:main Changing to port directory: /opt/local/var/macports/sources/rsync.macports.org/release/tarballs/ports/textproc/libxml2
200:debug:main OS darwin/14.3.0 (Mac OS X 10.10) arch i386
201:debug:main adding the default universal variant
202:debug:main Reading variant descriptions from /opt/local/var/macports/sources/rsync.macports.org/release/tarballs/ports/_resources/port1.0/variant_descriptions.conf
203:debug:main Running callback portconfigure::add_automatic_compiler_dependencies
204:debug:main Finished running callback portconfigure::add_automatic_compiler_dependencies
205:debug:main Running callback portbuild::add_automatic_buildsystem_dependencies
206:debug:main Finished running callback portbuild::add_automatic_buildsystem_dependencies
207:debug:main No need to upgrade! libxml2 2.9.2_2 >= libxml2 2.9.2_2
208:debug:main epoch: in tree: 0 installed: 0
209:debug:main xz 5.2.1_0 exists in the ports tree
210:debug:main xz 5.2.1_0  is the latest installed
211:debug:main xz 5.2.1_0  is active
212:debug:main Merging existing variants '' into variants
213:debug:main new fully merged portvariants:
214:debug:main Changing to port directory: /opt/local/var/macports/sources/rsync.macports.org/release/tarballs/ports/archivers/xz
215:debug:main OS darwin/14.3.0 (Mac OS X 10.10) arch i386
216:debug:main adding the default universal variant
217:debug:main Reading variant descriptions from /opt/local/var/macports/sources/rsync.macports.org/release/tarballs/ports/_resources/port1.0/variant_descriptions.conf
218:debug:main Running callback portconfigure::add_automatic_compiler_dependencies
219:debug:main Finished running callback portconfigure::add_automatic_compiler_dependencies
220:debug:main Running callback portbuild::add_automatic_buildsystem_dependencies
221:debug:main Finished running callback portbuild::add_automatic_buildsystem_dependencies
222:debug:main No need to upgrade! xz 5.2.1_0 >= xz 5.2.1_0
223:debug:main epoch: in tree: 0 installed: 0
224:debug:main lzo2 2.08_0 exists in the ports tree
225:debug:main lzo2 2.08_0  is the latest installed
226:debug:main lzo2 2.08_0  is active
227:debug:main Merging existing variants '' into variants
228:debug:main new fully merged portvariants:
229:debug:main Changing to port directory: /opt/local/var/macports/sources/rsync.macports.org/release/tarballs/ports/archivers/lzo2
230:debug:main OS darwin/14.3.0 (Mac OS X 10.10) arch i386
231:debug:main Reading variant descriptions from /opt/local/var/macports/sources/rsync.macports.org/release/tarballs/ports/_resources/port1.0/variant_descriptions.conf
232:debug:main Sourcing PortGroup muniversal 1.0 from /opt/local/var/macports/sources/rsync.macports.org/release/tarballs/ports/_resources/port1.0/group/muniversal-1.0.tcl
233:debug:main universal variant already exists, so not adding the default one
234:debug:main Running callback portconfigure::add_automatic_compiler_dependencies
235:debug:main Finished running callback portconfigure::add_automatic_compiler_dependencies
236:debug:main Running callback portbuild::add_automatic_buildsystem_dependencies
237:debug:main Finished running callback portbuild::add_automatic_buildsystem_dependencies
238:debug:main No need to upgrade! lzo2 2.08_0 >= lzo2 2.08_0
239:debug:main epoch: in tree: 0 installed: 0
240:debug:main pkgconfig 0.28_0 exists in the ports tree
241:debug:main pkgconfig 0.28_0  is the latest installed
242:debug:main pkgconfig 0.28_0  is active
243:debug:main Merging existing variants '' into variants
244:debug:main new fully merged portvariants:
245:debug:main Changing to port directory: /opt/local/var/macports/sources/rsync.macports.org/release/tarballs/ports/devel/pkgconfig
246:debug:main OS darwin/14.3.0 (Mac OS X 10.10) arch i386
247:debug:main adding the default universal variant
248:debug:main Reading variant descriptions from /opt/local/var/macports/sources/rsync.macports.org/release/tarballs/ports/_resources/port1.0/variant_descriptions.conf
249:debug:main Running callback portconfigure::add_automatic_compiler_dependencies
250:debug:main Finished running callback portconfigure::add_automatic_compiler_dependencies
251:debug:main Running callback portbuild::add_automatic_buildsystem_dependencies
252:debug:main Finished running callback portbuild::add_automatic_buildsystem_dependencies
253:debug:main No need to upgrade! pkgconfig 0.28_0 >= pkgconfig 0.28_0
254:debug:main epoch: in tree: 0 installed: 0
255:debug:main boost 1.57.0_1 exists in the ports tree
256:debug:main boost 1.57.0_1 +no_single+no_static+python27 is the latest installed
257:debug:main boost 1.57.0_1 +no_single+no_static+python27 is active
258:debug:main Merging existing variants '+no_single+no_static+python27' into variants
259:debug:main new fully merged portvariants: no_static + no_single + python27 +
260:debug:main Changing to port directory: /opt/local/var/macports/sources/rsync.macports.org/release/tarballs/ports/devel/boost
261:debug:main OS darwin/14.3.0 (Mac OS X 10.10) arch i386
262:debug:main Sourcing PortGroup compiler_blacklist_versions 1.0 from /opt/local/var/macports/sources/rsync.macports.org/release/tarballs/ports/_resources/port1.0/group/compiler_blacklist_versions-1.0.tcl
263:debug:main Sourcing PortGroup active_variants 1.1 from /opt/local/var/macports/sources/rsync.macports.org/release/tarballs/ports/_resources/port1.0/group/active_variants-1.1.tcl
264:debug:main Sourcing PortGroup compilers 1.0 from /opt/local/var/macports/sources/rsync.macports.org/release/tarballs/ports/_resources/port1.0/group/compilers-1.0.tcl
265:debug:main Sourcing PortGroup mpi 1.0 from /opt/local/var/macports/sources/rsync.macports.org/release/tarballs/ports/_resources/port1.0/group/mpi-1.0.tcl
266:debug:main compiler clang 602.0.49 not blacklisted because it doesn't match {clang < 421}
267:debug:main Unmatched blacklisted compiler: macports-clang-2.9
268:debug:main Unmatched blacklisted compiler: *gcc-4.0
269:debug:main Unmatched blacklisted compiler: gcc-3.3
270:debug:main Reading variant descriptions from /opt/local/var/macports/sources/rsync.macports.org/release/tarballs/ports/_resources/port1.0/variant_descriptions.conf
271:debug:main universal variant already exists, so not adding the default one
272:debug:main Executing variant python27 provides python27
273:debug:main Executing variant no_static provides no_static
274:debug:main Executing variant no_single provides no_single
275:debug:main Running callback portconfigure::add_automatic_compiler_dependencies
276:debug:main Finished running callback portconfigure::add_automatic_compiler_dependencies
277:debug:main Running callback portbuild::add_automatic_buildsystem_dependencies
278:debug:main Finished running callback portbuild::add_automatic_buildsystem_dependencies
279:debug:main No need to upgrade! boost 1.57.0_1 >= boost 1.57.0_1
280:debug:main epoch: in tree: 0 installed: 0
281:debug:main icu 54.1_0 exists in the ports tree
282:debug:main icu 54.1_0  is the latest installed
283:debug:main icu 54.1_0  is active
284:debug:main Merging existing variants '' into variants
285:debug:main new fully merged portvariants:
286:debug:main Changing to port directory: /opt/local/var/macports/sources/rsync.macports.org/release/tarballs/ports/devel/icu
287:debug:main OS darwin/14.3.0 (Mac OS X 10.10) arch i386
288:debug:main Reading variant descriptions from /opt/local/var/macports/sources/rsync.macports.org/release/tarballs/ports/_resources/port1.0/variant_descriptions.conf
289:debug:main Sourcing PortGroup muniversal 1.0 from /opt/local/var/macports/sources/rsync.macports.org/release/tarballs/ports/_resources/port1.0/group/muniversal-1.0.tcl
290:debug:main universal variant already exists, so not adding the default one
291:debug:main Running callback portconfigure::add_automatic_compiler_dependencies
292:debug:main Finished running callback portconfigure::add_automatic_compiler_dependencies
293:debug:main Running callback portbuild::add_automatic_buildsystem_dependencies
294:debug:main Finished running callback portbuild::add_automatic_buildsystem_dependencies
295:debug:main No need to upgrade! icu 54.1_0 >= icu 54.1_0
296:debug:main epoch: in tree: 2 installed: 2
297:debug:main python27 2.7.9_0 exists in the ports tree
298:debug:main python27 2.7.9_0  is the latest installed
299:debug:main python27 2.7.9_0  is active
300:debug:main Merging existing variants '' into variants
301:debug:main new fully merged portvariants:
302:debug:main Changing to port directory: /opt/local/var/macports/sources/rsync.macports.org/release/tarballs/ports/lang/python27
303:debug:main OS darwin/14.3.0 (Mac OS X 10.10) arch i386
304:debug:main Sourcing PortGroup select 1.0 from /opt/local/var/macports/sources/rsync.macports.org/release/tarballs/ports/_resources/port1.0/group/select-1.0.tcl
305:debug:main Reading variant descriptions from /opt/local/var/macports/sources/rsync.macports.org/release/tarballs/ports/_resources/port1.0/variant_descriptions.conf
306:debug:main universal variant already exists, so not adding the default one
307:debug:main Running callback portconfigure::add_automatic_compiler_dependencies
308:debug:main Finished running callback portconfigure::add_automatic_compiler_dependencies
309:debug:main Running callback portbuild::add_automatic_buildsystem_dependencies
310:debug:main Finished running callback portbuild::add_automatic_buildsystem_dependencies
311:debug:main No need to upgrade! python27 2.7.9_0 >= python27 2.7.9_0
312:debug:main epoch: in tree: 0 installed: 0
313:debug:main sqlite3 3.8.8.3_0 exists in the ports tree
314:debug:main sqlite3 3.8.8.3_0  is the latest installed
315:debug:main sqlite3 3.8.8.3_0  is active
316:debug:main Merging existing variants '' into variants
317:debug:main new fully merged portvariants:
318:debug:main Changing to port directory: /opt/local/var/macports/sources/rsync.macports.org/release/tarballs/ports/databases/sqlite3
319:debug:main OS darwin/14.3.0 (Mac OS X 10.10) arch i386
320:debug:main adding the default universal variant
321:debug:main Reading variant descriptions from /opt/local/var/macports/sources/rsync.macports.org/release/tarballs/ports/_resources/port1.0/variant_descriptions.conf
322:debug:main Running callback portconfigure::add_automatic_compiler_dependencies
323:debug:main Finished running callback portconfigure::add_automatic_compiler_dependencies
324:debug:main Running callback portbuild::add_automatic_buildsystem_dependencies
325:debug:main Finished running callback portbuild::add_automatic_buildsystem_dependencies
326:debug:main No need to upgrade! sqlite3 3.8.8.3_0 >= sqlite3 3.8.8.3_0
327:debug:main epoch: in tree: 20090923 installed: 20090923
328:debug:main libedit 20140620-3.1_0 exists in the ports tree
329:debug:main libedit 20140620-3.1_0  is the latest installed
330:debug:main libedit 20140620-3.1_0  is active
331:debug:main Merging existing variants '' into variants
332:debug:main new fully merged portvariants:
333:debug:main Changing to port directory: /opt/local/var/macports/sources/rsync.macports.org/release/tarballs/ports/devel/libedit
334:debug:main OS darwin/14.3.0 (Mac OS X 10.10) arch i386
335:debug:main Reading variant descriptions from /opt/local/var/macports/sources/rsync.macports.org/release/tarballs/ports/_resources/port1.0/variant_descriptions.conf
336:debug:main Sourcing PortGroup muniversal 1.0 from /opt/local/var/macports/sources/rsync.macports.org/release/tarballs/ports/_resources/port1.0/group/muniversal-1.0.tcl
337:debug:main universal variant already exists, so not adding the default one
338:debug:main Running callback portconfigure::add_automatic_compiler_dependencies
339:debug:main Finished running callback portconfigure::add_automatic_compiler_dependencies
340:debug:main Running callback portbuild::add_automatic_buildsystem_dependencies
341:debug:main Finished running callback portbuild::add_automatic_buildsystem_dependencies
342:debug:main No need to upgrade! libedit 20140620-3.1_0 >= libedit 20140620-3.1_0
343:debug:main epoch: in tree: 0 installed: 0
344:debug:main db48 4.8.30_4 exists in the ports tree
345:debug:main db48 4.8.30_4  is the latest installed
346:debug:main db48 4.8.30_4  is active
347:debug:main Merging existing variants '' into variants
348:debug:main new fully merged portvariants:
349:debug:main Changing to port directory: /opt/local/var/macports/sources/rsync.macports.org/release/tarballs/ports/databases/db48
350:debug:main OS darwin/14.3.0 (Mac OS X 10.10) arch i386
351:debug:main Reading variant descriptions from /opt/local/var/macports/sources/rsync.macports.org/release/tarballs/ports/_resources/port1.0/variant_descriptions.conf
352:debug:main Sourcing PortGroup muniversal 1.0 from /opt/local/var/macports/sources/rsync.macports.org/release/tarballs/ports/_resources/port1.0/group/muniversal-1.0.tcl
353:debug:main Sourcing PortGroup select 1.0 from /opt/local/var/macports/sources/rsync.macports.org/release/tarballs/ports/_resources/port1.0/group/select-1.0.tcl
354:debug:main universal variant already exists, so not adding the default one
355:debug:main Running callback portconfigure::add_automatic_compiler_dependencies
356:debug:main Finished running callback portconfigure::add_automatic_compiler_dependencies
357:debug:main Running callback portbuild::add_automatic_buildsystem_dependencies
358:debug:main Finished running callback portbuild::add_automatic_buildsystem_dependencies
359:debug:main No need to upgrade! db48 4.8.30_4 >= db48 4.8.30_4
360:debug:main epoch: in tree: 0 installed: 0
361:debug:main db_select 0.1_2 exists in the ports tree
362:debug:main db_select 0.1_2  is the latest installed
363:debug:main db_select 0.1_2  is active
364:debug:main Merging existing variants '' into variants
365:debug:main new fully merged portvariants:
366:debug:main Changing to port directory: /opt/local/var/macports/sources/rsync.macports.org/release/tarballs/ports/sysutils/db_select
367:debug:main OS darwin/14.3.0 (Mac OS X 10.10) arch i386
368:debug:main Sourcing PortGroup select 1.0 from /opt/local/var/macports/sources/rsync.macports.org/release/tarballs/ports/_resources/port1.0/group/select-1.0.tcl
369:debug:main universal_variant is false, so not adding the default universal variant
370:debug:main Running callback portconfigure::add_automatic_compiler_dependencies
371:debug:main Finished running callback portconfigure::add_automatic_compiler_dependencies
372:debug:main Running callback portbuild::add_automatic_buildsystem_dependencies
373:debug:main Finished running callback portbuild::add_automatic_buildsystem_dependencies
374:debug:main No need to upgrade! db_select 0.1_2 >= db_select 0.1_2
375:debug:main epoch: in tree: 0 installed: 0
376:debug:main python_select 0.3_4 exists in the ports tree
377:debug:main python_select 0.3_4  is the latest installed
378:debug:main python_select 0.3_4  is active
379:debug:main Merging existing variants '' into variants
380:debug:main new fully merged portvariants:
381:debug:main Changing to port directory: /opt/local/var/macports/sources/rsync.macports.org/release/tarballs/ports/sysutils/python_select
382:debug:main OS darwin/14.3.0 (Mac OS X 10.10) arch i386
383:debug:main Sourcing PortGroup select 1.0 from /opt/local/var/macports/sources/rsync.macports.org/release/tarballs/ports/_resources/port1.0/group/select-1.0.tcl
384:debug:main universal_variant is false, so not adding the default universal variant
385:debug:main Running callback portconfigure::add_automatic_compiler_dependencies
386:debug:main Finished running callback portconfigure::add_automatic_compiler_dependencies
387:debug:main Running callback portbuild::add_automatic_buildsystem_dependencies
388:debug:main Finished running callback portbuild::add_automatic_buildsystem_dependencies
389:debug:main No need to upgrade! python_select 0.3_4 >= python_select 0.3_4
390:debug:main epoch: in tree: 0 installed: 0
391:debug:main py27-cheetah 2.4.4_1 exists in the ports tree
392:debug:main py27-cheetah 2.4.4_1  is the latest installed
393:debug:main py27-cheetah 2.4.4_1  is active
394:debug:main Merging existing variants '' into variants
395:debug:main new fully merged portvariants:
396:debug:main Changing to port directory: /opt/local/var/macports/sources/rsync.macports.org/release/tarballs/ports/python/py-cheetah
397:debug:main OS darwin/14.3.0 (Mac OS X 10.10) arch i386
398:debug:main Re-registering default for build.cmd
399:debug:main Re-registering default for destroot.cmd
400:debug:main Re-registering default for destroot.destdir
401:debug:main Sourcing PortGroup python 1.0 from /opt/local/var/macports/sources/rsync.macports.org/release/tarballs/ports/_resources/port1.0/group/python-1.0.tcl
402:debug:main adding the default universal variant
403:debug:main Reading variant descriptions from /opt/local/var/macports/sources/rsync.macports.org/release/tarballs/ports/_resources/port1.0/variant_descriptions.conf
404:debug:main Running callback portconfigure::add_automatic_compiler_dependencies
405:debug:main Finished running callback portconfigure::add_automatic_compiler_dependencies
406:debug:main Running callback portbuild::add_automatic_buildsystem_dependencies
407:debug:main Finished running callback portbuild::add_automatic_buildsystem_dependencies
408:debug:main No need to upgrade! py27-cheetah 2.4.4_1 >= py27-cheetah 2.4.4_1
409:debug:main epoch: in tree: 0 installed: 0
410:debug:main libusb 1.0.18_0 exists in the ports tree
411:debug:main libusb 1.0.18_0  is the latest installed
412:debug:main libusb 1.0.18_0  is active
413:debug:main Merging existing variants '' into variants
414:debug:main new fully merged portvariants:
415:debug:main Changing to port directory: /opt/local/var/macports/sources/rsync.macports.org/release/tarballs/ports/devel/libusb
416:debug:main OS darwin/14.3.0 (Mac OS X 10.10) arch i386
417:debug:main adding the default universal variant
418:debug:main Reading variant descriptions from /opt/local/var/macports/sources/rsync.macports.org/release/tarballs/ports/_resources/port1.0/variant_descriptions.conf
419:debug:main Running callback portconfigure::add_automatic_compiler_dependencies
420:debug:main Finished running callback portconfigure::add_automatic_compiler_dependencies
421:debug:main Running callback portbuild::add_automatic_buildsystem_dependencies
422:debug:main Finished running callback portbuild::add_automatic_buildsystem_dependencies
423:debug:main No need to upgrade! libusb 1.0.18_0 >= libusb 1.0.18_0
424:debug:main epoch: in tree: 0 installed: 0
425:debug:main doxygen 1.8.9.1_0 exists in the ports tree
426:debug:main doxygen 1.8.9.1_0  is the latest installed
427:debug:main doxygen 1.8.9.1_0  is active
428:debug:main Merging existing variants '' into variants
429:debug:main new fully merged portvariants:
430:debug:main Changing to port directory: /opt/local/var/macports/sources/rsync.macports.org/release/tarballs/ports/textproc/doxygen
431:debug:main OS darwin/14.3.0 (Mac OS X 10.10) arch i386
432:debug:main adding the default universal variant
433:debug:main Reading variant descriptions from /opt/local/var/macports/sources/rsync.macports.org/release/tarballs/ports/_resources/port1.0/variant_descriptions.conf
434:debug:main Running callback portconfigure::add_automatic_compiler_dependencies
435:debug:main Finished running callback portconfigure::add_automatic_compiler_dependencies
436:debug:main Running callback portbuild::add_automatic_buildsystem_dependencies
437:debug:main Finished running callback portbuild::add_automatic_buildsystem_dependencies
438:debug:main No need to upgrade! doxygen 1.8.9.1_0 >= doxygen 1.8.9.1_0
439:debug:main epoch: in tree: 0 installed: 0
440:debug:main libpng 1.6.17_0 exists in the ports tree
441:debug:main libpng 1.6.17_0  is the latest installed
442:debug:main libpng 1.6.17_0  is active
443:debug:main Merging existing variants '' into variants
444:debug:main new fully merged portvariants:
445:debug:main Changing to port directory: /opt/local/var/macports/sources/rsync.macports.org/release/tarballs/ports/graphics/libpng
446:debug:main OS darwin/14.3.0 (Mac OS X 10.10) arch i386
447:debug:main adding the default universal variant
448:debug:main Reading variant descriptions from /opt/local/var/macports/sources/rsync.macports.org/release/tarballs/ports/_resources/port1.0/variant_descriptions.conf
449:debug:main Running callback portconfigure::add_automatic_compiler_dependencies
450:debug:main Finished running callback portconfigure::add_automatic_compiler_dependencies
451:debug:main Running callback portbuild::add_automatic_buildsystem_dependencies
452:debug:main Finished running callback portbuild::add_automatic_buildsystem_dependencies
453:debug:main No need to upgrade! libpng 1.6.17_0 >= libpng 1.6.17_0
454:debug:main epoch: in tree: 0 installed: 0
455:debug:main py27-docutils 0.12_0 exists in the ports tree
456:debug:main py27-docutils 0.12_0  is the latest installed
457:debug:main py27-docutils 0.12_0  is active
458:debug:main Merging existing variants '' into variants
459:debug:main new fully merged portvariants:
460:debug:main Changing to port directory: /opt/local/var/macports/sources/rsync.macports.org/release/tarballs/ports/python/py-docutils
461:debug:main OS darwin/14.3.0 (Mac OS X 10.10) arch i386
462:debug:main Re-registering default for build.cmd
463:debug:main Re-registering default for destroot.cmd
464:debug:main Re-registering default for destroot.destdir
465:debug:main Sourcing PortGroup python 1.0 from /opt/local/var/macports/sources/rsync.macports.org/release/tarballs/ports/_resources/port1.0/group/python-1.0.tcl
466:debug:main only one arch supported, so not adding the default universal variant
467:debug:main Running callback portconfigure::add_automatic_compiler_dependencies
468:debug:main Finished running callback portconfigure::add_automatic_compiler_dependencies
469:debug:main Running callback portbuild::add_automatic_buildsystem_dependencies
470:debug:main Finished running callback portbuild::add_automatic_buildsystem_dependencies
471:debug:main No need to upgrade! py27-docutils 0.12_0 >= py27-docutils 0.12_0
472:debug:main epoch: in tree: 0 installed: 0
473:debug:main py27-roman 2.0.0_0 exists in the ports tree
474:debug:main py27-roman 2.0.0_0  is the latest installed
475:debug:main py27-roman 2.0.0_0  is active
476:debug:main Merging existing variants '' into variants
477:debug:main new fully merged portvariants:
478:debug:main Changing to port directory: /opt/local/var/macports/sources/rsync.macports.org/release/tarballs/ports/python/py-roman
479:debug:main OS darwin/14.3.0 (Mac OS X 10.10) arch i386
480:debug:main Re-registering default for build.cmd
481:debug:main Re-registering default for destroot.cmd
482:debug:main Re-registering default for destroot.destdir
483:debug:main Sourcing PortGroup python 1.0 from /opt/local/var/macports/sources/rsync.macports.org/release/tarballs/ports/_resources/port1.0/group/python-1.0.tcl
484:debug:main only one arch supported, so not adding the default universal variant
485:debug:main Running callback portconfigure::add_automatic_compiler_dependencies
486:debug:main Finished running callback portconfigure::add_automatic_compiler_dependencies
487:debug:main Running callback portbuild::add_automatic_buildsystem_dependencies
488:debug:main Finished running callback portbuild::add_automatic_buildsystem_dependencies
489:debug:main No need to upgrade! py27-roman 2.0.0_0 >= py27-roman 2.0.0_0
490:debug:main epoch: in tree: 0 installed: 0
491:debug:main orc 0.4.23_0 exists in the ports tree
492:debug:main orc 0.4.23_0  is the latest installed
493:debug:main orc 0.4.23_0  is active
494:debug:main Merging existing variants '' into variants
495:debug:main new fully merged portvariants:
496:debug:main Changing to port directory: /opt/local/var/macports/sources/rsync.macports.org/release/tarballs/ports/devel/orc
497:debug:main OS darwin/14.3.0 (Mac OS X 10.10) arch i386
498:debug:main Reading variant descriptions from /opt/local/var/macports/sources/rsync.macports.org/release/tarballs/ports/_resources/port1.0/variant_descriptions.conf
499:debug:main Sourcing PortGroup muniversal 1.0 from /opt/local/var/macports/sources/rsync.macports.org/release/tarballs/ports/_resources/port1.0/group/muniversal-1.0.tcl
500:debug:main universal variant already exists, so not adding the default one
501:debug:main Running callback portconfigure::add_automatic_compiler_dependencies
502:debug:main Finished running callback portconfigure::add_automatic_compiler_dependencies
503:debug:main Running callback portbuild::add_automatic_buildsystem_dependencies
504:debug:main Finished running callback portbuild::add_automatic_buildsystem_dependencies
505:debug:main No need to upgrade! orc 0.4.23_0 >= orc 0.4.23_0
506:debug:main epoch: in tree: 0 installed: 0
507:debug:main gzip 1.6_0 exists in the ports tree
508:debug:main gzip 1.6_0  is the latest installed
509:debug:main gzip 1.6_0  is active
510:debug:main Merging existing variants '' into variants
511:debug:main new fully merged portvariants:
512:debug:main Changing to port directory: /opt/local/var/macports/sources/rsync.macports.org/release/tarballs/ports/archivers/gzip
513:debug:main OS darwin/14.3.0 (Mac OS X 10.10) arch i386
514:debug:main adding the default universal variant
515:debug:main Reading variant descriptions from /opt/local/var/macports/sources/rsync.macports.org/release/tarballs/ports/_resources/port1.0/variant_descriptions.conf
516:debug:main Running callback portconfigure::add_automatic_compiler_dependencies
517:debug:main Finished running callback portconfigure::add_automatic_compiler_dependencies
518:debug:main Running callback portbuild::add_automatic_buildsystem_dependencies
519:debug:main Finished running callback portbuild::add_automatic_buildsystem_dependencies
520:debug:main No need to upgrade! gzip 1.6_0 >= gzip 1.6_0
521:msg:main --->  Computing dependencies for uhd:info:main .:debug:main Checking for conflicts against uhd
522:debug:main Searching for dependency: uhd-devel
523:debug:main Didn't find receipt, going to depspec regex for: uhd-devel
524:debug:main Searching for dependency: cmake
525:debug:main Found Dependency: receipt exists for cmake
526:debug:main Searching for dependency: pkgconfig
527:debug:main Found Dependency: receipt exists for pkgconfig
528:debug:main Searching for dependency: boost
529:debug:main Found Dependency: receipt exists for boost
530:debug:main Searching for dependency: ncurses
531:debug:main Found Dependency: receipt exists for ncurses
532:debug:main Searching for dependency: python27
533:debug:main Found Dependency: receipt exists for python27
534:debug:main Searching for dependency: py27-cheetah
535:debug:main Found Dependency: receipt exists for py27-cheetah
536:debug:main Searching for dependency: libusb
537:debug:main Found Dependency: receipt exists for libusb
538:debug:main Searching for dependency: doxygen
539:debug:main Found Dependency: receipt exists for doxygen
540:debug:main Searching for dependency: py27-docutils
541:debug:main Found Dependency: receipt exists for py27-docutils
542:debug:main Searching for dependency: orc
543:debug:main Found Dependency: receipt exists for orc
544:debug:main Searching for dependency: gzip
545:debug:main Found Dependency: receipt exists for gzip
546:msg:main
547:debug:main Executing org.macports.main (uhd)
548:debug:main changing euid/egid - current euid: 0 - current egid: 0
549:debug:main egid changed to: 501
550:debug:main euid changed to: 503
551:debug:main Skipping completed org.macports.archivefetch (uhd)
552:debug:main Privilege de-escalation not attempted as not running as root.
553:debug:main Skipping completed org.macports.fetch (uhd)
554:debug:main Privilege de-escalation not attempted as not running as root.
555:debug:main Skipping completed org.macports.checksum (uhd)
556:debug:main Privilege de-escalation not attempted as not running as root.
557:debug:main Skipping completed org.macports.extract (uhd)
558:debug:main Privilege de-escalation not attempted as not running as root.
559:debug:main Skipping completed org.macports.patch (uhd)
560:debug:main Privilege de-escalation not attempted as not running as root.
561:debug:main Skipping completed org.macports.configure (uhd)
562:debug:main Privilege de-escalation not attempted as not running as root.
563:debug:build build phase started at Sat Apr 11 00:16:31 EDT 2015
564:notice:build --->  Building uhd
565:debug:build Executing org.macports.build (uhd)
566:debug:build Environment:
567CC_PRINT_OPTIONS='YES'
568CC_PRINT_OPTIONS_FILE='/opt/local/var/macports/build/_opt_local_var_macports_sources_rsync.macports.org_release_tarballs_ports_science_uhd/uhd/work/.CC_PRINT_OPTIONS'
569CPATH='/opt/local/include'
570LIBRARY_PATH='/opt/local/lib'
571MACOSX_DEPLOYMENT_TARGET='10.10'
572:debug:build Assembled command: 'cd "/opt/local/var/macports/build/_opt_local_var_macports_sources_rsync.macports.org_release_tarballs_ports_science_uhd/uhd/work/build" && /usr/bin/make -j4 -w all VERBOSE=ON'
573:debug:build Executing command line:  cd "/opt/local/var/macports/build/_opt_local_var_macports_sources_rsync.macports.org_release_tarballs_ports_science_uhd/uhd/work/build" && /usr/bin/make -j4 -w all VERBOSE=ON
574:info:build make: Entering directory `/opt/local/var/macports/build/_opt_local_var_macports_sources_rsync.macports.org_release_tarballs_ports_science_uhd/uhd/work/build'
575:info:build /opt/local/bin/cmake -H/opt/local/var/macports/build/_opt_local_var_macports_sources_rsync.macports.org_release_tarballs_ports_science_uhd/uhd/work/uhd-003_008_002/host -B/opt/local/var/macports/build/_opt_local_var_macports_sources_rsync.macports.org_release_tarballs_ports_science_uhd/uhd/work/build --check-build-system CMakeFiles/Makefile.cmake 0
576:info:build /opt/local/bin/cmake -E cmake_progress_start /opt/local/var/macports/build/_opt_local_var_macports_sources_rsync.macports.org_release_tarballs_ports_science_uhd/uhd/work/build/CMakeFiles /opt/local/var/macports/build/_opt_local_var_macports_sources_rsync.macports.org_release_tarballs_ports_science_uhd/uhd/work/build/CMakeFiles/progress.marks
577:info:build /Applications/Xcode.app/Contents/Developer/usr/bin/make -f CMakeFiles/Makefile2 all
578:info:build make[1]: Entering directory `/opt/local/var/macports/build/_opt_local_var_macports_sources_rsync.macports.org_release_tarballs_ports_science_uhd/uhd/work/build'
579:info:build /Applications/Xcode.app/Contents/Developer/usr/bin/make -f docs/CMakeFiles/doxygen_docs.dir/build.make docs/CMakeFiles/doxygen_docs.dir/depend
580:info:build /Applications/Xcode.app/Contents/Developer/usr/bin/make -f docs/CMakeFiles/man_page_gzips.dir/build.make docs/CMakeFiles/man_page_gzips.dir/depend
581:info:build /Applications/Xcode.app/Contents/Developer/usr/bin/make -f lib/CMakeFiles/uhd.dir/build.make lib/CMakeFiles/uhd.dir/depend
582:info:build make[2]: Entering directory `/opt/local/var/macports/build/_opt_local_var_macports_sources_rsync.macports.org_release_tarballs_ports_science_uhd/uhd/work/build'
583:info:build cd /opt/local/var/macports/build/_opt_local_var_macports_sources_rsync.macports.org_release_tarballs_ports_science_uhd/uhd/work/build && /opt/local/bin/cmake -E cmake_depends "Unix Makefiles" /opt/local/var/macports/build/_opt_local_var_macports_sources_rsync.macports.org_release_tarballs_ports_science_uhd/uhd/work/uhd-003_008_002/host /opt/local/var/macports/build/_opt_local_var_macports_sources_rsync.macports.org_release_tarballs_ports_science_uhd/uhd/work/uhd-003_008_002/host/docs /opt/local/var/macports/build/_opt_local_var_macports_sources_rsync.macports.org_release_tarballs_ports_science_uhd/uhd/work/build /opt/local/var/macports/build/_opt_local_var_macports_sources_rsync.macports.org_release_tarballs_ports_science_uhd/uhd/work/build/docs /opt/local/var/macports/build/_opt_local_var_macports_sources_rsync.macports.org_release_tarballs_ports_science_uhd/uhd/work/build/docs/CMakeFiles/man_page_gzips.dir/DependInfo.cmake --color=
584:info:build make[2]: Entering directory `/opt/local/var/macports/build/_opt_local_var_macports_sources_rsync.macports.org_release_tarballs_ports_science_uhd/uhd/work/build'
585:info:build cd /opt/local/var/macports/build/_opt_local_var_macports_sources_rsync.macports.org_release_tarballs_ports_science_uhd/uhd/work/build && /opt/local/bin/cmake -E cmake_depends "Unix Makefiles" /opt/local/var/macports/build/_opt_local_var_macports_sources_rsync.macports.org_release_tarballs_ports_science_uhd/uhd/work/uhd-003_008_002/host /opt/local/var/macports/build/_opt_local_var_macports_sources_rsync.macports.org_release_tarballs_ports_science_uhd/uhd/work/uhd-003_008_002/host/docs /opt/local/var/macports/build/_opt_local_var_macports_sources_rsync.macports.org_release_tarballs_ports_science_uhd/uhd/work/build /opt/local/var/macports/build/_opt_local_var_macports_sources_rsync.macports.org_release_tarballs_ports_science_uhd/uhd/work/build/docs /opt/local/var/macports/build/_opt_local_var_macports_sources_rsync.macports.org_release_tarballs_ports_science_uhd/uhd/work/build/docs/CMakeFiles/doxygen_docs.dir/DependInfo.cmake --color=
586:info:build make[2]: Leaving directory `/opt/local/var/macports/build/_opt_local_var_macports_sources_rsync.macports.org_release_tarballs_ports_science_uhd/uhd/work/build'
587:info:build /Applications/Xcode.app/Contents/Developer/usr/bin/make -f docs/CMakeFiles/man_page_gzips.dir/build.make docs/CMakeFiles/man_page_gzips.dir/build
588:info:build make[2]: Leaving directory `/opt/local/var/macports/build/_opt_local_var_macports_sources_rsync.macports.org_release_tarballs_ports_science_uhd/uhd/work/build'
589:info:build /Applications/Xcode.app/Contents/Developer/usr/bin/make -f docs/CMakeFiles/doxygen_docs.dir/build.make docs/CMakeFiles/doxygen_docs.dir/build
590:info:build make[2]: Entering directory `/opt/local/var/macports/build/_opt_local_var_macports_sources_rsync.macports.org_release_tarballs_ports_science_uhd/uhd/work/build'
591:info:build make[2]: Nothing to be done for `docs/CMakeFiles/man_page_gzips.dir/build'.
592:info:build make[2]: Leaving directory `/opt/local/var/macports/build/_opt_local_var_macports_sources_rsync.macports.org_release_tarballs_ports_science_uhd/uhd/work/build'
593:info:build /opt/local/bin/cmake -E cmake_progress_report /opt/local/var/macports/build/_opt_local_var_macports_sources_rsync.macports.org_release_tarballs_ports_science_uhd/uhd/work/build/CMakeFiles  7 8 9 10
594:info:build make[2]: Entering directory `/opt/local/var/macports/build/_opt_local_var_macports_sources_rsync.macports.org_release_tarballs_ports_science_uhd/uhd/work/build'
595:info:build make[2]: Nothing to be done for `docs/CMakeFiles/doxygen_docs.dir/build'.
596:info:build make[2]: Leaving directory `/opt/local/var/macports/build/_opt_local_var_macports_sources_rsync.macports.org_release_tarballs_ports_science_uhd/uhd/work/build'
597:info:build /opt/local/bin/cmake -E cmake_progress_report /opt/local/var/macports/build/_opt_local_var_macports_sources_rsync.macports.org_release_tarballs_ports_science_uhd/uhd/work/build/CMakeFiles
598:info:build [  4%] Built target man_page_gzips
599:info:build [  4%] Built target doxygen_docs
600:info:build make[2]: Entering directory `/opt/local/var/macports/build/_opt_local_var_macports_sources_rsync.macports.org_release_tarballs_ports_science_uhd/uhd/work/build'
601:info:build cd /opt/local/var/macports/build/_opt_local_var_macports_sources_rsync.macports.org_release_tarballs_ports_science_uhd/uhd/work/build && /opt/local/bin/cmake -E cmake_depends "Unix Makefiles" /opt/local/var/macports/build/_opt_local_var_macports_sources_rsync.macports.org_release_tarballs_ports_science_uhd/uhd/work/uhd-003_008_002/host /opt/local/var/macports/build/_opt_local_var_macports_sources_rsync.macports.org_release_tarballs_ports_science_uhd/uhd/work/uhd-003_008_002/host/lib /opt/local/var/macports/build/_opt_local_var_macports_sources_rsync.macports.org_release_tarballs_ports_science_uhd/uhd/work/build /opt/local/var/macports/build/_opt_local_var_macports_sources_rsync.macports.org_release_tarballs_ports_science_uhd/uhd/work/build/lib /opt/local/var/macports/build/_opt_local_var_macports_sources_rsync.macports.org_release_tarballs_ports_science_uhd/uhd/work/build/lib/CMakeFiles/uhd.dir/DependInfo.cmake --color=
602:info:build make[2]: Leaving directory `/opt/local/var/macports/build/_opt_local_var_macports_sources_rsync.macports.org_release_tarballs_ports_science_uhd/uhd/work/build'
603:info:build /Applications/Xcode.app/Contents/Developer/usr/bin/make -f lib/CMakeFiles/uhd.dir/build.make lib/CMakeFiles/uhd.dir/build
604:info:build make[2]: Entering directory `/opt/local/var/macports/build/_opt_local_var_macports_sources_rsync.macports.org_release_tarballs_ports_science_uhd/uhd/work/build'
605:info:build /opt/local/bin/cmake -E cmake_progress_report /opt/local/var/macports/build/_opt_local_var_macports_sources_rsync.macports.org_release_tarballs_ports_science_uhd/uhd/work/build/CMakeFiles
606:info:build /opt/local/bin/cmake -E cmake_progress_report /opt/local/var/macports/build/_opt_local_var_macports_sources_rsync.macports.org_release_tarballs_ports_science_uhd/uhd/work/build/CMakeFiles
607:info:build /opt/local/bin/cmake -E cmake_progress_report /opt/local/var/macports/build/_opt_local_var_macports_sources_rsync.macports.org_release_tarballs_ports_science_uhd/uhd/work/build/CMakeFiles 33
608:info:build [  4%] /opt/local/bin/cmake -E cmake_progress_report /opt/local/var/macports/build/_opt_local_var_macports_sources_rsync.macports.org_release_tarballs_ports_science_uhd/uhd/work/build/CMakeFiles
609:info:build [  4%] [  5%] [  5%] Building CXX object lib/CMakeFiles/uhd.dir/types/device_addr.cpp.o
610:info:build cd /opt/local/var/macports/build/_opt_local_var_macports_sources_rsync.macports.org_release_tarballs_ports_science_uhd/uhd/work/build/lib && /Applications/Xcode.app/Contents/Developer/Toolchains/XcodeDefault.xctoolchain/usr/bin/clang++   -DHAVE_CONFIG_H -DUHD_DLL_EXPORTS -DUHD_IMAGES_DIR=OFF -DUHD_VERSION=30802 -pipe -Os -arch x86_64 -stdlib=libc++  -DNDEBUG -arch x86_64 -mmacosx-version-min=10.10 -fPIC -I/opt/local/var/macports/build/_opt_local_var_macports_sources_rsync.macports.org_release_tarballs_ports_science_uhd/uhd/work/build/include -I/opt/local/var/macports/build/_opt_local_var_macports_sources_rsync.macports.org_release_tarballs_ports_science_uhd/uhd/work/uhd-003_008_002/host/include -I/opt/local/include -I/opt/local/var/macports/build/_opt_local_var_macports_sources_rsync.macports.org_release_tarballs_ports_science_uhd/uhd/work/build/lib/ic_reg_maps -I/opt/local/include/orc-0.4 -I/opt/local/var/macports/build/_opt_local_var_macports_sources_rsync.macports.org_release_tarballs_ports_science_uhd/uhd/work/uhd-003_008_002/host/lib/convert -I/opt/local/var/macports/build/_opt_local_var_macports_sources_rsync.macports.org_release_tarballs_ports_science_uhd/uhd/work/build/lib/convert -I/opt/local/var/macports/build/_opt_local_var_macports_sources_rsync.macports.org_release_tarballs_ports_science_uhd/uhd/work/build/lib/transport/nirio/lvbitx -I/opt/local/include/libusb-1.0 -I/opt/local/var/macports/build/_opt_local_var_macports_sources_rsync.macports.org_release_tarballs_ports_science_uhd/uhd/work/uhd-003_008_002/host/lib/usrp/cores -I/opt/local/var/macports/build/_opt_local_var_macports_sources_rsync.macports.org_release_tarballs_ports_science_uhd/uhd/work/uhd-003_008_002/host/../firmware/fx2/common -I/opt/local/var/macports/build/_opt_local_var_macports_sources_rsync.macports.org_release_tarballs_ports_science_uhd/uhd/work/uhd-003_008_002/host/lib/usrp/common -I/opt/local/var/macports/build/_opt_local_var_macports_sources_rsync.macports.org_release_tarballs_ports_science_uhd/uhd/work/uhd-003_008_002/host/lib/usrp/common/ad9361_driver    -o CMakeFiles/uhd.dir/types/device_addr.cpp.o -c /opt/local/var/macports/build/_opt_local_var_macports_sources_rsync.macports.org_release_tarballs_ports_science_uhd/uhd/work/uhd-003_008_002/host/lib/types/device_addr.cpp
611:info:build Building CXX object lib/CMakeFiles/uhd.dir/types/mac_addr.cpp.o
612:info:build cd /opt/local/var/macports/build/_opt_local_var_macports_sources_rsync.macports.org_release_tarballs_ports_science_uhd/uhd/work/build/lib && /Applications/Xcode.app/Contents/Developer/Toolchains/XcodeDefault.xctoolchain/usr/bin/clang++   -DHAVE_CONFIG_H -DUHD_DLL_EXPORTS -DUHD_IMAGES_DIR=OFF -DUHD_VERSION=30802 -pipe -Os -arch x86_64 -stdlib=libc++  -DNDEBUG -arch x86_64 -mmacosx-version-min=10.10 -fPIC -I/opt/local/var/macports/build/_opt_local_var_macports_sources_rsync.macports.org_release_tarballs_ports_science_uhd/uhd/work/build/include -I/opt/local/var/macports/build/_opt_local_var_macports_sources_rsync.macports.org_release_tarballs_ports_science_uhd/uhd/work/uhd-003_008_002/host/include -I/opt/local/include -I/opt/local/var/macports/build/_opt_local_var_macports_sources_rsync.macports.org_release_tarballs_ports_science_uhd/uhd/work/build/lib/ic_reg_maps -I/opt/local/include/orc-0.4 -I/opt/local/var/macports/build/_opt_local_var_macports_sources_rsync.macports.org_release_tarballs_ports_science_uhd/uhd/work/uhd-003_008_002/host/lib/convert -I/opt/local/var/macports/build/_opt_local_var_macports_sources_rsync.macports.org_release_tarballs_ports_science_uhd/uhd/work/build/lib/convert -I/opt/local/var/macports/build/_opt_local_var_macports_sources_rsync.macports.org_release_tarballs_ports_science_uhd/uhd/work/build/lib/transport/nirio/lvbitx -I/opt/local/include/libusb-1.0 -I/opt/local/var/macports/build/_opt_local_var_macports_sources_rsync.macports.org_release_tarballs_ports_science_uhd/uhd/work/uhd-003_008_002/host/lib/usrp/cores -I/opt/local/var/macports/build/_opt_local_var_macports_sources_rsync.macports.org_release_tarballs_ports_science_uhd/uhd/work/uhd-003_008_002/host/../firmware/fx2/common -I/opt/local/var/macports/build/_opt_local_var_macports_sources_rsync.macports.org_release_tarballs_ports_science_uhd/uhd/work/uhd-003_008_002/host/lib/usrp/common -I/opt/local/var/macports/build/_opt_local_var_macports_sources_rsync.macports.org_release_tarballs_ports_science_uhd/uhd/work/uhd-003_008_002/host/lib/usrp/common/ad9361_driver    -o CMakeFiles/uhd.dir/types/mac_addr.cpp.o -c /opt/local/var/macports/build/_opt_local_var_macports_sources_rsync.macports.org_release_tarballs_ports_science_uhd/uhd/work/uhd-003_008_002/host/lib/types/mac_addr.cpp
613:info:build Building CXX object lib/CMakeFiles/uhd.dir/types/ranges.cpp.o
614:info:build cd /opt/local/var/macports/build/_opt_local_var_macports_sources_rsync.macports.org_release_tarballs_ports_science_uhd/uhd/work/build/lib && /Applications/Xcode.app/Contents/Developer/Toolchains/XcodeDefault.xctoolchain/usr/bin/clang++   -DHAVE_CONFIG_H -DUHD_DLL_EXPORTS -DUHD_IMAGES_DIR=OFF -DUHD_VERSION=30802 -pipe -Os -arch x86_64 -stdlib=libc++  -DNDEBUG -arch x86_64 -mmacosx-version-min=10.10 -fPIC -I/opt/local/var/macports/build/_opt_local_var_macports_sources_rsync.macports.org_release_tarballs_ports_science_uhd/uhd/work/build/include -I/opt/local/var/macports/build/_opt_local_var_macports_sources_rsync.macports.org_release_tarballs_ports_science_uhd/uhd/work/uhd-003_008_002/host/include -I/opt/local/include -I/opt/local/var/macports/build/_opt_local_var_macports_sources_rsync.macports.org_release_tarballs_ports_science_uhd/uhd/work/build/lib/ic_reg_maps -I/opt/local/include/orc-0.4 -I/opt/local/var/macports/build/_opt_local_var_macports_sources_rsync.macports.org_release_tarballs_ports_science_uhd/uhd/work/uhd-003_008_002/host/lib/convert -I/opt/local/var/macports/build/_opt_local_var_macports_sources_rsync.macports.org_release_tarballs_ports_science_uhd/uhd/work/build/lib/convert -I/opt/local/var/macports/build/_opt_local_var_macports_sources_rsync.macports.org_release_tarballs_ports_science_uhd/uhd/work/build/lib/transport/nirio/lvbitx -I/opt/local/include/libusb-1.0 -I/opt/local/var/macports/build/_opt_local_var_macports_sources_rsync.macports.org_release_tarballs_ports_science_uhd/uhd/work/uhd-003_008_002/host/lib/usrp/cores -I/opt/local/var/macports/build/_opt_local_var_macports_sources_rsync.macports.org_release_tarballs_ports_science_uhd/uhd/work/uhd-003_008_002/host/../firmware/fx2/common -I/opt/local/var/macports/build/_opt_local_var_macports_sources_rsync.macports.org_release_tarballs_ports_science_uhd/uhd/work/uhd-003_008_002/host/lib/usrp/common -I/opt/local/var/macports/build/_opt_local_var_macports_sources_rsync.macports.org_release_tarballs_ports_science_uhd/uhd/work/uhd-003_008_002/host/lib/usrp/common/ad9361_driver    -o CMakeFiles/uhd.dir/types/ranges.cpp.o -c /opt/local/var/macports/build/_opt_local_var_macports_sources_rsync.macports.org_release_tarballs_ports_science_uhd/uhd/work/uhd-003_008_002/host/lib/types/ranges.cpp
615:info:build Building CXX object lib/CMakeFiles/uhd.dir/types/metadata.cpp.o
616:info:build cd /opt/local/var/macports/build/_opt_local_var_macports_sources_rsync.macports.org_release_tarballs_ports_science_uhd/uhd/work/build/lib && /Applications/Xcode.app/Contents/Developer/Toolchains/XcodeDefault.xctoolchain/usr/bin/clang++   -DHAVE_CONFIG_H -DUHD_DLL_EXPORTS -DUHD_IMAGES_DIR=OFF -DUHD_VERSION=30802 -pipe -Os -arch x86_64 -stdlib=libc++  -DNDEBUG -arch x86_64 -mmacosx-version-min=10.10 -fPIC -I/opt/local/var/macports/build/_opt_local_var_macports_sources_rsync.macports.org_release_tarballs_ports_science_uhd/uhd/work/build/include -I/opt/local/var/macports/build/_opt_local_var_macports_sources_rsync.macports.org_release_tarballs_ports_science_uhd/uhd/work/uhd-003_008_002/host/include -I/opt/local/include -I/opt/local/var/macports/build/_opt_local_var_macports_sources_rsync.macports.org_release_tarballs_ports_science_uhd/uhd/work/build/lib/ic_reg_maps -I/opt/local/include/orc-0.4 -I/opt/local/var/macports/build/_opt_local_var_macports_sources_rsync.macports.org_release_tarballs_ports_science_uhd/uhd/work/uhd-003_008_002/host/lib/convert -I/opt/local/var/macports/build/_opt_local_var_macports_sources_rsync.macports.org_release_tarballs_ports_science_uhd/uhd/work/build/lib/convert -I/opt/local/var/macports/build/_opt_local_var_macports_sources_rsync.macports.org_release_tarballs_ports_science_uhd/uhd/work/build/lib/transport/nirio/lvbitx -I/opt/local/include/libusb-1.0 -I/opt/local/var/macports/build/_opt_local_var_macports_sources_rsync.macports.org_release_tarballs_ports_science_uhd/uhd/work/uhd-003_008_002/host/lib/usrp/cores -I/opt/local/var/macports/build/_opt_local_var_macports_sources_rsync.macports.org_release_tarballs_ports_science_uhd/uhd/work/uhd-003_008_002/host/../firmware/fx2/common -I/opt/local/var/macports/build/_opt_local_var_macports_sources_rsync.macports.org_release_tarballs_ports_science_uhd/uhd/work/uhd-003_008_002/host/lib/usrp/common -I/opt/local/var/macports/build/_opt_local_var_macports_sources_rsync.macports.org_release_tarballs_ports_science_uhd/uhd/work/uhd-003_008_002/host/lib/usrp/common/ad9361_driver    -o CMakeFiles/uhd.dir/types/metadata.cpp.o -c /opt/local/var/macports/build/_opt_local_var_macports_sources_rsync.macports.org_release_tarballs_ports_science_uhd/uhd/work/uhd-003_008_002/host/lib/types/metadata.cpp
617:info:build In file included from /opt/local/var/macports/build/_opt_local_var_macports_sources_rsync.macports.org_release_tarballs_ports_science_uhd/uhd/work/uhd-003_008_002/host/lib/types/mac_addr.cpp:18:
618:info:build In file included from /opt/local/var/macports/build/_opt_local_var_macports_sources_rsync.macports.org_release_tarballs_ports_science_uhd/uhd/work/uhd-003_008_002/host/lib/types/device_addr.cpp:18:
619:info:build In file included from /opt/local/var/macports/build/_opt_local_var_macports_sources_rsync.macports.org_release_tarballs_ports_science_uhd/uhd/work/uhd-003_008_002/host/include/uhd/types/device_addr.hpp:21:
620:info:build In file included from /opt/local/var/macports/build/_opt_local_var_macports_sources_rsync.macports.org_release_tarballs_ports_science_uhd/uhd/work/uhd-003_008_002/host/include/uhd/config.hpp:21:
621:info:build In file included from /opt/local/include/boost/config.hpp:57:
622:info:build In file included from /opt/local/include/boost/config/platform/macos.hpp:28:
623:info:build /opt/local/include/boost/config/posix_features.hpp:18:15: fatal error: 'unistd.h' file not found
624:info:build #     include <unistd.h>
625:info:build               ^
626:info:build In file included from /opt/local/var/macports/build/_opt_local_var_macports_sources_rsync.macports.org_release_tarballs_ports_science_uhd/uhd/work/uhd-003_008_002/host/include/uhd/types/mac_addr.hpp:21:
627:info:build In file included from /opt/local/var/macports/build/_opt_local_var_macports_sources_rsync.macports.org_release_tarballs_ports_science_uhd/uhd/work/uhd-003_008_002/host/include/uhd/config.hpp:21:
628:info:build In file included from /opt/local/include/boost/config.hpp:57:
629:info:build In file included from /opt/local/include/boost/config/platform/macos.hpp:28:
630:info:build /opt/local/include/boost/config/posix_features.hpp:18:15: fatal error: 'unistd.h' file not found
631:info:build #     include <unistd.h>
632:info:build               ^
633:info:build In file included from /opt/local/var/macports/build/_opt_local_var_macports_sources_rsync.macports.org_release_tarballs_ports_science_uhd/uhd/work/uhd-003_008_002/host/lib/types/metadata.cpp:18:
634:info:build In file included from /Applications/Xcode.app/Contents/Developer/Toolchains/XcodeDefault.xctoolchain/usr/bin/../include/c++/v1/string:435:
635:info:build /Applications/Xcode.app/Contents/Developer/Toolchains/XcodeDefault.xctoolchain/usr/bin/../include/c++/v1/iosfwd:90:10: fatal error: 'wchar.h' file not found
636:info:build #include <wchar.h>  // for mbstate_t
637:info:build          ^
638:info:build In file included from /opt/local/var/macports/build/_opt_local_var_macports_sources_rsync.macports.org_release_tarballs_ports_science_uhd/uhd/work/uhd-003_008_002/host/lib/types/ranges.cpp:18:
639:info:build In file included from /opt/local/var/macports/build/_opt_local_var_macports_sources_rsync.macports.org_release_tarballs_ports_science_uhd/uhd/work/uhd-003_008_002/host/include/uhd/types/ranges.hpp:21:
640:info:build In file included from /opt/local/var/macports/build/_opt_local_var_macports_sources_rsync.macports.org_release_tarballs_ports_science_uhd/uhd/work/uhd-003_008_002/host/include/uhd/config.hpp:21:
641:info:build In file included from /opt/local/include/boost/config.hpp:57:
642:info:build In file included from /opt/local/include/boost/config/platform/macos.hpp:28:
643:info:build /opt/local/include/boost/config/posix_features.hpp:18:15: fatal error: 'unistd.h' file not found
644:info:build #     include <unistd.h>
645:info:build               ^
646:info:build 1 error generated.
647:info:build make[2]: *** [lib/CMakeFiles/uhd.dir/types/metadata.cpp.o] Error 1
648:info:build make[2]: *** Waiting for unfinished jobs....
649:info:build 1 error generated.
650:info:build make[2]: *** [lib/CMakeFiles/uhd.dir/types/mac_addr.cpp.o] Error 1
651:info:build 1 error generated.
652:info:build make[2]: *** [lib/CMakeFiles/uhd.dir/types/ranges.cpp.o] Error 1
653:info:build 1 error generated.
654:info:build make[2]: *** [lib/CMakeFiles/uhd.dir/types/device_addr.cpp.o] Error 1
655:info:build make[2]: Leaving directory `/opt/local/var/macports/build/_opt_local_var_macports_sources_rsync.macports.org_release_tarballs_ports_science_uhd/uhd/work/build'
656:info:build make[1]: *** [lib/CMakeFiles/uhd.dir/all] Error 2
657:info:build make[1]: Leaving directory `/opt/local/var/macports/build/_opt_local_var_macports_sources_rsync.macports.org_release_tarballs_ports_science_uhd/uhd/work/build'
658:info:build make: *** [all] Error 2
659:info:build make: Leaving directory `/opt/local/var/macports/build/_opt_local_var_macports_sources_rsync.macports.org_release_tarballs_ports_science_uhd/uhd/work/build'
660:info:build Command failed:  cd "/opt/local/var/macports/build/_opt_local_var_macports_sources_rsync.macports.org_release_tarballs_ports_science_uhd/uhd/work/build" && /usr/bin/make -j4 -w all VERBOSE=ON
661:info:build Exit code: 2
662:error:build org.macports.build for port uhd returned: command execution failed
663:debug:build Error code: CHILDSTATUS 92625 2
664:debug:build Backtrace: command execution failed
665    while executing
666"system -nice 0 $fullcmdstring"
667    ("eval" body line 1)
668    invoked from within
669"eval system $notty $nice \$fullcmdstring"
670    invoked from within
671"command_exec build"
672    (procedure "portbuild::build_main" line 8)
673    invoked from within
674"portbuild::build_main org.macports.build"
675    ("eval" body line 1)
676    invoked from within
677"eval $procedure $targetname"
678:info:build Warning: targets not executed for uhd: org.macports.activate org.macports.build org.macports.destroot org.macports.install
679:notice:build Please see the log file for port uhd for details:
680    /opt/local/var/macports/logs/_opt_local_var_macports_sources_rsync.macports.org_release_tarballs_ports_science_uhd/uhd/main.log