Ticket #47583: kerberos5_2015-04-28_main.log

File kerberos5_2015-04-28_main.log, 103.7 KB (added by dan+macports@…, 6 years ago)

kerberos5 install main.log

Line 
1version:1
2:debug:main epoch: in tree: 2 installed: 2
3:debug:main python27 2.7.9_0 exists in the ports tree
4:debug:main python27 2.7.9_0  is the latest installed
5:debug:main python27 2.7.9_0  is active
6:debug:main Merging existing variants '' into variants
7:debug:main new fully merged portvariants:
8:debug:main Changing to port directory: /opt/var/macports/sources/rsync.macports.org/release/tarballs/ports/lang/python27
9:debug:main OS darwin/11.4.0 (Mac OS X 10.7) arch i386
10:debug:main Sourcing PortGroup select 1.0 from /opt/var/macports/sources/rsync.macports.org/release/tarballs/ports/_resources/port1.0/group/select-1.0.tcl
11:debug:main Reading variant descriptions from /opt/var/macports/sources/rsync.macports.org/release/tarballs/ports/_resources/port1.0/variant_descriptions.conf
12:debug:main universal variant already exists, so not adding the default one
13:debug:main Running callback portconfigure::add_automatic_compiler_dependencies
14:debug:main Finished running callback portconfigure::add_automatic_compiler_dependencies
15:debug:main Running callback portbuild::add_automatic_buildsystem_dependencies
16:debug:main Finished running callback portbuild::add_automatic_buildsystem_dependencies
17:debug:main No need to upgrade! python27 2.7.9_0 >= python27 2.7.9_0
18:debug:main epoch: in tree: 2 installed: 2
19:debug:main gettext 0.19.4_0 exists in the ports tree
20:debug:main gettext 0.19.4_0  is the latest installed
21:debug:main gettext 0.19.4_0  is active
22:debug:main Merging existing variants '' into variants
23:debug:main new fully merged portvariants:
24:debug:main Changing to port directory: /opt/var/macports/sources/rsync.macports.org/release/tarballs/ports/devel/gettext
25:debug:main OS darwin/11.4.0 (Mac OS X 10.7) arch i386
26:debug:main Sourcing PortGroup compiler_blacklist_versions 1.0 from /opt/var/macports/sources/rsync.macports.org/release/tarballs/ports/_resources/port1.0/group/compiler_blacklist_versions-1.0.tcl
27:debug:main Reading variant descriptions from /opt/var/macports/sources/rsync.macports.org/release/tarballs/ports/_resources/port1.0/variant_descriptions.conf
28:debug:main Sourcing PortGroup muniversal 1.0 from /opt/var/macports/sources/rsync.macports.org/release/tarballs/ports/_resources/port1.0/group/muniversal-1.0.tcl
29:debug:main compiler clang 318.0.61 not blacklisted because it doesn't match {clang < 211.10.1}
30:debug:main universal variant already exists, so not adding the default one
31:debug:main Running callback portconfigure::add_automatic_compiler_dependencies
32:debug:main Finished running callback portconfigure::add_automatic_compiler_dependencies
33:debug:main Running callback portbuild::add_automatic_buildsystem_dependencies
34:debug:main Finished running callback portbuild::add_automatic_buildsystem_dependencies
35:debug:main No need to upgrade! gettext 0.19.4_0 >= gettext 0.19.4_0
36:debug:main epoch: in tree: 0 installed: 0
37:debug:main expat 2.1.0_0 exists in the ports tree
38:debug:main expat 2.1.0_0  is the latest installed
39:debug:main expat 2.1.0_0  is active
40:debug:main Merging existing variants '' into variants
41:debug:main new fully merged portvariants:
42:debug:main Changing to port directory: /opt/var/macports/sources/rsync.macports.org/release/tarballs/ports/textproc/expat
43:debug:main OS darwin/11.4.0 (Mac OS X 10.7) arch i386
44:debug:main adding the default universal variant
45:debug:main Reading variant descriptions from /opt/var/macports/sources/rsync.macports.org/release/tarballs/ports/_resources/port1.0/variant_descriptions.conf
46:debug:main Running callback portconfigure::add_automatic_compiler_dependencies
47:debug:main Finished running callback portconfigure::add_automatic_compiler_dependencies
48:debug:main Running callback portbuild::add_automatic_buildsystem_dependencies
49:debug:main Finished running callback portbuild::add_automatic_buildsystem_dependencies
50:debug:main No need to upgrade! expat 2.1.0_0 >= expat 2.1.0_0
51:debug:main epoch: in tree: 0 installed: 0
52:debug:main libiconv 1.14_0 exists in the ports tree
53:debug:main libiconv 1.14_0  is the latest installed
54:debug:main libiconv 1.14_0  is active
55:debug:main Merging existing variants '' into variants
56:debug:main new fully merged portvariants:
57:debug:main Changing to port directory: /opt/var/macports/sources/rsync.macports.org/release/tarballs/ports/textproc/libiconv
58:debug:main OS darwin/11.4.0 (Mac OS X 10.7) arch i386
59:debug:main Reading variant descriptions from /opt/var/macports/sources/rsync.macports.org/release/tarballs/ports/_resources/port1.0/variant_descriptions.conf
60:debug:main Sourcing PortGroup muniversal 1.0 from /opt/var/macports/sources/rsync.macports.org/release/tarballs/ports/_resources/port1.0/group/muniversal-1.0.tcl
61:debug:main universal variant already exists, so not adding the default one
62:debug:main Running callback portconfigure::add_automatic_compiler_dependencies
63:debug:main Finished running callback portconfigure::add_automatic_compiler_dependencies
64:debug:main Running callback portbuild::add_automatic_buildsystem_dependencies
65:debug:main Finished running callback portbuild::add_automatic_buildsystem_dependencies
66:debug:main No need to upgrade! libiconv 1.14_0 >= libiconv 1.14_0
67:debug:main epoch: in tree: 0 installed: 0
68:debug:main ncurses 5.9_2 exists in the ports tree
69:debug:main ncurses 5.9_2  is the latest installed
70:debug:main ncurses 5.9_2  is active
71:debug:main Merging existing variants '' into variants
72:debug:main new fully merged portvariants:
73:debug:main Changing to port directory: /opt/var/macports/sources/rsync.macports.org/release/tarballs/ports/devel/ncurses
74:debug:main OS darwin/11.4.0 (Mac OS X 10.7) arch i386
75:debug:main adding the default universal variant
76:debug:main Reading variant descriptions from /opt/var/macports/sources/rsync.macports.org/release/tarballs/ports/_resources/port1.0/variant_descriptions.conf
77:debug:main Running callback portconfigure::add_automatic_compiler_dependencies
78:debug:main Finished running callback portconfigure::add_automatic_compiler_dependencies
79:debug:main Running callback portbuild::add_automatic_buildsystem_dependencies
80:debug:main Finished running callback portbuild::add_automatic_buildsystem_dependencies
81:debug:main No need to upgrade! ncurses 5.9_2 >= ncurses 5.9_2
82:debug:main epoch: in tree: 0 installed: 0
83:debug:main zlib 1.2.8_0 exists in the ports tree
84:debug:main zlib 1.2.8_0  is the latest installed
85:debug:main zlib 1.2.8_0  is active
86:debug:main Merging existing variants '' into variants
87:debug:main new fully merged portvariants:
88:debug:main Changing to port directory: /opt/var/macports/sources/rsync.macports.org/release/tarballs/ports/archivers/zlib
89:debug:main OS darwin/11.4.0 (Mac OS X 10.7) arch i386
90:debug:main Sourcing PortGroup xcodeversion 1.0 from /opt/var/macports/sources/rsync.macports.org/release/tarballs/ports/_resources/port1.0/group/xcodeversion-1.0.tcl
91:debug:main adding the default universal variant
92:debug:main Reading variant descriptions from /opt/var/macports/sources/rsync.macports.org/release/tarballs/ports/_resources/port1.0/variant_descriptions.conf
93:debug:main Running callback portconfigure::add_automatic_compiler_dependencies
94:debug:main Finished running callback portconfigure::add_automatic_compiler_dependencies
95:debug:main Running callback portbuild::add_automatic_buildsystem_dependencies
96:debug:main Finished running callback portbuild::add_automatic_buildsystem_dependencies
97:debug:main No need to upgrade! zlib 1.2.8_0 >= zlib 1.2.8_0
98:debug:main epoch: in tree: 1 installed: 1
99:debug:main openssl 1.0.2a_0 exists in the ports tree
100:debug:main openssl 1.0.2a_0  is the latest installed
101:debug:main openssl 1.0.2a_0  is active
102:debug:main Merging existing variants '' into variants
103:debug:main new fully merged portvariants:
104:debug:main Changing to port directory: /opt/var/macports/sources/rsync.macports.org/release/tarballs/ports/devel/openssl
105:debug:main OS darwin/11.4.0 (Mac OS X 10.7) arch i386
106:debug:main Reading variant descriptions from /opt/var/macports/sources/rsync.macports.org/release/tarballs/ports/_resources/port1.0/variant_descriptions.conf
107:debug:main Sourcing PortGroup muniversal 1.0 from /opt/var/macports/sources/rsync.macports.org/release/tarballs/ports/_resources/port1.0/group/muniversal-1.0.tcl
108:debug:main universal variant already exists, so not adding the default one
109:debug:main Running callback portconfigure::add_automatic_compiler_dependencies
110:debug:main Finished running callback portconfigure::add_automatic_compiler_dependencies
111:debug:main Running callback portbuild::add_automatic_buildsystem_dependencies
112:debug:main Finished running callback portbuild::add_automatic_buildsystem_dependencies
113:debug:main No need to upgrade! openssl 1.0.2a_0 >= openssl 1.0.2a_0
114:debug:main epoch: in tree: 0 installed: 0
115:debug:main sqlite3 3.8.8.3_0 exists in the ports tree
116:debug:main sqlite3 3.8.8.3_0  is the latest installed
117:debug:main sqlite3 3.8.8.3_0  is active
118:debug:main Merging existing variants '' into variants
119:debug:main new fully merged portvariants:
120:debug:main Changing to port directory: /opt/var/macports/sources/rsync.macports.org/release/tarballs/ports/databases/sqlite3
121:debug:main OS darwin/11.4.0 (Mac OS X 10.7) arch i386
122:debug:main adding the default universal variant
123:debug:main Reading variant descriptions from /opt/var/macports/sources/rsync.macports.org/release/tarballs/ports/_resources/port1.0/variant_descriptions.conf
124:debug:main Running callback portconfigure::add_automatic_compiler_dependencies
125:debug:main Finished running callback portconfigure::add_automatic_compiler_dependencies
126:debug:main Running callback portbuild::add_automatic_buildsystem_dependencies
127:debug:main Finished running callback portbuild::add_automatic_buildsystem_dependencies
128:debug:main No need to upgrade! sqlite3 3.8.8.3_0 >= sqlite3 3.8.8.3_0
129:debug:main epoch: in tree: 20090923 installed: 20090923
130:debug:main libedit 20140620-3.1_0 exists in the ports tree
131:debug:main libedit 20140620-3.1_0  is the latest installed
132:debug:main libedit 20140620-3.1_0  is active
133:debug:main Merging existing variants '' into variants
134:debug:main new fully merged portvariants:
135:debug:main Changing to port directory: /opt/var/macports/sources/rsync.macports.org/release/tarballs/ports/devel/libedit
136:debug:main OS darwin/11.4.0 (Mac OS X 10.7) arch i386
137:debug:main Reading variant descriptions from /opt/var/macports/sources/rsync.macports.org/release/tarballs/ports/_resources/port1.0/variant_descriptions.conf
138:debug:main Sourcing PortGroup muniversal 1.0 from /opt/var/macports/sources/rsync.macports.org/release/tarballs/ports/_resources/port1.0/group/muniversal-1.0.tcl
139:debug:main universal variant already exists, so not adding the default one
140:debug:main Running callback portconfigure::add_automatic_compiler_dependencies
141:debug:main Finished running callback portconfigure::add_automatic_compiler_dependencies
142:debug:main Running callback portbuild::add_automatic_buildsystem_dependencies
143:debug:main Finished running callback portbuild::add_automatic_buildsystem_dependencies
144:debug:main No need to upgrade! libedit 20140620-3.1_0 >= libedit 20140620-3.1_0
145:debug:main epoch: in tree: 0 installed: 0
146:debug:main db48 4.8.30_4 exists in the ports tree
147:debug:main db48 4.8.30_4  is the latest installed
148:debug:main db48 4.8.30_4  is active
149:debug:main Merging existing variants '' into variants
150:debug:main new fully merged portvariants:
151:debug:main Changing to port directory: /opt/var/macports/sources/rsync.macports.org/release/tarballs/ports/databases/db48
152:debug:main OS darwin/11.4.0 (Mac OS X 10.7) arch i386
153:debug:main Reading variant descriptions from /opt/var/macports/sources/rsync.macports.org/release/tarballs/ports/_resources/port1.0/variant_descriptions.conf
154:debug:main Sourcing PortGroup muniversal 1.0 from /opt/var/macports/sources/rsync.macports.org/release/tarballs/ports/_resources/port1.0/group/muniversal-1.0.tcl
155:debug:main Sourcing PortGroup select 1.0 from /opt/var/macports/sources/rsync.macports.org/release/tarballs/ports/_resources/port1.0/group/select-1.0.tcl
156:debug:main universal variant already exists, so not adding the default one
157:debug:main Running callback portconfigure::add_automatic_compiler_dependencies
158:debug:main Finished running callback portconfigure::add_automatic_compiler_dependencies
159:debug:main Running callback portbuild::add_automatic_buildsystem_dependencies
160:debug:main Finished running callback portbuild::add_automatic_buildsystem_dependencies
161:debug:main No need to upgrade! db48 4.8.30_4 >= db48 4.8.30_4
162:debug:main epoch: in tree: 0 installed: 0
163:debug:main db_select 0.1_2 exists in the ports tree
164:debug:main db_select 0.1_2  is the latest installed
165:debug:main db_select 0.1_2  is active
166:debug:main Merging existing variants '' into variants
167:debug:main new fully merged portvariants:
168:debug:main Changing to port directory: /opt/var/macports/sources/rsync.macports.org/release/tarballs/ports/sysutils/db_select
169:debug:main OS darwin/11.4.0 (Mac OS X 10.7) arch i386
170:debug:main Sourcing PortGroup select 1.0 from /opt/var/macports/sources/rsync.macports.org/release/tarballs/ports/_resources/port1.0/group/select-1.0.tcl
171:debug:main universal_variant is false, so not adding the default universal variant
172:debug:main Running callback portconfigure::add_automatic_compiler_dependencies
173:debug:main Finished running callback portconfigure::add_automatic_compiler_dependencies
174:debug:main Running callback portbuild::add_automatic_buildsystem_dependencies
175:debug:main Finished running callback portbuild::add_automatic_buildsystem_dependencies
176:debug:main No need to upgrade! db_select 0.1_2 >= db_select 0.1_2
177:debug:main epoch: in tree: 0 installed: 0
178:debug:main bzip2 1.0.6_0 exists in the ports tree
179:debug:main bzip2 1.0.6_0  is the latest installed
180:debug:main bzip2 1.0.6_0  is active
181:debug:main Merging existing variants '' into variants
182:debug:main new fully merged portvariants:
183:debug:main Changing to port directory: /opt/var/macports/sources/rsync.macports.org/release/tarballs/ports/archivers/bzip2
184:debug:main OS darwin/11.4.0 (Mac OS X 10.7) arch i386
185:debug:main Reading variant descriptions from /opt/var/macports/sources/rsync.macports.org/release/tarballs/ports/_resources/port1.0/variant_descriptions.conf
186:debug:main universal variant already exists, so not adding the default one
187:debug:main Running callback portconfigure::add_automatic_compiler_dependencies
188:debug:main Finished running callback portconfigure::add_automatic_compiler_dependencies
189:debug:main Running callback portbuild::add_automatic_buildsystem_dependencies
190:debug:main Finished running callback portbuild::add_automatic_buildsystem_dependencies
191:debug:main No need to upgrade! bzip2 1.0.6_0 >= bzip2 1.0.6_0
192:debug:main epoch: in tree: 0 installed: 0
193:debug:main python_select 0.3_4 exists in the ports tree
194:debug:main python_select 0.3_4  is the latest installed
195:debug:main python_select 0.3_4  is active
196:debug:main Merging existing variants '' into variants
197:debug:main new fully merged portvariants:
198:debug:main Changing to port directory: /opt/var/macports/sources/rsync.macports.org/release/tarballs/ports/sysutils/python_select
199:debug:main OS darwin/11.4.0 (Mac OS X 10.7) arch i386
200:debug:main Sourcing PortGroup select 1.0 from /opt/var/macports/sources/rsync.macports.org/release/tarballs/ports/_resources/port1.0/group/select-1.0.tcl
201:debug:main universal_variant is false, so not adding the default universal variant
202:debug:main Running callback portconfigure::add_automatic_compiler_dependencies
203:debug:main Finished running callback portconfigure::add_automatic_compiler_dependencies
204:debug:main Running callback portbuild::add_automatic_buildsystem_dependencies
205:debug:main Finished running callback portbuild::add_automatic_buildsystem_dependencies
206:debug:main No need to upgrade! python_select 0.3_4 >= python_select 0.3_4
207:debug:main epoch: in tree: 1 installed: 1
208:debug:main autoconf 2.69_3 exists in the ports tree
209:debug:main autoconf 2.69_3  is the latest installed
210:debug:main autoconf 2.69_3  is active
211:debug:main Merging existing variants '' into variants
212:debug:main new fully merged portvariants:
213:debug:main Changing to port directory: /opt/var/macports/sources/rsync.macports.org/release/tarballs/ports/devel/autoconf
214:debug:main OS darwin/11.4.0 (Mac OS X 10.7) arch i386
215:debug:main only one arch supported, so not adding the default universal variant
216:debug:main Running callback portconfigure::add_automatic_compiler_dependencies
217:debug:main Finished running callback portconfigure::add_automatic_compiler_dependencies
218:debug:main Running callback portbuild::add_automatic_buildsystem_dependencies
219:debug:main Finished running callback portbuild::add_automatic_buildsystem_dependencies
220:debug:main No need to upgrade! autoconf 2.69_3 >= autoconf 2.69_3
221:debug:main epoch: in tree: 0 installed: 0
222:debug:main m4 1.4.17_0 exists in the ports tree
223:debug:main m4 1.4.17_0  is the latest installed
224:debug:main m4 1.4.17_0  is active
225:debug:main Merging existing variants '' into variants
226:debug:main new fully merged portvariants:
227:debug:main Changing to port directory: /opt/var/macports/sources/rsync.macports.org/release/tarballs/ports/devel/m4
228:debug:main OS darwin/11.4.0 (Mac OS X 10.7) arch i386
229:debug:main adding the default universal variant
230:debug:main Reading variant descriptions from /opt/var/macports/sources/rsync.macports.org/release/tarballs/ports/_resources/port1.0/variant_descriptions.conf
231:debug:main Running callback portconfigure::add_automatic_compiler_dependencies
232:debug:main Finished running callback portconfigure::add_automatic_compiler_dependencies
233:debug:main Running callback portbuild::add_automatic_buildsystem_dependencies
234:debug:main Finished running callback portbuild::add_automatic_buildsystem_dependencies
235:debug:main No need to upgrade! m4 1.4.17_0 >= m4 1.4.17_0
236:debug:main epoch: in tree: 0 installed: 0
237:debug:main perl5 5.16.3_0 exists in the ports tree
238:debug:main perl5 5.16.3_0 +perl5_16 is the latest installed
239:debug:main perl5 5.16.3_0 +perl5_16 is active
240:debug:main Merging existing variants '+perl5_16' into variants
241:debug:main new fully merged portvariants: perl5_16 +
242:debug:main Changing to port directory: /opt/var/macports/sources/rsync.macports.org/release/tarballs/ports/lang/perl5
243:debug:main OS darwin/11.4.0 (Mac OS X 10.7) arch i386
244:debug:main universal_variant is false, so not adding the default universal variant
245:debug:main Executing variant perl5_16 provides perl5_16
246:debug:main Running callback portconfigure::add_automatic_compiler_dependencies
247:debug:main Finished running callback portconfigure::add_automatic_compiler_dependencies
248:debug:main Running callback portbuild::add_automatic_buildsystem_dependencies
249:debug:main Finished running callback portbuild::add_automatic_buildsystem_dependencies
250:debug:main No need to upgrade! perl5 5.16.3_0 >= perl5 5.16.3_0
251:debug:main epoch: in tree: 0 installed: 0
252:debug:main perl5.16 5.16.3_1 exists in the ports tree
253:debug:main perl5.16 5.16.3_1  is the latest installed
254:debug:main perl5.16 5.16.3_1  is active
255:debug:main Merging existing variants '' into variants
256:debug:main new fully merged portvariants:
257:debug:main Changing to port directory: /opt/var/macports/sources/rsync.macports.org/release/tarballs/ports/lang/perl5.16
258:debug:main OS darwin/11.4.0 (Mac OS X 10.7) arch i386
259:debug:main adding the default universal variant
260:debug:main Reading variant descriptions from /opt/var/macports/sources/rsync.macports.org/release/tarballs/ports/_resources/port1.0/variant_descriptions.conf
261:debug:main Running callback portconfigure::add_automatic_compiler_dependencies
262:debug:main Finished running callback portconfigure::add_automatic_compiler_dependencies
263:debug:main Running callback portbuild::add_automatic_buildsystem_dependencies
264:debug:main Finished running callback portbuild::add_automatic_buildsystem_dependencies
265:debug:main No need to upgrade! perl5.16 5.16.3_1 >= perl5.16 5.16.3_1
266:debug:main epoch: in tree: 0 installed: 0
267:debug:main gdbm 1.11_1 exists in the ports tree
268:debug:main gdbm 1.11_1  is the latest installed
269:debug:main gdbm 1.11_1  is active
270:debug:main Merging existing variants '' into variants
271:debug:main new fully merged portvariants:
272:debug:main Changing to port directory: /opt/var/macports/sources/rsync.macports.org/release/tarballs/ports/databases/gdbm
273:debug:main OS darwin/11.4.0 (Mac OS X 10.7) arch i386
274:debug:main adding the default universal variant
275:debug:main Reading variant descriptions from /opt/var/macports/sources/rsync.macports.org/release/tarballs/ports/_resources/port1.0/variant_descriptions.conf
276:debug:main Running callback portconfigure::add_automatic_compiler_dependencies
277:debug:main Finished running callback portconfigure::add_automatic_compiler_dependencies
278:debug:main Running callback portbuild::add_automatic_buildsystem_dependencies
279:debug:main Finished running callback portbuild::add_automatic_buildsystem_dependencies
280:debug:main No need to upgrade! gdbm 1.11_1 >= gdbm 1.11_1
281:debug:main epoch: in tree: 0 installed: 0
282:debug:main automake 1.15_0 exists in the ports tree
283:debug:main automake 1.15_0  is the latest installed
284:debug:main automake 1.15_0  is active
285:debug:main Merging existing variants '' into variants
286:debug:main new fully merged portvariants:
287:debug:main Changing to port directory: /opt/var/macports/sources/rsync.macports.org/release/tarballs/ports/devel/automake
288:debug:main OS darwin/11.4.0 (Mac OS X 10.7) arch i386
289:debug:main only one arch supported, so not adding the default universal variant
290:debug:main Running callback portconfigure::add_automatic_compiler_dependencies
291:debug:main Finished running callback portconfigure::add_automatic_compiler_dependencies
292:debug:main Running callback portbuild::add_automatic_buildsystem_dependencies
293:debug:main Finished running callback portbuild::add_automatic_buildsystem_dependencies
294:debug:main No need to upgrade! automake 1.15_0 >= automake 1.15_0
295:debug:main epoch: in tree: 0 installed: 0
296:debug:main libtool 2.4.6_0 exists in the ports tree
297:debug:main libtool 2.4.6_0  is the latest installed
298:debug:main libtool 2.4.6_0  is active
299:debug:main Merging existing variants '' into variants
300:debug:main new fully merged portvariants:
301:debug:main Changing to port directory: /opt/var/macports/sources/rsync.macports.org/release/tarballs/ports/devel/libtool
302:debug:main OS darwin/11.4.0 (Mac OS X 10.7) arch i386
303:debug:main adding the default universal variant
304:debug:main Reading variant descriptions from /opt/var/macports/sources/rsync.macports.org/release/tarballs/ports/_resources/port1.0/variant_descriptions.conf
305:debug:main Running callback portconfigure::add_automatic_compiler_dependencies
306:debug:main Finished running callback portconfigure::add_automatic_compiler_dependencies
307:debug:main Running callback portbuild::add_automatic_buildsystem_dependencies
308:debug:main Finished running callback portbuild::add_automatic_buildsystem_dependencies
309:debug:main No need to upgrade! libtool 2.4.6_0 >= libtool 2.4.6_0
310:debug:main epoch: in tree: 0 installed: 0
311:debug:main libcomerr 1.42.9_0 exists in the ports tree
312:debug:main libcomerr 1.42.9_0  is the latest installed
313:debug:main libcomerr 1.42.9_0  is active
314:debug:main Merging existing variants '' into variants
315:debug:main new fully merged portvariants:
316:debug:main Changing to port directory: /opt/var/macports/sources/rsync.macports.org/release/tarballs/ports/sysutils/e2fsprogs
317:debug:main OS darwin/11.4.0 (Mac OS X 10.7) arch i386
318:debug:main adding the default universal variant
319:debug:main Reading variant descriptions from /opt/var/macports/sources/rsync.macports.org/release/tarballs/ports/_resources/port1.0/variant_descriptions.conf
320:debug:main Running callback portconfigure::add_automatic_compiler_dependencies
321:debug:main Finished running callback portconfigure::add_automatic_compiler_dependencies
322:debug:main Running callback portbuild::add_automatic_buildsystem_dependencies
323:debug:main Finished running callback portbuild::add_automatic_buildsystem_dependencies
324:debug:main No need to upgrade! libcomerr 1.42.9_0 >= libcomerr 1.42.9_0
325:msg:main --->  Computing dependencies for kerberos5:info:main .:debug:main Checking for conflicts against kerberos5
326:debug:main Searching for dependency: fbopenssl
327:debug:main Didn't find receipt, going to depspec regex for: fbopenssl
328:debug:main Searching for dependency: python27
329:debug:main Found Dependency: receipt exists for python27
330:debug:main Searching for dependency: autoconf
331:debug:main Found Dependency: receipt exists for autoconf
332:debug:main Searching for dependency: automake
333:debug:main Found Dependency: receipt exists for automake
334:debug:main Searching for dependency: libtool
335:debug:main Found Dependency: receipt exists for libtool
336:debug:main Searching for dependency: openssl
337:debug:main Found Dependency: receipt exists for openssl
338:debug:main Searching for dependency: libcomerr
339:debug:main Found Dependency: receipt exists for libcomerr
340:debug:main Searching for dependency: libedit
341:debug:main Found Dependency: receipt exists for libedit
342:msg:main
343:debug:main Executing org.macports.main (kerberos5)
344:debug:main changing euid/egid - current euid: 0 - current egid: 0
345:debug:main egid changed to: 501
346:debug:main euid changed to: 502
347:debug:archivefetch archivefetch phase started at Tue Apr 28 08:32:14 CEST 2015
348:debug:archivefetch Executing org.macports.archivefetch (kerberos5)
349:debug:archivefetch Privilege de-escalation not attempted as not running as root.
350:debug:fetch fetch phase started at Tue Apr 28 08:32:14 CEST 2015
351:notice:fetch --->  Fetching distfiles for kerberos5
352:debug:fetch Can't run fetch on this port without elevated privileges. Escalating privileges back to root.
353:debug:fetch euid changed to: 0. egid changed to: 0.
354:debug:fetch changing euid/egid - current euid: 0 - current egid: 0
355:debug:fetch egid changed to: 501
356:debug:fetch euid changed to: 502
357:debug:fetch Executing org.macports.fetch (kerberos5)
358:info:fetch --->  krb5-1.13.1-final.tar.gz doesn't seem to exist in /opt/var/macports/distfiles/kerberos5
359:notice:fetch --->  Attempting to fetch krb5-1.13.1-final.tar.gz from http://lil.fr.distfiles.macports.org/kerberos5
360:debug:fetch Privilege de-escalation not attempted as not running as root.
361:debug:checksum checksum phase started at Tue Apr 28 08:32:18 CEST 2015
362:notice:checksum --->  Verifying checksums for kerberos5
363:debug:checksum Executing org.macports.checksum (kerberos5)
364:info:checksum --->  Checksumming krb5-1.13.1-final.tar.gz
365:debug:checksum Calculated (rmd160) is c4b66e66490bb05e418acbef3f7b35af229155f5
366:debug:checksum Correct (rmd160) checksum for krb5-1.13.1-final.tar.gz
367:debug:checksum Calculated (sha256) is b5c9885b48cbe0ac1ec9cacc9be01f07f76297d47bc6ee6ecd85a57afd3be9c8
368:debug:checksum Correct (sha256) checksum for krb5-1.13.1-final.tar.gz
369:debug:checksum Privilege de-escalation not attempted as not running as root.
370:debug:extract extract phase started at Tue Apr 28 08:32:18 CEST 2015
371:notice:extract --->  Extracting kerberos5
372:debug:extract Executing org.macports.extract (kerberos5)
373:info:extract --->  Extracting krb5-1.13.1-final.tar.gz
374:debug:extract setting option extract.args to '/opt/var/macports/distfiles/kerberos5/krb5-1.13.1-final.tar.gz'
375:debug:extract Environment:
376CC_PRINT_OPTIONS='YES'
377CC_PRINT_OPTIONS_FILE='/opt/var/macports/build/_opt_var_macports_sources_rsync.macports.org_release_tarballs_ports_net_kerberos5/kerberos5/work/.CC_PRINT_OPTIONS'
378CPATH='/opt/include'
379LIBRARY_PATH='/opt/lib'
380MACOSX_DEPLOYMENT_TARGET='10.7'
381:debug:extract Assembled command: 'cd "/opt/var/macports/build/_opt_var_macports_sources_rsync.macports.org_release_tarballs_ports_net_kerberos5/kerberos5/work" && /usr/bin/gzip -dc '/opt/var/macports/distfiles/kerberos5/krb5-1.13.1-final.tar.gz' | /usr/bin/gnutar --no-same-owner -xf -'
382:debug:extract Executing command line:  cd "/opt/var/macports/build/_opt_var_macports_sources_rsync.macports.org_release_tarballs_ports_net_kerberos5/kerberos5/work" && /usr/bin/gzip -dc '/opt/var/macports/distfiles/kerberos5/krb5-1.13.1-final.tar.gz' | /usr/bin/gnutar --no-same-owner -xf -
383:debug:extract euid/egid changed to: 0/0
384:debug:extract chowned /opt/var/macports/build/_opt_var_macports_sources_rsync.macports.org_release_tarballs_ports_net_kerberos5/kerberos5/work to macports
385:debug:extract euid/egid changed to: 502/501
386:debug:extract Executing proc-post-org.macports.extract-extract-0
387:debug:extract Privilege de-escalation not attempted as not running as root.
388:debug:patch patch phase started at Tue Apr 28 08:32:21 CEST 2015
389:debug:patch Executing org.macports.patch (kerberos5)
390:notice:patch --->  Applying patches to kerberos5
391:info:patch --->  Applying patch-util__verto__Makefile.in-use-nonzero-compat-version.diff
392:debug:patch Environment:
393CC_PRINT_OPTIONS='YES'
394CC_PRINT_OPTIONS_FILE='/opt/var/macports/build/_opt_var_macports_sources_rsync.macports.org_release_tarballs_ports_net_kerberos5/kerberos5/work/.CC_PRINT_OPTIONS'
395CPATH='/opt/include'
396LIBRARY_PATH='/opt/lib'
397MACOSX_DEPLOYMENT_TARGET='10.7'
398:debug:patch Assembled command: 'cd "/opt/var/macports/build/_opt_var_macports_sources_rsync.macports.org_release_tarballs_ports_net_kerberos5/kerberos5/work/krb5-1.13.1-final/src" && /usr/bin/patch -p0'
399:debug:patch Executing command line:  cd "/opt/var/macports/build/_opt_var_macports_sources_rsync.macports.org_release_tarballs_ports_net_kerberos5/kerberos5/work/krb5-1.13.1-final/src" && /usr/bin/patch -p0 < '/opt/var/macports/sources/rsync.macports.org/release/tarballs/ports/net/kerberos5/files/patch-util__verto__Makefile.in-use-nonzero-compat-version.diff'
400:info:patch patching file util/verto/Makefile.in
401:info:patch --->  Applying patch-config__shlib.conf-do-not-pass-dylib-file-ldflags.diff
402:debug:patch Environment:
403CC_PRINT_OPTIONS='YES'
404CC_PRINT_OPTIONS_FILE='/opt/var/macports/build/_opt_var_macports_sources_rsync.macports.org_release_tarballs_ports_net_kerberos5/kerberos5/work/.CC_PRINT_OPTIONS'
405CPATH='/opt/include'
406LIBRARY_PATH='/opt/lib'
407MACOSX_DEPLOYMENT_TARGET='10.7'
408:debug:patch Assembled command: 'cd "/opt/var/macports/build/_opt_var_macports_sources_rsync.macports.org_release_tarballs_ports_net_kerberos5/kerberos5/work/krb5-1.13.1-final/src" && /usr/bin/patch -p0'
409:debug:patch Executing command line:  cd "/opt/var/macports/build/_opt_var_macports_sources_rsync.macports.org_release_tarballs_ports_net_kerberos5/kerberos5/work/krb5-1.13.1-final/src" && /usr/bin/patch -p0 < '/opt/var/macports/sources/rsync.macports.org/release/tarballs/ports/net/kerberos5/files/patch-config__shlib.conf-do-not-pass-dylib-file-ldflags.diff'
410:info:patch patching file config/shlib.conf
411:info:patch --->  Applying patch-lib_rpc_Makefile.in-explicitly-link-krb5support.diff
412:debug:patch Environment:
413CC_PRINT_OPTIONS='YES'
414CC_PRINT_OPTIONS_FILE='/opt/var/macports/build/_opt_var_macports_sources_rsync.macports.org_release_tarballs_ports_net_kerberos5/kerberos5/work/.CC_PRINT_OPTIONS'
415CPATH='/opt/include'
416LIBRARY_PATH='/opt/lib'
417MACOSX_DEPLOYMENT_TARGET='10.7'
418:debug:patch Assembled command: 'cd "/opt/var/macports/build/_opt_var_macports_sources_rsync.macports.org_release_tarballs_ports_net_kerberos5/kerberos5/work/krb5-1.13.1-final/src" && /usr/bin/patch -p0'
419:debug:patch Executing command line:  cd "/opt/var/macports/build/_opt_var_macports_sources_rsync.macports.org_release_tarballs_ports_net_kerberos5/kerberos5/work/krb5-1.13.1-final/src" && /usr/bin/patch -p0 < '/opt/var/macports/sources/rsync.macports.org/release/tarballs/ports/net/kerberos5/files/patch-lib_rpc_Makefile.in-explicitly-link-krb5support.diff'
420:info:patch patching file lib/rpc/Makefile.in
421:debug:patch Privilege de-escalation not attempted as not running as root.
422:debug:configure configure phase started at Tue Apr 28 08:32:21 CEST 2015
423:notice:configure --->  Configuring kerberos5
424:debug:configure Using compiler 'Xcode Clang'
425:debug:configure Executing org.macports.configure (kerberos5)
426:debug:configure Environment:
427CC_PRINT_OPTIONS='YES'
428CC_PRINT_OPTIONS_FILE='/opt/var/macports/build/_opt_var_macports_sources_rsync.macports.org_release_tarballs_ports_net_kerberos5/kerberos5/work/.CC_PRINT_OPTIONS'
429CPATH='/opt/include'
430LIBRARY_PATH='/opt/lib'
431MACOSX_DEPLOYMENT_TARGET='10.7'
432:debug:configure Assembled command: 'cd "/opt/var/macports/build/_opt_var_macports_sources_rsync.macports.org_release_tarballs_ports_net_kerberos5/kerberos5/work/krb5-1.13.1-final/src" && autoreconf --install --verbose'
433:debug:configure Executing command line:  cd "/opt/var/macports/build/_opt_var_macports_sources_rsync.macports.org_release_tarballs_ports_net_kerberos5/kerberos5/work/krb5-1.13.1-final/src" && autoreconf --install --verbose
434:info:configure autoreconf: Entering directory `.'
435:info:configure autoreconf: configure.in: not using Gettext
436:info:configure autoreconf: configure.in: not using aclocal
437:info:configure autoreconf: configure.in: tracing
438:info:configure autoreconf: configure.in: not using Libtool
439:info:configure autoreconf: running: /opt/bin/autoconf
440:info:configure autoreconf: running: /opt/bin/autoheader
441:info:configure autoreconf: configure.in: not using Automake
442:info:configure autoreconf: Leaving directory `.'
443:debug:configure Environment:
444CC='/usr/bin/clang'
445CC_PRINT_OPTIONS='YES'
446CC_PRINT_OPTIONS_FILE='/opt/var/macports/build/_opt_var_macports_sources_rsync.macports.org_release_tarballs_ports_net_kerberos5/kerberos5/work/.CC_PRINT_OPTIONS'
447CFLAGS='-pipe -Os -arch x86_64'
448CPATH='/opt/include'
449CPPFLAGS='-I/opt/include'
450CXX='/usr/bin/clang++'
451CXXFLAGS='-pipe -Os -arch x86_64 -stdlib=libstdc++'
452F77FLAGS='-m64'
453F90FLAGS='-pipe -Os -m64'
454FCFLAGS='-pipe -Os -m64'
455FFLAGS='-pipe -Os'
456INSTALL='/usr/bin/install -c'
457LDFLAGS='-Wl,-headerpad_max_install_names -arch x86_64'
458LIBRARY_PATH='/opt/lib'
459MACOSX_DEPLOYMENT_TARGET='10.7'
460OBJC='/usr/bin/clang'
461OBJCFLAGS='-pipe -Os -arch x86_64'
462OBJCXX='/usr/bin/clang++'
463OBJCXXFLAGS='-pipe -Os -arch x86_64 -stdlib=libstdc++'
464PYTHON='/opt/bin/python2.7'
465:debug:configure Assembled command: 'cd "/opt/var/macports/build/_opt_var_macports_sources_rsync.macports.org_release_tarballs_ports_net_kerberos5/kerberos5/work/krb5-1.13.1-final/src" && ./configure --prefix=/opt --mandir=/opt/share/man --with-system-et --without-system-db --without-hesiod --without-ldap --without-tcl --with-crypto-impl=openssl --with-pkinit-crypto-impl=openssl --with-libedit --without-readline --without-system-verto --without-system-ss'
466:debug:configure Executing command line:  cd "/opt/var/macports/build/_opt_var_macports_sources_rsync.macports.org_release_tarballs_ports_net_kerberos5/kerberos5/work/krb5-1.13.1-final/src" && ./configure --prefix=/opt --mandir=/opt/share/man --with-system-et --without-system-db --without-hesiod --without-ldap --without-tcl --with-crypto-impl=openssl --with-pkinit-crypto-impl=openssl --with-libedit --without-readline --without-system-verto --without-system-ss
467:info:configure checking for gcc... /usr/bin/clang
468:info:configure checking whether the C compiler works... yes
469:info:configure checking for C compiler default output file name... a.out
470:info:configure checking for suffix of executables...
471:info:configure checking whether we are cross compiling... no
472:info:configure checking for suffix of object files... o
473:info:configure checking whether we are using the GNU C compiler... yes
474:info:configure checking whether /usr/bin/clang accepts -g... yes
475:info:configure checking for /usr/bin/clang option to accept ISO C89... none needed
476:info:configure checking whether we are using the GNU C++ compiler... yes
477:info:configure checking whether /usr/bin/clang++ accepts -g... yes
478:info:configure checking how to run the C preprocessor... /usr/bin/clang -E
479:info:configure checking build system type... x86_64-apple-darwin11.4.0
480:info:configure checking host system type... x86_64-apple-darwin11.4.0
481:info:configure checking for grep that handles long lines and -e... /usr/bin/grep
482:info:configure checking for egrep... /usr/bin/grep -E
483:info:configure checking for ANSI C header files... yes
484:info:configure checking for sys/types.h... yes
485:info:configure checking for sys/stat.h... yes
486:info:configure checking for stdlib.h... yes
487:info:configure checking for string.h... yes
488:info:configure checking for memory.h... yes
489:info:configure checking for strings.h... yes
490:info:configure checking for inttypes.h... yes
491:info:configure checking for stdint.h... yes
492:info:configure checking for unistd.h... yes
493:info:configure checking for GNU linker... no
494:info:configure configure: adding extra warning flags for gcc
495:info:configure configure: skipping pedantic warnings on Darwin
496:info:configure configure: adding extra warning flags for g++
497:info:configure checking if C compiler supports -Wno-format-zero-length... yes
498:info:configure checking if C compiler supports -Woverflow... yes
499:info:configure checking if C compiler supports -Wstrict-overflow... yes
500:info:configure checking if C compiler supports -Wmissing-format-attribute... yes
501:info:configure checking if C compiler supports -Wmissing-prototypes... yes
502:info:configure checking if C compiler supports -Wreturn-type... yes
503:info:configure checking if C compiler supports -Wmissing-braces... yes
504:info:configure checking if C compiler supports -Wparentheses... yes
505:info:configure checking if C compiler supports -Wswitch... yes
506:info:configure checking if C compiler supports -Wunused-function... yes
507:info:configure checking if C compiler supports -Wunused-label... yes
508:info:configure checking if C compiler supports -Wunused-variable... yes
509:info:configure checking if C compiler supports -Wunused-value... yes
510:info:configure checking if C compiler supports -Wunknown-pragmas... yes
511:info:configure checking if C compiler supports -Wsign-compare... yes
512:info:configure checking if C compiler supports -Wnewline-eof... yes
513:info:configure checking if C compiler supports -Werror=uninitialized... yes
514:info:configure checking if C compiler supports -Werror=pointer-arith... yes
515:info:configure checking if C compiler supports -Werror=declaration-after-statement... yes
516:info:configure checking if C compiler supports -Werror-implicit-function-declaration... yes
517:info:configure configure: disabling the use of common storage on Darwin
518:info:configure checking which version of com_err to use... system
519:info:configure checking for add_error_table in -lcom_err... yes
520:info:configure checking for remove_error_table in -lcom_err... yes
521:info:configure checking for compile_et... compile_et
522:info:configure checking whether compile_et is useful... yes
523:info:configure checking whether compile_et supports --textdomain... no
524:info:configure checking which version of subsystem package to use... krb5
525:info:configure checking for an ANSI C-conforming const... yes
526:info:configure checking for gethostbyname... yes
527:info:configure checking for socket... yes
528:info:configure checking for main in -lresolv... yes
529:info:configure checking for res_ninit... yes
530:info:configure checking for res_nclose... yes
531:info:configure checking for res_ndestroy... yes
532:info:configure checking for res_nsearch... yes
533:info:configure checking for ns_initparse... yes
534:info:configure checking for ns_name_uncompress... yes
535:info:configure checking for dn_skipname... yes
536:info:configure checking for res_search... yes
537:info:configure checking whether pragma weak references are supported... no
538:info:configure checking for constructor/destructor attribute support... yes,yes
539:info:configure configure: enabling thread support
540:info:configure checking for the pthreads library -lpthreads... no
541:info:configure checking whether pthreads work without any flags... yes
542:info:configure checking for joinable pthread attribute... PTHREAD_CREATE_JOINABLE
543:info:configure checking if more special flags are required for pthreads... no
544:info:configure checking for cc_r... /usr/bin/clang
545:info:configure configure: PTHREAD_CC = /usr/bin/clang
546:info:configure configure: PTHREAD_CFLAGS =
547:info:configure configure: PTHREAD_LIBS =
548:info:configure checking for pthread_once... yes
549:info:configure checking for pthread_rwlock_init... yes
550:info:configure configure: rechecking with PTHREAD_... options
551:info:configure checking for pthread_rwlock_init in -lc... yes
552:info:configure checking for library containing dlopen... none required
553:info:configure checking keyutils.h usability... no
554:info:configure checking keyutils.h presence... no
555:info:configure checking for keyutils.h... no
556:info:configure checking for keyutils.h... (cached) no
557:info:configure checking if va_copy is available... yes
558:info:configure checking if va_list objects can be copied by assignment... no
559:info:configure configure: using shared libraries
560:info:configure checking whether ln -s works... yes
561:info:configure checking for ranlib... ranlib
562:info:configure checking for ar... ar cqv
563:info:configure checking for ar... ar cruv
564:info:configure checking for a BSD-compatible install... /usr/bin/install -c
565:info:configure checking for ar... ar
566:info:configure checking for perl... perl
567:info:configure checking for working regcomp... yes
568:info:configure checking for mode_t... yes
569:info:configure checking if daemon needs a prototype provided... yes
570:info:configure checking if getsockname() takes arguments struct sockaddr * and size_t *... no
571:info:configure checking if getsockname() takes arguments struct sockaddr * and int *... no
572:info:configure checking if getsockname() takes arguments struct sockaddr * and socklen_t *... yes
573:info:configure checking for main in -lutil... yes
574:info:configure checking libintl.h usability... yes
575:info:configure checking libintl.h presence... yes
576:info:configure checking for libintl.h... yes
577:info:configure checking for library containing dgettext... no
578:info:configure checking for msgfmt... msgfmt
579:info:configure checking syslog.h usability... yes
580:info:configure checking syslog.h presence... yes
581:info:configure checking for syslog.h... yes
582:info:configure checking sys/sockio.h usability... yes
583:info:configure checking sys/sockio.h presence... yes
584:info:configure checking for sys/sockio.h... yes
585:info:configure checking ifaddrs.h usability... yes
586:info:configure checking ifaddrs.h presence... yes
587:info:configure checking for ifaddrs.h... yes
588:info:configure checking for unistd.h... (cached) yes
589:info:configure checking fnmatch.h usability... yes
590:info:configure checking fnmatch.h presence... yes
591:info:configure checking for fnmatch.h... yes
592:info:configure checking for openlog... yes
593:info:configure checking for syslog... yes
594:info:configure checking for closelog... yes
595:info:configure checking for strftime... yes
596:info:configure checking for vsprintf... yes
597:info:configure checking for vasprintf... yes
598:info:configure checking for vsnprintf... yes
599:info:configure checking for strlcpy... yes
600:info:configure checking for fnmatch... yes
601:info:configure checking for strlcpy... (cached) yes
602:info:configure checking for fnmatch... (cached) yes
603:info:configure checking for vasprintf... (cached) yes
604:info:configure checking if vasprintf needs a prototype provided... no
605:info:configure checking if swab needs a prototype provided... no
606:info:configure checking for gawk... no
607:info:configure checking for mawk... no
608:info:configure checking for nawk... no
609:info:configure checking for awk... awk
610:info:configure checking for struct sockaddr.sa_len... yes
611:info:configure checking for sys/types.h... (cached) yes
612:info:configure checking sys/socket.h usability... yes
613:info:configure checking sys/socket.h presence... yes
614:info:configure checking for sys/socket.h... yes
615:info:configure checking netinet/in.h usability... yes
616:info:configure checking netinet/in.h presence... yes
617:info:configure checking for netinet/in.h... yes
618:info:configure checking netdb.h usability... yes
619:info:configure checking netdb.h presence... yes
620:info:configure checking for netdb.h... yes
621:info:configure checking for inet_ntop... yes
622:info:configure checking for inet_pton... yes
623:info:configure checking for getnameinfo... yes
624:info:configure checking for getaddrinfo... yes
625:info:configure checking for IPv6 compile-time support without -DINET6... yes
626:info:configure checking for struct sockaddr.sa_len... (cached) yes
627:info:configure checking for sigprocmask... yes
628:info:configure checking for sigset_t and POSIX_SIGNALS... yes
629:info:configure configure: k5crypto will use 'openssl'
630:info:configure checking for PKCS7_get_signer_info in -lcrypto... yes
631:info:configure configure: pkinit will use 'openssl'
632:info:configure checking for PKCS7_get_signer_info in -lcrypto... (cached) yes
633:info:configure checking for CMS_get0_content in -lcrypto... no
634:info:configure checking for SSL_CTX_new in -lssl... yes
635:info:configure checking for OpenSSL... yes
636:info:configure configure: TLS module will use OpenSSL
637:info:configure checking return type of signal handlers... void
638:info:configure checking for flex... flex
639:info:configure checking lex output file root... lex.yy
640:info:configure checking lex library... -lfl
641:info:configure checking whether yytext is a pointer... yes
642:info:configure checking for an ANSI C-conforming const... (cached) yes
643:info:configure checking for dirent.h that defines DIR... yes
644:info:configure checking for library containing opendir... none required
645:info:configure checking whether strerror_r is declared... yes
646:info:configure checking for strerror_r... yes
647:info:configure checking whether strerror_r returns char *... no
648:info:configure checking for strdup... yes
649:info:configure checking for setvbuf... yes
650:info:configure checking for seteuid... yes
651:info:configure checking for setresuid... no
652:info:configure checking for setreuid... yes
653:info:configure checking for setegid... yes
654:info:configure checking for setresgid... no
655:info:configure checking for setregid... yes
656:info:configure checking for setsid... yes
657:info:configure checking for flock... yes
658:info:configure checking for fchmod... yes
659:info:configure checking for chmod... yes
660:info:configure checking for strftime... (cached) yes
661:info:configure checking for strptime... yes
662:info:configure checking for geteuid... yes
663:info:configure checking for setenv... yes
664:info:configure checking for unsetenv... yes
665:info:configure checking for getenv... yes
666:info:configure checking for gmtime_r... yes
667:info:configure checking for localtime_r... yes
668:info:configure checking for bswap16... no
669:info:configure checking for bswap64... no
670:info:configure checking for mkstemp... yes
671:info:configure checking for getusershell... yes
672:info:configure checking for access... yes
673:info:configure checking for getcwd... yes
674:info:configure checking for srand48... yes
675:info:configure checking for srand... yes
676:info:configure checking for srandom... yes
677:info:configure checking for stat... yes
678:info:configure checking for strchr... yes
679:info:configure checking for strerror... yes
680:info:configure checking for timegm... yes
681:info:configure checking for mkstemp... (cached) yes
682:info:configure checking for gettimeofday... yes
683:info:configure checking for sys_errlist declaration... yes
684:info:configure checking for unistd.h... (cached) yes
685:info:configure checking paths.h usability... yes
686:info:configure checking paths.h presence... yes
687:info:configure checking for paths.h... yes
688:info:configure checking regex.h usability... yes
689:info:configure checking regex.h presence... yes
690:info:configure checking for regex.h... yes
691:info:configure checking regexpr.h usability... no
692:info:configure checking regexpr.h presence... no
693:info:configure checking for regexpr.h... no
694:info:configure checking fcntl.h usability... yes
695:info:configure checking fcntl.h presence... yes
696:info:configure checking for fcntl.h... yes
697:info:configure checking for memory.h... (cached) yes
698:info:configure checking for ifaddrs.h... (cached) yes
699:info:configure checking sys/filio.h usability... yes
700:info:configure checking sys/filio.h presence... yes
701:info:configure checking for sys/filio.h... yes
702:info:configure checking byteswap.h usability... no
703:info:configure checking byteswap.h presence... no
704:info:configure checking for byteswap.h... no
705:info:configure checking machine/endian.h usability... yes
706:info:configure checking machine/endian.h presence... yes
707:info:configure checking for machine/endian.h... yes
708:info:configure checking machine/byte_order.h usability... yes
709:info:configure checking machine/byte_order.h presence... yes
710:info:configure checking for machine/byte_order.h... yes
711:info:configure checking sys/bswap.h usability... no
712:info:configure checking sys/bswap.h presence... no
713:info:configure checking for sys/bswap.h... no
714:info:configure checking endian.h usability... no
715:info:configure checking endian.h presence... no
716:info:configure checking for endian.h... no
717:info:configure checking pwd.h usability... yes
718:info:configure checking pwd.h presence... yes
719:info:configure checking for pwd.h... yes
720:info:configure checking arpa/inet.h usability... yes
721:info:configure checking arpa/inet.h presence... yes
722:info:configure checking for arpa/inet.h... yes
723:info:configure checking alloca.h usability... yes
724:info:configure checking alloca.h presence... yes
725:info:configure checking for alloca.h... yes
726:info:configure checking dlfcn.h usability... yes
727:info:configure checking dlfcn.h presence... yes
728:info:configure checking for dlfcn.h... yes
729:info:configure checking limits.h usability... yes
730:info:configure checking limits.h presence... yes
731:info:configure checking for limits.h... yes
732:info:configure checking for regexp.h... no
733:info:configure checking for struct stat.st_mtimensec... no
734:info:configure checking for struct stat.st_mtimespec.tv_nsec... yes
735:info:configure checking for struct stat.st_mtim.tv_nsec... no
736:info:configure checking for re_comp... no
737:info:configure checking for re_exec... no
738:info:configure checking for regexec... yes
739:info:configure checking for off_t... yes
740:info:configure checking for perror declaration... no
741:info:configure checking if strptime needs a prototype provided... no
742:info:configure checking if argument to wait is int *... no
743:info:configure checking for use of sigprocmask... yes
744:info:configure checking for uid_t in sys/types.h... yes
745:info:configure checking type of array argument to getgroups... gid_t
746:info:configure checking for sigsetjmp... yes
747:info:configure checking for sigjmp_buf... yes
748:info:configure checking return type of setrpcent... void
749:info:configure checking return type of endrpcent... void
750:info:configure checking for bswap_16... no
751:info:configure checking for bswap_64... no
752:info:configure checking for gethostbyname_r... no
753:info:configure checking for getpwnam_r... yes
754:info:configure checking for getpwuid_r... yes
755:info:configure checking return type of getpwnam_r... int
756:info:configure checking number of arguments to getpwnam_r... 5
757:info:configure checking whether gmtime_r returns int... no
758:info:configure checking for getservbyname_r... no
759:info:configure checking for yylineno declaration... yes
760:info:configure checking dirent.h usability... yes
761:info:configure checking dirent.h presence... yes
762:info:configure checking for dirent.h... yes
763:info:configure checking for uid_t in sys/types.h... (cached) yes
764:info:configure checking termios.h usability... yes
765:info:configure checking termios.h presence... yes
766:info:configure checking for termios.h... yes
767:info:configure checking for tcsetattr... yes
768:info:configure checking POSIX signal handlers... yes
769:info:configure checking poll.h usability... yes
770:info:configure checking poll.h presence... yes
771:info:configure checking for poll.h... yes
772:info:configure checking for stdlib.h... (cached) yes
773:info:configure checking for string.h... (cached) yes
774:info:configure checking stddef.h usability... yes
775:info:configure checking stddef.h presence... yes
776:info:configure checking for stddef.h... yes
777:info:configure checking for sys/types.h... (cached) yes
778:info:configure checking sys/file.h usability... yes
779:info:configure checking sys/file.h presence... yes
780:info:configure checking for sys/file.h... yes
781:info:configure checking sys/param.h usability... yes
782:info:configure checking sys/param.h presence... yes
783:info:configure checking for sys/param.h... yes
784:info:configure checking for sys/stat.h... (cached) yes
785:info:configure checking sys/time.h usability... yes
786:info:configure checking sys/time.h presence... yes
787:info:configure checking for sys/time.h... yes
788:info:configure checking for netinet/in.h... (cached) yes
789:info:configure checking sys/uio.h usability... yes
790:info:configure checking sys/uio.h presence... yes
791:info:configure checking for sys/uio.h... yes
792:info:configure checking for sys/filio.h... (cached) yes
793:info:configure checking sys/select.h usability... yes
794:info:configure checking sys/select.h presence... yes
795:info:configure checking for sys/select.h... yes
796:info:configure checking time.h usability... yes
797:info:configure checking time.h presence... yes
798:info:configure checking for time.h... yes
799:info:configure checking for paths.h... (cached) yes
800:info:configure checking errno.h usability... yes
801:info:configure checking errno.h presence... yes
802:info:configure checking for errno.h... yes
803:info:configure checking for in6addr_any definition in library... yes
804:info:configure checking for ANSI stdio... yes
805:info:configure checking whether time.h and sys/time.h may both be included... yes
806:info:configure checking for time_t... yes
807:info:configure checking for replay cache directory... /var/tmp
808:info:configure checking for socklen_t... yes
809:info:configure checking for struct lifconf... no
810:info:configure checking for struct if_laddrconf... no
811:info:configure checking for h_errno in netdb.h... yes
812:info:configure checking for inline... inline
813:info:configure checking for struct cmsghdr... yes
814:info:configure checking for struct in_pktinfo... yes
815:info:configure checking for struct in6_pktinfo... yes
816:info:configure checking for struct sockaddr_storage... yes
817:info:configure checking for struct rt_msghdr... yes
818:info:configure checking for ssize_t... yes
819:info:configure checking for u_char... yes
820:info:configure checking for u_int... yes
821:info:configure checking for u_long... yes
822:info:configure checking for u_int8_t... yes
823:info:configure checking for u_int16_t... yes
824:info:configure checking for u_int32_t... yes
825:info:configure checking for int8_t... yes
826:info:configure checking for int16_t... yes
827:info:configure checking for int32_t... yes
828:info:configure checking for sh... /bin/sh
829:info:configure checking for sh5... false
830:info:configure checking for bash... /bin/sh
831:info:configure checking if /bin/sh supports functions... yes
832:info:configure checking for POSIX printf positional specification support... yes
833:info:configure checking for dig... /usr/bin/dig
834:info:configure checking for nslookup... /usr/bin/nslookup
835:info:configure checking for bison... bison -y
836:info:configure checking for runtest... no
837:info:configure checking for perl... perl
838:info:configure checking for perl... /opt/bin/perl
839:info:configure checking for expect... /usr/bin/expect
840:info:configure checking whether to use priocntl hack... no
841:info:configure checking for runtest... no
842:info:configure checking for perl... (cached) perl
843:info:configure checking xom.h usability... no
844:info:configure checking xom.h presence... no
845:info:configure checking for xom.h... no
846:info:configure checking where struct rpcent is declared... netdb.h
847:info:configure checking for sys/select.h... (cached) yes
848:info:configure checking for sys/time.h... (cached) yes
849:info:configure checking for unistd.h... (cached) yes
850:info:configure checking for MAXHOSTNAMELEN in sys/param.h... yes
851:info:configure checking for MAXHOSTNAMELEN in netdb.h... no
852:info:configure checking for BSD type aliases... yes
853:info:configure checking return type of setrpcent... (cached) void
854:info:configure checking return type of endrpcent... (cached) void
855:info:configure checking for a recent enough OpenSSL... yes
856:info:configure checking for PKCS7_get_signer_info in -lcrypto... (cached) yes
857:info:configure checking for daemon... yes
858:info:configure checking for python... /opt/bin/python2.7
859:info:configure checking for gethostbyname_r... (cached) no
860:info:configure checking for getservbyname_r... (cached) no
861:info:configure checking for gmtime_r... (cached) yes
862:info:configure checking for localtime_r... (cached) yes
863:info:configure configure: WARNING: Some functions that are needed for library thread
864:info:configure configure: WARNING: safety appear to be missing.
865:info:configure configure: WARNING:   missing thread-safe function: gethostbyname_r
866:info:configure configure: WARNING:   missing thread-safe function: getservbyname_r
867:info:configure configure: WARNING: Without these functions, the installed libraries
868:info:configure configure: WARNING: may not be thread-safe.
869:info:configure checking for sd_init in -laceclnt... no
870:info:configure checking Python.h usability... no
871:info:configure checking Python.h presence... no
872:info:configure checking for Python.h... no
873:info:configure checking python2.3/Python.h usability... no
874:info:configure checking python2.3/Python.h presence... no
875:info:configure checking for python2.3/Python.h... no
876:info:configure checking python2.5/Python.h usability... yes
877:info:configure checking python2.5/Python.h presence... yes
878:info:configure checking for python2.5/Python.h... yes
879:info:configure checking for main in -lpython2.3... no
880:info:configure checking for main in -lpython2.5... yes
881:info:configure checking for readline support... using libedit
882:info:configure Using built-in libverto
883:info:configure checking for groff... /usr/bin/groff
884:info:configure configure: Default ccache name: KCM:
885:info:configure configure: Default keytab name: FILE:/etc/krb5.keytab
886:info:configure configure: Default client keytab name: FILE:/opt/var/krb5/user/%{euid}/client.keytab
887:info:configure configure: creating ./config.status
888:info:configure config.status: creating kadmin/testing/scripts/env-setup.sh
889:info:configure config.status: creating include/gssrpc/types.h
890:info:configure config.status: creating plugins/preauth/pkinit/Makefile
891:info:configure config.status: creating util/ss/Makefile
892:info:configure config.status: creating build-tools/krb5-config
893:info:configure config.status: creating build-tools/kadm-server.pc
894:info:configure config.status: creating build-tools/kadm-client.pc
895:info:configure config.status: creating build-tools/kdb.pc
896:info:configure config.status: creating build-tools/krb5.pc
897:info:configure config.status: creating build-tools/krb5-gssapi.pc
898:info:configure config.status: creating build-tools/mit-krb5.pc
899:info:configure config.status: creating build-tools/mit-krb5-gssapi.pc
900:info:configure config.status: creating build-tools/gssrpc.pc
901:info:configure config.status: creating ./Makefile
902:info:configure config.status: creating util/Makefile
903:info:configure config.status: creating util/support/Makefile
904:info:configure config.status: creating util/profile/Makefile
905:info:configure config.status: creating util/profile/testmod/Makefile
906:info:configure config.status: creating util/verto/Makefile
907:info:configure config.status: creating lib/Makefile
908:info:configure config.status: creating lib/kdb/Makefile
909:info:configure config.status: creating lib/crypto/Makefile
910:info:configure config.status: creating lib/crypto/krb/Makefile
911:info:configure config.status: creating lib/crypto/openssl/Makefile
912:info:configure config.status: creating lib/crypto/openssl/enc_provider/Makefile
913:info:configure config.status: creating lib/crypto/openssl/hash_provider/Makefile
914:info:configure config.status: creating lib/crypto/openssl/des/Makefile
915:info:configure config.status: creating lib/crypto/openssl/md4/Makefile
916:info:configure config.status: creating lib/crypto/openssl/md5/Makefile
917:info:configure config.status: creating lib/crypto/openssl/sha1/Makefile
918:info:configure config.status: creating lib/crypto/openssl/sha2/Makefile
919:info:configure config.status: creating lib/crypto/openssl/aes/Makefile
920:info:configure config.status: creating lib/crypto/openssl/camellia/Makefile
921:info:configure config.status: creating lib/crypto/crypto_tests/Makefile
922:info:configure config.status: creating lib/krb5/Makefile
923:info:configure config.status: creating lib/krb5/error_tables/Makefile
924:info:configure config.status: creating lib/krb5/asn.1/Makefile
925:info:configure config.status: creating lib/krb5/ccache/Makefile
926:info:configure config.status: creating lib/krb5/keytab/Makefile
927:info:configure config.status: creating lib/krb5/krb/Makefile
928:info:configure config.status: creating lib/krb5/rcache/Makefile
929:info:configure config.status: creating lib/krb5/os/Makefile
930:info:configure config.status: creating lib/krb5/unicode/Makefile
931:info:configure config.status: creating lib/gssapi/Makefile
932:info:configure config.status: creating lib/gssapi/generic/Makefile
933:info:configure config.status: creating lib/gssapi/krb5/Makefile
934:info:configure config.status: creating lib/gssapi/spnego/Makefile
935:info:configure config.status: creating lib/gssapi/mechglue/Makefile
936:info:configure config.status: creating lib/rpc/Makefile
937:info:configure config.status: creating lib/rpc/unit-test/Makefile
938:info:configure config.status: creating lib/kadm5/Makefile
939:info:configure config.status: creating lib/kadm5/clnt/Makefile
940:info:configure config.status: creating lib/kadm5/srv/Makefile
941:info:configure config.status: creating lib/kadm5/unit-test/Makefile
942:info:configure config.status: creating lib/krad/Makefile
943:info:configure config.status: creating lib/apputils/Makefile
944:info:configure config.status: creating kdc/Makefile
945:info:configure config.status: creating slave/Makefile
946:info:configure config.status: creating config-files/Makefile
947:info:configure config.status: creating build-tools/Makefile
948:info:configure config.status: creating man/Makefile
949:info:configure config.status: creating doc/Makefile
950:info:configure config.status: creating include/Makefile
951:info:configure config.status: creating plugins/hostrealm/test/Makefile
952:info:configure config.status: creating plugins/locate/python/Makefile
953:info:configure config.status: creating plugins/localauth/test/Makefile
954:info:configure config.status: creating plugins/kadm5_hook/test/Makefile
955:info:configure config.status: creating plugins/pwqual/test/Makefile
956:info:configure config.status: creating plugins/audit/Makefile
957:info:configure config.status: creating plugins/audit/test/Makefile
958:info:configure config.status: creating plugins/kdb/db2/Makefile
959:info:configure config.status: creating plugins/kdb/db2/libdb2/Makefile
960:info:configure config.status: creating plugins/kdb/db2/libdb2/hash/Makefile
961:info:configure config.status: creating plugins/kdb/db2/libdb2/btree/Makefile
962:info:configure config.status: creating plugins/kdb/db2/libdb2/db/Makefile
963:info:configure config.status: creating plugins/kdb/db2/libdb2/mpool/Makefile
964:info:configure config.status: creating plugins/kdb/db2/libdb2/recno/Makefile
965:info:configure config.status: creating plugins/kdb/db2/libdb2/test/Makefile
966:info:configure config.status: creating plugins/kdb/hdb/Makefile
967:info:configure config.status: creating plugins/preauth/cksum_body/Makefile
968:info:configure config.status: creating plugins/preauth/otp/Makefile
969:info:configure config.status: creating plugins/preauth/securid_sam2/Makefile
970:info:configure config.status: creating plugins/preauth/wpse/Makefile
971:info:configure config.status: creating plugins/authdata/greet/Makefile
972:info:configure config.status: creating plugins/authdata/greet_client/Makefile
973:info:configure config.status: creating plugins/authdata/greet_server/Makefile
974:info:configure config.status: creating plugins/tls/k5tls/Makefile
975:info:configure config.status: creating clients/Makefile
976:info:configure config.status: creating clients/klist/Makefile
977:info:configure config.status: creating clients/kinit/Makefile
978:info:configure config.status: creating clients/kvno/Makefile
979:info:configure config.status: creating clients/kdestroy/Makefile
980:info:configure config.status: creating clients/kpasswd/Makefile
981:info:configure config.status: creating clients/ksu/Makefile
982:info:configure config.status: creating clients/kswitch/Makefile
983:info:configure config.status: creating kadmin/Makefile
984:info:configure config.status: creating kadmin/cli/Makefile
985:info:configure config.status: creating kadmin/dbutil/Makefile
986:info:configure config.status: creating kadmin/ktutil/Makefile
987:info:configure config.status: creating kadmin/server/Makefile
988:info:configure config.status: creating kadmin/testing/Makefile
989:info:configure config.status: creating kadmin/testing/scripts/Makefile
990:info:configure config.status: creating kadmin/testing/util/Makefile
991:info:configure config.status: creating appl/Makefile
992:info:configure config.status: creating appl/sample/Makefile
993:info:configure config.status: creating appl/sample/sclient/Makefile
994:info:configure config.status: creating appl/sample/sserver/Makefile
995:info:configure config.status: creating appl/simple/Makefile
996:info:configure config.status: creating appl/simple/client/Makefile
997:info:configure config.status: creating appl/simple/server/Makefile
998:info:configure config.status: creating appl/gss-sample/Makefile
999:info:configure config.status: creating appl/user_user/Makefile
1000:info:configure config.status: creating tests/Makefile
1001:info:configure config.status: creating tests/resolve/Makefile
1002:info:configure config.status: creating tests/asn.1/Makefile
1003:info:configure config.status: creating tests/create/Makefile
1004:info:configure config.status: creating tests/hammer/Makefile
1005:info:configure config.status: creating tests/verify/Makefile
1006:info:configure config.status: creating tests/gssapi/Makefile
1007:info:configure config.status: creating tests/dejagnu/Makefile
1008:info:configure config.status: creating tests/threads/Makefile
1009:info:configure config.status: creating tests/shlib/Makefile
1010:info:configure config.status: creating tests/gss-threads/Makefile
1011:info:configure config.status: creating tests/misc/Makefile
1012:info:configure config.status: creating util/gss-kernel-lib/Makefile
1013:info:configure config.status: creating util/collected-client-lib/Makefile
1014:info:configure config.status: creating po/Makefile
1015:info:configure config.status: creating include/autoconf.h
1016:info:configure config.status: executing CRYPTO_IMPL commands
1017:info:configure config.status: executing PRNG_ALG commands
1018:info:configure config.status: executing PKINIT_CRYPTO_IMPL commands
1019:debug:configure Executing proc-post-org.macports.configure-configure-0
1020:info:configure --->  Patching krb5-config: s|-arch [^ ]+||g
1021:debug:configure Executing reinplace: /usr/bin/sed -E {s|-arch [^ ]+||g} < /opt/var/macports/build/_opt_var_macports_sources_rsync.macports.org_release_tarballs_ports_net_kerberos5/kerberos5/work/krb5-1.13.1-final/src/build-tools/krb5-config >@ file10 2>@stderr
1022:debug:configure euid/egid changed to: 0/0
1023:debug:configure chowned /opt/var/macports/build/_opt_var_macports_sources_rsync.macports.org_release_tarballs_ports_net_kerberos5/kerberos5/work/krb5-1.13.1-final/src/build-tools/krb5-config to macports
1024:debug:configure euid/egid changed to: 502/501
1025:debug:configure euid/egid changed to: 0/0
1026:debug:configure setting attributes on /opt/var/macports/build/_opt_var_macports_sources_rsync.macports.org_release_tarballs_ports_net_kerberos5/kerberos5/work/krb5-1.13.1-final/src/build-tools/krb5-config
1027:debug:configure euid/egid changed to: 502/501
1028:debug:configure Privilege de-escalation not attempted as not running as root.
1029:debug:build build phase started at Tue Apr 28 08:32:48 CEST 2015
1030:notice:build --->  Building kerberos5
1031:debug:build Executing org.macports.build (kerberos5)
1032:debug:build Environment:
1033CC_PRINT_OPTIONS='YES'
1034CC_PRINT_OPTIONS_FILE='/opt/var/macports/build/_opt_var_macports_sources_rsync.macports.org_release_tarballs_ports_net_kerberos5/kerberos5/work/.CC_PRINT_OPTIONS'
1035CPATH='/opt/include'
1036LIBRARY_PATH='/opt/lib'
1037MACOSX_DEPLOYMENT_TARGET='10.7'
1038:debug:build Assembled command: 'cd "/opt/var/macports/build/_opt_var_macports_sources_rsync.macports.org_release_tarballs_ports_net_kerberos5/kerberos5/work/krb5-1.13.1-final/src" && /usr/bin/make -w all'
1039:debug:build Executing command line:  cd "/opt/var/macports/build/_opt_var_macports_sources_rsync.macports.org_release_tarballs_ports_net_kerberos5/kerberos5/work/krb5-1.13.1-final/src" && /usr/bin/make -w all
1040:info:build make: Entering directory `/opt/var/macports/build/_opt_var_macports_sources_rsync.macports.org_release_tarballs_ports_net_kerberos5/kerberos5/work/krb5-1.13.1-final/src'
1041:info:build (cd include && /usr/bin/make autoconf.h osconf.h)
1042:info:build make[1]: Entering directory `/opt/var/macports/build/_opt_var_macports_sources_rsync.macports.org_release_tarballs_ports_net_kerberos5/kerberos5/work/krb5-1.13.1-final/src/include'
1043:info:build make[1]: Nothing to be done for `autoconf.h'.
1044:info:build cat ./osconf.hin | sed -e "s+@KRB5RCTMPDIR+/var/tmp+" -e "s+@PREFIX+/opt+" -e "s+@EXEC_PREFIX+/opt+" -e "s+@BINDIR+/opt/bin+" -e "s+@LIBDIR+/opt/lib+" -e "s+@SBINDIR+/opt/sbin+" -e "s+@MODULEDIR+/opt/lib/krb5/plugins+" -e "s+@GSSMODULEDIR+/opt/lib/gss+" -e 's+@LOCALSTATEDIR+/opt/var+' -e 's+@RUNSTATEDIR+/opt/var/run+' -e 's+@SYSCONFDIR+/opt/etc+' -e 's+@DYNOBJEXT+.so+' -e 's+@SYSCONFCONF+:/opt/etc/krb5.conf+' > osconf.new
1045:info:build ../config/move-if-changed osconf.new osconf.h
1046:info:build make[1]: Leaving directory `/opt/var/macports/build/_opt_var_macports_sources_rsync.macports.org_release_tarballs_ports_net_kerberos5/kerberos5/work/krb5-1.13.1-final/src/include'
1047:info:build making all in util...
1048:info:build make[1]: Entering directory `/opt/var/macports/build/_opt_var_macports_sources_rsync.macports.org_release_tarballs_ports_net_kerberos5/kerberos5/work/krb5-1.13.1-final/src/util'
1049:info:build making all in util/support...
1050:info:build make[2]: Entering directory `/opt/var/macports/build/_opt_var_macports_sources_rsync.macports.org_release_tarballs_ports_net_kerberos5/kerberos5/work/krb5-1.13.1-final/src/util/support'
1051:info:build /usr/bin/clang  -DSHARED -DHAVE_CONFIG_H  -I../../include -I../../include  -DKRB5_DEPRECATED=1 -DKRB5_PRIVATE -I/opt/include -pipe -Os -arch x86_64 -fno-common -Wall -Wcast-align -Wshadow -Wmissing-prototypes -Wno-format-zero-length -Woverflow -Wstrict-overflow -Wmissing-format-attribute -Wmissing-prototypes -Wreturn-type -Wmissing-braces -Wparentheses -Wswitch -Wunused-function -Wunused-label -Wunused-variable -Wunused-value -Wunknown-pragmas -Wsign-compare -Wnewline-eof -Werror=uninitialized -Werror=pointer-arith -Werror=declaration-after-statement -Werror-implicit-function-declaration  -c threads.c -o threads.so.o && mv -f threads.so.o threads.so
1052:info:build /usr/bin/clang  -DSHARED -DHAVE_CONFIG_H  -I../../include -I../../include  -DKRB5_DEPRECATED=1 -DKRB5_PRIVATE -I/opt/include -pipe -Os -arch x86_64 -fno-common -Wall -Wcast-align -Wshadow -Wmissing-prototypes -Wno-format-zero-length -Woverflow -Wstrict-overflow -Wmissing-format-attribute -Wmissing-prototypes -Wreturn-type -Wmissing-braces -Wparentheses -Wswitch -Wunused-function -Wunused-label -Wunused-variable -Wunused-value -Wunknown-pragmas -Wsign-compare -Wnewline-eof -Werror=uninitialized -Werror=pointer-arith -Werror=declaration-after-statement -Werror-implicit-function-declaration  -c init-addrinfo.c -o init-addrinfo.so.o && mv -f init-addrinfo.so.o init-addrinfo.so
1053:info:build /usr/bin/clang  -DSHARED -DHAVE_CONFIG_H  -I../../include -I../../include  -DKRB5_DEPRECATED=1 -DKRB5_PRIVATE -I/opt/include -pipe -Os -arch x86_64 -fno-common -Wall -Wcast-align -Wshadow -Wmissing-prototypes -Wno-format-zero-length -Woverflow -Wstrict-overflow -Wmissing-format-attribute -Wmissing-prototypes -Wreturn-type -Wmissing-braces -Wparentheses -Wswitch -Wunused-function -Wunused-label -Wunused-variable -Wunused-value -Wunknown-pragmas -Wsign-compare -Wnewline-eof -Werror=uninitialized -Werror=pointer-arith -Werror=declaration-after-statement -Werror-implicit-function-declaration  -c plugins.c -o plugins.so.o && mv -f plugins.so.o plugins.so
1054:info:build /usr/bin/clang  -DSHARED -DHAVE_CONFIG_H  -I../../include -I../../include  -DKRB5_DEPRECATED=1 -DKRB5_PRIVATE -I/opt/include -pipe -Os -arch x86_64 -fno-common -Wall -Wcast-align -Wshadow -Wmissing-prototypes -Wno-format-zero-length -Woverflow -Wstrict-overflow -Wmissing-format-attribute -Wmissing-prototypes -Wreturn-type -Wmissing-braces -Wparentheses -Wswitch -Wunused-function -Wunused-label -Wunused-variable -Wunused-value -Wunknown-pragmas -Wsign-compare -Wnewline-eof -Werror=uninitialized -Werror=pointer-arith -Werror=declaration-after-statement -Werror-implicit-function-declaration  -c errors.c -o errors.so.o && mv -f errors.so.o errors.so
1055:info:build /usr/bin/clang  -DSHARED -DHAVE_CONFIG_H  -I../../include -I../../include  -DKRB5_DEPRECATED=1 -DKRB5_PRIVATE -I/opt/include -pipe -Os -arch x86_64 -fno-common -Wall -Wcast-align -Wshadow -Wmissing-prototypes -Wno-format-zero-length -Woverflow -Wstrict-overflow -Wmissing-format-attribute -Wmissing-prototypes -Wreturn-type -Wmissing-braces -Wparentheses -Wswitch -Wunused-function -Wunused-label -Wunused-variable -Wunused-value -Wunknown-pragmas -Wsign-compare -Wnewline-eof -Werror=uninitialized -Werror=pointer-arith -Werror=declaration-after-statement -Werror-implicit-function-declaration  -c k5buf.c -o k5buf.so.o && mv -f k5buf.so.o k5buf.so
1056:info:build /usr/bin/clang  -DSHARED -DHAVE_CONFIG_H  -I../../include -I../../include  -DKRB5_DEPRECATED=1 -DKRB5_PRIVATE -I/opt/include -pipe -Os -arch x86_64 -fno-common -Wall -Wcast-align -Wshadow -Wmissing-prototypes -Wno-format-zero-length -Woverflow -Wstrict-overflow -Wmissing-format-attribute -Wmissing-prototypes -Wreturn-type -Wmissing-braces -Wparentheses -Wswitch -Wunused-function -Wunused-label -Wunused-variable -Wunused-value -Wunknown-pragmas -Wsign-compare -Wnewline-eof -Werror=uninitialized -Werror=pointer-arith -Werror=declaration-after-statement -Werror-implicit-function-declaration  -c gmt_mktime.c -o gmt_mktime.so.o && mv -f gmt_mktime.so.o gmt_mktime.so
1057:info:build /usr/bin/clang  -DSHARED -DHAVE_CONFIG_H  -I../../include -I../../include  -DKRB5_DEPRECATED=1 -DKRB5_PRIVATE -I/opt/include -pipe -Os -arch x86_64 -fno-common -Wall -Wcast-align -Wshadow -Wmissing-prototypes -Wno-format-zero-length -Woverflow -Wstrict-overflow -Wmissing-format-attribute -Wmissing-prototypes -Wreturn-type -Wmissing-braces -Wparentheses -Wswitch -Wunused-function -Wunused-label -Wunused-variable -Wunused-value -Wunknown-pragmas -Wsign-compare -Wnewline-eof -Werror=uninitialized -Werror=pointer-arith -Werror=declaration-after-statement -Werror-implicit-function-declaration  -c fake-addrinfo.c -o fake-addrinfo.so.o && mv -f fake-addrinfo.so.o fake-addrinfo.so
1058:info:build /usr/bin/clang  -DSHARED -DHAVE_CONFIG_H  -I../../include -I../../include  -DKRB5_DEPRECATED=1 -DKRB5_PRIVATE -I/opt/include -pipe -Os -arch x86_64 -fno-common -Wall -Wcast-align -Wshadow -Wmissing-prototypes -Wno-format-zero-length -Woverflow -Wstrict-overflow -Wmissing-format-attribute -Wmissing-prototypes -Wreturn-type -Wmissing-braces -Wparentheses -Wswitch -Wunused-function -Wunused-label -Wunused-variable -Wunused-value -Wunknown-pragmas -Wsign-compare -Wnewline-eof -Werror=uninitialized -Werror=pointer-arith -Werror=declaration-after-statement -Werror-implicit-function-declaration  -c utf8.c -o utf8.so.o && mv -f utf8.so.o utf8.so
1059:info:build /usr/bin/clang  -DSHARED -DHAVE_CONFIG_H  -I../../include -I../../include  -DKRB5_DEPRECATED=1 -DKRB5_PRIVATE -I/opt/include -pipe -Os -arch x86_64 -fno-common -Wall -Wcast-align -Wshadow -Wmissing-prototypes -Wno-format-zero-length -Woverflow -Wstrict-overflow -Wmissing-format-attribute -Wmissing-prototypes -Wreturn-type -Wmissing-braces -Wparentheses -Wswitch -Wunused-function -Wunused-label -Wunused-variable -Wunused-value -Wunknown-pragmas -Wsign-compare -Wnewline-eof -Werror=uninitialized -Werror=pointer-arith -Werror=declaration-after-statement -Werror-implicit-function-declaration  -c utf8_conv.c -o utf8_conv.so.o && mv -f utf8_conv.so.o utf8_conv.so
1060:info:build utf8_conv.c:203:29: warning: cast from 'unsigned char *' to 'krb5_ucs2 *' (aka 'unsigned short *') increases required alignment from 1 to 2 [-Wcast-align]
1061:info:build     len = k5_utf8s_to_ucs2s((krb5_ucs2 *)*ucs2les, utf8s, chars + 1, 1);
1062:info:build                             ^~~~~~~~~~~~~~~~~~~~~
1063:info:build utf8_conv.c:362:35: warning: cast from 'const unsigned char *' to 'krb5_ucs2 *' (aka 'unsigned short *') increases required alignment from 1 to 2 [-Wcast-align]
1064:info:build     len = k5_ucs2s_to_utf8s(NULL, (krb5_ucs2 *)ucs2les, 0, -1, 1);
1065:info:build                                   ^~~~~~~~~~~~~~~~~~~~
1066:info:build utf8_conv.c:371:37: warning: cast from 'const unsigned char *' to 'krb5_ucs2 *' (aka 'unsigned short *') increases required alignment from 1 to 2 [-Wcast-align]
1067:info:build     len = k5_ucs2s_to_utf8s(*utf8s, (krb5_ucs2 *)ucs2les, (size_t)len + 1, -1, 1);
1068:info:build                                     ^~~~~~~~~~~~~~~~~~~~
1069:info:build utf8_conv.c:433:35: warning: cast from 'const unsigned char *' to 'krb5_ucs2 *' (aka 'unsigned short *') increases required alignment from 1 to 2 [-Wcast-align]
1070:info:build     len = k5_ucs2s_to_utf8s(NULL, (krb5_ucs2 *)ucs2les, 0,
1071:info:build                                   ^~~~~~~~~~~~~~~~~~~~
1072:info:build utf8_conv.c:443:37: warning: cast from 'const unsigned char *' to 'krb5_ucs2 *' (aka 'unsigned short *') increases required alignment from 1 to 2 [-Wcast-align]
1073:info:build     len = k5_ucs2s_to_utf8s(*utf8s, (krb5_ucs2 *)ucs2les, (size_t)len,
1074:info:build                                     ^~~~~~~~~~~~~~~~~~~~
1075:info:build 5 warnings generated.
1076:info:build /usr/bin/clang  -DSHARED -DHAVE_CONFIG_H  -I../../include -I../../include  -DKRB5_DEPRECATED=1 -DKRB5_PRIVATE -I/opt/include -pipe -Os -arch x86_64 -fno-common -Wall -Wcast-align -Wshadow -Wmissing-prototypes -Wno-format-zero-length -Woverflow -Wstrict-overflow -Wmissing-format-attribute -Wmissing-prototypes -Wreturn-type -Wmissing-braces -Wparentheses -Wswitch -Wunused-function -Wunused-label -Wunused-variable -Wunused-value -Wunknown-pragmas -Wsign-compare -Wnewline-eof -Werror=uninitialized -Werror=pointer-arith -Werror=declaration-after-statement -Werror-implicit-function-declaration  -c zap.c -o zap.so.o && mv -f zap.so.o zap.so
1077:info:build /usr/bin/clang  -DSHARED -DHAVE_CONFIG_H  -I../../include -I../../include  -DKRB5_DEPRECATED=1 -DKRB5_PRIVATE -I/opt/include -pipe -Os -arch x86_64 -fno-common -Wall -Wcast-align -Wshadow -Wmissing-prototypes -Wno-format-zero-length -Woverflow -Wstrict-overflow -Wmissing-format-attribute -Wmissing-prototypes -Wreturn-type -Wmissing-braces -Wparentheses -Wswitch -Wunused-function -Wunused-label -Wunused-variable -Wunused-value -Wunknown-pragmas -Wsign-compare -Wnewline-eof -Werror=uninitialized -Werror=pointer-arith -Werror=declaration-after-statement -Werror-implicit-function-declaration  -c path.c -o path.so.o && mv -f path.so.o path.so
1078:info:build /usr/bin/clang  -DSHARED -DHAVE_CONFIG_H  -I../../include -I../../include  -DKRB5_DEPRECATED=1 -DKRB5_PRIVATE -I/opt/include -pipe -Os -arch x86_64 -fno-common -Wall -Wcast-align -Wshadow -Wmissing-prototypes -Wno-format-zero-length -Woverflow -Wstrict-overflow -Wmissing-format-attribute -Wmissing-prototypes -Wreturn-type -Wmissing-braces -Wparentheses -Wswitch -Wunused-function -Wunused-label -Wunused-variable -Wunused-value -Wunknown-pragmas -Wsign-compare -Wnewline-eof -Werror=uninitialized -Werror=pointer-arith -Werror=declaration-after-statement -Werror-implicit-function-declaration  -c base64.c -o base64.so.o && mv -f base64.so.o base64.so
1079:info:build /usr/bin/clang  -DSHARED -DHAVE_CONFIG_H  -I../../include -I../../include  -DKRB5_DEPRECATED=1 -DKRB5_PRIVATE -I/opt/include -pipe -Os -arch x86_64 -fno-common -Wall -Wcast-align -Wshadow -Wmissing-prototypes -Wno-format-zero-length -Woverflow -Wstrict-overflow -Wmissing-format-attribute -Wmissing-prototypes -Wreturn-type -Wmissing-braces -Wparentheses -Wswitch -Wunused-function -Wunused-label -Wunused-variable -Wunused-value -Wunknown-pragmas -Wsign-compare -Wnewline-eof -Werror=uninitialized -Werror=pointer-arith -Werror=declaration-after-statement -Werror-implicit-function-declaration  -c json.c -o json.so.o && mv -f json.so.o json.so
1080:info:build /usr/bin/clang  -DSHARED -DHAVE_CONFIG_H  -I../../include -I../../include  -DKRB5_DEPRECATED=1 -DKRB5_PRIVATE -I/opt/include -pipe -Os -arch x86_64 -fno-common -Wall -Wcast-align -Wshadow -Wmissing-prototypes -Wno-format-zero-length -Woverflow -Wstrict-overflow -Wmissing-format-attribute -Wmissing-prototypes -Wreturn-type -Wmissing-braces -Wparentheses -Wswitch -Wunused-function -Wunused-label -Wunused-variable -Wunused-value -Wunknown-pragmas -Wsign-compare -Wnewline-eof -Werror=uninitialized -Werror=pointer-arith -Werror=declaration-after-statement -Werror-implicit-function-declaration  -c bcmp.c -o bcmp.so.o && mv -f bcmp.so.o bcmp.so
1081:info:build /usr/bin/clang  -DSHARED -DHAVE_CONFIG_H  -I../../include -I../../include  -DKRB5_DEPRECATED=1 -DKRB5_PRIVATE -I/opt/include -pipe -Os -arch x86_64 -fno-common -Wall -Wcast-align -Wshadow -Wmissing-prototypes -Wno-format-zero-length -Woverflow -Wstrict-overflow -Wmissing-format-attribute -Wmissing-prototypes -Wreturn-type -Wmissing-braces -Wparentheses -Wswitch -Wunused-function -Wunused-label -Wunused-variable -Wunused-value -Wunknown-pragmas -Wsign-compare -Wnewline-eof -Werror=uninitialized -Werror=pointer-arith -Werror=declaration-after-statement -Werror-implicit-function-declaration  -c strerror_r.c -o strerror_r.so.o && mv -f strerror_r.so.o strerror_r.so
1082:info:build : updated OBJS.SH
1083:info:build cat ./libkrb5support-fixed.exports > new-exports
1084:info:build for i in  .; do \
1085:info:build       if test "$i" != .; then echo $i >> new-exports; else :; fi ; \
1086:info:build     done
1087:info:build mv -f new-exports libkrb5support.exports
1088:info:build sed > darwin-exports.tmp < libkrb5support.exports "s/^/_/"
1089:info:build mv -f darwin-exports.tmp darwin.exports
1090:info:build rm -f libkrb5support.1.1.dylib
1091:info:build building shared krb5support library (1.1)
1092:info:build set -x; objlist=`set -x && perl -p -e 'BEGIN { $SIG{__WARN__} = sub {die @_} }; $e=$ARGV; $e =~ s/OBJS\...$//; s/^/ /; s/ $//; s/ / $e/g;' OBJS.SH` && /usr/bin/clang -undefined error -dead_strip -dynamiclib -compatibility_version 1 -current_version 1.1 -install_name "/opt/lib/libkrb5support.1.1.dylib" -exported_symbols_list darwin.exports -pipe -Os -arch x86_64 -fno-common -o libkrb5support.1.1.dylib $objlist -L../../lib -lcrypto -lresolv   -Wl,-headerpad_max_install_names -arch x86_64 -Wl,-search_paths_first
1093:info:build ++ set -x
1094:info:build ++ perl -p -e 'BEGIN { $SIG{__WARN__} = sub {die @_} }; $e=$ARGV; $e =~ s/OBJS\...$//; s/^/ /; s/ $//; s/ / $e/g;' OBJS.SH
1095:info:build + objlist=' threads.so init-addrinfo.so plugins.so errors.so k5buf.so gmt_mktime.so fake-addrinfo.so utf8.so utf8_conv.so zap.so path.so base64.so json.so bcmp.so strerror_r.so'
1096:info:build + /usr/bin/clang -undefined error -dead_strip -dynamiclib -compatibility_version 1 -current_version 1.1 -install_name /opt/lib/libkrb5support.1.1.dylib -exported_symbols_list darwin.exports -pipe -Os -arch x86_64 -fno-common -o libkrb5support.1.1.dylib threads.so init-addrinfo.so plugins.so errors.so k5buf.so gmt_mktime.so fake-addrinfo.so utf8.so utf8_conv.so zap.so path.so base64.so json.so bcmp.so strerror_r.so -L../../lib -lcrypto -lresolv -Wl,-headerpad_max_install_names -arch x86_64 -Wl,-search_paths_first
1097:info:build rm -f libkrb5support.dylib
1098:info:build ln -s libkrb5support.1.1.dylib libkrb5support.dylib
1099:info:build rm -f ../../lib/libkrb5support.dylib
1100:info:build (cd ../../lib && \
1101:info:build      ln -s libkrb5support.1.1.dylib libkrb5support.dylib)
1102:info:build rm -f ../../lib/libkrb5support.1.1.dylib
1103:info:build (cd ../../lib && ln -s ../util/support/libkrb5support.1.1.dylib .)
1104:info:build rm -f libkrb5support.1.dylib
1105:info:build ln -s libkrb5support.1.1.dylib libkrb5support.1.dylib
1106:info:build rm -f ../../lib/libkrb5support.1.dylib
1107:info:build (cd ../../lib && \
1108:info:build      ln -s libkrb5support.1.1.dylib libkrb5support.1.dylib)
1109:info:build make[2]: Leaving directory `/opt/var/macports/build/_opt_var_macports_sources_rsync.macports.org_release_tarballs_ports_net_kerberos5/kerberos5/work/krb5-1.13.1-final/src/util/support'
1110:info:build making all in util/ss...
1111:info:build make[2]: Entering directory `/opt/var/macports/build/_opt_var_macports_sources_rsync.macports.org_release_tarballs_ports_net_kerberos5/kerberos5/work/krb5-1.13.1-final/src/util/ss'
1112:info:build /bin/sh ./config_script ./mk_cmds.sh . awk sed > mk_cmds
1113:info:build chmod 755 mk_cmds   
1114:info:build rm -f ct_c.awk
1115:info:build cp ./ct_c_awk.in ct_c.awk
1116:info:build sed -e '/^#/d' ./ct_c_sed.in > ct_c.sed
1117:info:build rm -f et-h-ss_err.et et-h-ss_err.c et-h-ss_err.h
1118:info:build cp ss_err.et et-h-ss_err.et
1119:info:build compile_et et-h-ss_err.et
1120:info:build mv -f et-h-ss_err.h ss_err.h
1121:info:build rm -f et-h-ss_err.et et-h-ss_err.c
1122:info:build if [ -d ../../include/ss ] ; then :; else mkdir -p ../../include/ss; fi
1123:info:build echo timestamp > ../../include/ss/timestamp
1124:info:build rm -f ../../include/ss/ss.h
1125:info:build cp ./ss.h ../../include/ss/ss.h
1126:info:build rm -f ../../include/ss/ss_err.h
1127:info:build cp ss_err.h ../../include/ss/ss_err.h
1128:info:build rm -f et-c-ss_err.et et-c-ss_err.c et-c-ss_err.h
1129:info:build cp ss_err.et et-c-ss_err.et
1130:info:build compile_et et-c-ss_err.et
1131:info:build mv -f et-c-ss_err.c ss_err.c
1132:info:build rm -f et-c-ss_err.et et-c-ss_err.h
1133:info:build /usr/bin/clang -DHAVE_CONFIG_H  -I../../include -I../../include -I. -I./ -I/opt/include -I/opt/include/editline  -DKRB5_DEPRECATED=1 -DKRB5_PRIVATE -I/opt/include -pipe -Os -arch x86_64 -fno-common -Wall -Wcast-align -Wshadow -Wmissing-prototypes -Wno-format-zero-length -Woverflow -Wstrict-overflow -Wmissing-format-attribute -Wmissing-prototypes -Wreturn-type -Wmissing-braces -Wparentheses -Wswitch -Wunused-function -Wunused-label -Wunused-variable -Wunused-value -Wunknown-pragmas -Wsign-compare -Wnewline-eof -Werror=uninitialized -Werror=pointer-arith -Werror=declaration-after-statement -Werror-implicit-function-declaration  -c ss_err.c
1134:info:build ../../util/ss/mk_cmds std_rqs.ct
1135:info:build /usr/bin/clang -DHAVE_CONFIG_H  -I../../include -I../../include -I. -I./ -I/opt/include -I/opt/include/editline  -DKRB5_DEPRECATED=1 -DKRB5_PRIVATE -I/opt/include -pipe -Os -arch x86_64 -fno-common -Wall -Wcast-align -Wshadow -Wmissing-prototypes -Wno-format-zero-length -Woverflow -Wstrict-overflow -Wmissing-format-attribute -Wmissing-prototypes -Wreturn-type -Wmissing-braces -Wparentheses -Wswitch -Wunused-function -Wunused-label -Wunused-variable -Wunused-value -Wunknown-pragmas -Wsign-compare -Wnewline-eof -Werror=uninitialized -Werror=pointer-arith -Werror=declaration-after-statement -Werror-implicit-function-declaration  -c std_rqs.c
1136:info:build /usr/bin/clang -DHAVE_CONFIG_H  -I../../include -I../../include -I. -I./ -I/opt/include -I/opt/include/editline  -DKRB5_DEPRECATED=1 -DKRB5_PRIVATE -I/opt/include -pipe -Os -arch x86_64 -fno-common -Wall -Wcast-align -Wshadow -Wmissing-prototypes -Wno-format-zero-length -Woverflow -Wstrict-overflow -Wmissing-format-attribute -Wmissing-prototypes -Wreturn-type -Wmissing-braces -Wparentheses -Wswitch -Wunused-function -Wunused-label -Wunused-variable -Wunused-value -Wunknown-pragmas -Wsign-compare -Wnewline-eof -Werror=uninitialized -Werror=pointer-arith -Werror=declaration-after-statement -Werror-implicit-function-declaration  -c invocation.c
1137:info:build /usr/bin/clang -DHAVE_CONFIG_H  -I../../include -I../../include -I. -I./ -I/opt/include -I/opt/include/editline  -DKRB5_DEPRECATED=1 -DKRB5_PRIVATE -I/opt/include -pipe -Os -arch x86_64 -fno-common -Wall -Wcast-align -Wshadow -Wmissing-prototypes -Wno-format-zero-length -Woverflow -Wstrict-overflow -Wmissing-format-attribute -Wmissing-prototypes -Wreturn-type -Wmissing-braces -Wparentheses -Wswitch -Wunused-function -Wunused-label -Wunused-variable -Wunused-value -Wunknown-pragmas -Wsign-compare -Wnewline-eof -Werror=uninitialized -Werror=pointer-arith -Werror=declaration-after-statement -Werror-implicit-function-declaration  -c help.c
1138:info:build /usr/bin/clang -DHAVE_CONFIG_H  -I../../include -I../../include -I. -I./ -I/opt/include -I/opt/include/editline  -DKRB5_DEPRECATED=1 -DKRB5_PRIVATE -I/opt/include -pipe -Os -arch x86_64 -fno-common -Wall -Wcast-align -Wshadow -Wmissing-prototypes -Wno-format-zero-length -Woverflow -Wstrict-overflow -Wmissing-format-attribute -Wmissing-prototypes -Wreturn-type -Wmissing-braces -Wparentheses -Wswitch -Wunused-function -Wunused-label -Wunused-variable -Wunused-value -Wunknown-pragmas -Wsign-compare -Wnewline-eof -Werror=uninitialized -Werror=pointer-arith -Werror=declaration-after-statement -Werror-implicit-function-declaration  -c execute_cmd.c
1139:info:build /usr/bin/clang -DHAVE_CONFIG_H  -I../../include -I../../include -I. -I./ -I/opt/include -I/opt/include/editline  -DKRB5_DEPRECATED=1 -DKRB5_PRIVATE -I/opt/include -pipe -Os -arch x86_64 -fno-common -Wall -Wcast-align -Wshadow -Wmissing-prototypes -Wno-format-zero-length -Woverflow -Wstrict-overflow -Wmissing-format-attribute -Wmissing-prototypes -Wreturn-type -Wmissing-braces -Wparentheses -Wswitch -Wunused-function -Wunused-label -Wunused-variable -Wunused-value -Wunknown-pragmas -Wsign-compare -Wnewline-eof -Werror=uninitialized -Werror=pointer-arith -Werror=declaration-after-statement -Werror-implicit-function-declaration  -c listen.c
1140:info:build /usr/bin/clang -DHAVE_CONFIG_H  -I../../include -I../../include -I. -I./ -I/opt/include -I/opt/include/editline  -DKRB5_DEPRECATED=1 -DKRB5_PRIVATE -I/opt/include -pipe -Os -arch x86_64 -fno-common -Wall -Wcast-align -Wshadow -Wmissing-prototypes -Wno-format-zero-length -Woverflow -Wstrict-overflow -Wmissing-format-attribute -Wmissing-prototypes -Wreturn-type -Wmissing-braces -Wparentheses -Wswitch -Wunused-function -Wunused-label -Wunused-variable -Wunused-value -Wunknown-pragmas -Wsign-compare -Wnewline-eof -Werror=uninitialized -Werror=pointer-arith -Werror=declaration-after-statement -Werror-implicit-function-declaration  -c parse.c
1141:info:build /usr/bin/clang -DHAVE_CONFIG_H  -I../../include -I../../include -I. -I./ -I/opt/include -I/opt/include/editline  -DKRB5_DEPRECATED=1 -DKRB5_PRIVATE -I/opt/include -pipe -Os -arch x86_64 -fno-common -Wall -Wcast-align -Wshadow -Wmissing-prototypes -Wno-format-zero-length -Woverflow -Wstrict-overflow -Wmissing-format-attribute -Wmissing-prototypes -Wreturn-type -Wmissing-braces -Wparentheses -Wswitch -Wunused-function -Wunused-label -Wunused-variable -Wunused-value -Wunknown-pragmas -Wsign-compare -Wnewline-eof -Werror=uninitialized -Werror=pointer-arith -Werror=declaration-after-statement -Werror-implicit-function-declaration  -c error.c
1142:info:build /usr/bin/clang -DHAVE_CONFIG_H  -I../../include -I../../include -I. -I./ -I/opt/include -I/opt/include/editline  -DKRB5_DEPRECATED=1 -DKRB5_PRIVATE -I/opt/include -pipe -Os -arch x86_64 -fno-common -Wall -Wcast-align -Wshadow -Wmissing-prototypes -Wno-format-zero-length -Woverflow -Wstrict-overflow -Wmissing-format-attribute -Wmissing-prototypes -Wreturn-type -Wmissing-braces -Wparentheses -Wswitch -Wunused-function -Wunused-label -Wunused-variable -Wunused-value -Wunknown-pragmas -Wsign-compare -Wnewline-eof -Werror=uninitialized -Werror=pointer-arith -Werror=declaration-after-statement -Werror-implicit-function-declaration  -c prompt.c
1143:info:build /usr/bin/clang -DHAVE_CONFIG_H  -I../../include -I../../include -I. -I./ -I/opt/include -I/opt/include/editline  -DKRB5_DEPRECATED=1 -DKRB5_PRIVATE -I/opt/include -pipe -Os -arch x86_64 -fno-common -Wall -Wcast-align -Wshadow -Wmissing-prototypes -Wno-format-zero-length -Woverflow -Wstrict-overflow -Wmissing-format-attribute -Wmissing-prototypes -Wreturn-type -Wmissing-braces -Wparentheses -Wswitch -Wunused-function -Wunused-label -Wunused-variable -Wunused-value -Wunknown-pragmas -Wsign-compare -Wnewline-eof -Werror=uninitialized -Werror=pointer-arith -Werror=declaration-after-statement -Werror-implicit-function-declaration  -c request_tbl.c
1144:info:build /usr/bin/clang -DHAVE_CONFIG_H  -I../../include -I../../include -I. -I./ -I/opt/include -I/opt/include/editline  -DKRB5_DEPRECATED=1 -DKRB5_PRIVATE -I/opt/include -pipe -Os -arch x86_64 -fno-common -Wall -Wcast-align -Wshadow -Wmissing-prototypes -Wno-format-zero-length -Woverflow -Wstrict-overflow -Wmissing-format-attribute -Wmissing-prototypes -Wreturn-type -Wmissing-braces -Wparentheses -Wswitch -Wunused-function -Wunused-label -Wunused-variable -Wunused-value -Wunknown-pragmas -Wsign-compare -Wnewline-eof -Werror=uninitialized -Werror=pointer-arith -Werror=declaration-after-statement -Werror-implicit-function-declaration  -c list_rqs.c
1145:info:build /usr/bin/clang -DHAVE_CONFIG_H  -I../../include -I../../include -I. -I./ -I/opt/include -I/opt/include/editline  -DKRB5_DEPRECATED=1 -DKRB5_PRIVATE -I/opt/include -pipe -Os -arch x86_64 -fno-common -Wall -Wcast-align -Wshadow -Wmissing-prototypes -Wno-format-zero-length -Woverflow -Wstrict-overflow -Wmissing-format-attribute -Wmissing-prototypes -Wreturn-type -Wmissing-braces -Wparentheses -Wswitch -Wunused-function -Wunused-label -Wunused-variable -Wunused-value -Wunknown-pragmas -Wsign-compare -Wnewline-eof -Werror=uninitialized -Werror=pointer-arith -Werror=declaration-after-statement -Werror-implicit-function-declaration  -c pager.c
1146:info:build /usr/bin/clang -DHAVE_CONFIG_H  -I../../include -I../../include -I. -I./ -I/opt/include -I/opt/include/editline  -DKRB5_DEPRECATED=1 -DKRB5_PRIVATE -I/opt/include -pipe -Os -arch x86_64 -fno-common -Wall -Wcast-align -Wshadow -Wmissing-prototypes -Wno-format-zero-length -Woverflow -Wstrict-overflow -Wmissing-format-attribute -Wmissing-prototypes -Wreturn-type -Wmissing-braces -Wparentheses -Wswitch -Wunused-function -Wunused-label -Wunused-variable -Wunused-value -Wunknown-pragmas -Wsign-compare -Wnewline-eof -Werror=uninitialized -Werror=pointer-arith -Werror=declaration-after-statement -Werror-implicit-function-declaration  -c requests.c
1147:info:build /usr/bin/clang -DHAVE_CONFIG_H  -I../../include -I../../include -I. -I./ -I/opt/include -I/opt/include/editline  -DKRB5_DEPRECATED=1 -DKRB5_PRIVATE -I/opt/include -pipe -Os -arch x86_64 -fno-common -Wall -Wcast-align -Wshadow -Wmissing-prototypes -Wno-format-zero-length -Woverflow -Wstrict-overflow -Wmissing-format-attribute -Wmissing-prototypes -Wreturn-type -Wmissing-braces -Wparentheses -Wswitch -Wunused-function -Wunused-label -Wunused-variable -Wunused-value -Wunknown-pragmas -Wsign-compare -Wnewline-eof -Werror=uninitialized -Werror=pointer-arith -Werror=declaration-after-statement -Werror-implicit-function-declaration  -c data.c
1148:info:build : updated OBJS.ST
1149:info:build rm -f libss.a
1150:info:build building static ss library
1151:info:build set -x; objlist=`set -x && perl -p -e 'BEGIN { $SIG{__WARN__} = sub {die @_} }; $e=$ARGV; $e =~ s/OBJS\...$//; s/^/ /; s/ $//; s/ / $e/g;' OBJS.ST` && ar cq libss.a $objlist
1152:info:build ++ set -x
1153:info:build ++ perl -p -e 'BEGIN { $SIG{__WARN__} = sub {die @_} }; $e=$ARGV; $e =~ s/OBJS\...$//; s/^/ /; s/ $//; s/ / $e/g;' OBJS.ST
1154:info:build + objlist=' ss_err.o std_rqs.o invocation.o help.o execute_cmd.o listen.o parse.o error.o prompt.o request_tbl.o list_rqs.o pager.o requests.o data.o'
1155:info:build + ar cq libss.a ss_err.o std_rqs.o invocation.o help.o execute_cmd.o listen.o parse.o error.o prompt.o request_tbl.o list_rqs.o pager.o requests.o data.o
1156:info:build ranlib libss.a
1157:info:build rm -f ../../lib/libss.a
1158:info:build (cd ../../lib && ln -s ../util/ss/libss.a .)
1159:info:build make[2]: Leaving directory `/opt/var/macports/build/_opt_var_macports_sources_rsync.macports.org_release_tarballs_ports_net_kerberos5/kerberos5/work/krb5-1.13.1-final/src/util/ss'
1160:info:build making all in util/profile...
1161:info:build make[2]: Entering directory `/opt/var/macports/build/_opt_var_macports_sources_rsync.macports.org_release_tarballs_ports_net_kerberos5/kerberos5/work/krb5-1.13.1-final/src/util/profile'
1162:info:build making all in util/profile/testmod...
1163:info:build make[3]: Entering directory `/opt/var/macports/build/_opt_var_macports_sources_rsync.macports.org_release_tarballs_ports_net_kerberos5/kerberos5/work/krb5-1.13.1-final/src/util/profile/testmod'
1164:info:build make[3]: Leaving directory `/opt/var/macports/build/_opt_var_macports_sources_rsync.macports.org_release_tarballs_ports_net_kerberos5/kerberos5/work/krb5-1.13.1-final/src/util/profile/testmod'
1165:info:build rm -f et-h-prof_err.et et-h-prof_err.c et-h-prof_err.h
1166:info:build cp prof_err.et et-h-prof_err.et
1167:info:build compile_et et-h-prof_err.et
1168:info:build mv -f et-h-prof_err.h prof_err.h
1169:info:build rm -f et-h-prof_err.et et-h-prof_err.c
1170:info:build cat ./profile.hin prof_err.h > profile.h
1171:info:build cp profile.h "../../include/profile.h"
1172:info:build /usr/bin/clang  -DSHARED -DHAVE_CONFIG_H -DHAS_STDARG -DLIBDIR=\"/opt/lib\" -I../../include -I../../include -I.  -DKRB5_DEPRECATED=1 -DKRB5_PRIVATE -I/opt/include -pipe -Os -arch x86_64 -fno-common -Wall -Wcast-align -Wshadow -Wmissing-prototypes -Wno-format-zero-length -Woverflow -Wstrict-overflow -Wmissing-format-attribute -Wmissing-prototypes -Wreturn-type -Wmissing-braces -Wparentheses -Wswitch -Wunused-function -Wunused-label -Wunused-variable -Wunused-value -Wunknown-pragmas -Wsign-compare -Wnewline-eof -Werror=uninitialized -Werror=pointer-arith -Werror=declaration-after-statement -Werror-implicit-function-declaration  -c prof_tree.c -o prof_tree.so.o && mv -f prof_tree.so.o prof_tree.so
1173:info:build /usr/bin/clang  -DSHARED -DHAVE_CONFIG_H -DHAS_STDARG -DLIBDIR=\"/opt/lib\" -I../../include -I../../include -I.  -DKRB5_DEPRECATED=1 -DKRB5_PRIVATE -I/opt/include -pipe -Os -arch x86_64 -fno-common -Wall -Wcast-align -Wshadow -Wmissing-prototypes -Wno-format-zero-length -Woverflow -Wstrict-overflow -Wmissing-format-attribute -Wmissing-prototypes -Wreturn-type -Wmissing-braces -Wparentheses -Wswitch -Wunused-function -Wunused-label -Wunused-variable -Wunused-value -Wunknown-pragmas -Wsign-compare -Wnewline-eof -Werror=uninitialized -Werror=pointer-arith -Werror=declaration-after-statement -Werror-implicit-function-declaration  -c prof_file.c -o prof_file.so.o && mv -f prof_file.so.o prof_file.so
1174:info:build /usr/bin/clang  -DSHARED -DHAVE_CONFIG_H -DHAS_STDARG -DLIBDIR=\"/opt/lib\" -I../../include -I../../include -I.  -DKRB5_DEPRECATED=1 -DKRB5_PRIVATE -I/opt/include -pipe -Os -arch x86_64 -fno-common -Wall -Wcast-align -Wshadow -Wmissing-prototypes -Wno-format-zero-length -Woverflow -Wstrict-overflow -Wmissing-format-attribute -Wmissing-prototypes -Wreturn-type -Wmissing-braces -Wparentheses -Wswitch -Wunused-function -Wunused-label -Wunused-variable -Wunused-value -Wunknown-pragmas -Wsign-compare -Wnewline-eof -Werror=uninitialized -Werror=pointer-arith -Werror=declaration-after-statement -Werror-implicit-function-declaration  -c prof_parse.c -o prof_parse.so.o && mv -f prof_parse.so.o prof_parse.so
1175:info:build /usr/bin/clang  -DSHARED -DHAVE_CONFIG_H -DHAS_STDARG -DLIBDIR=\"/opt/lib\" -I../../include -I../../include -I.  -DKRB5_DEPRECATED=1 -DKRB5_PRIVATE -I/opt/include -pipe -Os -arch x86_64 -fno-common -Wall -Wcast-align -Wshadow -Wmissing-prototypes -Wno-format-zero-length -Woverflow -Wstrict-overflow -Wmissing-format-attribute -Wmissing-prototypes -Wreturn-type -Wmissing-braces -Wparentheses -Wswitch -Wunused-function -Wunused-label -Wunused-variable -Wunused-value -Wunknown-pragmas -Wsign-compare -Wnewline-eof -Werror=uninitialized -Werror=pointer-arith -Werror=declaration-after-statement -Werror-implicit-function-declaration  -c prof_get.c -o prof_get.so.o && mv -f prof_get.so.o prof_get.so
1176:info:build /usr/bin/clang  -DSHARED -DHAVE_CONFIG_H -DHAS_STDARG -DLIBDIR=\"/opt/lib\" -I../../include -I../../include -I.  -DKRB5_DEPRECATED=1 -DKRB5_PRIVATE -I/opt/include -pipe -Os -arch x86_64 -fno-common -Wall -Wcast-align -Wshadow -Wmissing-prototypes -Wno-format-zero-length -Woverflow -Wstrict-overflow -Wmissing-format-attribute -Wmissing-prototypes -Wreturn-type -Wmissing-braces -Wparentheses -Wswitch -Wunused-function -Wunused-label -Wunused-variable -Wunused-value -Wunknown-pragmas -Wsign-compare -Wnewline-eof -Werror=uninitialized -Werror=pointer-arith -Werror=declaration-after-statement -Werror-implicit-function-declaration  -c prof_set.c -o prof_set.so.o && mv -f prof_set.so.o prof_set.so
1177:info:build rm -f et-c-prof_err.et et-c-prof_err.c et-c-prof_err.h
1178:info:build cp prof_err.et et-c-prof_err.et
1179:info:build compile_et et-c-prof_err.et
1180:info:build mv -f et-c-prof_err.c prof_err.c
1181:info:build rm -f et-c-prof_err.et et-c-prof_err.h
1182:info:build /usr/bin/clang  -DSHARED -DHAVE_CONFIG_H -DHAS_STDARG -DLIBDIR=\"/opt/lib\" -I../../include -I../../include -I.  -DKRB5_DEPRECATED=1 -DKRB5_PRIVATE -I/opt/include -pipe -Os -arch x86_64 -fno-common -Wall -Wcast-align -Wshadow -Wmissing-prototypes -Wno-format-zero-length -Woverflow -Wstrict-overflow -Wmissing-format-attribute -Wmissing-prototypes -Wreturn-type -Wmissing-braces -Wparentheses -Wswitch -Wunused-function -Wunused-label -Wunused-variable -Wunused-value -Wunknown-pragmas -Wsign-compare -Wnewline-eof -Werror=uninitialized -Werror=pointer-arith -Werror=declaration-after-statement -Werror-implicit-function-declaration  -c prof_err.c -o prof_err.so.o && mv -f prof_err.so.o prof_err.so
1183:info:build /usr/bin/clang  -DSHARED -DHAVE_CONFIG_H -DHAS_STDARG -DLIBDIR=\"/opt/lib\" -I../../include -I../../include -I.  -DKRB5_DEPRECATED=1 -DKRB5_PRIVATE -I/opt/include -pipe -Os -arch x86_64 -fno-common -Wall -Wcast-align -Wshadow -Wmissing-prototypes -Wno-format-zero-length -Woverflow -Wstrict-overflow -Wmissing-format-attribute -Wmissing-prototypes -Wreturn-type -Wmissing-braces -Wparentheses -Wswitch -Wunused-function -Wunused-label -Wunused-variable -Wunused-value -Wunknown-pragmas -Wsign-compare -Wnewline-eof -Werror=uninitialized -Werror=pointer-arith -Werror=declaration-after-statement -Werror-implicit-function-declaration  -c prof_init.c -o prof_init.so.o && mv -f prof_init.so.o prof_init.so
1184:info:build : updated OBJS.SH
1185:info:build sed > darwin-exports.tmp < ./libprofile.exports "s/^/_/"
1186:info:build mv -f darwin-exports.tmp darwin.exports
1187:info:build rm -f libprofile.1.1.dylib
1188:info:build building shared profile library (1.1)
1189:info:build set -x; objlist=`set -x && perl -p -e 'BEGIN { $SIG{__WARN__} = sub {die @_} }; $e=$ARGV; $e =~ s/OBJS\...$//; s/^/ /; s/ $//; s/ / $e/g;' OBJS.SH` && /usr/bin/clang -undefined error -dead_strip -dynamiclib -compatibility_version 1 -current_version 1.1 -install_name "/opt/lib/libprofile.1.1.dylib" -exported_symbols_list darwin.exports -pipe -Os -arch x86_64 -fno-common -o libprofile.1.1.dylib $objlist -L../../lib -lcom_err -lkrb5support -lcrypto -lresolv  -Wl,-headerpad_max_install_names -arch x86_64 -Wl,-search_paths_first
1190:info:build ++ set -x
1191:info:build ++ perl -p -e 'BEGIN { $SIG{__WARN__} = sub {die @_} }; $e=$ARGV; $e =~ s/OBJS\...$//; s/^/ /; s/ $//; s/ / $e/g;' OBJS.SH
1192:info:build + objlist=' prof_tree.so prof_file.so prof_parse.so prof_get.so prof_set.so prof_err.so prof_init.so'
1193:info:build + /usr/bin/clang -undefined error -dead_strip -dynamiclib -compatibility_version 1 -current_version 1.1 -install_name /opt/lib/libprofile.1.1.dylib -exported_symbols_list darwin.exports -pipe -Os -arch x86_64 -fno-common -o libprofile.1.1.dylib prof_tree.so prof_file.so prof_parse.so prof_get.so prof_set.so prof_err.so prof_init.so -L../../lib -lcom_err -lkrb5support -lcrypto -lresolv -Wl,-headerpad_max_install_names -arch x86_64 -Wl,-search_paths_first
1194:info:build Undefined symbols for architecture x86_64:
1195:info:build   "__et_list", referenced from:
1196:info:build       _initialize_prof_error_table in prof_err.so
1197:info:build ld: symbol(s) not found for architecture x86_64
1198:info:build clang: error: linker command failed with exit code 1 (use -v to see invocation)
1199:info:build make[2]: *** [libprofile.1.1.dylib] Error 1
1200:info:build make[2]: Leaving directory `/opt/var/macports/build/_opt_var_macports_sources_rsync.macports.org_release_tarballs_ports_net_kerberos5/kerberos5/work/krb5-1.13.1-final/src/util/profile'
1201:info:build make[1]: *** [all-recurse] Error 1
1202:info:build make[1]: Leaving directory `/opt/var/macports/build/_opt_var_macports_sources_rsync.macports.org_release_tarballs_ports_net_kerberos5/kerberos5/work/krb5-1.13.1-final/src/util'
1203:info:build make: *** [all-recurse] Error 1
1204:info:build make: Leaving directory `/opt/var/macports/build/_opt_var_macports_sources_rsync.macports.org_release_tarballs_ports_net_kerberos5/kerberos5/work/krb5-1.13.1-final/src'
1205:info:build Command failed:  cd "/opt/var/macports/build/_opt_var_macports_sources_rsync.macports.org_release_tarballs_ports_net_kerberos5/kerberos5/work/krb5-1.13.1-final/src" && /usr/bin/make -w all
1206:info:build Exit code: 2
1207:error:build org.macports.build for port kerberos5 returned: command execution failed
1208:debug:build Error code: CHILDSTATUS 61764 2
1209:debug:build Backtrace: command execution failed
1210    while executing
1211"system -nice 0 $fullcmdstring"
1212    ("eval" body line 1)
1213    invoked from within
1214"eval system $notty $nice \$fullcmdstring"
1215    invoked from within
1216"command_exec build"
1217    (procedure "portbuild::build_main" line 8)
1218    invoked from within
1219"portbuild::build_main org.macports.build"
1220    ("eval" body line 1)
1221    invoked from within
1222"eval $procedure $targetname"
1223:info:build Warning: targets not executed for kerberos5: org.macports.activate org.macports.build org.macports.destroot org.macports.install
1224:notice:build Please see the log file for port kerberos5 for details:
1225    /opt/var/macports/logs/_opt_var_macports_sources_rsync.macports.org_release_tarballs_ports_net_kerberos5/kerberos5/main.log