Ticket #48261: main.log

File main.log, 149.1 KB (added by fluzzygib@…, 6 years ago)

Main.log as requested

Line 
1version:1
2:debug:main Attempting ln -sf /opt/local/var/macports/build/_opt_local_var_macports_sources_rsync.macports.org_release_tarballs_ports_science_volk/volk/work /opt/local/var/macports/sources/rsync.macports.org/release/tarballs/ports/science/volk/work
3:debug:main changing euid/egid - current euid: 0 - current egid: 0
4:debug:main egid changed to: 501
5:debug:main euid changed to: 502
6:debug:main Executing org.macports.main (volk)
7:debug:main Privilege de-escalation not attempted as not running as root.
8:debug:archivefetch archivefetch phase started at Sun Jul  5 23:34:30 EDT 2015
9:msg:archivefetch --->  Fetching archive for volk
10:debug:archivefetch Executing org.macports.archivefetch (volk)
11:debug:archivefetch euid/egid changed to: 0/0
12:debug:archivefetch chowned /opt/local/var/macports/incoming to macports
13:debug:archivefetch euid/egid changed to: 502/501
14:info:archivefetch --->  volk-20150523_0+docs+orc.darwin_11.x86_64.tbz2 doesn't seem to exist in /opt/local/var/macports/incoming/verified
15:msg:archivefetch --->  Attempting to fetch volk-20150523_0+docs+orc.darwin_11.x86_64.tbz2 from http://packages.macports.org/volk
16:debug:archivefetch Fetching archive failed:: The requested URL returned error: 404
17:msg:archivefetch --->  Attempting to fetch volk-20150523_0+docs+orc.darwin_11.x86_64.tbz2 from http://nue.de.packages.macports.org/macports/packages/volk
18:debug:archivefetch Fetching archive failed:: The requested URL returned error: 404
19:msg:archivefetch --->  Attempting to fetch volk-20150523_0+docs+orc.darwin_11.x86_64.tbz2 from http://mse.uk.packages.macports.org/sites/packages.macports.org/volk
20:debug:archivefetch Fetching archive failed:: The requested URL returned error: 404
21:debug:archivefetch Privilege de-escalation not attempted as not running as root.
22:debug:fetch fetch phase started at Sun Jul  5 23:34:33 EDT 2015
23:notice:fetch --->  Fetching distfiles for volk
24:debug:fetch Executing org.macports.fetch (volk)
25:debug:fetch Privilege de-escalation not attempted as not running as root.
26:debug:checksum checksum phase started at Sun Jul  5 23:34:33 EDT 2015
27:notice:checksum --->  Verifying checksums for volk
28:debug:checksum Executing org.macports.checksum (volk)
29:info:checksum --->  Checksumming volk-8a16928a7e2ae5c5949ddeeb5479e642da9d68d7.tar.gz
30:debug:checksum Calculated (rmd160) is eb46ecf5ccf24a7a356b107b1f0bce7cc66202ff
31:debug:checksum Correct (rmd160) checksum for volk-8a16928a7e2ae5c5949ddeeb5479e642da9d68d7.tar.gz
32:debug:checksum Calculated (sha256) is 7e53f6ff69873f7dc102164b3c1985af1992c88ad674d0fdb92e10b4dcc3445d
33:debug:checksum Correct (sha256) checksum for volk-8a16928a7e2ae5c5949ddeeb5479e642da9d68d7.tar.gz
34:debug:checksum Privilege de-escalation not attempted as not running as root.
35:debug:extract extract phase started at Sun Jul  5 23:34:33 EDT 2015
36:notice:extract --->  Extracting volk
37:debug:extract Executing proc-pre-org.macports.extract-extract-0
38:debug:extract Executing org.macports.extract (volk)
39:info:extract --->  Extracting volk-8a16928a7e2ae5c5949ddeeb5479e642da9d68d7.tar.gz
40:debug:extract setting option extract.args to '/opt/local/var/macports/distfiles/volk/volk-8a16928a7e2ae5c5949ddeeb5479e642da9d68d7.tar.gz'
41:debug:extract Environment:
42CC_PRINT_OPTIONS='YES'
43CC_PRINT_OPTIONS_FILE='/opt/local/var/macports/build/_opt_local_var_macports_sources_rsync.macports.org_release_tarballs_ports_science_volk/volk/work/.CC_PRINT_OPTIONS'
44CPATH='/opt/local/include'
45LIBRARY_PATH='/opt/local/lib'
46MACOSX_DEPLOYMENT_TARGET='10.7'
47:debug:extract Assembled command: 'cd "/opt/local/var/macports/build/_opt_local_var_macports_sources_rsync.macports.org_release_tarballs_ports_science_volk/volk/work" && /usr/bin/gzip -dc '/opt/local/var/macports/distfiles/volk/volk-8a16928a7e2ae5c5949ddeeb5479e642da9d68d7.tar.gz' | /usr/bin/gnutar --no-same-owner -xf -'
48:debug:extract Executing command line:  cd "/opt/local/var/macports/build/_opt_local_var_macports_sources_rsync.macports.org_release_tarballs_ports_science_volk/volk/work" && /usr/bin/gzip -dc '/opt/local/var/macports/distfiles/volk/volk-8a16928a7e2ae5c5949ddeeb5479e642da9d68d7.tar.gz' | /usr/bin/gnutar --no-same-owner -xf -
49:debug:extract euid/egid changed to: 0/0
50:debug:extract chowned /opt/local/var/macports/build/_opt_local_var_macports_sources_rsync.macports.org_release_tarballs_ports_science_volk/volk/work to macports
51:debug:extract euid/egid changed to: 502/501
52:debug:extract Executing proc-post-org.macports.extract-extract-0
53:debug:extract Privilege de-escalation not attempted as not running as root.
54:debug:patch patch phase started at Sun Jul  5 23:34:33 EDT 2015
55:debug:patch Executing org.macports.patch (volk)
56:notice:patch --->  Applying patches to volk
57:info:patch --->  Applying patch-add-back-cpuid.diff
58:debug:patch Environment:
59CC_PRINT_OPTIONS='YES'
60CC_PRINT_OPTIONS_FILE='/opt/local/var/macports/build/_opt_local_var_macports_sources_rsync.macports.org_release_tarballs_ports_science_volk/volk/work/.CC_PRINT_OPTIONS'
61CPATH='/opt/local/include'
62LIBRARY_PATH='/opt/local/lib'
63MACOSX_DEPLOYMENT_TARGET='10.7'
64:debug:patch Assembled command: 'cd "/opt/local/var/macports/build/_opt_local_var_macports_sources_rsync.macports.org_release_tarballs_ports_science_volk/volk/work/volk-8a16928a7e2ae5c5949ddeeb5479e642da9d68d7" && /usr/bin/patch -p0'
65:debug:patch Executing command line:  cd "/opt/local/var/macports/build/_opt_local_var_macports_sources_rsync.macports.org_release_tarballs_ports_science_volk/volk/work/volk-8a16928a7e2ae5c5949ddeeb5479e642da9d68d7" && /usr/bin/patch -p0 < '/opt/local/var/macports/sources/rsync.macports.org/release/tarballs/ports/science/volk/files/patch-add-back-cpuid.diff'
66:info:patch patching file lib/gcc_x86_cpuid.h
67:info:patch patching file tmpl/volk_cpu.tmpl.c
68:debug:patch Privilege de-escalation not attempted as not running as root.
69:debug:configure configure phase started at Sun Jul  5 23:34:34 EDT 2015
70:notice:configure --->  Configuring volk
71:debug:configure Using compiler 'Xcode Clang'
72:debug:configure Executing proc-pre-org.macports.configure-configure-0
73:debug:configure Executing proc-pre-org.macports.configure-configure-1
74:debug:configure Executing org.macports.configure (volk)
75:debug:configure Environment:
76CC='/usr/bin/clang'
77CC_PRINT_OPTIONS='YES'
78CC_PRINT_OPTIONS_FILE='/opt/local/var/macports/build/_opt_local_var_macports_sources_rsync.macports.org_release_tarballs_ports_science_volk/volk/work/.CC_PRINT_OPTIONS'
79CFLAGS='-pipe -Os -arch x86_64'
80CPATH='/opt/local/include'
81CPPFLAGS='-I/opt/local/include'
82CXX='/usr/bin/clang++'
83CXXFLAGS='-pipe -Os -arch x86_64 -stdlib=libstdc++'
84F77FLAGS='-m64'
85F90FLAGS='-pipe -Os -m64'
86FCFLAGS='-pipe -Os -m64'
87FFLAGS='-pipe -Os'
88INSTALL='/usr/bin/install -c'
89LDFLAGS='-Wl,-headerpad_max_install_names -arch x86_64'
90LIBRARY_PATH='/opt/local/lib'
91MACOSX_DEPLOYMENT_TARGET='10.7'
92OBJC='/usr/bin/clang'
93OBJCFLAGS='-pipe -Os -arch x86_64'
94OBJCXX='/usr/bin/clang++'
95OBJCXXFLAGS='-pipe -Os -arch x86_64 -stdlib=libstdc++'
96:debug:configure Assembled command: 'cd "/opt/local/var/macports/build/_opt_local_var_macports_sources_rsync.macports.org_release_tarballs_ports_science_volk/volk/work/build" && /opt/local/bin/cmake -DCMAKE_INSTALL_PREFIX=/opt/local -DCMAKE_VERBOSE_MAKEFILE=ON -DCMAKE_COLOR_MAKEFILE=ON -DCMAKE_BUILD_TYPE=Release -DCMAKE_BUILD_WITH_INSTALL_RPATH=ON -DCMAKE_INSTALL_RPATH=/opt/local/lib -DCMAKE_INSTALL_NAME_DIR=/opt/local/lib -DCMAKE_SYSTEM_PREFIX_PATH="/opt/local;/usr" -DCMAKE_MODULE_PATH=/opt/local/share/cmake/Modules -DCMAKE_FIND_FRAMEWORK=LAST -Wno-dev -DVOLK_GIT_COUNT="MacPorts" -DVOLK_GIT_HASH="git-8a16928a(20150523)" -DCMAKE_MODULES_DIR=/opt/local/share/cmake -DPYTHON_EXECUTABLE=/opt/local/Library/Frameworks/Python.framework/Versions/2.7/bin/python2.7 -DVOLK_PYTHON_DIR=/opt/local/Library/Frameworks/Python.framework/Versions/2.7/lib/python2.7/site-packages -DDOXYGEN_EXECUTABLE=/opt/local/bin/doxygen -DORCC_EXECUTABLE=/opt/local/bin/orcc -DORC_INCLUDE_DIR=/opt/local/include/orc-0.4 -DORC_LIBRARY_DIR=/opt/local/lib -DCMAKE_C_FLAGS_RELEASE="-DNDEBUG" -DCMAKE_CXX_FLAGS_RELEASE="-DNDEBUG" -DCMAKE_OSX_ARCHITECTURES="x86_64" -DCMAKE_OSX_DEPLOYMENT_TARGET="10.7" -DCMAKE_OSX_SYSROOT="/" /opt/local/var/macports/build/_opt_local_var_macports_sources_rsync.macports.org_release_tarballs_ports_science_volk/volk/work/volk-8a16928a7e2ae5c5949ddeeb5479e642da9d68d7'
97:debug:configure Executing command line:  cd "/opt/local/var/macports/build/_opt_local_var_macports_sources_rsync.macports.org_release_tarballs_ports_science_volk/volk/work/build" && /opt/local/bin/cmake -DCMAKE_INSTALL_PREFIX=/opt/local -DCMAKE_VERBOSE_MAKEFILE=ON -DCMAKE_COLOR_MAKEFILE=ON -DCMAKE_BUILD_TYPE=Release -DCMAKE_BUILD_WITH_INSTALL_RPATH=ON -DCMAKE_INSTALL_RPATH=/opt/local/lib -DCMAKE_INSTALL_NAME_DIR=/opt/local/lib -DCMAKE_SYSTEM_PREFIX_PATH="/opt/local;/usr" -DCMAKE_MODULE_PATH=/opt/local/share/cmake/Modules -DCMAKE_FIND_FRAMEWORK=LAST -Wno-dev -DVOLK_GIT_COUNT="MacPorts" -DVOLK_GIT_HASH="git-8a16928a(20150523)" -DCMAKE_MODULES_DIR=/opt/local/share/cmake -DPYTHON_EXECUTABLE=/opt/local/Library/Frameworks/Python.framework/Versions/2.7/bin/python2.7 -DVOLK_PYTHON_DIR=/opt/local/Library/Frameworks/Python.framework/Versions/2.7/lib/python2.7/site-packages -DDOXYGEN_EXECUTABLE=/opt/local/bin/doxygen -DORCC_EXECUTABLE=/opt/local/bin/orcc -DORC_INCLUDE_DIR=/opt/local/include/orc-0.4 -DORC_LIBRARY_DIR=/opt/local/lib -DCMAKE_C_FLAGS_RELEASE="-DNDEBUG" -DCMAKE_CXX_FLAGS_RELEASE="-DNDEBUG" -DCMAKE_OSX_ARCHITECTURES="x86_64" -DCMAKE_OSX_DEPLOYMENT_TARGET="10.7" -DCMAKE_OSX_SYSROOT="/" /opt/local/var/macports/build/_opt_local_var_macports_sources_rsync.macports.org_release_tarballs_ports_science_volk/volk/work/volk-8a16928a7e2ae5c5949ddeeb5479e642da9d68d7
98:info:configure -- The C compiler identification is AppleClang 4.2.0.4250028
99:info:configure -- The CXX compiler identification is AppleClang 4.2.0.4250028
100:info:configure -- Check for working C compiler: /Applications/Xcode.app/Contents/Developer/Toolchains/XcodeDefault.xctoolchain/usr/bin/clang
101:info:configure -- Check for working C compiler: /Applications/Xcode.app/Contents/Developer/Toolchains/XcodeDefault.xctoolchain/usr/bin/clang -- works
102:info:configure -- Detecting C compiler ABI info
103:info:configure -- Detecting C compiler ABI info - done
104:info:configure -- Detecting C compile features
105:info:configure -- Detecting C compile features - done
106:info:configure -- Check for working CXX compiler: /Applications/Xcode.app/Contents/Developer/Toolchains/XcodeDefault.xctoolchain/usr/bin/clang++
107:info:configure -- Check for working CXX compiler: /Applications/Xcode.app/Contents/Developer/Toolchains/XcodeDefault.xctoolchain/usr/bin/clang++ -- works
108:info:configure -- Detecting CXX compiler ABI info
109:info:configure -- Detecting CXX compiler ABI info - done
110:info:configure -- Detecting CXX compile features
111:info:configure -- Detecting CXX compile features - done
112:info:configure -- Build type set to Release.
113:info:configure -- Found Git: /usr/bin/git (found version "1.7.12.4 (Apple Git-37)")
114:info:configure --
115:info:configure -- Python checking for python >= 2.5
116:info:configure -- Python checking for python >= 2.5 - found
117:info:configure --
118:info:configure -- Python checking for Cheetah >= 2.0.0
119:info:configure -- Python checking for Cheetah >= 2.0.0 - found
120:info:configure -- Boost version: 1.58.0
121:info:configure -- Found the following Boost libraries:
122:info:configure --   filesystem
123:info:configure --   system
124:info:configure --   unit_test_framework
125:info:configure --   program_options
126:info:configure -- Found PkgConfig: /opt/local/bin/pkg-config (found version "0.28")
127:info:configure -- checking for module 'orc-0.4 > 0.4.11'
128:info:configure --   found orc-0.4 > 0.4.11, version 0.4.24
129:info:configure -- Found ORC: /opt/local/lib/liborc-0.4.dylib 
130:info:configure -- Found Doxygen: /opt/local/bin/doxygen (found version "1.8.9.1")
131:info:configure -- QA Testing is enabled.
132:info:configure --   Modify using: -DENABLE_TESTING=ON/OFF
133:info:configure -- Looking for cpuid.h
134:info:configure -- Looking for cpuid.h - found
135:info:configure -- Looking for intrin.h
136:info:configure -- Looking for intrin.h - not found
137:info:configure -- Looking for fenv.h
138:info:configure -- Looking for fenv.h - found
139:info:configure -- Looking for dlfcn.h
140:info:configure -- Looking for dlfcn.h - found
141:info:configure -- Compiler name: Clang
142:info:configure -- Looking for posix_memalign
143:info:configure -- Looking for posix_memalign - found
144:info:configure -- x86* CPU detected
145:info:configure -- Performing Test have_m64
146:info:configure -- Performing Test have_m64 - Success
147:info:configure -- Performing Test have_m3dnow
148:info:configure -- Performing Test have_m3dnow - Success
149:info:configure -- Performing Test have_msse4_2
150:info:configure -- Performing Test have_msse4_2 - Success
151:info:configure -- Performing Test have_mpopcnt
152:info:configure -- Performing Test have_mpopcnt - Success
153:info:configure -- Performing Test have_mmmx
154:info:configure -- Performing Test have_mmmx - Success
155:info:configure -- Performing Test have_msse
156:info:configure -- Performing Test have_msse - Success
157:info:configure -- Performing Test have_msse2
158:info:configure -- Performing Test have_msse2 - Success
159:info:configure -- Performing Test have_msse3
160:info:configure -- Performing Test have_msse3 - Success
161:info:configure -- Performing Test have_mssse3
162:info:configure -- Performing Test have_mssse3 - Success
163:info:configure -- Performing Test have_msse4a
164:info:configure -- Performing Test have_msse4a - Success
165:info:configure -- Performing Test have_msse4_1
166:info:configure -- Performing Test have_msse4_1 - Success
167:info:configure -- Performing Test have_mavx
168:info:configure -- Performing Test have_mavx - Success
169:info:configure -- Compiler missing cvtpi32_ps instrinsic, Overruled arch avx
170:info:configure -- Check size of void*[8]
171:info:configure -- Check size of void*[8] - done
172:info:configure -- CPU width is 64 bits, Overruled arch 32
173:info:configure -- Available architectures: generic;64;3dnow;abm;popcount;mmx;sse;sse2;orc;norc;sse3;ssse3;sse4_a;sse4_1;sse4_2
174:info:configure -- Available machines: generic_orc;sse2_64_mmx_orc;sse3_64_orc;ssse3_64_orc;sse4_a_64_orc;sse4_1_64_orc;sse4_2_64_orc
175:info:configure -- BUILD TYPE = RELEASE
176:info:configure -- Base cflags = -DNDEBUG -pipe -Os -arch x86_64  -Wall
177:info:configure -- BUILD INFO ::: generic_orc ::: Clang ::: -DNDEBUG -pipe -Os -arch x86_64  -Wall
178:info:configure -- BUILD INFO ::: sse2_64_mmx_orc ::: Clang ::: -DNDEBUG -pipe -Os -arch x86_64  -Wall -m64 -mmmx -msse -msse2
179:info:configure -- BUILD INFO ::: sse3_64_orc ::: Clang ::: -DNDEBUG -pipe -Os -arch x86_64  -Wall -m64 -mmmx -msse -msse2 -msse3
180:info:configure -- BUILD INFO ::: ssse3_64_orc ::: Clang ::: -DNDEBUG -pipe -Os -arch x86_64  -Wall -m64 -mmmx -msse -msse2 -msse3 -mssse3
181:info:configure -- BUILD INFO ::: sse4_a_64_orc ::: Clang ::: -DNDEBUG -pipe -Os -arch x86_64  -Wall -m64 -mmmx -msse -msse2 -msse3 -msse4a -mpopcnt
182:info:configure -- BUILD INFO ::: sse4_1_64_orc ::: Clang ::: -DNDEBUG -pipe -Os -arch x86_64  -Wall -m64 -mmmx -msse -msse2 -msse3 -mssse3 -msse4.1
183:info:configure -- BUILD INFO ::: sse4_2_64_orc ::: Clang ::: -DNDEBUG -pipe -Os -arch x86_64  -Wall -m64 -mmmx -msse -msse2 -msse3 -mssse3 -msse4.1 -msse4.2 -mpopcnt
184:info:configure -- Compiler Version: Apple LLVM version 4.2 (clang-425.0.28) (based on LLVM 3.2svn)
185:info:configure Target: x86_64-apple-darwin11.4.2
186:info:configure Thread model: posix
187:info:configure -- The ASM compiler identification is Clang
188:info:configure -- Found assembler: /Applications/Xcode.app/Contents/Developer/Toolchains/XcodeDefault.xctoolchain/usr/bin/clang
189:info:configure -- c flags: -pipe -Os -arch x86_64  -Wall;
190:info:configure -- asm flags:
191:info:configure -- Loading build date Mon, 06 Jul 2015 03:34:47 into constants...
192:info:configure -- Loading version v1.1-MacPorts-git-8a16928a(20150523) into constants...
193:info:configure -- Using install prefix: /opt/local
194:info:configure -- Configuring done
195:info:configure -- Generating done
196:info:configure -- Build files have been written to: /opt/local/var/macports/build/_opt_local_var_macports_sources_rsync.macports.org_release_tarballs_ports_science_volk/volk/work/build
197:debug:configure Privilege de-escalation not attempted as not running as root.
198:debug:build build phase started at Sun Jul  5 23:34:47 EDT 2015
199:notice:build --->  Building volk
200:debug:build Executing org.macports.build (volk)
201:debug:build Environment:
202CC_PRINT_OPTIONS='YES'
203CC_PRINT_OPTIONS_FILE='/opt/local/var/macports/build/_opt_local_var_macports_sources_rsync.macports.org_release_tarballs_ports_science_volk/volk/work/.CC_PRINT_OPTIONS'
204CPATH='/opt/local/include'
205LIBRARY_PATH='/opt/local/lib'
206MACOSX_DEPLOYMENT_TARGET='10.7'
207:debug:build Assembled command: 'cd "/opt/local/var/macports/build/_opt_local_var_macports_sources_rsync.macports.org_release_tarballs_ports_science_volk/volk/work/build" && /usr/bin/make -j4 -w all VERBOSE=ON'
208:debug:build Executing command line:  cd "/opt/local/var/macports/build/_opt_local_var_macports_sources_rsync.macports.org_release_tarballs_ports_science_volk/volk/work/build" && /usr/bin/make -j4 -w all VERBOSE=ON
209:info:build make: Entering directory `/opt/local/var/macports/build/_opt_local_var_macports_sources_rsync.macports.org_release_tarballs_ports_science_volk/volk/work/build'
210:info:build /opt/local/bin/cmake -H/opt/local/var/macports/build/_opt_local_var_macports_sources_rsync.macports.org_release_tarballs_ports_science_volk/volk/work/volk-8a16928a7e2ae5c5949ddeeb5479e642da9d68d7 -B/opt/local/var/macports/build/_opt_local_var_macports_sources_rsync.macports.org_release_tarballs_ports_science_volk/volk/work/build --check-build-system CMakeFiles/Makefile.cmake 0
211:info:build /opt/local/bin/cmake -E cmake_progress_start /opt/local/var/macports/build/_opt_local_var_macports_sources_rsync.macports.org_release_tarballs_ports_science_volk/volk/work/build/CMakeFiles /opt/local/var/macports/build/_opt_local_var_macports_sources_rsync.macports.org_release_tarballs_ports_science_volk/volk/work/build/CMakeFiles/progress.marks
212:info:build /usr/bin/make -f CMakeFiles/Makefile2 all
213:info:build make[1]: Entering directory `/opt/local/var/macports/build/_opt_local_var_macports_sources_rsync.macports.org_release_tarballs_ports_science_volk/volk/work/build'
214:info:build /usr/bin/make -f lib/CMakeFiles/volk_obj.dir/build.make lib/CMakeFiles/volk_obj.dir/depend
215:info:build /usr/bin/make -f python/volk_modtool/CMakeFiles/pygen_python_volk_modtool_5fba6.dir/build.make python/volk_modtool/CMakeFiles/pygen_python_volk_modtool_5fba6.dir/depend
216:info:build /usr/bin/make -f python/volk_modtool/CMakeFiles/pygen_python_volk_modtool_7de50.dir/build.make python/volk_modtool/CMakeFiles/pygen_python_volk_modtool_7de50.dir/depend
217:info:build make[2]: Entering directory `/opt/local/var/macports/build/_opt_local_var_macports_sources_rsync.macports.org_release_tarballs_ports_science_volk/volk/work/build'
218:info:build cd /opt/local/var/macports/build/_opt_local_var_macports_sources_rsync.macports.org_release_tarballs_ports_science_volk/volk/work/build && /opt/local/bin/cmake -E cmake_depends "Unix Makefiles" /opt/local/var/macports/build/_opt_local_var_macports_sources_rsync.macports.org_release_tarballs_ports_science_volk/volk/work/volk-8a16928a7e2ae5c5949ddeeb5479e642da9d68d7 /opt/local/var/macports/build/_opt_local_var_macports_sources_rsync.macports.org_release_tarballs_ports_science_volk/volk/work/volk-8a16928a7e2ae5c5949ddeeb5479e642da9d68d7/python/volk_modtool /opt/local/var/macports/build/_opt_local_var_macports_sources_rsync.macports.org_release_tarballs_ports_science_volk/volk/work/build /opt/local/var/macports/build/_opt_local_var_macports_sources_rsync.macports.org_release_tarballs_ports_science_volk/volk/work/build/python/volk_modtool /opt/local/var/macports/build/_opt_local_var_macports_sources_rsync.macports.org_release_tarballs_ports_science_volk/volk/work/build/python/volk_modtool/CMakeFiles/pygen_python_volk_modtool_5fba6.dir/DependInfo.cmake --color=
219:info:build make[2]: Entering directory `/opt/local/var/macports/build/_opt_local_var_macports_sources_rsync.macports.org_release_tarballs_ports_science_volk/volk/work/build'
220:info:build cd /opt/local/var/macports/build/_opt_local_var_macports_sources_rsync.macports.org_release_tarballs_ports_science_volk/volk/work/build && /opt/local/bin/cmake -E cmake_depends "Unix Makefiles" /opt/local/var/macports/build/_opt_local_var_macports_sources_rsync.macports.org_release_tarballs_ports_science_volk/volk/work/volk-8a16928a7e2ae5c5949ddeeb5479e642da9d68d7 /opt/local/var/macports/build/_opt_local_var_macports_sources_rsync.macports.org_release_tarballs_ports_science_volk/volk/work/volk-8a16928a7e2ae5c5949ddeeb5479e642da9d68d7/python/volk_modtool /opt/local/var/macports/build/_opt_local_var_macports_sources_rsync.macports.org_release_tarballs_ports_science_volk/volk/work/build /opt/local/var/macports/build/_opt_local_var_macports_sources_rsync.macports.org_release_tarballs_ports_science_volk/volk/work/build/python/volk_modtool /opt/local/var/macports/build/_opt_local_var_macports_sources_rsync.macports.org_release_tarballs_ports_science_volk/volk/work/build/python/volk_modtool/CMakeFiles/pygen_python_volk_modtool_7de50.dir/DependInfo.cmake --color=
221:info:build Dependee "/opt/local/var/macports/build/_opt_local_var_macports_sources_rsync.macports.org_release_tarballs_ports_science_volk/volk/work/build/python/volk_modtool/CMakeFiles/pygen_python_volk_modtool_5fba6.dir/DependInfo.cmake" is newer than depender "/opt/local/var/macports/build/_opt_local_var_macports_sources_rsync.macports.org_release_tarballs_ports_science_volk/volk/work/build/python/volk_modtool/CMakeFiles/pygen_python_volk_modtool_5fba6.dir/depend.internal".
222:info:build Dependee "/opt/local/var/macports/build/_opt_local_var_macports_sources_rsync.macports.org_release_tarballs_ports_science_volk/volk/work/build/python/volk_modtool/CMakeFiles/CMakeDirectoryInformation.cmake" is newer than depender "/opt/local/var/macports/build/_opt_local_var_macports_sources_rsync.macports.org_release_tarballs_ports_science_volk/volk/work/build/python/volk_modtool/CMakeFiles/pygen_python_volk_modtool_5fba6.dir/depend.internal".
223:info:build Dependee "/opt/local/var/macports/build/_opt_local_var_macports_sources_rsync.macports.org_release_tarballs_ports_science_volk/volk/work/build/python/volk_modtool/CMakeFiles/pygen_python_volk_modtool_7de50.dir/DependInfo.cmake" is newer than depender "/opt/local/var/macports/build/_opt_local_var_macports_sources_rsync.macports.org_release_tarballs_ports_science_volk/volk/work/build/python/volk_modtool/CMakeFiles/pygen_python_volk_modtool_7de50.dir/depend.internal".
224:info:build Dependee "/opt/local/var/macports/build/_opt_local_var_macports_sources_rsync.macports.org_release_tarballs_ports_science_volk/volk/work/build/python/volk_modtool/CMakeFiles/CMakeDirectoryInformation.cmake" is newer than depender "/opt/local/var/macports/build/_opt_local_var_macports_sources_rsync.macports.org_release_tarballs_ports_science_volk/volk/work/build/python/volk_modtool/CMakeFiles/pygen_python_volk_modtool_7de50.dir/depend.internal".
225:info:build Scanning dependencies of target pygen_python_volk_modtool_5fba6
226:info:build Scanning dependencies of target pygen_python_volk_modtool_7de50
227:info:build make[2]: Leaving directory `/opt/local/var/macports/build/_opt_local_var_macports_sources_rsync.macports.org_release_tarballs_ports_science_volk/volk/work/build'
228:info:build make[2]: Leaving directory `/opt/local/var/macports/build/_opt_local_var_macports_sources_rsync.macports.org_release_tarballs_ports_science_volk/volk/work/build'
229:info:build /usr/bin/make -f python/volk_modtool/CMakeFiles/pygen_python_volk_modtool_5fba6.dir/build.make python/volk_modtool/CMakeFiles/pygen_python_volk_modtool_5fba6.dir/build
230:info:build /usr/bin/make -f python/volk_modtool/CMakeFiles/pygen_python_volk_modtool_7de50.dir/build.make python/volk_modtool/CMakeFiles/pygen_python_volk_modtool_7de50.dir/build
231:info:build make[2]: Entering directory `/opt/local/var/macports/build/_opt_local_var_macports_sources_rsync.macports.org_release_tarballs_ports_science_volk/volk/work/build'
232:info:build /opt/local/bin/cmake -E cmake_progress_report /opt/local/var/macports/build/_opt_local_var_macports_sources_rsync.macports.org_release_tarballs_ports_science_volk/volk/work/build/CMakeFiles 2
233:info:build make[2]: Entering directory `/opt/local/var/macports/build/_opt_local_var_macports_sources_rsync.macports.org_release_tarballs_ports_science_volk/volk/work/build'
234:info:build /opt/local/bin/cmake -E cmake_progress_report /opt/local/var/macports/build/_opt_local_var_macports_sources_rsync.macports.org_release_tarballs_ports_science_volk/volk/work/build/CMakeFiles 3
235:info:build /opt/local/bin/cmake -E cmake_progress_report /opt/local/var/macports/build/_opt_local_var_macports_sources_rsync.macports.org_release_tarballs_ports_science_volk/volk/work/build/CMakeFiles 4
236:info:build [  2%] [  2%] [  3%] make[2]: Entering directory `/opt/local/var/macports/build/_opt_local_var_macports_sources_rsync.macports.org_release_tarballs_ports_science_volk/volk/work/build'
237:info:build /opt/local/bin/cmake -E cmake_progress_report /opt/local/var/macports/build/_opt_local_var_macports_sources_rsync.macports.org_release_tarballs_ports_science_volk/volk/work/build/CMakeFiles 47
238:info:build [  4%] Generating __init__.pyc, cfg.pyc, volk_modtool_generate.pyc
239:info:build Shebangin volk_modtool
240:info:build cd /opt/local/var/macports/build/_opt_local_var_macports_sources_rsync.macports.org_release_tarballs_ports_science_volk/volk/work/build/python/volk_modtool && /opt/local/Library/Frameworks/Python.framework/Versions/2.7/bin/python2.7 -c "open('/opt/local/var/macports/build/_opt_local_var_macports_sources_rsync.macports.org_release_tarballs_ports_science_volk/volk/work/build/python/volk_modtool/volk_modtool.exe','w').write('#!/opt/local/Library/Frameworks/Python.framework/Versions/2.7/bin/python2.7\\n'+open('/opt/local/var/macports/build/_opt_local_var_macports_sources_rsync.macports.org_release_tarballs_ports_science_volk/volk/work/volk-8a16928a7e2ae5c5949ddeeb5479e642da9d68d7/python/volk_modtool/volk_modtool').read())"
241:info:build cd /opt/local/var/macports/build/_opt_local_var_macports_sources_rsync.macports.org_release_tarballs_ports_science_volk/volk/work/build/python/volk_modtool && /opt/local/Library/Frameworks/Python.framework/Versions/2.7/bin/python2.7 /opt/local/var/macports/build/_opt_local_var_macports_sources_rsync.macports.org_release_tarballs_ports_science_volk/volk/work/build/python_compile_helper.py /opt/local/var/macports/build/_opt_local_var_macports_sources_rsync.macports.org_release_tarballs_ports_science_volk/volk/work/volk-8a16928a7e2ae5c5949ddeeb5479e642da9d68d7/python/volk_modtool/__init__.py /opt/local/var/macports/build/_opt_local_var_macports_sources_rsync.macports.org_release_tarballs_ports_science_volk/volk/work/volk-8a16928a7e2ae5c5949ddeeb5479e642da9d68d7/python/volk_modtool/cfg.py /opt/local/var/macports/build/_opt_local_var_macports_sources_rsync.macports.org_release_tarballs_ports_science_volk/volk/work/volk-8a16928a7e2ae5c5949ddeeb5479e642da9d68d7/python/volk_modtool/volk_modtool_generate.py /opt/local/var/macports/build/_opt_local_var_macports_sources_rsync.macports.org_release_tarballs_ports_science_volk/volk/work/build/python/volk_modtool/__init__.pyc /opt/local/var/macports/build/_opt_local_var_macports_sources_rsync.macports.org_release_tarballs_ports_science_volk/volk/work/build/python/volk_modtool/cfg.pyc /opt/local/var/macports/build/_opt_local_var_macports_sources_rsync.macports.org_release_tarballs_ports_science_volk/volk/work/build/python/volk_modtool/volk_modtool_generate.pyc
242:info:build Generating __init__.pyo, cfg.pyo, volk_modtool_generate.pyo
243:info:build cd /opt/local/var/macports/build/_opt_local_var_macports_sources_rsync.macports.org_release_tarballs_ports_science_volk/volk/work/build/python/volk_modtool && /opt/local/Library/Frameworks/Python.framework/Versions/2.7/bin/python2.7 -O /opt/local/var/macports/build/_opt_local_var_macports_sources_rsync.macports.org_release_tarballs_ports_science_volk/volk/work/build/python_compile_helper.py /opt/local/var/macports/build/_opt_local_var_macports_sources_rsync.macports.org_release_tarballs_ports_science_volk/volk/work/volk-8a16928a7e2ae5c5949ddeeb5479e642da9d68d7/python/volk_modtool/__init__.py /opt/local/var/macports/build/_opt_local_var_macports_sources_rsync.macports.org_release_tarballs_ports_science_volk/volk/work/volk-8a16928a7e2ae5c5949ddeeb5479e642da9d68d7/python/volk_modtool/cfg.py /opt/local/var/macports/build/_opt_local_var_macports_sources_rsync.macports.org_release_tarballs_ports_science_volk/volk/work/volk-8a16928a7e2ae5c5949ddeeb5479e642da9d68d7/python/volk_modtool/volk_modtool_generate.py /opt/local/var/macports/build/_opt_local_var_macports_sources_rsync.macports.org_release_tarballs_ports_science_volk/volk/work/build/python/volk_modtool/__init__.pyo /opt/local/var/macports/build/_opt_local_var_macports_sources_rsync.macports.org_release_tarballs_ports_science_volk/volk/work/build/python/volk_modtool/cfg.pyo /opt/local/var/macports/build/_opt_local_var_macports_sources_rsync.macports.org_release_tarballs_ports_science_volk/volk/work/build/python/volk_modtool/volk_modtool_generate.pyo
244:info:build Generating volk_machine_sse4_2_64_orc.c
245:info:build cd /opt/local/var/macports/build/_opt_local_var_macports_sources_rsync.macports.org_release_tarballs_ports_science_volk/volk/work/build/lib && /opt/local/Library/Frameworks/Python.framework/Versions/2.7/bin/python2.7 -B /opt/local/var/macports/build/_opt_local_var_macports_sources_rsync.macports.org_release_tarballs_ports_science_volk/volk/work/volk-8a16928a7e2ae5c5949ddeeb5479e642da9d68d7/gen/volk_tmpl_utils.py --input /opt/local/var/macports/build/_opt_local_var_macports_sources_rsync.macports.org_release_tarballs_ports_science_volk/volk/work/volk-8a16928a7e2ae5c5949ddeeb5479e642da9d68d7/tmpl/volk_machine_xxx.tmpl.c --output /opt/local/var/macports/build/_opt_local_var_macports_sources_rsync.macports.org_release_tarballs_ports_science_volk/volk/work/build/lib/volk_machine_sse4_2_64_orc.c sse4_2_64_orc
246:info:build /opt/local/bin/cmake -E cmake_progress_report /opt/local/var/macports/build/_opt_local_var_macports_sources_rsync.macports.org_release_tarballs_ports_science_volk/volk/work/build/CMakeFiles 8
247:info:build [  5%] make[2]: Leaving directory `/opt/local/var/macports/build/_opt_local_var_macports_sources_rsync.macports.org_release_tarballs_ports_science_volk/volk/work/build'
248:info:build /opt/local/bin/cmake -E cmake_progress_report /opt/local/var/macports/build/_opt_local_var_macports_sources_rsync.macports.org_release_tarballs_ports_science_volk/volk/work/build/CMakeFiles  2
249:info:build Generating volk_16ic_deinterleave_16i_x2_a_orc_impl.c
250:info:build cd /opt/local/var/macports/build/_opt_local_var_macports_sources_rsync.macports.org_release_tarballs_ports_science_volk/volk/work/build/lib && /opt/local/bin/orcc --include math.h --implementation -o /opt/local/var/macports/build/_opt_local_var_macports_sources_rsync.macports.org_release_tarballs_ports_science_volk/volk/work/build/lib/volk_16ic_deinterleave_16i_x2_a_orc_impl.c /opt/local/var/macports/build/_opt_local_var_macports_sources_rsync.macports.org_release_tarballs_ports_science_volk/volk/work/volk-8a16928a7e2ae5c5949ddeeb5479e642da9d68d7/kernels/volk/asm/orc/volk_16ic_deinterleave_16i_x2_a_orc_impl.orc
251:info:build [  5%] Built target pygen_python_volk_modtool_5fba6
252:info:build /opt/local/bin/cmake -E cmake_progress_report /opt/local/var/macports/build/_opt_local_var_macports_sources_rsync.macports.org_release_tarballs_ports_science_volk/volk/work/build/CMakeFiles 9
253:info:build [  6%] Generating volk_16ic_deinterleave_real_8i_a_orc_impl.c
254:info:build cd /opt/local/var/macports/build/_opt_local_var_macports_sources_rsync.macports.org_release_tarballs_ports_science_volk/volk/work/build/lib && /opt/local/bin/orcc --include math.h --implementation -o /opt/local/var/macports/build/_opt_local_var_macports_sources_rsync.macports.org_release_tarballs_ports_science_volk/volk/work/build/lib/volk_16ic_deinterleave_real_8i_a_orc_impl.c /opt/local/var/macports/build/_opt_local_var_macports_sources_rsync.macports.org_release_tarballs_ports_science_volk/volk/work/volk-8a16928a7e2ae5c5949ddeeb5479e642da9d68d7/kernels/volk/asm/orc/volk_16ic_deinterleave_real_8i_a_orc_impl.orc
255:info:build /opt/local/bin/cmake -E cmake_progress_report /opt/local/var/macports/build/_opt_local_var_macports_sources_rsync.macports.org_release_tarballs_ports_science_volk/volk/work/build/CMakeFiles 10
256:info:build /opt/local/bin/cmake -E cmake_progress_report /opt/local/var/macports/build/_opt_local_var_macports_sources_rsync.macports.org_release_tarballs_ports_science_volk/volk/work/build/CMakeFiles 11
257:info:build [  8%] [  9%] Generating volk_16ic_magnitude_16i_a_orc_impl.c
258:info:build cd /opt/local/var/macports/build/_opt_local_var_macports_sources_rsync.macports.org_release_tarballs_ports_science_volk/volk/work/build/lib && /opt/local/bin/orcc --include math.h --implementation -o /opt/local/var/macports/build/_opt_local_var_macports_sources_rsync.macports.org_release_tarballs_ports_science_volk/volk/work/build/lib/volk_16ic_magnitude_16i_a_orc_impl.c /opt/local/var/macports/build/_opt_local_var_macports_sources_rsync.macports.org_release_tarballs_ports_science_volk/volk/work/volk-8a16928a7e2ae5c5949ddeeb5479e642da9d68d7/kernels/volk/asm/orc/volk_16ic_magnitude_16i_a_orc_impl.orc
259:info:build Generating volk_16ic_s32f_deinterleave_32f_x2_a_orc_impl.c
260:info:build cd /opt/local/var/macports/build/_opt_local_var_macports_sources_rsync.macports.org_release_tarballs_ports_science_volk/volk/work/build/lib && /opt/local/bin/orcc --include math.h --implementation -o /opt/local/var/macports/build/_opt_local_var_macports_sources_rsync.macports.org_release_tarballs_ports_science_volk/volk/work/build/lib/volk_16ic_s32f_deinterleave_32f_x2_a_orc_impl.c /opt/local/var/macports/build/_opt_local_var_macports_sources_rsync.macports.org_release_tarballs_ports_science_volk/volk/work/volk-8a16928a7e2ae5c5949ddeeb5479e642da9d68d7/kernels/volk/asm/orc/volk_16ic_s32f_deinterleave_32f_x2_a_orc_impl.orc
261:info:build /opt/local/bin/cmake -E cmake_progress_report /opt/local/var/macports/build/_opt_local_var_macports_sources_rsync.macports.org_release_tarballs_ports_science_volk/volk/work/build/CMakeFiles 12
262:info:build /opt/local/bin/cmake -E cmake_progress_report /opt/local/var/macports/build/_opt_local_var_macports_sources_rsync.macports.org_release_tarballs_ports_science_volk/volk/work/build/CMakeFiles 13
263:info:build [ 10%] Generating volk_16sc_magnitude_32f_aligned16_orc_impl.c
264:info:build cd /opt/local/var/macports/build/_opt_local_var_macports_sources_rsync.macports.org_release_tarballs_ports_science_volk/volk/work/build/lib && /opt/local/bin/orcc --include math.h --implementation -o /opt/local/var/macports/build/_opt_local_var_macports_sources_rsync.macports.org_release_tarballs_ports_science_volk/volk/work/build/lib/volk_16sc_magnitude_32f_aligned16_orc_impl.c /opt/local/var/macports/build/_opt_local_var_macports_sources_rsync.macports.org_release_tarballs_ports_science_volk/volk/work/volk-8a16928a7e2ae5c5949ddeeb5479e642da9d68d7/kernels/volk/asm/orc/volk_16sc_magnitude_32f_aligned16_orc_impl.orc
265:info:build [ 11%] /opt/local/bin/cmake -E cmake_progress_report /opt/local/var/macports/build/_opt_local_var_macports_sources_rsync.macports.org_release_tarballs_ports_science_volk/volk/work/build/CMakeFiles 14
266:info:build Generating volk_16u_byteswap_a_orc_impl.c
267:info:build [ 12%] cd /opt/local/var/macports/build/_opt_local_var_macports_sources_rsync.macports.org_release_tarballs_ports_science_volk/volk/work/build/lib && /opt/local/bin/orcc --include math.h --implementation -o /opt/local/var/macports/build/_opt_local_var_macports_sources_rsync.macports.org_release_tarballs_ports_science_volk/volk/work/build/lib/volk_16u_byteswap_a_orc_impl.c /opt/local/var/macports/build/_opt_local_var_macports_sources_rsync.macports.org_release_tarballs_ports_science_volk/volk/work/volk-8a16928a7e2ae5c5949ddeeb5479e642da9d68d7/kernels/volk/asm/orc/volk_16u_byteswap_a_orc_impl.orc
268:info:build Generating volk_32f_s32f_multiply_32f_a_orc_impl.c
269:info:build cd /opt/local/var/macports/build/_opt_local_var_macports_sources_rsync.macports.org_release_tarballs_ports_science_volk/volk/work/build/lib && /opt/local/bin/orcc --include math.h --implementation -o /opt/local/var/macports/build/_opt_local_var_macports_sources_rsync.macports.org_release_tarballs_ports_science_volk/volk/work/build/lib/volk_32f_s32f_multiply_32f_a_orc_impl.c /opt/local/var/macports/build/_opt_local_var_macports_sources_rsync.macports.org_release_tarballs_ports_science_volk/volk/work/volk-8a16928a7e2ae5c5949ddeeb5479e642da9d68d7/kernels/volk/asm/orc/volk_32f_s32f_multiply_32f_a_orc_impl.orc
270:info:build /opt/local/bin/cmake -E cmake_progress_report /opt/local/var/macports/build/_opt_local_var_macports_sources_rsync.macports.org_release_tarballs_ports_science_volk/volk/work/build/CMakeFiles 15
271:info:build /opt/local/bin/cmake -E cmake_progress_report /opt/local/var/macports/build/_opt_local_var_macports_sources_rsync.macports.org_release_tarballs_ports_science_volk/volk/work/build/CMakeFiles 16
272:info:build [ 13%] [ 14%] Generating volk_32f_s32f_normalize_a_orc_impl.c
273:info:build cd /opt/local/var/macports/build/_opt_local_var_macports_sources_rsync.macports.org_release_tarballs_ports_science_volk/volk/work/build/lib && /opt/local/bin/orcc --include math.h --implementation -o /opt/local/var/macports/build/_opt_local_var_macports_sources_rsync.macports.org_release_tarballs_ports_science_volk/volk/work/build/lib/volk_32f_s32f_normalize_a_orc_impl.c /opt/local/var/macports/build/_opt_local_var_macports_sources_rsync.macports.org_release_tarballs_ports_science_volk/volk/work/volk-8a16928a7e2ae5c5949ddeeb5479e642da9d68d7/kernels/volk/asm/orc/volk_32f_s32f_normalize_a_orc_impl.orc
274:info:build Generating volk_32f_sqrt_32f_a_orc_impl.c
275:info:build cd /opt/local/var/macports/build/_opt_local_var_macports_sources_rsync.macports.org_release_tarballs_ports_science_volk/volk/work/build/lib && /opt/local/bin/orcc --include math.h --implementation -o /opt/local/var/macports/build/_opt_local_var_macports_sources_rsync.macports.org_release_tarballs_ports_science_volk/volk/work/build/lib/volk_32f_sqrt_32f_a_orc_impl.c /opt/local/var/macports/build/_opt_local_var_macports_sources_rsync.macports.org_release_tarballs_ports_science_volk/volk/work/volk-8a16928a7e2ae5c5949ddeeb5479e642da9d68d7/kernels/volk/asm/orc/volk_32f_sqrt_32f_a_orc_impl.orc
276:info:build /opt/local/bin/cmake -E cmake_progress_report /opt/local/var/macports/build/_opt_local_var_macports_sources_rsync.macports.org_release_tarballs_ports_science_volk/volk/work/build/CMakeFiles 17
277:info:build /opt/local/bin/cmake -E cmake_progress_report /opt/local/var/macports/build/_opt_local_var_macports_sources_rsync.macports.org_release_tarballs_ports_science_volk/volk/work/build/CMakeFiles 18
278:info:build [ 16%] [ 17%] Generating volk_32f_x2_add_32f_a_orc_impl.c
279:info:build cd /opt/local/var/macports/build/_opt_local_var_macports_sources_rsync.macports.org_release_tarballs_ports_science_volk/volk/work/build/lib && /opt/local/bin/orcc --include math.h --implementation -o /opt/local/var/macports/build/_opt_local_var_macports_sources_rsync.macports.org_release_tarballs_ports_science_volk/volk/work/build/lib/volk_32f_x2_add_32f_a_orc_impl.c /opt/local/var/macports/build/_opt_local_var_macports_sources_rsync.macports.org_release_tarballs_ports_science_volk/volk/work/volk-8a16928a7e2ae5c5949ddeeb5479e642da9d68d7/kernels/volk/asm/orc/volk_32f_x2_add_32f_a_orc_impl.orc
280:info:build Generating volk_32f_x2_divide_32f_a_orc_impl.c
281:info:build cd /opt/local/var/macports/build/_opt_local_var_macports_sources_rsync.macports.org_release_tarballs_ports_science_volk/volk/work/build/lib && /opt/local/bin/orcc --include math.h --implementation -o /opt/local/var/macports/build/_opt_local_var_macports_sources_rsync.macports.org_release_tarballs_ports_science_volk/volk/work/build/lib/volk_32f_x2_divide_32f_a_orc_impl.c /opt/local/var/macports/build/_opt_local_var_macports_sources_rsync.macports.org_release_tarballs_ports_science_volk/volk/work/volk-8a16928a7e2ae5c5949ddeeb5479e642da9d68d7/kernels/volk/asm/orc/volk_32f_x2_divide_32f_a_orc_impl.orc
282:info:build /opt/local/bin/cmake -E cmake_progress_report /opt/local/var/macports/build/_opt_local_var_macports_sources_rsync.macports.org_release_tarballs_ports_science_volk/volk/work/build/CMakeFiles 19
283:info:build /opt/local/bin/cmake -E cmake_progress_report /opt/local/var/macports/build/_opt_local_var_macports_sources_rsync.macports.org_release_tarballs_ports_science_volk/volk/work/build/CMakeFiles 20
284:info:build [ 18%] [ 19%] Generating volk_32f_x2_dot_prod_32f_a_orc_impl.c
285:info:build Generating volk_32f_x2_max_32f_a_orc_impl.c
286:info:build cd /opt/local/var/macports/build/_opt_local_var_macports_sources_rsync.macports.org_release_tarballs_ports_science_volk/volk/work/build/lib && /opt/local/bin/orcc --include math.h --implementation -o /opt/local/var/macports/build/_opt_local_var_macports_sources_rsync.macports.org_release_tarballs_ports_science_volk/volk/work/build/lib/volk_32f_x2_max_32f_a_orc_impl.c /opt/local/var/macports/build/_opt_local_var_macports_sources_rsync.macports.org_release_tarballs_ports_science_volk/volk/work/volk-8a16928a7e2ae5c5949ddeeb5479e642da9d68d7/kernels/volk/asm/orc/volk_32f_x2_max_32f_a_orc_impl.orc
287:info:build cd /opt/local/var/macports/build/_opt_local_var_macports_sources_rsync.macports.org_release_tarballs_ports_science_volk/volk/work/build/lib && /opt/local/bin/orcc --include math.h --implementation -o /opt/local/var/macports/build/_opt_local_var_macports_sources_rsync.macports.org_release_tarballs_ports_science_volk/volk/work/build/lib/volk_32f_x2_dot_prod_32f_a_orc_impl.c /opt/local/var/macports/build/_opt_local_var_macports_sources_rsync.macports.org_release_tarballs_ports_science_volk/volk/work/volk-8a16928a7e2ae5c5949ddeeb5479e642da9d68d7/kernels/volk/asm/orc/volk_32f_x2_dot_prod_32f_a_orc_impl.orc
288:info:build /opt/local/bin/cmake -E cmake_progress_report /opt/local/var/macports/build/_opt_local_var_macports_sources_rsync.macports.org_release_tarballs_ports_science_volk/volk/work/build/CMakeFiles 21
289:info:build /opt/local/bin/cmake -E cmake_progress_report /opt/local/var/macports/build/_opt_local_var_macports_sources_rsync.macports.org_release_tarballs_ports_science_volk/volk/work/build/CMakeFiles 22
290:info:build [ 20%] [ 21%] Generating volk_32f_x2_min_32f_a_orc_impl.c
291:info:build Generating volk_32f_x2_multiply_32f_a_orc_impl.c
292:info:build cd /opt/local/var/macports/build/_opt_local_var_macports_sources_rsync.macports.org_release_tarballs_ports_science_volk/volk/work/build/lib && /opt/local/bin/orcc --include math.h --implementation -o /opt/local/var/macports/build/_opt_local_var_macports_sources_rsync.macports.org_release_tarballs_ports_science_volk/volk/work/build/lib/volk_32f_x2_multiply_32f_a_orc_impl.c /opt/local/var/macports/build/_opt_local_var_macports_sources_rsync.macports.org_release_tarballs_ports_science_volk/volk/work/volk-8a16928a7e2ae5c5949ddeeb5479e642da9d68d7/kernels/volk/asm/orc/volk_32f_x2_multiply_32f_a_orc_impl.orc
293:info:build cd /opt/local/var/macports/build/_opt_local_var_macports_sources_rsync.macports.org_release_tarballs_ports_science_volk/volk/work/build/lib && /opt/local/bin/orcc --include math.h --implementation -o /opt/local/var/macports/build/_opt_local_var_macports_sources_rsync.macports.org_release_tarballs_ports_science_volk/volk/work/build/lib/volk_32f_x2_min_32f_a_orc_impl.c /opt/local/var/macports/build/_opt_local_var_macports_sources_rsync.macports.org_release_tarballs_ports_science_volk/volk/work/volk-8a16928a7e2ae5c5949ddeeb5479e642da9d68d7/kernels/volk/asm/orc/volk_32f_x2_min_32f_a_orc_impl.orc
294:info:build /opt/local/bin/cmake -E cmake_progress_report /opt/local/var/macports/build/_opt_local_var_macports_sources_rsync.macports.org_release_tarballs_ports_science_volk/volk/work/build/CMakeFiles 23
295:info:build /opt/local/bin/cmake -E cmake_progress_report /opt/local/var/macports/build/_opt_local_var_macports_sources_rsync.macports.org_release_tarballs_ports_science_volk/volk/work/build/CMakeFiles 24
296:info:build [ 22%] [ 24%] Generating volk_32f_x2_subtract_32f_a_orc_impl.c
297:info:build cd /opt/local/var/macports/build/_opt_local_var_macports_sources_rsync.macports.org_release_tarballs_ports_science_volk/volk/work/build/lib && /opt/local/bin/orcc --include math.h --implementation -o /opt/local/var/macports/build/_opt_local_var_macports_sources_rsync.macports.org_release_tarballs_ports_science_volk/volk/work/build/lib/volk_32f_x2_subtract_32f_a_orc_impl.c /opt/local/var/macports/build/_opt_local_var_macports_sources_rsync.macports.org_release_tarballs_ports_science_volk/volk/work/volk-8a16928a7e2ae5c5949ddeeb5479e642da9d68d7/kernels/volk/asm/orc/volk_32f_x2_subtract_32f_a_orc_impl.orc
298:info:build Generating volk_32fc_32f_multiply_32fc_a_orc_impl.c
299:info:build cd /opt/local/var/macports/build/_opt_local_var_macports_sources_rsync.macports.org_release_tarballs_ports_science_volk/volk/work/build/lib && /opt/local/bin/orcc --include math.h --implementation -o /opt/local/var/macports/build/_opt_local_var_macports_sources_rsync.macports.org_release_tarballs_ports_science_volk/volk/work/build/lib/volk_32fc_32f_multiply_32fc_a_orc_impl.c /opt/local/var/macports/build/_opt_local_var_macports_sources_rsync.macports.org_release_tarballs_ports_science_volk/volk/work/volk-8a16928a7e2ae5c5949ddeeb5479e642da9d68d7/kernels/volk/asm/orc/volk_32fc_32f_multiply_32fc_a_orc_impl.orc
300:info:build /opt/local/bin/cmake -E cmake_progress_report /opt/local/var/macports/build/_opt_local_var_macports_sources_rsync.macports.org_release_tarballs_ports_science_volk/volk/work/build/CMakeFiles 25
301:info:build /opt/local/bin/cmake -E cmake_progress_report /opt/local/var/macports/build/_opt_local_var_macports_sources_rsync.macports.org_release_tarballs_ports_science_volk/volk/work/build/CMakeFiles 26
302:info:build [ 25%] [ 26%] Generating volk_32fc_magnitude_32f_a_orc_impl.c
303:info:build cd /opt/local/var/macports/build/_opt_local_var_macports_sources_rsync.macports.org_release_tarballs_ports_science_volk/volk/work/build/lib && /opt/local/bin/orcc --include math.h --implementation -o /opt/local/var/macports/build/_opt_local_var_macports_sources_rsync.macports.org_release_tarballs_ports_science_volk/volk/work/build/lib/volk_32fc_magnitude_32f_a_orc_impl.c /opt/local/var/macports/build/_opt_local_var_macports_sources_rsync.macports.org_release_tarballs_ports_science_volk/volk/work/volk-8a16928a7e2ae5c5949ddeeb5479e642da9d68d7/kernels/volk/asm/orc/volk_32fc_magnitude_32f_a_orc_impl.orc
304:info:build Generating volk_32fc_s32f_magnitude_16i_a_orc_impl.c
305:info:build cd /opt/local/var/macports/build/_opt_local_var_macports_sources_rsync.macports.org_release_tarballs_ports_science_volk/volk/work/build/lib && /opt/local/bin/orcc --include math.h --implementation -o /opt/local/var/macports/build/_opt_local_var_macports_sources_rsync.macports.org_release_tarballs_ports_science_volk/volk/work/build/lib/volk_32fc_s32f_magnitude_16i_a_orc_impl.c /opt/local/var/macports/build/_opt_local_var_macports_sources_rsync.macports.org_release_tarballs_ports_science_volk/volk/work/volk-8a16928a7e2ae5c5949ddeeb5479e642da9d68d7/kernels/volk/asm/orc/volk_32fc_s32f_magnitude_16i_a_orc_impl.orc
306:info:build /opt/local/bin/cmake -E cmake_progress_report /opt/local/var/macports/build/_opt_local_var_macports_sources_rsync.macports.org_release_tarballs_ports_science_volk/volk/work/build/CMakeFiles 27
307:info:build /opt/local/bin/cmake -E cmake_progress_report /opt/local/var/macports/build/_opt_local_var_macports_sources_rsync.macports.org_release_tarballs_ports_science_volk/volk/work/build/CMakeFiles 28
308:info:build [ 27%] [ 28%] Generating volk_32fc_s32fc_multiply_32fc_a_orc_impl.c
309:info:build Generating volk_32fc_x2_multiply_32fc_a_orc_impl.c
310:info:build cd /opt/local/var/macports/build/_opt_local_var_macports_sources_rsync.macports.org_release_tarballs_ports_science_volk/volk/work/build/lib && /opt/local/bin/orcc --include math.h --implementation -o /opt/local/var/macports/build/_opt_local_var_macports_sources_rsync.macports.org_release_tarballs_ports_science_volk/volk/work/build/lib/volk_32fc_s32fc_multiply_32fc_a_orc_impl.c /opt/local/var/macports/build/_opt_local_var_macports_sources_rsync.macports.org_release_tarballs_ports_science_volk/volk/work/volk-8a16928a7e2ae5c5949ddeeb5479e642da9d68d7/kernels/volk/asm/orc/volk_32fc_s32fc_multiply_32fc_a_orc_impl.orc
311:info:build cd /opt/local/var/macports/build/_opt_local_var_macports_sources_rsync.macports.org_release_tarballs_ports_science_volk/volk/work/build/lib && /opt/local/bin/orcc --include math.h --implementation -o /opt/local/var/macports/build/_opt_local_var_macports_sources_rsync.macports.org_release_tarballs_ports_science_volk/volk/work/build/lib/volk_32fc_x2_multiply_32fc_a_orc_impl.c /opt/local/var/macports/build/_opt_local_var_macports_sources_rsync.macports.org_release_tarballs_ports_science_volk/volk/work/volk-8a16928a7e2ae5c5949ddeeb5479e642da9d68d7/kernels/volk/asm/orc/volk_32fc_x2_multiply_32fc_a_orc_impl.orc
312:info:build /opt/local/bin/cmake -E cmake_progress_report /opt/local/var/macports/build/_opt_local_var_macports_sources_rsync.macports.org_release_tarballs_ports_science_volk/volk/work/build/CMakeFiles 29
313:info:build /opt/local/bin/cmake -E cmake_progress_report /opt/local/var/macports/build/_opt_local_var_macports_sources_rsync.macports.org_release_tarballs_ports_science_volk/volk/work/build/CMakeFiles 30
314:info:build [ 29%] [ 31%] Generating volk_32i_x2_and_32i_a_orc_impl.c
315:info:build Generating volk_32i_x2_or_32i_a_orc_impl.c
316:info:build cd /opt/local/var/macports/build/_opt_local_var_macports_sources_rsync.macports.org_release_tarballs_ports_science_volk/volk/work/build/lib && /opt/local/bin/orcc --include math.h --implementation -o /opt/local/var/macports/build/_opt_local_var_macports_sources_rsync.macports.org_release_tarballs_ports_science_volk/volk/work/build/lib/volk_32i_x2_and_32i_a_orc_impl.c /opt/local/var/macports/build/_opt_local_var_macports_sources_rsync.macports.org_release_tarballs_ports_science_volk/volk/work/volk-8a16928a7e2ae5c5949ddeeb5479e642da9d68d7/kernels/volk/asm/orc/volk_32i_x2_and_32i_a_orc_impl.orc
317:info:build cd /opt/local/var/macports/build/_opt_local_var_macports_sources_rsync.macports.org_release_tarballs_ports_science_volk/volk/work/build/lib && /opt/local/bin/orcc --include math.h --implementation -o /opt/local/var/macports/build/_opt_local_var_macports_sources_rsync.macports.org_release_tarballs_ports_science_volk/volk/work/build/lib/volk_32i_x2_or_32i_a_orc_impl.c /opt/local/var/macports/build/_opt_local_var_macports_sources_rsync.macports.org_release_tarballs_ports_science_volk/volk/work/volk-8a16928a7e2ae5c5949ddeeb5479e642da9d68d7/kernels/volk/asm/orc/volk_32i_x2_or_32i_a_orc_impl.orc
318:info:build /opt/local/bin/cmake -E cmake_progress_report /opt/local/var/macports/build/_opt_local_var_macports_sources_rsync.macports.org_release_tarballs_ports_science_volk/volk/work/build/CMakeFiles 31
319:info:build /opt/local/bin/cmake -E cmake_progress_report /opt/local/var/macports/build/_opt_local_var_macports_sources_rsync.macports.org_release_tarballs_ports_science_volk/volk/work/build/CMakeFiles 32
320:info:build [ 32%] [ 33%] Generating volk_8i_convert_16i_a_orc_impl.c
321:info:build Generating volk_8i_s32f_convert_32f_a_orc_impl.c
322:info:build cd /opt/local/var/macports/build/_opt_local_var_macports_sources_rsync.macports.org_release_tarballs_ports_science_volk/volk/work/build/lib && /opt/local/bin/orcc --include math.h --implementation -o /opt/local/var/macports/build/_opt_local_var_macports_sources_rsync.macports.org_release_tarballs_ports_science_volk/volk/work/build/lib/volk_8i_s32f_convert_32f_a_orc_impl.c /opt/local/var/macports/build/_opt_local_var_macports_sources_rsync.macports.org_release_tarballs_ports_science_volk/volk/work/volk-8a16928a7e2ae5c5949ddeeb5479e642da9d68d7/kernels/volk/asm/orc/volk_8i_s32f_convert_32f_a_orc_impl.orc
323:info:build cd /opt/local/var/macports/build/_opt_local_var_macports_sources_rsync.macports.org_release_tarballs_ports_science_volk/volk/work/build/lib && /opt/local/bin/orcc --include math.h --implementation -o /opt/local/var/macports/build/_opt_local_var_macports_sources_rsync.macports.org_release_tarballs_ports_science_volk/volk/work/build/lib/volk_8i_convert_16i_a_orc_impl.c /opt/local/var/macports/build/_opt_local_var_macports_sources_rsync.macports.org_release_tarballs_ports_science_volk/volk/work/volk-8a16928a7e2ae5c5949ddeeb5479e642da9d68d7/kernels/volk/asm/orc/volk_8i_convert_16i_a_orc_impl.orc
324:info:build /opt/local/bin/cmake -E cmake_progress_report /opt/local/var/macports/build/_opt_local_var_macports_sources_rsync.macports.org_release_tarballs_ports_science_volk/volk/work/build/CMakeFiles 33
325:info:build /opt/local/bin/cmake -E cmake_progress_report /opt/local/var/macports/build/_opt_local_var_macports_sources_rsync.macports.org_release_tarballs_ports_science_volk/volk/work/build/CMakeFiles 34
326:info:build [ 34%] [ 35%] Generating ../include/volk/volk.h
327:info:build Generating volk.c
328:info:build cd /opt/local/var/macports/build/_opt_local_var_macports_sources_rsync.macports.org_release_tarballs_ports_science_volk/volk/work/build/lib && /opt/local/Library/Frameworks/Python.framework/Versions/2.7/bin/python2.7 -B /opt/local/var/macports/build/_opt_local_var_macports_sources_rsync.macports.org_release_tarballs_ports_science_volk/volk/work/volk-8a16928a7e2ae5c5949ddeeb5479e642da9d68d7/gen/volk_tmpl_utils.py --input /opt/local/var/macports/build/_opt_local_var_macports_sources_rsync.macports.org_release_tarballs_ports_science_volk/volk/work/volk-8a16928a7e2ae5c5949ddeeb5479e642da9d68d7/tmpl/volk.tmpl.c --output /opt/local/var/macports/build/_opt_local_var_macports_sources_rsync.macports.org_release_tarballs_ports_science_volk/volk/work/build/lib/volk.c
329:info:build cd /opt/local/var/macports/build/_opt_local_var_macports_sources_rsync.macports.org_release_tarballs_ports_science_volk/volk/work/build/lib && /opt/local/Library/Frameworks/Python.framework/Versions/2.7/bin/python2.7 -B /opt/local/var/macports/build/_opt_local_var_macports_sources_rsync.macports.org_release_tarballs_ports_science_volk/volk/work/volk-8a16928a7e2ae5c5949ddeeb5479e642da9d68d7/gen/volk_tmpl_utils.py --input /opt/local/var/macports/build/_opt_local_var_macports_sources_rsync.macports.org_release_tarballs_ports_science_volk/volk/work/volk-8a16928a7e2ae5c5949ddeeb5479e642da9d68d7/tmpl/volk.tmpl.h --output /opt/local/var/macports/build/_opt_local_var_macports_sources_rsync.macports.org_release_tarballs_ports_science_volk/volk/work/build/include/volk/volk.h
330:info:build make[2]: Leaving directory `/opt/local/var/macports/build/_opt_local_var_macports_sources_rsync.macports.org_release_tarballs_ports_science_volk/volk/work/build'
331:info:build /opt/local/bin/cmake -E cmake_progress_report /opt/local/var/macports/build/_opt_local_var_macports_sources_rsync.macports.org_release_tarballs_ports_science_volk/volk/work/build/CMakeFiles  3 4
332:info:build [ 35%] Built target pygen_python_volk_modtool_7de50
333:info:build /opt/local/bin/cmake -E cmake_progress_report /opt/local/var/macports/build/_opt_local_var_macports_sources_rsync.macports.org_release_tarballs_ports_science_volk/volk/work/build/CMakeFiles 35
334:info:build [ 36%] Generating ../include/volk/volk_typedefs.h
335:info:build cd /opt/local/var/macports/build/_opt_local_var_macports_sources_rsync.macports.org_release_tarballs_ports_science_volk/volk/work/build/lib && /opt/local/Library/Frameworks/Python.framework/Versions/2.7/bin/python2.7 -B /opt/local/var/macports/build/_opt_local_var_macports_sources_rsync.macports.org_release_tarballs_ports_science_volk/volk/work/volk-8a16928a7e2ae5c5949ddeeb5479e642da9d68d7/gen/volk_tmpl_utils.py --input /opt/local/var/macports/build/_opt_local_var_macports_sources_rsync.macports.org_release_tarballs_ports_science_volk/volk/work/volk-8a16928a7e2ae5c5949ddeeb5479e642da9d68d7/tmpl/volk_typedefs.tmpl.h --output /opt/local/var/macports/build/_opt_local_var_macports_sources_rsync.macports.org_release_tarballs_ports_science_volk/volk/work/build/include/volk/volk_typedefs.h
336:info:build /opt/local/bin/cmake -E cmake_progress_report /opt/local/var/macports/build/_opt_local_var_macports_sources_rsync.macports.org_release_tarballs_ports_science_volk/volk/work/build/CMakeFiles 36
337:info:build [ 37%] /opt/local/bin/cmake -E cmake_progress_report /opt/local/var/macports/build/_opt_local_var_macports_sources_rsync.macports.org_release_tarballs_ports_science_volk/volk/work/build/CMakeFiles 37
338:info:build Generating ../include/volk/volk_cpu.h
339:info:build cd /opt/local/var/macports/build/_opt_local_var_macports_sources_rsync.macports.org_release_tarballs_ports_science_volk/volk/work/build/lib && /opt/local/Library/Frameworks/Python.framework/Versions/2.7/bin/python2.7 -B /opt/local/var/macports/build/_opt_local_var_macports_sources_rsync.macports.org_release_tarballs_ports_science_volk/volk/work/volk-8a16928a7e2ae5c5949ddeeb5479e642da9d68d7/gen/volk_tmpl_utils.py --input /opt/local/var/macports/build/_opt_local_var_macports_sources_rsync.macports.org_release_tarballs_ports_science_volk/volk/work/volk-8a16928a7e2ae5c5949ddeeb5479e642da9d68d7/tmpl/volk_cpu.tmpl.h --output /opt/local/var/macports/build/_opt_local_var_macports_sources_rsync.macports.org_release_tarballs_ports_science_volk/volk/work/build/include/volk/volk_cpu.h
340:info:build [ 39%] /opt/local/bin/cmake -E cmake_progress_report /opt/local/var/macports/build/_opt_local_var_macports_sources_rsync.macports.org_release_tarballs_ports_science_volk/volk/work/build/CMakeFiles 38
341:info:build Generating volk_cpu.c
342:info:build cd /opt/local/var/macports/build/_opt_local_var_macports_sources_rsync.macports.org_release_tarballs_ports_science_volk/volk/work/build/lib && /opt/local/Library/Frameworks/Python.framework/Versions/2.7/bin/python2.7 -B /opt/local/var/macports/build/_opt_local_var_macports_sources_rsync.macports.org_release_tarballs_ports_science_volk/volk/work/volk-8a16928a7e2ae5c5949ddeeb5479e642da9d68d7/gen/volk_tmpl_utils.py --input /opt/local/var/macports/build/_opt_local_var_macports_sources_rsync.macports.org_release_tarballs_ports_science_volk/volk/work/volk-8a16928a7e2ae5c5949ddeeb5479e642da9d68d7/tmpl/volk_cpu.tmpl.c --output /opt/local/var/macports/build/_opt_local_var_macports_sources_rsync.macports.org_release_tarballs_ports_science_volk/volk/work/build/lib/volk_cpu.c
343:info:build [ 40%] Generating ../include/volk/volk_config_fixed.h
344:info:build cd /opt/local/var/macports/build/_opt_local_var_macports_sources_rsync.macports.org_release_tarballs_ports_science_volk/volk/work/build/lib && /opt/local/Library/Frameworks/Python.framework/Versions/2.7/bin/python2.7 -B /opt/local/var/macports/build/_opt_local_var_macports_sources_rsync.macports.org_release_tarballs_ports_science_volk/volk/work/volk-8a16928a7e2ae5c5949ddeeb5479e642da9d68d7/gen/volk_tmpl_utils.py --input /opt/local/var/macports/build/_opt_local_var_macports_sources_rsync.macports.org_release_tarballs_ports_science_volk/volk/work/volk-8a16928a7e2ae5c5949ddeeb5479e642da9d68d7/tmpl/volk_config_fixed.tmpl.h --output /opt/local/var/macports/build/_opt_local_var_macports_sources_rsync.macports.org_release_tarballs_ports_science_volk/volk/work/build/include/volk/volk_config_fixed.h
345:info:build /opt/local/bin/cmake -E cmake_progress_report /opt/local/var/macports/build/_opt_local_var_macports_sources_rsync.macports.org_release_tarballs_ports_science_volk/volk/work/build/CMakeFiles 39
346:info:build [ 41%] Generating volk_machines.h
347:info:build cd /opt/local/var/macports/build/_opt_local_var_macports_sources_rsync.macports.org_release_tarballs_ports_science_volk/volk/work/build/lib && /opt/local/Library/Frameworks/Python.framework/Versions/2.7/bin/python2.7 -B /opt/local/var/macports/build/_opt_local_var_macports_sources_rsync.macports.org_release_tarballs_ports_science_volk/volk/work/volk-8a16928a7e2ae5c5949ddeeb5479e642da9d68d7/gen/volk_tmpl_utils.py --input /opt/local/var/macports/build/_opt_local_var_macports_sources_rsync.macports.org_release_tarballs_ports_science_volk/volk/work/volk-8a16928a7e2ae5c5949ddeeb5479e642da9d68d7/tmpl/volk_machines.tmpl.h --output /opt/local/var/macports/build/_opt_local_var_macports_sources_rsync.macports.org_release_tarballs_ports_science_volk/volk/work/build/lib/volk_machines.h
348:info:build /opt/local/bin/cmake -E cmake_progress_report /opt/local/var/macports/build/_opt_local_var_macports_sources_rsync.macports.org_release_tarballs_ports_science_volk/volk/work/build/CMakeFiles 40
349:info:build [ 42%] Generating volk_machines.c
350:info:build cd /opt/local/var/macports/build/_opt_local_var_macports_sources_rsync.macports.org_release_tarballs_ports_science_volk/volk/work/build/lib && /opt/local/Library/Frameworks/Python.framework/Versions/2.7/bin/python2.7 -B /opt/local/var/macports/build/_opt_local_var_macports_sources_rsync.macports.org_release_tarballs_ports_science_volk/volk/work/volk-8a16928a7e2ae5c5949ddeeb5479e642da9d68d7/gen/volk_tmpl_utils.py --input /opt/local/var/macports/build/_opt_local_var_macports_sources_rsync.macports.org_release_tarballs_ports_science_volk/volk/work/volk-8a16928a7e2ae5c5949ddeeb5479e642da9d68d7/tmpl/volk_machines.tmpl.c --output /opt/local/var/macports/build/_opt_local_var_macports_sources_rsync.macports.org_release_tarballs_ports_science_volk/volk/work/build/lib/volk_machines.c
351:info:build /opt/local/bin/cmake -E cmake_progress_report /opt/local/var/macports/build/_opt_local_var_macports_sources_rsync.macports.org_release_tarballs_ports_science_volk/volk/work/build/CMakeFiles 41
352:info:build /opt/local/bin/cmake -E cmake_progress_report /opt/local/var/macports/build/_opt_local_var_macports_sources_rsync.macports.org_release_tarballs_ports_science_volk/volk/work/build/CMakeFiles 42
353:info:build [ 43%] [ 44%] Generating volk_machine_generic_orc.c
354:info:build cd /opt/local/var/macports/build/_opt_local_var_macports_sources_rsync.macports.org_release_tarballs_ports_science_volk/volk/work/build/lib && /opt/local/Library/Frameworks/Python.framework/Versions/2.7/bin/python2.7 -B /opt/local/var/macports/build/_opt_local_var_macports_sources_rsync.macports.org_release_tarballs_ports_science_volk/volk/work/volk-8a16928a7e2ae5c5949ddeeb5479e642da9d68d7/gen/volk_tmpl_utils.py --input /opt/local/var/macports/build/_opt_local_var_macports_sources_rsync.macports.org_release_tarballs_ports_science_volk/volk/work/volk-8a16928a7e2ae5c5949ddeeb5479e642da9d68d7/tmpl/volk_machine_xxx.tmpl.c --output /opt/local/var/macports/build/_opt_local_var_macports_sources_rsync.macports.org_release_tarballs_ports_science_volk/volk/work/build/lib/volk_machine_generic_orc.c generic_orc
355:info:build Generating volk_machine_sse2_64_mmx_orc.c
356:info:build cd /opt/local/var/macports/build/_opt_local_var_macports_sources_rsync.macports.org_release_tarballs_ports_science_volk/volk/work/build/lib && /opt/local/Library/Frameworks/Python.framework/Versions/2.7/bin/python2.7 -B /opt/local/var/macports/build/_opt_local_var_macports_sources_rsync.macports.org_release_tarballs_ports_science_volk/volk/work/volk-8a16928a7e2ae5c5949ddeeb5479e642da9d68d7/gen/volk_tmpl_utils.py --input /opt/local/var/macports/build/_opt_local_var_macports_sources_rsync.macports.org_release_tarballs_ports_science_volk/volk/work/volk-8a16928a7e2ae5c5949ddeeb5479e642da9d68d7/tmpl/volk_machine_xxx.tmpl.c --output /opt/local/var/macports/build/_opt_local_var_macports_sources_rsync.macports.org_release_tarballs_ports_science_volk/volk/work/build/lib/volk_machine_sse2_64_mmx_orc.c sse2_64_mmx_orc
357:info:build /opt/local/bin/cmake -E cmake_progress_report /opt/local/var/macports/build/_opt_local_var_macports_sources_rsync.macports.org_release_tarballs_ports_science_volk/volk/work/build/CMakeFiles 43
358:info:build [ 45%] Generating volk_machine_sse3_64_orc.c
359:info:build cd /opt/local/var/macports/build/_opt_local_var_macports_sources_rsync.macports.org_release_tarballs_ports_science_volk/volk/work/build/lib && /opt/local/Library/Frameworks/Python.framework/Versions/2.7/bin/python2.7 -B /opt/local/var/macports/build/_opt_local_var_macports_sources_rsync.macports.org_release_tarballs_ports_science_volk/volk/work/volk-8a16928a7e2ae5c5949ddeeb5479e642da9d68d7/gen/volk_tmpl_utils.py --input /opt/local/var/macports/build/_opt_local_var_macports_sources_rsync.macports.org_release_tarballs_ports_science_volk/volk/work/volk-8a16928a7e2ae5c5949ddeeb5479e642da9d68d7/tmpl/volk_machine_xxx.tmpl.c --output /opt/local/var/macports/build/_opt_local_var_macports_sources_rsync.macports.org_release_tarballs_ports_science_volk/volk/work/build/lib/volk_machine_sse3_64_orc.c sse3_64_orc
360:info:build /opt/local/bin/cmake -E cmake_progress_report /opt/local/var/macports/build/_opt_local_var_macports_sources_rsync.macports.org_release_tarballs_ports_science_volk/volk/work/build/CMakeFiles 44
361:info:build [ 47%] Generating volk_machine_ssse3_64_orc.c
362:info:build cd /opt/local/var/macports/build/_opt_local_var_macports_sources_rsync.macports.org_release_tarballs_ports_science_volk/volk/work/build/lib && /opt/local/Library/Frameworks/Python.framework/Versions/2.7/bin/python2.7 -B /opt/local/var/macports/build/_opt_local_var_macports_sources_rsync.macports.org_release_tarballs_ports_science_volk/volk/work/volk-8a16928a7e2ae5c5949ddeeb5479e642da9d68d7/gen/volk_tmpl_utils.py --input /opt/local/var/macports/build/_opt_local_var_macports_sources_rsync.macports.org_release_tarballs_ports_science_volk/volk/work/volk-8a16928a7e2ae5c5949ddeeb5479e642da9d68d7/tmpl/volk_machine_xxx.tmpl.c --output /opt/local/var/macports/build/_opt_local_var_macports_sources_rsync.macports.org_release_tarballs_ports_science_volk/volk/work/build/lib/volk_machine_ssse3_64_orc.c ssse3_64_orc
363:info:build /opt/local/bin/cmake -E cmake_progress_report /opt/local/var/macports/build/_opt_local_var_macports_sources_rsync.macports.org_release_tarballs_ports_science_volk/volk/work/build/CMakeFiles 45
364:info:build /opt/local/bin/cmake -E cmake_progress_report /opt/local/var/macports/build/_opt_local_var_macports_sources_rsync.macports.org_release_tarballs_ports_science_volk/volk/work/build/CMakeFiles 46
365:info:build [ 48%] [ 49%] Generating volk_machine_sse4_a_64_orc.c
366:info:build cd /opt/local/var/macports/build/_opt_local_var_macports_sources_rsync.macports.org_release_tarballs_ports_science_volk/volk/work/build/lib && /opt/local/Library/Frameworks/Python.framework/Versions/2.7/bin/python2.7 -B /opt/local/var/macports/build/_opt_local_var_macports_sources_rsync.macports.org_release_tarballs_ports_science_volk/volk/work/volk-8a16928a7e2ae5c5949ddeeb5479e642da9d68d7/gen/volk_tmpl_utils.py --input /opt/local/var/macports/build/_opt_local_var_macports_sources_rsync.macports.org_release_tarballs_ports_science_volk/volk/work/volk-8a16928a7e2ae5c5949ddeeb5479e642da9d68d7/tmpl/volk_machine_xxx.tmpl.c --output /opt/local/var/macports/build/_opt_local_var_macports_sources_rsync.macports.org_release_tarballs_ports_science_volk/volk/work/build/lib/volk_machine_sse4_a_64_orc.c sse4_a_64_orc
367:info:build Generating volk_machine_sse4_1_64_orc.c
368:info:build cd /opt/local/var/macports/build/_opt_local_var_macports_sources_rsync.macports.org_release_tarballs_ports_science_volk/volk/work/build/lib && /opt/local/Library/Frameworks/Python.framework/Versions/2.7/bin/python2.7 -B /opt/local/var/macports/build/_opt_local_var_macports_sources_rsync.macports.org_release_tarballs_ports_science_volk/volk/work/volk-8a16928a7e2ae5c5949ddeeb5479e642da9d68d7/gen/volk_tmpl_utils.py --input /opt/local/var/macports/build/_opt_local_var_macports_sources_rsync.macports.org_release_tarballs_ports_science_volk/volk/work/volk-8a16928a7e2ae5c5949ddeeb5479e642da9d68d7/tmpl/volk_machine_xxx.tmpl.c --output /opt/local/var/macports/build/_opt_local_var_macports_sources_rsync.macports.org_release_tarballs_ports_science_volk/volk/work/build/lib/volk_machine_sse4_1_64_orc.c sse4_1_64_orc
369:info:build cd /opt/local/var/macports/build/_opt_local_var_macports_sources_rsync.macports.org_release_tarballs_ports_science_volk/volk/work/build && /opt/local/bin/cmake -E cmake_depends "Unix Makefiles" /opt/local/var/macports/build/_opt_local_var_macports_sources_rsync.macports.org_release_tarballs_ports_science_volk/volk/work/volk-8a16928a7e2ae5c5949ddeeb5479e642da9d68d7 /opt/local/var/macports/build/_opt_local_var_macports_sources_rsync.macports.org_release_tarballs_ports_science_volk/volk/work/volk-8a16928a7e2ae5c5949ddeeb5479e642da9d68d7/lib /opt/local/var/macports/build/_opt_local_var_macports_sources_rsync.macports.org_release_tarballs_ports_science_volk/volk/work/build /opt/local/var/macports/build/_opt_local_var_macports_sources_rsync.macports.org_release_tarballs_ports_science_volk/volk/work/build/lib /opt/local/var/macports/build/_opt_local_var_macports_sources_rsync.macports.org_release_tarballs_ports_science_volk/volk/work/build/lib/CMakeFiles/volk_obj.dir/DependInfo.cmake --color=
370:info:build Dependee "/opt/local/var/macports/build/_opt_local_var_macports_sources_rsync.macports.org_release_tarballs_ports_science_volk/volk/work/build/lib/CMakeFiles/volk_obj.dir/DependInfo.cmake" is newer than depender "/opt/local/var/macports/build/_opt_local_var_macports_sources_rsync.macports.org_release_tarballs_ports_science_volk/volk/work/build/lib/CMakeFiles/volk_obj.dir/depend.internal".
371:info:build Dependee "/opt/local/var/macports/build/_opt_local_var_macports_sources_rsync.macports.org_release_tarballs_ports_science_volk/volk/work/build/lib/CMakeFiles/CMakeDirectoryInformation.cmake" is newer than depender "/opt/local/var/macports/build/_opt_local_var_macports_sources_rsync.macports.org_release_tarballs_ports_science_volk/volk/work/build/lib/CMakeFiles/volk_obj.dir/depend.internal".
372:info:build Scanning dependencies of target volk_obj
373:info:build make[2]: Leaving directory `/opt/local/var/macports/build/_opt_local_var_macports_sources_rsync.macports.org_release_tarballs_ports_science_volk/volk/work/build'
374:info:build /usr/bin/make -f lib/CMakeFiles/volk_obj.dir/build.make lib/CMakeFiles/volk_obj.dir/build
375:info:build make[2]: Entering directory `/opt/local/var/macports/build/_opt_local_var_macports_sources_rsync.macports.org_release_tarballs_ports_science_volk/volk/work/build'
376:info:build /opt/local/bin/cmake -E cmake_progress_report /opt/local/var/macports/build/_opt_local_var_macports_sources_rsync.macports.org_release_tarballs_ports_science_volk/volk/work/build/CMakeFiles 48
377:info:build /opt/local/bin/cmake -E cmake_progress_report /opt/local/var/macports/build/_opt_local_var_macports_sources_rsync.macports.org_release_tarballs_ports_science_volk/volk/work/build/CMakeFiles 49
378:info:build /opt/local/bin/cmake -E cmake_progress_report /opt/local/var/macports/build/_opt_local_var_macports_sources_rsync.macports.org_release_tarballs_ports_science_volk/volk/work/build/CMakeFiles 50
379:info:build /opt/local/bin/cmake -E cmake_progress_report /opt/local/var/macports/build/_opt_local_var_macports_sources_rsync.macports.org_release_tarballs_ports_science_volk/volk/work/build/CMakeFiles 51
380:info:build [ 50%] [ 51%] [ 52%] [ 54%] Building C object lib/CMakeFiles/volk_obj.dir/volk_16ic_deinterleave_16i_x2_a_orc_impl.c.o
381:info:build cd /opt/local/var/macports/build/_opt_local_var_macports_sources_rsync.macports.org_release_tarballs_ports_science_volk/volk/work/build/lib && /Applications/Xcode.app/Contents/Developer/Toolchains/XcodeDefault.xctoolchain/usr/bin/clang  -DHAVE_CPUID_H -DHAVE_DLFCN_H -DHAVE_FENV_H -DHAVE_POSIX_MEMALIGN -DHAVE_XGETBV -pipe -Os -arch x86_64  -Wall -fvisibility=hidden -DNDEBUG -arch x86_64 -mmacosx-version-min=10.7 -I/opt/local/var/macports/build/_opt_local_var_macports_sources_rsync.macports.org_release_tarballs_ports_science_volk/volk/work/build/include -I/opt/local/var/macports/build/_opt_local_var_macports_sources_rsync.macports.org_release_tarballs_ports_science_volk/volk/work/volk-8a16928a7e2ae5c5949ddeeb5479e642da9d68d7/include -I/opt/local/var/macports/build/_opt_local_var_macports_sources_rsync.macports.org_release_tarballs_ports_science_volk/volk/work/volk-8a16928a7e2ae5c5949ddeeb5479e642da9d68d7/kernels -I/opt/local/var/macports/build/_opt_local_var_macports_sources_rsync.macports.org_release_tarballs_ports_science_volk/volk/work/build/lib -I/opt/local/var/macports/build/_opt_local_var_macports_sources_rsync.macports.org_release_tarballs_ports_science_volk/volk/work/volk-8a16928a7e2ae5c5949ddeeb5479e642da9d68d7/lib -I/opt/local/include/orc-0.4 -I/opt/local/include    -fPIC -o CMakeFiles/volk_obj.dir/volk_16ic_deinterleave_16i_x2_a_orc_impl.c.o   -c /opt/local/var/macports/build/_opt_local_var_macports_sources_rsync.macports.org_release_tarballs_ports_science_volk/volk/work/build/lib/volk_16ic_deinterleave_16i_x2_a_orc_impl.c
382:info:build Building C object lib/CMakeFiles/volk_obj.dir/volk_16ic_deinterleave_real_8i_a_orc_impl.c.o
383:info:build Building C object lib/CMakeFiles/volk_obj.dir/volk_16ic_magnitude_16i_a_orc_impl.c.o
384:info:build cd /opt/local/var/macports/build/_opt_local_var_macports_sources_rsync.macports.org_release_tarballs_ports_science_volk/volk/work/build/lib && /Applications/Xcode.app/Contents/Developer/Toolchains/XcodeDefault.xctoolchain/usr/bin/clang  -DHAVE_CPUID_H -DHAVE_DLFCN_H -DHAVE_FENV_H -DHAVE_POSIX_MEMALIGN -DHAVE_XGETBV -pipe -Os -arch x86_64  -Wall -fvisibility=hidden -DNDEBUG -arch x86_64 -mmacosx-version-min=10.7 -I/opt/local/var/macports/build/_opt_local_var_macports_sources_rsync.macports.org_release_tarballs_ports_science_volk/volk/work/build/include -I/opt/local/var/macports/build/_opt_local_var_macports_sources_rsync.macports.org_release_tarballs_ports_science_volk/volk/work/volk-8a16928a7e2ae5c5949ddeeb5479e642da9d68d7/include -I/opt/local/var/macports/build/_opt_local_var_macports_sources_rsync.macports.org_release_tarballs_ports_science_volk/volk/work/volk-8a16928a7e2ae5c5949ddeeb5479e642da9d68d7/kernels -I/opt/local/var/macports/build/_opt_local_var_macports_sources_rsync.macports.org_release_tarballs_ports_science_volk/volk/work/build/lib -I/opt/local/var/macports/build/_opt_local_var_macports_sources_rsync.macports.org_release_tarballs_ports_science_volk/volk/work/volk-8a16928a7e2ae5c5949ddeeb5479e642da9d68d7/lib -I/opt/local/include/orc-0.4 -I/opt/local/include    -fPIC -o CMakeFiles/volk_obj.dir/volk_16ic_magnitude_16i_a_orc_impl.c.o   -c /opt/local/var/macports/build/_opt_local_var_macports_sources_rsync.macports.org_release_tarballs_ports_science_volk/volk/work/build/lib/volk_16ic_magnitude_16i_a_orc_impl.c
385:info:build cd /opt/local/var/macports/build/_opt_local_var_macports_sources_rsync.macports.org_release_tarballs_ports_science_volk/volk/work/build/lib && /Applications/Xcode.app/Contents/Developer/Toolchains/XcodeDefault.xctoolchain/usr/bin/clang  -DHAVE_CPUID_H -DHAVE_DLFCN_H -DHAVE_FENV_H -DHAVE_POSIX_MEMALIGN -DHAVE_XGETBV -pipe -Os -arch x86_64  -Wall -fvisibility=hidden -DNDEBUG -arch x86_64 -mmacosx-version-min=10.7 -I/opt/local/var/macports/build/_opt_local_var_macports_sources_rsync.macports.org_release_tarballs_ports_science_volk/volk/work/build/include -I/opt/local/var/macports/build/_opt_local_var_macports_sources_rsync.macports.org_release_tarballs_ports_science_volk/volk/work/volk-8a16928a7e2ae5c5949ddeeb5479e642da9d68d7/include -I/opt/local/var/macports/build/_opt_local_var_macports_sources_rsync.macports.org_release_tarballs_ports_science_volk/volk/work/volk-8a16928a7e2ae5c5949ddeeb5479e642da9d68d7/kernels -I/opt/local/var/macports/build/_opt_local_var_macports_sources_rsync.macports.org_release_tarballs_ports_science_volk/volk/work/build/lib -I/opt/local/var/macports/build/_opt_local_var_macports_sources_rsync.macports.org_release_tarballs_ports_science_volk/volk/work/volk-8a16928a7e2ae5c5949ddeeb5479e642da9d68d7/lib -I/opt/local/include/orc-0.4 -I/opt/local/include    -fPIC -o CMakeFiles/volk_obj.dir/volk_16ic_deinterleave_real_8i_a_orc_impl.c.o   -c /opt/local/var/macports/build/_opt_local_var_macports_sources_rsync.macports.org_release_tarballs_ports_science_volk/volk/work/build/lib/volk_16ic_deinterleave_real_8i_a_orc_impl.c
386:info:build Building C object lib/CMakeFiles/volk_obj.dir/volk_16ic_s32f_deinterleave_32f_x2_a_orc_impl.c.o
387:info:build cd /opt/local/var/macports/build/_opt_local_var_macports_sources_rsync.macports.org_release_tarballs_ports_science_volk/volk/work/build/lib && /Applications/Xcode.app/Contents/Developer/Toolchains/XcodeDefault.xctoolchain/usr/bin/clang  -DHAVE_CPUID_H -DHAVE_DLFCN_H -DHAVE_FENV_H -DHAVE_POSIX_MEMALIGN -DHAVE_XGETBV -pipe -Os -arch x86_64  -Wall -fvisibility=hidden -DNDEBUG -arch x86_64 -mmacosx-version-min=10.7 -I/opt/local/var/macports/build/_opt_local_var_macports_sources_rsync.macports.org_release_tarballs_ports_science_volk/volk/work/build/include -I/opt/local/var/macports/build/_opt_local_var_macports_sources_rsync.macports.org_release_tarballs_ports_science_volk/volk/work/volk-8a16928a7e2ae5c5949ddeeb5479e642da9d68d7/include -I/opt/local/var/macports/build/_opt_local_var_macports_sources_rsync.macports.org_release_tarballs_ports_science_volk/volk/work/volk-8a16928a7e2ae5c5949ddeeb5479e642da9d68d7/kernels -I/opt/local/var/macports/build/_opt_local_var_macports_sources_rsync.macports.org_release_tarballs_ports_science_volk/volk/work/build/lib -I/opt/local/var/macports/build/_opt_local_var_macports_sources_rsync.macports.org_release_tarballs_ports_science_volk/volk/work/volk-8a16928a7e2ae5c5949ddeeb5479e642da9d68d7/lib -I/opt/local/include/orc-0.4 -I/opt/local/include    -fPIC -o CMakeFiles/volk_obj.dir/volk_16ic_s32f_deinterleave_32f_x2_a_orc_impl.c.o   -c /opt/local/var/macports/build/_opt_local_var_macports_sources_rsync.macports.org_release_tarballs_ports_science_volk/volk/work/build/lib/volk_16ic_s32f_deinterleave_32f_x2_a_orc_impl.c
388:info:build /opt/local/bin/cmake -E cmake_progress_report /opt/local/var/macports/build/_opt_local_var_macports_sources_rsync.macports.org_release_tarballs_ports_science_volk/volk/work/build/CMakeFiles 52
389:info:build /opt/local/bin/cmake -E cmake_progress_report /opt/local/var/macports/build/_opt_local_var_macports_sources_rsync.macports.org_release_tarballs_ports_science_volk/volk/work/build/CMakeFiles 53
390:info:build /opt/local/bin/cmake -E cmake_progress_report /opt/local/var/macports/build/_opt_local_var_macports_sources_rsync.macports.org_release_tarballs_ports_science_volk/volk/work/build/CMakeFiles 54
391:info:build /opt/local/bin/cmake -E cmake_progress_report /opt/local/var/macports/build/_opt_local_var_macports_sources_rsync.macports.org_release_tarballs_ports_science_volk/volk/work/build/CMakeFiles 55
392:info:build [ 55%] [ 56%] [ 57%] [ 58%] Building C object lib/CMakeFiles/volk_obj.dir/volk_16sc_magnitude_32f_aligned16_orc_impl.c.o
393:info:build cd /opt/local/var/macports/build/_opt_local_var_macports_sources_rsync.macports.org_release_tarballs_ports_science_volk/volk/work/build/lib && /Applications/Xcode.app/Contents/Developer/Toolchains/XcodeDefault.xctoolchain/usr/bin/clang  -DHAVE_CPUID_H -DHAVE_DLFCN_H -DHAVE_FENV_H -DHAVE_POSIX_MEMALIGN -DHAVE_XGETBV -pipe -Os -arch x86_64  -Wall -fvisibility=hidden -DNDEBUG -arch x86_64 -mmacosx-version-min=10.7 -I/opt/local/var/macports/build/_opt_local_var_macports_sources_rsync.macports.org_release_tarballs_ports_science_volk/volk/work/build/include -I/opt/local/var/macports/build/_opt_local_var_macports_sources_rsync.macports.org_release_tarballs_ports_science_volk/volk/work/volk-8a16928a7e2ae5c5949ddeeb5479e642da9d68d7/include -I/opt/local/var/macports/build/_opt_local_var_macports_sources_rsync.macports.org_release_tarballs_ports_science_volk/volk/work/volk-8a16928a7e2ae5c5949ddeeb5479e642da9d68d7/kernels -I/opt/local/var/macports/build/_opt_local_var_macports_sources_rsync.macports.org_release_tarballs_ports_science_volk/volk/work/build/lib -I/opt/local/var/macports/build/_opt_local_var_macports_sources_rsync.macports.org_release_tarballs_ports_science_volk/volk/work/volk-8a16928a7e2ae5c5949ddeeb5479e642da9d68d7/lib -I/opt/local/include/orc-0.4 -I/opt/local/include    -fPIC -o CMakeFiles/volk_obj.dir/volk_16sc_magnitude_32f_aligned16_orc_impl.c.o   -c /opt/local/var/macports/build/_opt_local_var_macports_sources_rsync.macports.org_release_tarballs_ports_science_volk/volk/work/build/lib/volk_16sc_magnitude_32f_aligned16_orc_impl.c
394:info:build Building C object lib/CMakeFiles/volk_obj.dir/volk_16u_byteswap_a_orc_impl.c.o
395:info:build cd /opt/local/var/macports/build/_opt_local_var_macports_sources_rsync.macports.org_release_tarballs_ports_science_volk/volk/work/build/lib && /Applications/Xcode.app/Contents/Developer/Toolchains/XcodeDefault.xctoolchain/usr/bin/clang  -DHAVE_CPUID_H -DHAVE_DLFCN_H -DHAVE_FENV_H -DHAVE_POSIX_MEMALIGN -DHAVE_XGETBV -pipe -Os -arch x86_64  -Wall -fvisibility=hidden -DNDEBUG -arch x86_64 -mmacosx-version-min=10.7 -I/opt/local/var/macports/build/_opt_local_var_macports_sources_rsync.macports.org_release_tarballs_ports_science_volk/volk/work/build/include -I/opt/local/var/macports/build/_opt_local_var_macports_sources_rsync.macports.org_release_tarballs_ports_science_volk/volk/work/volk-8a16928a7e2ae5c5949ddeeb5479e642da9d68d7/include -I/opt/local/var/macports/build/_opt_local_var_macports_sources_rsync.macports.org_release_tarballs_ports_science_volk/volk/work/volk-8a16928a7e2ae5c5949ddeeb5479e642da9d68d7/kernels -I/opt/local/var/macports/build/_opt_local_var_macports_sources_rsync.macports.org_release_tarballs_ports_science_volk/volk/work/build/lib -I/opt/local/var/macports/build/_opt_local_var_macports_sources_rsync.macports.org_release_tarballs_ports_science_volk/volk/work/volk-8a16928a7e2ae5c5949ddeeb5479e642da9d68d7/lib -I/opt/local/include/orc-0.4 -I/opt/local/include    -fPIC -o CMakeFiles/volk_obj.dir/volk_16u_byteswap_a_orc_impl.c.o   -c /opt/local/var/macports/build/_opt_local_var_macports_sources_rsync.macports.org_release_tarballs_ports_science_volk/volk/work/build/lib/volk_16u_byteswap_a_orc_impl.c
396:info:build Building C object lib/CMakeFiles/volk_obj.dir/volk_32f_s32f_multiply_32f_a_orc_impl.c.o
397:info:build Building C object lib/CMakeFiles/volk_obj.dir/volk_32f_s32f_normalize_a_orc_impl.c.o
398:info:build cd /opt/local/var/macports/build/_opt_local_var_macports_sources_rsync.macports.org_release_tarballs_ports_science_volk/volk/work/build/lib && /Applications/Xcode.app/Contents/Developer/Toolchains/XcodeDefault.xctoolchain/usr/bin/clang  -DHAVE_CPUID_H -DHAVE_DLFCN_H -DHAVE_FENV_H -DHAVE_POSIX_MEMALIGN -DHAVE_XGETBV -pipe -Os -arch x86_64  -Wall -fvisibility=hidden -DNDEBUG -arch x86_64 -mmacosx-version-min=10.7 -I/opt/local/var/macports/build/_opt_local_var_macports_sources_rsync.macports.org_release_tarballs_ports_science_volk/volk/work/build/include -I/opt/local/var/macports/build/_opt_local_var_macports_sources_rsync.macports.org_release_tarballs_ports_science_volk/volk/work/volk-8a16928a7e2ae5c5949ddeeb5479e642da9d68d7/include -I/opt/local/var/macports/build/_opt_local_var_macports_sources_rsync.macports.org_release_tarballs_ports_science_volk/volk/work/volk-8a16928a7e2ae5c5949ddeeb5479e642da9d68d7/kernels -I/opt/local/var/macports/build/_opt_local_var_macports_sources_rsync.macports.org_release_tarballs_ports_science_volk/volk/work/build/lib -I/opt/local/var/macports/build/_opt_local_var_macports_sources_rsync.macports.org_release_tarballs_ports_science_volk/volk/work/volk-8a16928a7e2ae5c5949ddeeb5479e642da9d68d7/lib -I/opt/local/include/orc-0.4 -I/opt/local/include    -fPIC -o CMakeFiles/volk_obj.dir/volk_32f_s32f_normalize_a_orc_impl.c.o   -c /opt/local/var/macports/build/_opt_local_var_macports_sources_rsync.macports.org_release_tarballs_ports_science_volk/volk/work/build/lib/volk_32f_s32f_normalize_a_orc_impl.c
399:info:build cd /opt/local/var/macports/build/_opt_local_var_macports_sources_rsync.macports.org_release_tarballs_ports_science_volk/volk/work/build/lib && /Applications/Xcode.app/Contents/Developer/Toolchains/XcodeDefault.xctoolchain/usr/bin/clang  -DHAVE_CPUID_H -DHAVE_DLFCN_H -DHAVE_FENV_H -DHAVE_POSIX_MEMALIGN -DHAVE_XGETBV -pipe -Os -arch x86_64  -Wall -fvisibility=hidden -DNDEBUG -arch x86_64 -mmacosx-version-min=10.7 -I/opt/local/var/macports/build/_opt_local_var_macports_sources_rsync.macports.org_release_tarballs_ports_science_volk/volk/work/build/include -I/opt/local/var/macports/build/_opt_local_var_macports_sources_rsync.macports.org_release_tarballs_ports_science_volk/volk/work/volk-8a16928a7e2ae5c5949ddeeb5479e642da9d68d7/include -I/opt/local/var/macports/build/_opt_local_var_macports_sources_rsync.macports.org_release_tarballs_ports_science_volk/volk/work/volk-8a16928a7e2ae5c5949ddeeb5479e642da9d68d7/kernels -I/opt/local/var/macports/build/_opt_local_var_macports_sources_rsync.macports.org_release_tarballs_ports_science_volk/volk/work/build/lib -I/opt/local/var/macports/build/_opt_local_var_macports_sources_rsync.macports.org_release_tarballs_ports_science_volk/volk/work/volk-8a16928a7e2ae5c5949ddeeb5479e642da9d68d7/lib -I/opt/local/include/orc-0.4 -I/opt/local/include    -fPIC -o CMakeFiles/volk_obj.dir/volk_32f_s32f_multiply_32f_a_orc_impl.c.o   -c /opt/local/var/macports/build/_opt_local_var_macports_sources_rsync.macports.org_release_tarballs_ports_science_volk/volk/work/build/lib/volk_32f_s32f_multiply_32f_a_orc_impl.c
400:info:build /opt/local/bin/cmake -E cmake_progress_report /opt/local/var/macports/build/_opt_local_var_macports_sources_rsync.macports.org_release_tarballs_ports_science_volk/volk/work/build/CMakeFiles 56
401:info:build /opt/local/bin/cmake -E cmake_progress_report /opt/local/var/macports/build/_opt_local_var_macports_sources_rsync.macports.org_release_tarballs_ports_science_volk/volk/work/build/CMakeFiles 57
402:info:build /opt/local/bin/cmake -E cmake_progress_report /opt/local/var/macports/build/_opt_local_var_macports_sources_rsync.macports.org_release_tarballs_ports_science_volk/volk/work/build/CMakeFiles 58
403:info:build /opt/local/bin/cmake -E cmake_progress_report /opt/local/var/macports/build/_opt_local_var_macports_sources_rsync.macports.org_release_tarballs_ports_science_volk/volk/work/build/CMakeFiles 59
404:info:build [ 59%] [ 60%] [ 62%] [ 63%] Building C object lib/CMakeFiles/volk_obj.dir/volk_32f_sqrt_32f_a_orc_impl.c.o
405:info:build cd /opt/local/var/macports/build/_opt_local_var_macports_sources_rsync.macports.org_release_tarballs_ports_science_volk/volk/work/build/lib && /Applications/Xcode.app/Contents/Developer/Toolchains/XcodeDefault.xctoolchain/usr/bin/clang  -DHAVE_CPUID_H -DHAVE_DLFCN_H -DHAVE_FENV_H -DHAVE_POSIX_MEMALIGN -DHAVE_XGETBV -pipe -Os -arch x86_64  -Wall -fvisibility=hidden -DNDEBUG -arch x86_64 -mmacosx-version-min=10.7 -I/opt/local/var/macports/build/_opt_local_var_macports_sources_rsync.macports.org_release_tarballs_ports_science_volk/volk/work/build/include -I/opt/local/var/macports/build/_opt_local_var_macports_sources_rsync.macports.org_release_tarballs_ports_science_volk/volk/work/volk-8a16928a7e2ae5c5949ddeeb5479e642da9d68d7/include -I/opt/local/var/macports/build/_opt_local_var_macports_sources_rsync.macports.org_release_tarballs_ports_science_volk/volk/work/volk-8a16928a7e2ae5c5949ddeeb5479e642da9d68d7/kernels -I/opt/local/var/macports/build/_opt_local_var_macports_sources_rsync.macports.org_release_tarballs_ports_science_volk/volk/work/build/lib -I/opt/local/var/macports/build/_opt_local_var_macports_sources_rsync.macports.org_release_tarballs_ports_science_volk/volk/work/volk-8a16928a7e2ae5c5949ddeeb5479e642da9d68d7/lib -I/opt/local/include/orc-0.4 -I/opt/local/include    -fPIC -o CMakeFiles/volk_obj.dir/volk_32f_sqrt_32f_a_orc_impl.c.o   -c /opt/local/var/macports/build/_opt_local_var_macports_sources_rsync.macports.org_release_tarballs_ports_science_volk/volk/work/build/lib/volk_32f_sqrt_32f_a_orc_impl.c
406:info:build Building C object lib/CMakeFiles/volk_obj.dir/volk_32f_x2_add_32f_a_orc_impl.c.o
407:info:build cd /opt/local/var/macports/build/_opt_local_var_macports_sources_rsync.macports.org_release_tarballs_ports_science_volk/volk/work/build/lib && /Applications/Xcode.app/Contents/Developer/Toolchains/XcodeDefault.xctoolchain/usr/bin/clang  -DHAVE_CPUID_H -DHAVE_DLFCN_H -DHAVE_FENV_H -DHAVE_POSIX_MEMALIGN -DHAVE_XGETBV -pipe -Os -arch x86_64  -Wall -fvisibility=hidden -DNDEBUG -arch x86_64 -mmacosx-version-min=10.7 -I/opt/local/var/macports/build/_opt_local_var_macports_sources_rsync.macports.org_release_tarballs_ports_science_volk/volk/work/build/include -I/opt/local/var/macports/build/_opt_local_var_macports_sources_rsync.macports.org_release_tarballs_ports_science_volk/volk/work/volk-8a16928a7e2ae5c5949ddeeb5479e642da9d68d7/include -I/opt/local/var/macports/build/_opt_local_var_macports_sources_rsync.macports.org_release_tarballs_ports_science_volk/volk/work/volk-8a16928a7e2ae5c5949ddeeb5479e642da9d68d7/kernels -I/opt/local/var/macports/build/_opt_local_var_macports_sources_rsync.macports.org_release_tarballs_ports_science_volk/volk/work/build/lib -I/opt/local/var/macports/build/_opt_local_var_macports_sources_rsync.macports.org_release_tarballs_ports_science_volk/volk/work/volk-8a16928a7e2ae5c5949ddeeb5479e642da9d68d7/lib -I/opt/local/include/orc-0.4 -I/opt/local/include    -fPIC -o CMakeFiles/volk_obj.dir/volk_32f_x2_add_32f_a_orc_impl.c.o   -c /opt/local/var/macports/build/_opt_local_var_macports_sources_rsync.macports.org_release_tarballs_ports_science_volk/volk/work/build/lib/volk_32f_x2_add_32f_a_orc_impl.c
408:info:build Building C object lib/CMakeFiles/volk_obj.dir/volk_32f_x2_dot_prod_32f_a_orc_impl.c.o
409:info:build Building C object lib/CMakeFiles/volk_obj.dir/volk_32f_x2_divide_32f_a_orc_impl.c.o
410:info:build cd /opt/local/var/macports/build/_opt_local_var_macports_sources_rsync.macports.org_release_tarballs_ports_science_volk/volk/work/build/lib && /Applications/Xcode.app/Contents/Developer/Toolchains/XcodeDefault.xctoolchain/usr/bin/clang  -DHAVE_CPUID_H -DHAVE_DLFCN_H -DHAVE_FENV_H -DHAVE_POSIX_MEMALIGN -DHAVE_XGETBV -pipe -Os -arch x86_64  -Wall -fvisibility=hidden -DNDEBUG -arch x86_64 -mmacosx-version-min=10.7 -I/opt/local/var/macports/build/_opt_local_var_macports_sources_rsync.macports.org_release_tarballs_ports_science_volk/volk/work/build/include -I/opt/local/var/macports/build/_opt_local_var_macports_sources_rsync.macports.org_release_tarballs_ports_science_volk/volk/work/volk-8a16928a7e2ae5c5949ddeeb5479e642da9d68d7/include -I/opt/local/var/macports/build/_opt_local_var_macports_sources_rsync.macports.org_release_tarballs_ports_science_volk/volk/work/volk-8a16928a7e2ae5c5949ddeeb5479e642da9d68d7/kernels -I/opt/local/var/macports/build/_opt_local_var_macports_sources_rsync.macports.org_release_tarballs_ports_science_volk/volk/work/build/lib -I/opt/local/var/macports/build/_opt_local_var_macports_sources_rsync.macports.org_release_tarballs_ports_science_volk/volk/work/volk-8a16928a7e2ae5c5949ddeeb5479e642da9d68d7/lib -I/opt/local/include/orc-0.4 -I/opt/local/include    -fPIC -o CMakeFiles/volk_obj.dir/volk_32f_x2_dot_prod_32f_a_orc_impl.c.o   -c /opt/local/var/macports/build/_opt_local_var_macports_sources_rsync.macports.org_release_tarballs_ports_science_volk/volk/work/build/lib/volk_32f_x2_dot_prod_32f_a_orc_impl.c
411:info:build cd /opt/local/var/macports/build/_opt_local_var_macports_sources_rsync.macports.org_release_tarballs_ports_science_volk/volk/work/build/lib && /Applications/Xcode.app/Contents/Developer/Toolchains/XcodeDefault.xctoolchain/usr/bin/clang  -DHAVE_CPUID_H -DHAVE_DLFCN_H -DHAVE_FENV_H -DHAVE_POSIX_MEMALIGN -DHAVE_XGETBV -pipe -Os -arch x86_64  -Wall -fvisibility=hidden -DNDEBUG -arch x86_64 -mmacosx-version-min=10.7 -I/opt/local/var/macports/build/_opt_local_var_macports_sources_rsync.macports.org_release_tarballs_ports_science_volk/volk/work/build/include -I/opt/local/var/macports/build/_opt_local_var_macports_sources_rsync.macports.org_release_tarballs_ports_science_volk/volk/work/volk-8a16928a7e2ae5c5949ddeeb5479e642da9d68d7/include -I/opt/local/var/macports/build/_opt_local_var_macports_sources_rsync.macports.org_release_tarballs_ports_science_volk/volk/work/volk-8a16928a7e2ae5c5949ddeeb5479e642da9d68d7/kernels -I/opt/local/var/macports/build/_opt_local_var_macports_sources_rsync.macports.org_release_tarballs_ports_science_volk/volk/work/build/lib -I/opt/local/var/macports/build/_opt_local_var_macports_sources_rsync.macports.org_release_tarballs_ports_science_volk/volk/work/volk-8a16928a7e2ae5c5949ddeeb5479e642da9d68d7/lib -I/opt/local/include/orc-0.4 -I/opt/local/include    -fPIC -o CMakeFiles/volk_obj.dir/volk_32f_x2_divide_32f_a_orc_impl.c.o   -c /opt/local/var/macports/build/_opt_local_var_macports_sources_rsync.macports.org_release_tarballs_ports_science_volk/volk/work/build/lib/volk_32f_x2_divide_32f_a_orc_impl.c
412:info:build /opt/local/bin/cmake -E cmake_progress_report /opt/local/var/macports/build/_opt_local_var_macports_sources_rsync.macports.org_release_tarballs_ports_science_volk/volk/work/build/CMakeFiles 60
413:info:build /opt/local/bin/cmake -E cmake_progress_report /opt/local/var/macports/build/_opt_local_var_macports_sources_rsync.macports.org_release_tarballs_ports_science_volk/volk/work/build/CMakeFiles 61
414:info:build /opt/local/bin/cmake -E cmake_progress_report /opt/local/var/macports/build/_opt_local_var_macports_sources_rsync.macports.org_release_tarballs_ports_science_volk/volk/work/build/CMakeFiles 62
415:info:build /opt/local/bin/cmake -E cmake_progress_report /opt/local/var/macports/build/_opt_local_var_macports_sources_rsync.macports.org_release_tarballs_ports_science_volk/volk/work/build/CMakeFiles 63
416:info:build [ 64%] [ 65%] [ 66%] [ 67%] Building C object lib/CMakeFiles/volk_obj.dir/volk_32f_x2_max_32f_a_orc_impl.c.o
417:info:build cd /opt/local/var/macports/build/_opt_local_var_macports_sources_rsync.macports.org_release_tarballs_ports_science_volk/volk/work/build/lib && /Applications/Xcode.app/Contents/Developer/Toolchains/XcodeDefault.xctoolchain/usr/bin/clang  -DHAVE_CPUID_H -DHAVE_DLFCN_H -DHAVE_FENV_H -DHAVE_POSIX_MEMALIGN -DHAVE_XGETBV -pipe -Os -arch x86_64  -Wall -fvisibility=hidden -DNDEBUG -arch x86_64 -mmacosx-version-min=10.7 -I/opt/local/var/macports/build/_opt_local_var_macports_sources_rsync.macports.org_release_tarballs_ports_science_volk/volk/work/build/include -I/opt/local/var/macports/build/_opt_local_var_macports_sources_rsync.macports.org_release_tarballs_ports_science_volk/volk/work/volk-8a16928a7e2ae5c5949ddeeb5479e642da9d68d7/include -I/opt/local/var/macports/build/_opt_local_var_macports_sources_rsync.macports.org_release_tarballs_ports_science_volk/volk/work/volk-8a16928a7e2ae5c5949ddeeb5479e642da9d68d7/kernels -I/opt/local/var/macports/build/_opt_local_var_macports_sources_rsync.macports.org_release_tarballs_ports_science_volk/volk/work/build/lib -I/opt/local/var/macports/build/_opt_local_var_macports_sources_rsync.macports.org_release_tarballs_ports_science_volk/volk/work/volk-8a16928a7e2ae5c5949ddeeb5479e642da9d68d7/lib -I/opt/local/include/orc-0.4 -I/opt/local/include    -fPIC -o CMakeFiles/volk_obj.dir/volk_32f_x2_max_32f_a_orc_impl.c.o   -c /opt/local/var/macports/build/_opt_local_var_macports_sources_rsync.macports.org_release_tarballs_ports_science_volk/volk/work/build/lib/volk_32f_x2_max_32f_a_orc_impl.c
418:info:build Building C object lib/CMakeFiles/volk_obj.dir/volk_32f_x2_multiply_32f_a_orc_impl.c.o
419:info:build cd /opt/local/var/macports/build/_opt_local_var_macports_sources_rsync.macports.org_release_tarballs_ports_science_volk/volk/work/build/lib && /Applications/Xcode.app/Contents/Developer/Toolchains/XcodeDefault.xctoolchain/usr/bin/clang  -DHAVE_CPUID_H -DHAVE_DLFCN_H -DHAVE_FENV_H -DHAVE_POSIX_MEMALIGN -DHAVE_XGETBV -pipe -Os -arch x86_64  -Wall -fvisibility=hidden -DNDEBUG -arch x86_64 -mmacosx-version-min=10.7 -I/opt/local/var/macports/build/_opt_local_var_macports_sources_rsync.macports.org_release_tarballs_ports_science_volk/volk/work/build/include -I/opt/local/var/macports/build/_opt_local_var_macports_sources_rsync.macports.org_release_tarballs_ports_science_volk/volk/work/volk-8a16928a7e2ae5c5949ddeeb5479e642da9d68d7/include -I/opt/local/var/macports/build/_opt_local_var_macports_sources_rsync.macports.org_release_tarballs_ports_science_volk/volk/work/volk-8a16928a7e2ae5c5949ddeeb5479e642da9d68d7/kernels -I/opt/local/var/macports/build/_opt_local_var_macports_sources_rsync.macports.org_release_tarballs_ports_science_volk/volk/work/build/lib -I/opt/local/var/macports/build/_opt_local_var_macports_sources_rsync.macports.org_release_tarballs_ports_science_volk/volk/work/volk-8a16928a7e2ae5c5949ddeeb5479e642da9d68d7/lib -I/opt/local/include/orc-0.4 -I/opt/local/include    -fPIC -o CMakeFiles/volk_obj.dir/volk_32f_x2_multiply_32f_a_orc_impl.c.o   -c /opt/local/var/macports/build/_opt_local_var_macports_sources_rsync.macports.org_release_tarballs_ports_science_volk/volk/work/build/lib/volk_32f_x2_multiply_32f_a_orc_impl.c
420:info:build Building C object lib/CMakeFiles/volk_obj.dir/volk_32f_x2_min_32f_a_orc_impl.c.o
421:info:build cd /opt/local/var/macports/build/_opt_local_var_macports_sources_rsync.macports.org_release_tarballs_ports_science_volk/volk/work/build/lib && /Applications/Xcode.app/Contents/Developer/Toolchains/XcodeDefault.xctoolchain/usr/bin/clang  -DHAVE_CPUID_H -DHAVE_DLFCN_H -DHAVE_FENV_H -DHAVE_POSIX_MEMALIGN -DHAVE_XGETBV -pipe -Os -arch x86_64  -Wall -fvisibility=hidden -DNDEBUG -arch x86_64 -mmacosx-version-min=10.7 -I/opt/local/var/macports/build/_opt_local_var_macports_sources_rsync.macports.org_release_tarballs_ports_science_volk/volk/work/build/include -I/opt/local/var/macports/build/_opt_local_var_macports_sources_rsync.macports.org_release_tarballs_ports_science_volk/volk/work/volk-8a16928a7e2ae5c5949ddeeb5479e642da9d68d7/include -I/opt/local/var/macports/build/_opt_local_var_macports_sources_rsync.macports.org_release_tarballs_ports_science_volk/volk/work/volk-8a16928a7e2ae5c5949ddeeb5479e642da9d68d7/kernels -I/opt/local/var/macports/build/_opt_local_var_macports_sources_rsync.macports.org_release_tarballs_ports_science_volk/volk/work/build/lib -I/opt/local/var/macports/build/_opt_local_var_macports_sources_rsync.macports.org_release_tarballs_ports_science_volk/volk/work/volk-8a16928a7e2ae5c5949ddeeb5479e642da9d68d7/lib -I/opt/local/include/orc-0.4 -I/opt/local/include    -fPIC -o CMakeFiles/volk_obj.dir/volk_32f_x2_min_32f_a_orc_impl.c.o   -c /opt/local/var/macports/build/_opt_local_var_macports_sources_rsync.macports.org_release_tarballs_ports_science_volk/volk/work/build/lib/volk_32f_x2_min_32f_a_orc_impl.c
422:info:build Building C object lib/CMakeFiles/volk_obj.dir/volk_32f_x2_subtract_32f_a_orc_impl.c.o
423:info:build cd /opt/local/var/macports/build/_opt_local_var_macports_sources_rsync.macports.org_release_tarballs_ports_science_volk/volk/work/build/lib && /Applications/Xcode.app/Contents/Developer/Toolchains/XcodeDefault.xctoolchain/usr/bin/clang  -DHAVE_CPUID_H -DHAVE_DLFCN_H -DHAVE_FENV_H -DHAVE_POSIX_MEMALIGN -DHAVE_XGETBV -pipe -Os -arch x86_64  -Wall -fvisibility=hidden -DNDEBUG -arch x86_64 -mmacosx-version-min=10.7 -I/opt/local/var/macports/build/_opt_local_var_macports_sources_rsync.macports.org_release_tarballs_ports_science_volk/volk/work/build/include -I/opt/local/var/macports/build/_opt_local_var_macports_sources_rsync.macports.org_release_tarballs_ports_science_volk/volk/work/volk-8a16928a7e2ae5c5949ddeeb5479e642da9d68d7/include -I/opt/local/var/macports/build/_opt_local_var_macports_sources_rsync.macports.org_release_tarballs_ports_science_volk/volk/work/volk-8a16928a7e2ae5c5949ddeeb5479e642da9d68d7/kernels -I/opt/local/var/macports/build/_opt_local_var_macports_sources_rsync.macports.org_release_tarballs_ports_science_volk/volk/work/build/lib -I/opt/local/var/macports/build/_opt_local_var_macports_sources_rsync.macports.org_release_tarballs_ports_science_volk/volk/work/volk-8a16928a7e2ae5c5949ddeeb5479e642da9d68d7/lib -I/opt/local/include/orc-0.4 -I/opt/local/include    -fPIC -o CMakeFiles/volk_obj.dir/volk_32f_x2_subtract_32f_a_orc_impl.c.o   -c /opt/local/var/macports/build/_opt_local_var_macports_sources_rsync.macports.org_release_tarballs_ports_science_volk/volk/work/build/lib/volk_32f_x2_subtract_32f_a_orc_impl.c
424:info:build /opt/local/bin/cmake -E cmake_progress_report /opt/local/var/macports/build/_opt_local_var_macports_sources_rsync.macports.org_release_tarballs_ports_science_volk/volk/work/build/CMakeFiles 64
425:info:build /opt/local/bin/cmake -E cmake_progress_report /opt/local/var/macports/build/_opt_local_var_macports_sources_rsync.macports.org_release_tarballs_ports_science_volk/volk/work/build/CMakeFiles 65
426:info:build /opt/local/bin/cmake -E cmake_progress_report /opt/local/var/macports/build/_opt_local_var_macports_sources_rsync.macports.org_release_tarballs_ports_science_volk/volk/work/build/CMakeFiles 66
427:info:build [ 68%] [ 70%] [ 71%] /opt/local/bin/cmake -E cmake_progress_report /opt/local/var/macports/build/_opt_local_var_macports_sources_rsync.macports.org_release_tarballs_ports_science_volk/volk/work/build/CMakeFiles 67
428:info:build Building C object lib/CMakeFiles/volk_obj.dir/volk_32fc_32f_multiply_32fc_a_orc_impl.c.o
429:info:build cd /opt/local/var/macports/build/_opt_local_var_macports_sources_rsync.macports.org_release_tarballs_ports_science_volk/volk/work/build/lib && /Applications/Xcode.app/Contents/Developer/Toolchains/XcodeDefault.xctoolchain/usr/bin/clang  -DHAVE_CPUID_H -DHAVE_DLFCN_H -DHAVE_FENV_H -DHAVE_POSIX_MEMALIGN -DHAVE_XGETBV -pipe -Os -arch x86_64  -Wall -fvisibility=hidden -DNDEBUG -arch x86_64 -mmacosx-version-min=10.7 -I/opt/local/var/macports/build/_opt_local_var_macports_sources_rsync.macports.org_release_tarballs_ports_science_volk/volk/work/build/include -I/opt/local/var/macports/build/_opt_local_var_macports_sources_rsync.macports.org_release_tarballs_ports_science_volk/volk/work/volk-8a16928a7e2ae5c5949ddeeb5479e642da9d68d7/include -I/opt/local/var/macports/build/_opt_local_var_macports_sources_rsync.macports.org_release_tarballs_ports_science_volk/volk/work/volk-8a16928a7e2ae5c5949ddeeb5479e642da9d68d7/kernels -I/opt/local/var/macports/build/_opt_local_var_macports_sources_rsync.macports.org_release_tarballs_ports_science_volk/volk/work/build/lib -I/opt/local/var/macports/build/_opt_local_var_macports_sources_rsync.macports.org_release_tarballs_ports_science_volk/volk/work/volk-8a16928a7e2ae5c5949ddeeb5479e642da9d68d7/lib -I/opt/local/include/orc-0.4 -I/opt/local/include    -fPIC -o CMakeFiles/volk_obj.dir/volk_32fc_32f_multiply_32fc_a_orc_impl.c.o   -c /opt/local/var/macports/build/_opt_local_var_macports_sources_rsync.macports.org_release_tarballs_ports_science_volk/volk/work/build/lib/volk_32fc_32f_multiply_32fc_a_orc_impl.c
430:info:build [ 72%] Building C object lib/CMakeFiles/volk_obj.dir/volk_32fc_magnitude_32f_a_orc_impl.c.o
431:info:build cd /opt/local/var/macports/build/_opt_local_var_macports_sources_rsync.macports.org_release_tarballs_ports_science_volk/volk/work/build/lib && /Applications/Xcode.app/Contents/Developer/Toolchains/XcodeDefault.xctoolchain/usr/bin/clang  -DHAVE_CPUID_H -DHAVE_DLFCN_H -DHAVE_FENV_H -DHAVE_POSIX_MEMALIGN -DHAVE_XGETBV -pipe -Os -arch x86_64  -Wall -fvisibility=hidden -DNDEBUG -arch x86_64 -mmacosx-version-min=10.7 -I/opt/local/var/macports/build/_opt_local_var_macports_sources_rsync.macports.org_release_tarballs_ports_science_volk/volk/work/build/include -I/opt/local/var/macports/build/_opt_local_var_macports_sources_rsync.macports.org_release_tarballs_ports_science_volk/volk/work/volk-8a16928a7e2ae5c5949ddeeb5479e642da9d68d7/include -I/opt/local/var/macports/build/_opt_local_var_macports_sources_rsync.macports.org_release_tarballs_ports_science_volk/volk/work/volk-8a16928a7e2ae5c5949ddeeb5479e642da9d68d7/kernels -I/opt/local/var/macports/build/_opt_local_var_macports_sources_rsync.macports.org_release_tarballs_ports_science_volk/volk/work/build/lib -I/opt/local/var/macports/build/_opt_local_var_macports_sources_rsync.macports.org_release_tarballs_ports_science_volk/volk/work/volk-8a16928a7e2ae5c5949ddeeb5479e642da9d68d7/lib -I/opt/local/include/orc-0.4 -I/opt/local/include    -fPIC -o CMakeFiles/volk_obj.dir/volk_32fc_magnitude_32f_a_orc_impl.c.o   -c /opt/local/var/macports/build/_opt_local_var_macports_sources_rsync.macports.org_release_tarballs_ports_science_volk/volk/work/build/lib/volk_32fc_magnitude_32f_a_orc_impl.c
432:info:build Building C object lib/CMakeFiles/volk_obj.dir/volk_32fc_s32f_magnitude_16i_a_orc_impl.c.o
433:info:build cd /opt/local/var/macports/build/_opt_local_var_macports_sources_rsync.macports.org_release_tarballs_ports_science_volk/volk/work/build/lib && /Applications/Xcode.app/Contents/Developer/Toolchains/XcodeDefault.xctoolchain/usr/bin/clang  -DHAVE_CPUID_H -DHAVE_DLFCN_H -DHAVE_FENV_H -DHAVE_POSIX_MEMALIGN -DHAVE_XGETBV -pipe -Os -arch x86_64  -Wall -fvisibility=hidden -DNDEBUG -arch x86_64 -mmacosx-version-min=10.7 -I/opt/local/var/macports/build/_opt_local_var_macports_sources_rsync.macports.org_release_tarballs_ports_science_volk/volk/work/build/include -I/opt/local/var/macports/build/_opt_local_var_macports_sources_rsync.macports.org_release_tarballs_ports_science_volk/volk/work/volk-8a16928a7e2ae5c5949ddeeb5479e642da9d68d7/include -I/opt/local/var/macports/build/_opt_local_var_macports_sources_rsync.macports.org_release_tarballs_ports_science_volk/volk/work/volk-8a16928a7e2ae5c5949ddeeb5479e642da9d68d7/kernels -I/opt/local/var/macports/build/_opt_local_var_macports_sources_rsync.macports.org_release_tarballs_ports_science_volk/volk/work/build/lib -I/opt/local/var/macports/build/_opt_local_var_macports_sources_rsync.macports.org_release_tarballs_ports_science_volk/volk/work/volk-8a16928a7e2ae5c5949ddeeb5479e642da9d68d7/lib -I/opt/local/include/orc-0.4 -I/opt/local/include    -fPIC -o CMakeFiles/volk_obj.dir/volk_32fc_s32f_magnitude_16i_a_orc_impl.c.o   -c /opt/local/var/macports/build/_opt_local_var_macports_sources_rsync.macports.org_release_tarballs_ports_science_volk/volk/work/build/lib/volk_32fc_s32f_magnitude_16i_a_orc_impl.c
434:info:build Building C object lib/CMakeFiles/volk_obj.dir/volk_32fc_s32fc_multiply_32fc_a_orc_impl.c.o
435:info:build cd /opt/local/var/macports/build/_opt_local_var_macports_sources_rsync.macports.org_release_tarballs_ports_science_volk/volk/work/build/lib && /Applications/Xcode.app/Contents/Developer/Toolchains/XcodeDefault.xctoolchain/usr/bin/clang  -DHAVE_CPUID_H -DHAVE_DLFCN_H -DHAVE_FENV_H -DHAVE_POSIX_MEMALIGN -DHAVE_XGETBV -pipe -Os -arch x86_64  -Wall -fvisibility=hidden -DNDEBUG -arch x86_64 -mmacosx-version-min=10.7 -I/opt/local/var/macports/build/_opt_local_var_macports_sources_rsync.macports.org_release_tarballs_ports_science_volk/volk/work/build/include -I/opt/local/var/macports/build/_opt_local_var_macports_sources_rsync.macports.org_release_tarballs_ports_science_volk/volk/work/volk-8a16928a7e2ae5c5949ddeeb5479e642da9d68d7/include -I/opt/local/var/macports/build/_opt_local_var_macports_sources_rsync.macports.org_release_tarballs_ports_science_volk/volk/work/volk-8a16928a7e2ae5c5949ddeeb5479e642da9d68d7/kernels -I/opt/local/var/macports/build/_opt_local_var_macports_sources_rsync.macports.org_release_tarballs_ports_science_volk/volk/work/build/lib -I/opt/local/var/macports/build/_opt_local_var_macports_sources_rsync.macports.org_release_tarballs_ports_science_volk/volk/work/volk-8a16928a7e2ae5c5949ddeeb5479e642da9d68d7/lib -I/opt/local/include/orc-0.4 -I/opt/local/include    -fPIC -o CMakeFiles/volk_obj.dir/volk_32fc_s32fc_multiply_32fc_a_orc_impl.c.o   -c /opt/local/var/macports/build/_opt_local_var_macports_sources_rsync.macports.org_release_tarballs_ports_science_volk/volk/work/build/lib/volk_32fc_s32fc_multiply_32fc_a_orc_impl.c
436:info:build /opt/local/bin/cmake -E cmake_progress_report /opt/local/var/macports/build/_opt_local_var_macports_sources_rsync.macports.org_release_tarballs_ports_science_volk/volk/work/build/CMakeFiles 68
437:info:build /opt/local/bin/cmake -E cmake_progress_report /opt/local/var/macports/build/_opt_local_var_macports_sources_rsync.macports.org_release_tarballs_ports_science_volk/volk/work/build/CMakeFiles 69
438:info:build /opt/local/bin/cmake -E cmake_progress_report /opt/local/var/macports/build/_opt_local_var_macports_sources_rsync.macports.org_release_tarballs_ports_science_volk/volk/work/build/CMakeFiles 70
439:info:build [ 73%] [ 74%] /opt/local/bin/cmake -E cmake_progress_report /opt/local/var/macports/build/_opt_local_var_macports_sources_rsync.macports.org_release_tarballs_ports_science_volk/volk/work/build/CMakeFiles 71
440:info:build [ 75%] [ 77%] Building C object lib/CMakeFiles/volk_obj.dir/volk_32i_x2_and_32i_a_orc_impl.c.o
441:info:build cd /opt/local/var/macports/build/_opt_local_var_macports_sources_rsync.macports.org_release_tarballs_ports_science_volk/volk/work/build/lib && /Applications/Xcode.app/Contents/Developer/Toolchains/XcodeDefault.xctoolchain/usr/bin/clang  -DHAVE_CPUID_H -DHAVE_DLFCN_H -DHAVE_FENV_H -DHAVE_POSIX_MEMALIGN -DHAVE_XGETBV -pipe -Os -arch x86_64  -Wall -fvisibility=hidden -DNDEBUG -arch x86_64 -mmacosx-version-min=10.7 -I/opt/local/var/macports/build/_opt_local_var_macports_sources_rsync.macports.org_release_tarballs_ports_science_volk/volk/work/build/include -I/opt/local/var/macports/build/_opt_local_var_macports_sources_rsync.macports.org_release_tarballs_ports_science_volk/volk/work/volk-8a16928a7e2ae5c5949ddeeb5479e642da9d68d7/include -I/opt/local/var/macports/build/_opt_local_var_macports_sources_rsync.macports.org_release_tarballs_ports_science_volk/volk/work/volk-8a16928a7e2ae5c5949ddeeb5479e642da9d68d7/kernels -I/opt/local/var/macports/build/_opt_local_var_macports_sources_rsync.macports.org_release_tarballs_ports_science_volk/volk/work/build/lib -I/opt/local/var/macports/build/_opt_local_var_macports_sources_rsync.macports.org_release_tarballs_ports_science_volk/volk/work/volk-8a16928a7e2ae5c5949ddeeb5479e642da9d68d7/lib -I/opt/local/include/orc-0.4 -I/opt/local/include    -fPIC -o CMakeFiles/volk_obj.dir/volk_32i_x2_and_32i_a_orc_impl.c.o   -c /opt/local/var/macports/build/_opt_local_var_macports_sources_rsync.macports.org_release_tarballs_ports_science_volk/volk/work/build/lib/volk_32i_x2_and_32i_a_orc_impl.c
442:info:build Building C object lib/CMakeFiles/volk_obj.dir/volk_32fc_x2_multiply_32fc_a_orc_impl.c.o
443:info:build cd /opt/local/var/macports/build/_opt_local_var_macports_sources_rsync.macports.org_release_tarballs_ports_science_volk/volk/work/build/lib && /Applications/Xcode.app/Contents/Developer/Toolchains/XcodeDefault.xctoolchain/usr/bin/clang  -DHAVE_CPUID_H -DHAVE_DLFCN_H -DHAVE_FENV_H -DHAVE_POSIX_MEMALIGN -DHAVE_XGETBV -pipe -Os -arch x86_64  -Wall -fvisibility=hidden -DNDEBUG -arch x86_64 -mmacosx-version-min=10.7 -I/opt/local/var/macports/build/_opt_local_var_macports_sources_rsync.macports.org_release_tarballs_ports_science_volk/volk/work/build/include -I/opt/local/var/macports/build/_opt_local_var_macports_sources_rsync.macports.org_release_tarballs_ports_science_volk/volk/work/volk-8a16928a7e2ae5c5949ddeeb5479e642da9d68d7/include -I/opt/local/var/macports/build/_opt_local_var_macports_sources_rsync.macports.org_release_tarballs_ports_science_volk/volk/work/volk-8a16928a7e2ae5c5949ddeeb5479e642da9d68d7/kernels -I/opt/local/var/macports/build/_opt_local_var_macports_sources_rsync.macports.org_release_tarballs_ports_science_volk/volk/work/build/lib -I/opt/local/var/macports/build/_opt_local_var_macports_sources_rsync.macports.org_release_tarballs_ports_science_volk/volk/work/volk-8a16928a7e2ae5c5949ddeeb5479e642da9d68d7/lib -I/opt/local/include/orc-0.4 -I/opt/local/include    -fPIC -o CMakeFiles/volk_obj.dir/volk_32fc_x2_multiply_32fc_a_orc_impl.c.o   -c /opt/local/var/macports/build/_opt_local_var_macports_sources_rsync.macports.org_release_tarballs_ports_science_volk/volk/work/build/lib/volk_32fc_x2_multiply_32fc_a_orc_impl.c
444:info:build Building C object lib/CMakeFiles/volk_obj.dir/volk_32i_x2_or_32i_a_orc_impl.c.o
445:info:build cd /opt/local/var/macports/build/_opt_local_var_macports_sources_rsync.macports.org_release_tarballs_ports_science_volk/volk/work/build/lib && /Applications/Xcode.app/Contents/Developer/Toolchains/XcodeDefault.xctoolchain/usr/bin/clang  -DHAVE_CPUID_H -DHAVE_DLFCN_H -DHAVE_FENV_H -DHAVE_POSIX_MEMALIGN -DHAVE_XGETBV -pipe -Os -arch x86_64  -Wall -fvisibility=hidden -DNDEBUG -arch x86_64 -mmacosx-version-min=10.7 -I/opt/local/var/macports/build/_opt_local_var_macports_sources_rsync.macports.org_release_tarballs_ports_science_volk/volk/work/build/include -I/opt/local/var/macports/build/_opt_local_var_macports_sources_rsync.macports.org_release_tarballs_ports_science_volk/volk/work/volk-8a16928a7e2ae5c5949ddeeb5479e642da9d68d7/include -I/opt/local/var/macports/build/_opt_local_var_macports_sources_rsync.macports.org_release_tarballs_ports_science_volk/volk/work/volk-8a16928a7e2ae5c5949ddeeb5479e642da9d68d7/kernels -I/opt/local/var/macports/build/_opt_local_var_macports_sources_rsync.macports.org_release_tarballs_ports_science_volk/volk/work/build/lib -I/opt/local/var/macports/build/_opt_local_var_macports_sources_rsync.macports.org_release_tarballs_ports_science_volk/volk/work/volk-8a16928a7e2ae5c5949ddeeb5479e642da9d68d7/lib -I/opt/local/include/orc-0.4 -I/opt/local/include    -fPIC -o CMakeFiles/volk_obj.dir/volk_32i_x2_or_32i_a_orc_impl.c.o   -c /opt/local/var/macports/build/_opt_local_var_macports_sources_rsync.macports.org_release_tarballs_ports_science_volk/volk/work/build/lib/volk_32i_x2_or_32i_a_orc_impl.c
446:info:build Building C object lib/CMakeFiles/volk_obj.dir/volk_8i_convert_16i_a_orc_impl.c.o
447:info:build cd /opt/local/var/macports/build/_opt_local_var_macports_sources_rsync.macports.org_release_tarballs_ports_science_volk/volk/work/build/lib && /Applications/Xcode.app/Contents/Developer/Toolchains/XcodeDefault.xctoolchain/usr/bin/clang  -DHAVE_CPUID_H -DHAVE_DLFCN_H -DHAVE_FENV_H -DHAVE_POSIX_MEMALIGN -DHAVE_XGETBV -pipe -Os -arch x86_64  -Wall -fvisibility=hidden -DNDEBUG -arch x86_64 -mmacosx-version-min=10.7 -I/opt/local/var/macports/build/_opt_local_var_macports_sources_rsync.macports.org_release_tarballs_ports_science_volk/volk/work/build/include -I/opt/local/var/macports/build/_opt_local_var_macports_sources_rsync.macports.org_release_tarballs_ports_science_volk/volk/work/volk-8a16928a7e2ae5c5949ddeeb5479e642da9d68d7/include -I/opt/local/var/macports/build/_opt_local_var_macports_sources_rsync.macports.org_release_tarballs_ports_science_volk/volk/work/volk-8a16928a7e2ae5c5949ddeeb5479e642da9d68d7/kernels -I/opt/local/var/macports/build/_opt_local_var_macports_sources_rsync.macports.org_release_tarballs_ports_science_volk/volk/work/build/lib -I/opt/local/var/macports/build/_opt_local_var_macports_sources_rsync.macports.org_release_tarballs_ports_science_volk/volk/work/volk-8a16928a7e2ae5c5949ddeeb5479e642da9d68d7/lib -I/opt/local/include/orc-0.4 -I/opt/local/include    -fPIC -o CMakeFiles/volk_obj.dir/volk_8i_convert_16i_a_orc_impl.c.o   -c /opt/local/var/macports/build/_opt_local_var_macports_sources_rsync.macports.org_release_tarballs_ports_science_volk/volk/work/build/lib/volk_8i_convert_16i_a_orc_impl.c
448:info:build /opt/local/bin/cmake -E cmake_progress_report /opt/local/var/macports/build/_opt_local_var_macports_sources_rsync.macports.org_release_tarballs_ports_science_volk/volk/work/build/CMakeFiles 72
449:info:build /opt/local/bin/cmake -E cmake_progress_report /opt/local/var/macports/build/_opt_local_var_macports_sources_rsync.macports.org_release_tarballs_ports_science_volk/volk/work/build/CMakeFiles 73
450:info:build /opt/local/bin/cmake -E cmake_progress_report /opt/local/var/macports/build/_opt_local_var_macports_sources_rsync.macports.org_release_tarballs_ports_science_volk/volk/work/build/CMakeFiles 74
451:info:build [ 78%] [ 79%] /opt/local/bin/cmake -E cmake_progress_report /opt/local/var/macports/build/_opt_local_var_macports_sources_rsync.macports.org_release_tarballs_ports_science_volk/volk/work/build/CMakeFiles 75
452:info:build [ 80%] [ 81%] Building C object lib/CMakeFiles/volk_obj.dir/constants.c.o
453:info:build Building C object lib/CMakeFiles/volk_obj.dir/volk_8i_s32f_convert_32f_a_orc_impl.c.o
454:info:build cd /opt/local/var/macports/build/_opt_local_var_macports_sources_rsync.macports.org_release_tarballs_ports_science_volk/volk/work/build/lib && /Applications/Xcode.app/Contents/Developer/Toolchains/XcodeDefault.xctoolchain/usr/bin/clang  -DHAVE_CPUID_H -DHAVE_DLFCN_H -DHAVE_FENV_H -DHAVE_POSIX_MEMALIGN -DHAVE_XGETBV -pipe -Os -arch x86_64  -Wall -fvisibility=hidden -DNDEBUG -arch x86_64 -mmacosx-version-min=10.7 -I/opt/local/var/macports/build/_opt_local_var_macports_sources_rsync.macports.org_release_tarballs_ports_science_volk/volk/work/build/include -I/opt/local/var/macports/build/_opt_local_var_macports_sources_rsync.macports.org_release_tarballs_ports_science_volk/volk/work/volk-8a16928a7e2ae5c5949ddeeb5479e642da9d68d7/include -I/opt/local/var/macports/build/_opt_local_var_macports_sources_rsync.macports.org_release_tarballs_ports_science_volk/volk/work/volk-8a16928a7e2ae5c5949ddeeb5479e642da9d68d7/kernels -I/opt/local/var/macports/build/_opt_local_var_macports_sources_rsync.macports.org_release_tarballs_ports_science_volk/volk/work/build/lib -I/opt/local/var/macports/build/_opt_local_var_macports_sources_rsync.macports.org_release_tarballs_ports_science_volk/volk/work/volk-8a16928a7e2ae5c5949ddeeb5479e642da9d68d7/lib -I/opt/local/include/orc-0.4 -I/opt/local/include    -fPIC -o CMakeFiles/volk_obj.dir/constants.c.o   -c /opt/local/var/macports/build/_opt_local_var_macports_sources_rsync.macports.org_release_tarballs_ports_science_volk/volk/work/build/lib/constants.c
455:info:build cd /opt/local/var/macports/build/_opt_local_var_macports_sources_rsync.macports.org_release_tarballs_ports_science_volk/volk/work/build/lib && /Applications/Xcode.app/Contents/Developer/Toolchains/XcodeDefault.xctoolchain/usr/bin/clang  -DHAVE_CPUID_H -DHAVE_DLFCN_H -DHAVE_FENV_H -DHAVE_POSIX_MEMALIGN -DHAVE_XGETBV -pipe -Os -arch x86_64  -Wall -fvisibility=hidden -DNDEBUG -arch x86_64 -mmacosx-version-min=10.7 -I/opt/local/var/macports/build/_opt_local_var_macports_sources_rsync.macports.org_release_tarballs_ports_science_volk/volk/work/build/include -I/opt/local/var/macports/build/_opt_local_var_macports_sources_rsync.macports.org_release_tarballs_ports_science_volk/volk/work/volk-8a16928a7e2ae5c5949ddeeb5479e642da9d68d7/include -I/opt/local/var/macports/build/_opt_local_var_macports_sources_rsync.macports.org_release_tarballs_ports_science_volk/volk/work/volk-8a16928a7e2ae5c5949ddeeb5479e642da9d68d7/kernels -I/opt/local/var/macports/build/_opt_local_var_macports_sources_rsync.macports.org_release_tarballs_ports_science_volk/volk/work/build/lib -I/opt/local/var/macports/build/_opt_local_var_macports_sources_rsync.macports.org_release_tarballs_ports_science_volk/volk/work/volk-8a16928a7e2ae5c5949ddeeb5479e642da9d68d7/lib -I/opt/local/include/orc-0.4 -I/opt/local/include    -fPIC -o CMakeFiles/volk_obj.dir/volk_8i_s32f_convert_32f_a_orc_impl.c.o   -c /opt/local/var/macports/build/_opt_local_var_macports_sources_rsync.macports.org_release_tarballs_ports_science_volk/volk/work/build/lib/volk_8i_s32f_convert_32f_a_orc_impl.c
456:info:build Building C object lib/CMakeFiles/volk_obj.dir/volk_prefs.c.o
457:info:build cd /opt/local/var/macports/build/_opt_local_var_macports_sources_rsync.macports.org_release_tarballs_ports_science_volk/volk/work/build/lib && /Applications/Xcode.app/Contents/Developer/Toolchains/XcodeDefault.xctoolchain/usr/bin/clang  -DHAVE_CPUID_H -DHAVE_DLFCN_H -DHAVE_FENV_H -DHAVE_POSIX_MEMALIGN -DHAVE_XGETBV -pipe -Os -arch x86_64  -Wall -fvisibility=hidden -DNDEBUG -arch x86_64 -mmacosx-version-min=10.7 -I/opt/local/var/macports/build/_opt_local_var_macports_sources_rsync.macports.org_release_tarballs_ports_science_volk/volk/work/build/include -I/opt/local/var/macports/build/_opt_local_var_macports_sources_rsync.macports.org_release_tarballs_ports_science_volk/volk/work/volk-8a16928a7e2ae5c5949ddeeb5479e642da9d68d7/include -I/opt/local/var/macports/build/_opt_local_var_macports_sources_rsync.macports.org_release_tarballs_ports_science_volk/volk/work/volk-8a16928a7e2ae5c5949ddeeb5479e642da9d68d7/kernels -I/opt/local/var/macports/build/_opt_local_var_macports_sources_rsync.macports.org_release_tarballs_ports_science_volk/volk/work/build/lib -I/opt/local/var/macports/build/_opt_local_var_macports_sources_rsync.macports.org_release_tarballs_ports_science_volk/volk/work/volk-8a16928a7e2ae5c5949ddeeb5479e642da9d68d7/lib -I/opt/local/include/orc-0.4 -I/opt/local/include    -fPIC -o CMakeFiles/volk_obj.dir/volk_prefs.c.o   -c /opt/local/var/macports/build/_opt_local_var_macports_sources_rsync.macports.org_release_tarballs_ports_science_volk/volk/work/volk-8a16928a7e2ae5c5949ddeeb5479e642da9d68d7/lib/volk_prefs.c
458:info:build Building C object lib/CMakeFiles/volk_obj.dir/volk_rank_archs.c.o
459:info:build cd /opt/local/var/macports/build/_opt_local_var_macports_sources_rsync.macports.org_release_tarballs_ports_science_volk/volk/work/build/lib && /Applications/Xcode.app/Contents/Developer/Toolchains/XcodeDefault.xctoolchain/usr/bin/clang  -DHAVE_CPUID_H -DHAVE_DLFCN_H -DHAVE_FENV_H -DHAVE_POSIX_MEMALIGN -DHAVE_XGETBV -pipe -Os -arch x86_64  -Wall -fvisibility=hidden -DNDEBUG -arch x86_64 -mmacosx-version-min=10.7 -I/opt/local/var/macports/build/_opt_local_var_macports_sources_rsync.macports.org_release_tarballs_ports_science_volk/volk/work/build/include -I/opt/local/var/macports/build/_opt_local_var_macports_sources_rsync.macports.org_release_tarballs_ports_science_volk/volk/work/volk-8a16928a7e2ae5c5949ddeeb5479e642da9d68d7/include -I/opt/local/var/macports/build/_opt_local_var_macports_sources_rsync.macports.org_release_tarballs_ports_science_volk/volk/work/volk-8a16928a7e2ae5c5949ddeeb5479e642da9d68d7/kernels -I/opt/local/var/macports/build/_opt_local_var_macports_sources_rsync.macports.org_release_tarballs_ports_science_volk/volk/work/build/lib -I/opt/local/var/macports/build/_opt_local_var_macports_sources_rsync.macports.org_release_tarballs_ports_science_volk/volk/work/volk-8a16928a7e2ae5c5949ddeeb5479e642da9d68d7/lib -I/opt/local/include/orc-0.4 -I/opt/local/include    -fPIC -o CMakeFiles/volk_obj.dir/volk_rank_archs.c.o   -c /opt/local/var/macports/build/_opt_local_var_macports_sources_rsync.macports.org_release_tarballs_ports_science_volk/volk/work/volk-8a16928a7e2ae5c5949ddeeb5479e642da9d68d7/lib/volk_rank_archs.c
460:info:build /opt/local/bin/cmake -E cmake_progress_report /opt/local/var/macports/build/_opt_local_var_macports_sources_rsync.macports.org_release_tarballs_ports_science_volk/volk/work/build/CMakeFiles 76
461:info:build [ 82%] /opt/local/bin/cmake -E cmake_progress_report /opt/local/var/macports/build/_opt_local_var_macports_sources_rsync.macports.org_release_tarballs_ports_science_volk/volk/work/build/CMakeFiles 77
462:info:build [ 83%] Building C object lib/CMakeFiles/volk_obj.dir/volk_malloc.c.o
463:info:build cd /opt/local/var/macports/build/_opt_local_var_macports_sources_rsync.macports.org_release_tarballs_ports_science_volk/volk/work/build/lib && /Applications/Xcode.app/Contents/Developer/Toolchains/XcodeDefault.xctoolchain/usr/bin/clang  -DHAVE_CPUID_H -DHAVE_DLFCN_H -DHAVE_FENV_H -DHAVE_POSIX_MEMALIGN -DHAVE_XGETBV -pipe -Os -arch x86_64  -Wall -fvisibility=hidden -DNDEBUG -arch x86_64 -mmacosx-version-min=10.7 -I/opt/local/var/macports/build/_opt_local_var_macports_sources_rsync.macports.org_release_tarballs_ports_science_volk/volk/work/build/include -I/opt/local/var/macports/build/_opt_local_var_macports_sources_rsync.macports.org_release_tarballs_ports_science_volk/volk/work/volk-8a16928a7e2ae5c5949ddeeb5479e642da9d68d7/include -I/opt/local/var/macports/build/_opt_local_var_macports_sources_rsync.macports.org_release_tarballs_ports_science_volk/volk/work/volk-8a16928a7e2ae5c5949ddeeb5479e642da9d68d7/kernels -I/opt/local/var/macports/build/_opt_local_var_macports_sources_rsync.macports.org_release_tarballs_ports_science_volk/volk/work/build/lib -I/opt/local/var/macports/build/_opt_local_var_macports_sources_rsync.macports.org_release_tarballs_ports_science_volk/volk/work/volk-8a16928a7e2ae5c5949ddeeb5479e642da9d68d7/lib -I/opt/local/include/orc-0.4 -I/opt/local/include    -fPIC -o CMakeFiles/volk_obj.dir/volk_malloc.c.o   -c /opt/local/var/macports/build/_opt_local_var_macports_sources_rsync.macports.org_release_tarballs_ports_science_volk/volk/work/volk-8a16928a7e2ae5c5949ddeeb5479e642da9d68d7/lib/volk_malloc.c
464:info:build Building C object lib/CMakeFiles/volk_obj.dir/volk.c.o
465:info:build cd /opt/local/var/macports/build/_opt_local_var_macports_sources_rsync.macports.org_release_tarballs_ports_science_volk/volk/work/build/lib && /Applications/Xcode.app/Contents/Developer/Toolchains/XcodeDefault.xctoolchain/usr/bin/clang  -DHAVE_CPUID_H -DHAVE_DLFCN_H -DHAVE_FENV_H -DHAVE_POSIX_MEMALIGN -DHAVE_XGETBV -DLV_MACHINE_GENERIC_ORC -DLV_MACHINE_SSE2_64_MMX_ORC -DLV_MACHINE_SSE3_64_ORC -DLV_MACHINE_SSE4_1_64_ORC -DLV_MACHINE_SSE4_2_64_ORC -DLV_MACHINE_SSE4_A_64_ORC -DLV_MACHINE_SSSE3_64_ORC -pipe -Os -arch x86_64  -Wall -fvisibility=hidden -DNDEBUG -arch x86_64 -mmacosx-version-min=10.7 -I/opt/local/var/macports/build/_opt_local_var_macports_sources_rsync.macports.org_release_tarballs_ports_science_volk/volk/work/build/include -I/opt/local/var/macports/build/_opt_local_var_macports_sources_rsync.macports.org_release_tarballs_ports_science_volk/volk/work/volk-8a16928a7e2ae5c5949ddeeb5479e642da9d68d7/include -I/opt/local/var/macports/build/_opt_local_var_macports_sources_rsync.macports.org_release_tarballs_ports_science_volk/volk/work/volk-8a16928a7e2ae5c5949ddeeb5479e642da9d68d7/kernels -I/opt/local/var/macports/build/_opt_local_var_macports_sources_rsync.macports.org_release_tarballs_ports_science_volk/volk/work/build/lib -I/opt/local/var/macports/build/_opt_local_var_macports_sources_rsync.macports.org_release_tarballs_ports_science_volk/volk/work/volk-8a16928a7e2ae5c5949ddeeb5479e642da9d68d7/lib -I/opt/local/include/orc-0.4 -I/opt/local/include    -fPIC -o CMakeFiles/volk_obj.dir/volk.c.o   -c /opt/local/var/macports/build/_opt_local_var_macports_sources_rsync.macports.org_release_tarballs_ports_science_volk/volk/work/build/lib/volk.c
466:info:build /opt/local/bin/cmake -E cmake_progress_report /opt/local/var/macports/build/_opt_local_var_macports_sources_rsync.macports.org_release_tarballs_ports_science_volk/volk/work/build/CMakeFiles 78
467:info:build /opt/local/bin/cmake -E cmake_progress_report /opt/local/var/macports/build/_opt_local_var_macports_sources_rsync.macports.org_release_tarballs_ports_science_volk/volk/work/build/CMakeFiles 79
468:info:build /opt/local/bin/cmake -E cmake_progress_report /opt/local/var/macports/build/_opt_local_var_macports_sources_rsync.macports.org_release_tarballs_ports_science_volk/volk/work/build/CMakeFiles 80
469:info:build [ 85%] [ 86%] [ 87%] Building C object lib/CMakeFiles/volk_obj.dir/volk_machines.c.o
470:info:build Building C object lib/CMakeFiles/volk_obj.dir/volk_cpu.c.o
471:info:build Building C object lib/CMakeFiles/volk_obj.dir/volk_machine_generic_orc.c.o
472:info:build cd /opt/local/var/macports/build/_opt_local_var_macports_sources_rsync.macports.org_release_tarballs_ports_science_volk/volk/work/build/lib && /Applications/Xcode.app/Contents/Developer/Toolchains/XcodeDefault.xctoolchain/usr/bin/clang  -DHAVE_CPUID_H -DHAVE_DLFCN_H -DHAVE_FENV_H -DHAVE_POSIX_MEMALIGN -DHAVE_XGETBV -DLV_MACHINE_GENERIC_ORC -DLV_MACHINE_SSE2_64_MMX_ORC -DLV_MACHINE_SSE3_64_ORC -DLV_MACHINE_SSE4_1_64_ORC -DLV_MACHINE_SSE4_2_64_ORC -DLV_MACHINE_SSE4_A_64_ORC -DLV_MACHINE_SSSE3_64_ORC -pipe -Os -arch x86_64  -Wall -fvisibility=hidden -DNDEBUG -arch x86_64 -mmacosx-version-min=10.7 -I/opt/local/var/macports/build/_opt_local_var_macports_sources_rsync.macports.org_release_tarballs_ports_science_volk/volk/work/build/include -I/opt/local/var/macports/build/_opt_local_var_macports_sources_rsync.macports.org_release_tarballs_ports_science_volk/volk/work/volk-8a16928a7e2ae5c5949ddeeb5479e642da9d68d7/include -I/opt/local/var/macports/build/_opt_local_var_macports_sources_rsync.macports.org_release_tarballs_ports_science_volk/volk/work/volk-8a16928a7e2ae5c5949ddeeb5479e642da9d68d7/kernels -I/opt/local/var/macports/build/_opt_local_var_macports_sources_rsync.macports.org_release_tarballs_ports_science_volk/volk/work/build/lib -I/opt/local/var/macports/build/_opt_local_var_macports_sources_rsync.macports.org_release_tarballs_ports_science_volk/volk/work/volk-8a16928a7e2ae5c5949ddeeb5479e642da9d68d7/lib -I/opt/local/include/orc-0.4 -I/opt/local/include    -fPIC -o CMakeFiles/volk_obj.dir/volk_machines.c.o   -c /opt/local/var/macports/build/_opt_local_var_macports_sources_rsync.macports.org_release_tarballs_ports_science_volk/volk/work/build/lib/volk_machines.c
473:info:build cd /opt/local/var/macports/build/_opt_local_var_macports_sources_rsync.macports.org_release_tarballs_ports_science_volk/volk/work/build/lib && /Applications/Xcode.app/Contents/Developer/Toolchains/XcodeDefault.xctoolchain/usr/bin/clang  -DHAVE_CPUID_H -DHAVE_DLFCN_H -DHAVE_FENV_H -DHAVE_POSIX_MEMALIGN -DHAVE_XGETBV -pipe -Os -arch x86_64  -Wall -fvisibility=hidden -DNDEBUG -arch x86_64 -mmacosx-version-min=10.7 -I/opt/local/var/macports/build/_opt_local_var_macports_sources_rsync.macports.org_release_tarballs_ports_science_volk/volk/work/build/include -I/opt/local/var/macports/build/_opt_local_var_macports_sources_rsync.macports.org_release_tarballs_ports_science_volk/volk/work/volk-8a16928a7e2ae5c5949ddeeb5479e642da9d68d7/include -I/opt/local/var/macports/build/_opt_local_var_macports_sources_rsync.macports.org_release_tarballs_ports_science_volk/volk/work/volk-8a16928a7e2ae5c5949ddeeb5479e642da9d68d7/kernels -I/opt/local/var/macports/build/_opt_local_var_macports_sources_rsync.macports.org_release_tarballs_ports_science_volk/volk/work/build/lib -I/opt/local/var/macports/build/_opt_local_var_macports_sources_rsync.macports.org_release_tarballs_ports_science_volk/volk/work/volk-8a16928a7e2ae5c5949ddeeb5479e642da9d68d7/lib -I/opt/local/include/orc-0.4 -I/opt/local/include    -fPIC -o CMakeFiles/volk_obj.dir/volk_machine_generic_orc.c.o   -c /opt/local/var/macports/build/_opt_local_var_macports_sources_rsync.macports.org_release_tarballs_ports_science_volk/volk/work/build/lib/volk_machine_generic_orc.c
474:info:build cd /opt/local/var/macports/build/_opt_local_var_macports_sources_rsync.macports.org_release_tarballs_ports_science_volk/volk/work/build/lib && /Applications/Xcode.app/Contents/Developer/Toolchains/XcodeDefault.xctoolchain/usr/bin/clang  -DHAVE_CPUID_H -DHAVE_DLFCN_H -DHAVE_FENV_H -DHAVE_POSIX_MEMALIGN -DHAVE_XGETBV -pipe -Os -arch x86_64  -Wall -fvisibility=hidden -DNDEBUG -arch x86_64 -mmacosx-version-min=10.7 -I/opt/local/var/macports/build/_opt_local_var_macports_sources_rsync.macports.org_release_tarballs_ports_science_volk/volk/work/build/include -I/opt/local/var/macports/build/_opt_local_var_macports_sources_rsync.macports.org_release_tarballs_ports_science_volk/volk/work/volk-8a16928a7e2ae5c5949ddeeb5479e642da9d68d7/include -I/opt/local/var/macports/build/_opt_local_var_macports_sources_rsync.macports.org_release_tarballs_ports_science_volk/volk/work/volk-8a16928a7e2ae5c5949ddeeb5479e642da9d68d7/kernels -I/opt/local/var/macports/build/_opt_local_var_macports_sources_rsync.macports.org_release_tarballs_ports_science_volk/volk/work/build/lib -I/opt/local/var/macports/build/_opt_local_var_macports_sources_rsync.macports.org_release_tarballs_ports_science_volk/volk/work/volk-8a16928a7e2ae5c5949ddeeb5479e642da9d68d7/lib -I/opt/local/include/orc-0.4 -I/opt/local/include    -fPIC -o CMakeFiles/volk_obj.dir/volk_cpu.c.o   -c /opt/local/var/macports/build/_opt_local_var_macports_sources_rsync.macports.org_release_tarballs_ports_science_volk/volk/work/build/lib/volk_cpu.c
475:info:build /opt/local/var/macports/build/_opt_local_var_macports_sources_rsync.macports.org_release_tarballs_ports_science_volk/volk/work/build/lib/volk_cpu.c:83:5: warning: implicit declaration of function '__cpuid_count' is invalid in C99 [-Wimplicit-function-declaration]
476:info:build     __cpuid_count(level, count, regs[0],  regs[1],  regs[2], regs[3]);
477:info:build     ^
478:info:build /opt/local/bin/cmake -E cmake_progress_report /opt/local/var/macports/build/_opt_local_var_macports_sources_rsync.macports.org_release_tarballs_ports_science_volk/volk/work/build/CMakeFiles 81
479:info:build [ 88%] Building C object lib/CMakeFiles/volk_obj.dir/volk_machine_sse2_64_mmx_orc.c.o
480:info:build cd /opt/local/var/macports/build/_opt_local_var_macports_sources_rsync.macports.org_release_tarballs_ports_science_volk/volk/work/build/lib && /Applications/Xcode.app/Contents/Developer/Toolchains/XcodeDefault.xctoolchain/usr/bin/clang  -DHAVE_CPUID_H -DHAVE_DLFCN_H -DHAVE_FENV_H -DHAVE_POSIX_MEMALIGN -DHAVE_XGETBV -pipe -Os -arch x86_64  -Wall -fvisibility=hidden -DNDEBUG -arch x86_64 -mmacosx-version-min=10.7 -I/opt/local/var/macports/build/_opt_local_var_macports_sources_rsync.macports.org_release_tarballs_ports_science_volk/volk/work/build/include -I/opt/local/var/macports/build/_opt_local_var_macports_sources_rsync.macports.org_release_tarballs_ports_science_volk/volk/work/volk-8a16928a7e2ae5c5949ddeeb5479e642da9d68d7/include -I/opt/local/var/macports/build/_opt_local_var_macports_sources_rsync.macports.org_release_tarballs_ports_science_volk/volk/work/volk-8a16928a7e2ae5c5949ddeeb5479e642da9d68d7/kernels -I/opt/local/var/macports/build/_opt_local_var_macports_sources_rsync.macports.org_release_tarballs_ports_science_volk/volk/work/build/lib -I/opt/local/var/macports/build/_opt_local_var_macports_sources_rsync.macports.org_release_tarballs_ports_science_volk/volk/work/volk-8a16928a7e2ae5c5949ddeeb5479e642da9d68d7/lib -I/opt/local/include/orc-0.4 -I/opt/local/include    -fPIC -m64 -mmmx -msse -msse2 -o CMakeFiles/volk_obj.dir/volk_machine_sse2_64_mmx_orc.c.o   -c /opt/local/var/macports/build/_opt_local_var_macports_sources_rsync.macports.org_release_tarballs_ports_science_volk/volk/work/build/lib/volk_machine_sse2_64_mmx_orc.c
481:info:build 1 warning generated.
482:info:build /opt/local/bin/cmake -E cmake_progress_report /opt/local/var/macports/build/_opt_local_var_macports_sources_rsync.macports.org_release_tarballs_ports_science_volk/volk/work/build/CMakeFiles 82
483:info:build [ 89%] Building C object lib/CMakeFiles/volk_obj.dir/volk_machine_sse3_64_orc.c.o
484:info:build cd /opt/local/var/macports/build/_opt_local_var_macports_sources_rsync.macports.org_release_tarballs_ports_science_volk/volk/work/build/lib && /Applications/Xcode.app/Contents/Developer/Toolchains/XcodeDefault.xctoolchain/usr/bin/clang  -DHAVE_CPUID_H -DHAVE_DLFCN_H -DHAVE_FENV_H -DHAVE_POSIX_MEMALIGN -DHAVE_XGETBV -pipe -Os -arch x86_64  -Wall -fvisibility=hidden -DNDEBUG -arch x86_64 -mmacosx-version-min=10.7 -I/opt/local/var/macports/build/_opt_local_var_macports_sources_rsync.macports.org_release_tarballs_ports_science_volk/volk/work/build/include -I/opt/local/var/macports/build/_opt_local_var_macports_sources_rsync.macports.org_release_tarballs_ports_science_volk/volk/work/volk-8a16928a7e2ae5c5949ddeeb5479e642da9d68d7/include -I/opt/local/var/macports/build/_opt_local_var_macports_sources_rsync.macports.org_release_tarballs_ports_science_volk/volk/work/volk-8a16928a7e2ae5c5949ddeeb5479e642da9d68d7/kernels -I/opt/local/var/macports/build/_opt_local_var_macports_sources_rsync.macports.org_release_tarballs_ports_science_volk/volk/work/build/lib -I/opt/local/var/macports/build/_opt_local_var_macports_sources_rsync.macports.org_release_tarballs_ports_science_volk/volk/work/volk-8a16928a7e2ae5c5949ddeeb5479e642da9d68d7/lib -I/opt/local/include/orc-0.4 -I/opt/local/include    -fPIC -m64 -mmmx -msse -msse2 -msse3 -o CMakeFiles/volk_obj.dir/volk_machine_sse3_64_orc.c.o   -c /opt/local/var/macports/build/_opt_local_var_macports_sources_rsync.macports.org_release_tarballs_ports_science_volk/volk/work/build/lib/volk_machine_sse3_64_orc.c
485:info:build /opt/local/bin/cmake -E cmake_progress_report /opt/local/var/macports/build/_opt_local_var_macports_sources_rsync.macports.org_release_tarballs_ports_science_volk/volk/work/build/CMakeFiles 83
486:info:build [ 90%] Building C object lib/CMakeFiles/volk_obj.dir/volk_machine_ssse3_64_orc.c.o
487:info:build cd /opt/local/var/macports/build/_opt_local_var_macports_sources_rsync.macports.org_release_tarballs_ports_science_volk/volk/work/build/lib && /Applications/Xcode.app/Contents/Developer/Toolchains/XcodeDefault.xctoolchain/usr/bin/clang  -DHAVE_CPUID_H -DHAVE_DLFCN_H -DHAVE_FENV_H -DHAVE_POSIX_MEMALIGN -DHAVE_XGETBV -pipe -Os -arch x86_64  -Wall -fvisibility=hidden -DNDEBUG -arch x86_64 -mmacosx-version-min=10.7 -I/opt/local/var/macports/build/_opt_local_var_macports_sources_rsync.macports.org_release_tarballs_ports_science_volk/volk/work/build/include -I/opt/local/var/macports/build/_opt_local_var_macports_sources_rsync.macports.org_release_tarballs_ports_science_volk/volk/work/volk-8a16928a7e2ae5c5949ddeeb5479e642da9d68d7/include -I/opt/local/var/macports/build/_opt_local_var_macports_sources_rsync.macports.org_release_tarballs_ports_science_volk/volk/work/volk-8a16928a7e2ae5c5949ddeeb5479e642da9d68d7/kernels -I/opt/local/var/macports/build/_opt_local_var_macports_sources_rsync.macports.org_release_tarballs_ports_science_volk/volk/work/build/lib -I/opt/local/var/macports/build/_opt_local_var_macports_sources_rsync.macports.org_release_tarballs_ports_science_volk/volk/work/volk-8a16928a7e2ae5c5949ddeeb5479e642da9d68d7/lib -I/opt/local/include/orc-0.4 -I/opt/local/include    -fPIC -m64 -mmmx -msse -msse2 -msse3 -mssse3 -o CMakeFiles/volk_obj.dir/volk_machine_ssse3_64_orc.c.o   -c /opt/local/var/macports/build/_opt_local_var_macports_sources_rsync.macports.org_release_tarballs_ports_science_volk/volk/work/build/lib/volk_machine_ssse3_64_orc.c
488:info:build /opt/local/bin/cmake -E cmake_progress_report /opt/local/var/macports/build/_opt_local_var_macports_sources_rsync.macports.org_release_tarballs_ports_science_volk/volk/work/build/CMakeFiles 84
489:info:build [ 91%] Building C object lib/CMakeFiles/volk_obj.dir/volk_machine_sse4_a_64_orc.c.o
490:info:build cd /opt/local/var/macports/build/_opt_local_var_macports_sources_rsync.macports.org_release_tarballs_ports_science_volk/volk/work/build/lib && /Applications/Xcode.app/Contents/Developer/Toolchains/XcodeDefault.xctoolchain/usr/bin/clang  -DHAVE_CPUID_H -DHAVE_DLFCN_H -DHAVE_FENV_H -DHAVE_POSIX_MEMALIGN -DHAVE_XGETBV -pipe -Os -arch x86_64  -Wall -fvisibility=hidden -DNDEBUG -arch x86_64 -mmacosx-version-min=10.7 -I/opt/local/var/macports/build/_opt_local_var_macports_sources_rsync.macports.org_release_tarballs_ports_science_volk/volk/work/build/include -I/opt/local/var/macports/build/_opt_local_var_macports_sources_rsync.macports.org_release_tarballs_ports_science_volk/volk/work/volk-8a16928a7e2ae5c5949ddeeb5479e642da9d68d7/include -I/opt/local/var/macports/build/_opt_local_var_macports_sources_rsync.macports.org_release_tarballs_ports_science_volk/volk/work/volk-8a16928a7e2ae5c5949ddeeb5479e642da9d68d7/kernels -I/opt/local/var/macports/build/_opt_local_var_macports_sources_rsync.macports.org_release_tarballs_ports_science_volk/volk/work/build/lib -I/opt/local/var/macports/build/_opt_local_var_macports_sources_rsync.macports.org_release_tarballs_ports_science_volk/volk/work/volk-8a16928a7e2ae5c5949ddeeb5479e642da9d68d7/lib -I/opt/local/include/orc-0.4 -I/opt/local/include    -fPIC -m64 -mmmx -msse -msse2 -msse3 -msse4a -mpopcnt -o CMakeFiles/volk_obj.dir/volk_machine_sse4_a_64_orc.c.o   -c /opt/local/var/macports/build/_opt_local_var_macports_sources_rsync.macports.org_release_tarballs_ports_science_volk/volk/work/build/lib/volk_machine_sse4_a_64_orc.c
491:info:build /opt/local/bin/cmake -E cmake_progress_report /opt/local/var/macports/build/_opt_local_var_macports_sources_rsync.macports.org_release_tarballs_ports_science_volk/volk/work/build/CMakeFiles 85
492:info:build [ 93%] Building C object lib/CMakeFiles/volk_obj.dir/volk_machine_sse4_1_64_orc.c.o
493:info:build cd /opt/local/var/macports/build/_opt_local_var_macports_sources_rsync.macports.org_release_tarballs_ports_science_volk/volk/work/build/lib && /Applications/Xcode.app/Contents/Developer/Toolchains/XcodeDefault.xctoolchain/usr/bin/clang  -DHAVE_CPUID_H -DHAVE_DLFCN_H -DHAVE_FENV_H -DHAVE_POSIX_MEMALIGN -DHAVE_XGETBV -pipe -Os -arch x86_64  -Wall -fvisibility=hidden -DNDEBUG -arch x86_64 -mmacosx-version-min=10.7 -I/opt/local/var/macports/build/_opt_local_var_macports_sources_rsync.macports.org_release_tarballs_ports_science_volk/volk/work/build/include -I/opt/local/var/macports/build/_opt_local_var_macports_sources_rsync.macports.org_release_tarballs_ports_science_volk/volk/work/volk-8a16928a7e2ae5c5949ddeeb5479e642da9d68d7/include -I/opt/local/var/macports/build/_opt_local_var_macports_sources_rsync.macports.org_release_tarballs_ports_science_volk/volk/work/volk-8a16928a7e2ae5c5949ddeeb5479e642da9d68d7/kernels -I/opt/local/var/macports/build/_opt_local_var_macports_sources_rsync.macports.org_release_tarballs_ports_science_volk/volk/work/build/lib -I/opt/local/var/macports/build/_opt_local_var_macports_sources_rsync.macports.org_release_tarballs_ports_science_volk/volk/work/volk-8a16928a7e2ae5c5949ddeeb5479e642da9d68d7/lib -I/opt/local/include/orc-0.4 -I/opt/local/include    -fPIC -m64 -mmmx -msse -msse2 -msse3 -mssse3 -msse4.1 -o CMakeFiles/volk_obj.dir/volk_machine_sse4_1_64_orc.c.o   -c /opt/local/var/macports/build/_opt_local_var_macports_sources_rsync.macports.org_release_tarballs_ports_science_volk/volk/work/build/lib/volk_machine_sse4_1_64_orc.c
494:info:build /opt/local/bin/cmake -E cmake_progress_report /opt/local/var/macports/build/_opt_local_var_macports_sources_rsync.macports.org_release_tarballs_ports_science_volk/volk/work/build/CMakeFiles 86
495:info:build [ 94%] Building C object lib/CMakeFiles/volk_obj.dir/volk_machine_sse4_2_64_orc.c.o
496:info:build cd /opt/local/var/macports/build/_opt_local_var_macports_sources_rsync.macports.org_release_tarballs_ports_science_volk/volk/work/build/lib && /Applications/Xcode.app/Contents/Developer/Toolchains/XcodeDefault.xctoolchain/usr/bin/clang  -DHAVE_CPUID_H -DHAVE_DLFCN_H -DHAVE_FENV_H -DHAVE_POSIX_MEMALIGN -DHAVE_XGETBV -pipe -Os -arch x86_64  -Wall -fvisibility=hidden -DNDEBUG -arch x86_64 -mmacosx-version-min=10.7 -I/opt/local/var/macports/build/_opt_local_var_macports_sources_rsync.macports.org_release_tarballs_ports_science_volk/volk/work/build/include -I/opt/local/var/macports/build/_opt_local_var_macports_sources_rsync.macports.org_release_tarballs_ports_science_volk/volk/work/volk-8a16928a7e2ae5c5949ddeeb5479e642da9d68d7/include -I/opt/local/var/macports/build/_opt_local_var_macports_sources_rsync.macports.org_release_tarballs_ports_science_volk/volk/work/volk-8a16928a7e2ae5c5949ddeeb5479e642da9d68d7/kernels -I/opt/local/var/macports/build/_opt_local_var_macports_sources_rsync.macports.org_release_tarballs_ports_science_volk/volk/work/build/lib -I/opt/local/var/macports/build/_opt_local_var_macports_sources_rsync.macports.org_release_tarballs_ports_science_volk/volk/work/volk-8a16928a7e2ae5c5949ddeeb5479e642da9d68d7/lib -I/opt/local/include/orc-0.4 -I/opt/local/include    -fPIC -m64 -mmmx -msse -msse2 -msse3 -mssse3 -msse4.1 -msse4.2 -mpopcnt -o CMakeFiles/volk_obj.dir/volk_machine_sse4_2_64_orc.c.o   -c /opt/local/var/macports/build/_opt_local_var_macports_sources_rsync.macports.org_release_tarballs_ports_science_volk/volk/work/build/lib/volk_machine_sse4_2_64_orc.c
497:info:build make[2]: Leaving directory `/opt/local/var/macports/build/_opt_local_var_macports_sources_rsync.macports.org_release_tarballs_ports_science_volk/volk/work/build'
498:info:build /opt/local/bin/cmake -E cmake_progress_report /opt/local/var/macports/build/_opt_local_var_macports_sources_rsync.macports.org_release_tarballs_ports_science_volk/volk/work/build/CMakeFiles  8 9 10 11 12 13 14 15 16 17 18 19 20 21 22 23 24 25 26 27 28 29 30 31 32 33 34 35 36 37 38 39 40 41 42 43 44 45 46 47 48 49 50 51 52 53 54 55 56 57 58 59 60 61 62 63 64 65 66 67 68 69 70 71 72 73 74 75 76 77 78 79 80 81 82 83 84 85 86
499:info:build [ 94%] Built target volk_obj
500:info:build /usr/bin/make -f lib/CMakeFiles/volk.dir/build.make lib/CMakeFiles/volk.dir/depend
501:info:build make[2]: Entering directory `/opt/local/var/macports/build/_opt_local_var_macports_sources_rsync.macports.org_release_tarballs_ports_science_volk/volk/work/build'
502:info:build cd /opt/local/var/macports/build/_opt_local_var_macports_sources_rsync.macports.org_release_tarballs_ports_science_volk/volk/work/build && /opt/local/bin/cmake -E cmake_depends "Unix Makefiles" /opt/local/var/macports/build/_opt_local_var_macports_sources_rsync.macports.org_release_tarballs_ports_science_volk/volk/work/volk-8a16928a7e2ae5c5949ddeeb5479e642da9d68d7 /opt/local/var/macports/build/_opt_local_var_macports_sources_rsync.macports.org_release_tarballs_ports_science_volk/volk/work/volk-8a16928a7e2ae5c5949ddeeb5479e642da9d68d7/lib /opt/local/var/macports/build/_opt_local_var_macports_sources_rsync.macports.org_release_tarballs_ports_science_volk/volk/work/build /opt/local/var/macports/build/_opt_local_var_macports_sources_rsync.macports.org_release_tarballs_ports_science_volk/volk/work/build/lib /opt/local/var/macports/build/_opt_local_var_macports_sources_rsync.macports.org_release_tarballs_ports_science_volk/volk/work/build/lib/CMakeFiles/volk.dir/DependInfo.cmake --color=
503:info:build Dependee "/opt/local/var/macports/build/_opt_local_var_macports_sources_rsync.macports.org_release_tarballs_ports_science_volk/volk/work/build/lib/CMakeFiles/volk.dir/DependInfo.cmake" is newer than depender "/opt/local/var/macports/build/_opt_local_var_macports_sources_rsync.macports.org_release_tarballs_ports_science_volk/volk/work/build/lib/CMakeFiles/volk.dir/depend.internal".
504:info:build Dependee "/opt/local/var/macports/build/_opt_local_var_macports_sources_rsync.macports.org_release_tarballs_ports_science_volk/volk/work/build/lib/CMakeFiles/CMakeDirectoryInformation.cmake" is newer than depender "/opt/local/var/macports/build/_opt_local_var_macports_sources_rsync.macports.org_release_tarballs_ports_science_volk/volk/work/build/lib/CMakeFiles/volk.dir/depend.internal".
505:info:build Scanning dependencies of target volk
506:info:build make[2]: Leaving directory `/opt/local/var/macports/build/_opt_local_var_macports_sources_rsync.macports.org_release_tarballs_ports_science_volk/volk/work/build'
507:info:build /usr/bin/make -f lib/CMakeFiles/volk.dir/build.make lib/CMakeFiles/volk.dir/build
508:info:build make[2]: Entering directory `/opt/local/var/macports/build/_opt_local_var_macports_sources_rsync.macports.org_release_tarballs_ports_science_volk/volk/work/build'
509:info:build Linking C shared library libvolk.dylib
510:info:build cd /opt/local/var/macports/build/_opt_local_var_macports_sources_rsync.macports.org_release_tarballs_ports_science_volk/volk/work/build/lib && /opt/local/bin/cmake -E cmake_link_script CMakeFiles/volk.dir/link.txt --verbose=ON
511:info:build /Applications/Xcode.app/Contents/Developer/Toolchains/XcodeDefault.xctoolchain/usr/bin/clang  -pipe -Os -arch x86_64  -Wall -fvisibility=hidden -DNDEBUG -arch x86_64 -mmacosx-version-min=10.7 -dynamiclib -Wl,-headerpad_max_install_names  -Wl,-headerpad_max_install_names -arch x86_64 -compatibility_version 1.1.0 -o libvolk.1.1git.dylib -install_name /opt/local/lib/libvolk.1.1git.dylib CMakeFiles/volk_obj.dir/volk_16ic_deinterleave_16i_x2_a_orc_impl.c.o CMakeFiles/volk_obj.dir/volk_16ic_deinterleave_real_8i_a_orc_impl.c.o CMakeFiles/volk_obj.dir/volk_16ic_magnitude_16i_a_orc_impl.c.o CMakeFiles/volk_obj.dir/volk_16ic_s32f_deinterleave_32f_x2_a_orc_impl.c.o CMakeFiles/volk_obj.dir/volk_16sc_magnitude_32f_aligned16_orc_impl.c.o CMakeFiles/volk_obj.dir/volk_16u_byteswap_a_orc_impl.c.o CMakeFiles/volk_obj.dir/volk_32f_s32f_multiply_32f_a_orc_impl.c.o CMakeFiles/volk_obj.dir/volk_32f_s32f_normalize_a_orc_impl.c.o CMakeFiles/volk_obj.dir/volk_32f_sqrt_32f_a_orc_impl.c.o CMakeFiles/volk_obj.dir/volk_32f_x2_add_32f_a_orc_impl.c.o CMakeFiles/volk_obj.dir/volk_32f_x2_divide_32f_a_orc_impl.c.o CMakeFiles/volk_obj.dir/volk_32f_x2_dot_prod_32f_a_orc_impl.c.o CMakeFiles/volk_obj.dir/volk_32f_x2_max_32f_a_orc_impl.c.o CMakeFiles/volk_obj.dir/volk_32f_x2_min_32f_a_orc_impl.c.o CMakeFiles/volk_obj.dir/volk_32f_x2_multiply_32f_a_orc_impl.c.o CMakeFiles/volk_obj.dir/volk_32f_x2_subtract_32f_a_orc_impl.c.o CMakeFiles/volk_obj.dir/volk_32fc_32f_multiply_32fc_a_orc_impl.c.o CMakeFiles/volk_obj.dir/volk_32fc_magnitude_32f_a_orc_impl.c.o CMakeFiles/volk_obj.dir/volk_32fc_s32f_magnitude_16i_a_orc_impl.c.o CMakeFiles/volk_obj.dir/volk_32fc_s32fc_multiply_32fc_a_orc_impl.c.o CMakeFiles/volk_obj.dir/volk_32fc_x2_multiply_32fc_a_orc_impl.c.o CMakeFiles/volk_obj.dir/volk_32i_x2_and_32i_a_orc_impl.c.o CMakeFiles/volk_obj.dir/volk_32i_x2_or_32i_a_orc_impl.c.o CMakeFiles/volk_obj.dir/volk_8i_convert_16i_a_orc_impl.c.o CMakeFiles/volk_obj.dir/volk_8i_s32f_convert_32f_a_orc_impl.c.o CMakeFiles/volk_obj.dir/constants.c.o CMakeFiles/volk_obj.dir/volk_prefs.c.o CMakeFiles/volk_obj.dir/volk_rank_archs.c.o CMakeFiles/volk_obj.dir/volk_malloc.c.o CMakeFiles/volk_obj.dir/volk.c.o CMakeFiles/volk_obj.dir/volk_cpu.c.o CMakeFiles/volk_obj.dir/volk_machines.c.o CMakeFiles/volk_obj.dir/volk_machine_generic_orc.c.o CMakeFiles/volk_obj.dir/volk_machine_sse2_64_mmx_orc.c.o CMakeFiles/volk_obj.dir/volk_machine_sse3_64_orc.c.o CMakeFiles/volk_obj.dir/volk_machine_ssse3_64_orc.c.o CMakeFiles/volk_obj.dir/volk_machine_sse4_a_64_orc.c.o CMakeFiles/volk_obj.dir/volk_machine_sse4_1_64_orc.c.o CMakeFiles/volk_obj.dir/volk_machine_sse4_2_64_orc.c.o /opt/local/lib/liborc-0.4.dylib -Wl,-rpath,/opt/local/lib
512:info:build Undefined symbols for architecture x86_64:
513:info:build   "___cpuid_count", referenced from:
514:info:build       _i_can_has_avx2 in volk_cpu.c.o
515:info:build ld: symbol(s) not found for architecture x86_64
516:info:build clang: error: linker command failed with exit code 1 (use -v to see invocation)
517:info:build make[2]: *** [lib/libvolk.1.1git.dylib] Error 1
518:info:build make[2]: Leaving directory `/opt/local/var/macports/build/_opt_local_var_macports_sources_rsync.macports.org_release_tarballs_ports_science_volk/volk/work/build'
519:info:build make[1]: *** [lib/CMakeFiles/volk.dir/all] Error 2
520:info:build make[1]: Leaving directory `/opt/local/var/macports/build/_opt_local_var_macports_sources_rsync.macports.org_release_tarballs_ports_science_volk/volk/work/build'
521:info:build make: *** [all] Error 2
522:info:build make: Leaving directory `/opt/local/var/macports/build/_opt_local_var_macports_sources_rsync.macports.org_release_tarballs_ports_science_volk/volk/work/build'
523:info:build Command failed:  cd "/opt/local/var/macports/build/_opt_local_var_macports_sources_rsync.macports.org_release_tarballs_ports_science_volk/volk/work/build" && /usr/bin/make -j4 -w all VERBOSE=ON
524:info:build Exit code: 2
525:error:build org.macports.build for port volk returned: command execution failed
526:debug:build Error code: CHILDSTATUS 36324 2
527:debug:build Backtrace: command execution failed
528    while executing
529"system -nice 0 $fullcmdstring"
530    ("eval" body line 1)
531    invoked from within
532"eval system $notty $nice \$fullcmdstring"
533    invoked from within
534"command_exec build"
535    (procedure "portbuild::build_main" line 8)
536    invoked from within
537"portbuild::build_main org.macports.build"
538    ("eval" body line 1)
539    invoked from within
540"eval $procedure $targetname"
541:info:build Warning: targets not executed for volk: org.macports.activate org.macports.build org.macports.destroot org.macports.install
542:error:build Failed to install volk
543:debug:build Registry error: gnuradio not registered as installed & active.
544:notice:build Please see the log file for port volk for details:
545    /opt/local/var/macports/logs/_opt_local_var_macports_sources_rsync.macports.org_release_tarballs_ports_science_volk/volk/main.log