Ticket #48471: main.log

File main.log, 73.4 KB (added by jasonw@…, 3 years ago)
Line 
1version:1
2:debug:main changing euid/egid - current euid: 0 - current egid: 0
3:debug:main egid changed to: 20
4:debug:main euid changed to: 502
5:debug:main Executing org.macports.main (gcc48)
6:debug:main Privilege de-escalation not attempted as not running as root.
7:debug:main Skipping completed org.macports.archivefetch (gcc48)
8:debug:main Privilege de-escalation not attempted as not running as root.
9:debug:main Skipping completed org.macports.fetch (gcc48)
10:debug:main Privilege de-escalation not attempted as not running as root.
11:debug:main Skipping completed org.macports.checksum (gcc48)
12:debug:main Privilege de-escalation not attempted as not running as root.
13:debug:main Skipping completed org.macports.extract (gcc48)
14:debug:main Privilege de-escalation not attempted as not running as root.
15:debug:main Skipping completed org.macports.patch (gcc48)
16:debug:main Privilege de-escalation not attempted as not running as root.
17:debug:main Skipping completed org.macports.configure (gcc48)
18:debug:main Privilege de-escalation not attempted as not running as root.
19:debug:build build phase started at Fri Jul 31 09:11:38 EDT 2015
20:notice:build --->  Building gcc48
21:debug:build Executing org.macports.build (gcc48)
22:debug:build Environment:
23CC_PRINT_OPTIONS='YES'
24CC_PRINT_OPTIONS_FILE='/opt/local/var/macports/build/_opt_local_var_macports_sources_rsync.macports.org_release_tarballs_ports_lang_gcc48/gcc48/work/.CC_PRINT_OPTIONS'
25CPATH='/opt/local/include'
26CPP='/usr/bin/clang -E'
27LIBRARY_PATH='/opt/local/lib'
28MACOSX_DEPLOYMENT_TARGET='10.11'
29:debug:build Assembled command: 'cd "/opt/local/var/macports/build/_opt_local_var_macports_sources_rsync.macports.org_release_tarballs_ports_lang_gcc48/gcc48/work/build" && /usr/bin/make -j8 -w bootstrap'
30:debug:build Executing command line:  cd "/opt/local/var/macports/build/_opt_local_var_macports_sources_rsync.macports.org_release_tarballs_ports_lang_gcc48/gcc48/work/build" && /usr/bin/make -j8 -w bootstrap
31:info:build make: Entering directory `/opt/local/var/macports/build/_opt_local_var_macports_sources_rsync.macports.org_release_tarballs_ports_lang_gcc48/gcc48/work/build'
32:info:build echo stage3 > stage_final
33:info:build make[1]: Entering directory `/opt/local/var/macports/build/_opt_local_var_macports_sources_rsync.macports.org_release_tarballs_ports_lang_gcc48/gcc48/work/build'
34:info:build make[2]: Entering directory `/opt/local/var/macports/build/_opt_local_var_macports_sources_rsync.macports.org_release_tarballs_ports_lang_gcc48/gcc48/work/build'
35:info:build make[3]: Entering directory `/opt/local/var/macports/build/_opt_local_var_macports_sources_rsync.macports.org_release_tarballs_ports_lang_gcc48/gcc48/work/build'
36:info:build rm -f stage_current
37:info:build make[3]: Leaving directory `/opt/local/var/macports/build/_opt_local_var_macports_sources_rsync.macports.org_release_tarballs_ports_lang_gcc48/gcc48/work/build'
38:info:build make[2]: Leaving directory `/opt/local/var/macports/build/_opt_local_var_macports_sources_rsync.macports.org_release_tarballs_ports_lang_gcc48/gcc48/work/build'
39:info:build make[2]: Entering directory `/opt/local/var/macports/build/_opt_local_var_macports_sources_rsync.macports.org_release_tarballs_ports_lang_gcc48/gcc48/work/build'
40:info:build make[3]: Entering directory `/opt/local/var/macports/build/_opt_local_var_macports_sources_rsync.macports.org_release_tarballs_ports_lang_gcc48/gcc48/work/build/build-x86_64-apple-darwin15/libiberty'
41:info:build make[3]: Entering directory `/opt/local/var/macports/build/_opt_local_var_macports_sources_rsync.macports.org_release_tarballs_ports_lang_gcc48/gcc48/work/build/libdecnumber'
42:info:build make[3]: Nothing to be done for `all'.
43:info:build make[3]: Leaving directory `/opt/local/var/macports/build/_opt_local_var_macports_sources_rsync.macports.org_release_tarballs_ports_lang_gcc48/gcc48/work/build/libdecnumber'
44:info:build make[4]: Entering directory `/opt/local/var/macports/build/_opt_local_var_macports_sources_rsync.macports.org_release_tarballs_ports_lang_gcc48/gcc48/work/build/build-x86_64-apple-darwin15/libiberty/testsuite'
45:info:build make[4]: Nothing to be done for `all'.
46:info:build make[4]: Leaving directory `/opt/local/var/macports/build/_opt_local_var_macports_sources_rsync.macports.org_release_tarballs_ports_lang_gcc48/gcc48/work/build/build-x86_64-apple-darwin15/libiberty/testsuite'
47:info:build make[3]: Leaving directory `/opt/local/var/macports/build/_opt_local_var_macports_sources_rsync.macports.org_release_tarballs_ports_lang_gcc48/gcc48/work/build/build-x86_64-apple-darwin15/libiberty'
48:info:build make[3]: Entering directory `/opt/local/var/macports/build/_opt_local_var_macports_sources_rsync.macports.org_release_tarballs_ports_lang_gcc48/gcc48/work/build/intl'
49:info:build make[3]: Nothing to be done for `all'.
50:info:build make[3]: Leaving directory `/opt/local/var/macports/build/_opt_local_var_macports_sources_rsync.macports.org_release_tarballs_ports_lang_gcc48/gcc48/work/build/intl'
51:info:build make[3]: Entering directory `/opt/local/var/macports/build/_opt_local_var_macports_sources_rsync.macports.org_release_tarballs_ports_lang_gcc48/gcc48/work/build/build-x86_64-apple-darwin15/fixincludes'
52:info:build make[3]: Nothing to be done for `all'.
53:info:build make[3]: Leaving directory `/opt/local/var/macports/build/_opt_local_var_macports_sources_rsync.macports.org_release_tarballs_ports_lang_gcc48/gcc48/work/build/build-x86_64-apple-darwin15/fixincludes'
54:info:build make[3]: Entering directory `/opt/local/var/macports/build/_opt_local_var_macports_sources_rsync.macports.org_release_tarballs_ports_lang_gcc48/gcc48/work/build/libiberty'
55:info:build make[3]: Entering directory `/opt/local/var/macports/build/_opt_local_var_macports_sources_rsync.macports.org_release_tarballs_ports_lang_gcc48/gcc48/work/build/libbacktrace'
56:info:build /Applications/Xcode-beta.app/Contents/Developer/usr/bin/make  all-am
57:info:build make[4]: Entering directory `/opt/local/var/macports/build/_opt_local_var_macports_sources_rsync.macports.org_release_tarballs_ports_lang_gcc48/gcc48/work/build/libbacktrace'
58:info:build true  DO=all multi-do # /Applications/Xcode-beta.app/Contents/Developer/usr/bin/make
59:info:build make[4]: Entering directory `/opt/local/var/macports/build/_opt_local_var_macports_sources_rsync.macports.org_release_tarballs_ports_lang_gcc48/gcc48/work/build/libiberty/testsuite'
60:info:build make[4]: Nothing to be done for `all'.
61:info:build make[4]: Leaving directory `/opt/local/var/macports/build/_opt_local_var_macports_sources_rsync.macports.org_release_tarballs_ports_lang_gcc48/gcc48/work/build/libiberty/testsuite'
62:info:build make[4]: Leaving directory `/opt/local/var/macports/build/_opt_local_var_macports_sources_rsync.macports.org_release_tarballs_ports_lang_gcc48/gcc48/work/build/libbacktrace'
63:info:build make[3]: Leaving directory `/opt/local/var/macports/build/_opt_local_var_macports_sources_rsync.macports.org_release_tarballs_ports_lang_gcc48/gcc48/work/build/libbacktrace'
64:info:build make[3]: Leaving directory `/opt/local/var/macports/build/_opt_local_var_macports_sources_rsync.macports.org_release_tarballs_ports_lang_gcc48/gcc48/work/build/libiberty'
65:info:build make[3]: Entering directory `/opt/local/var/macports/build/_opt_local_var_macports_sources_rsync.macports.org_release_tarballs_ports_lang_gcc48/gcc48/work/build/libcpp'
66:info:build make[3]: Leaving directory `/opt/local/var/macports/build/_opt_local_var_macports_sources_rsync.macports.org_release_tarballs_ports_lang_gcc48/gcc48/work/build/libcpp'
67:info:build make[3]: Entering directory `/opt/local/var/macports/build/_opt_local_var_macports_sources_rsync.macports.org_release_tarballs_ports_lang_gcc48/gcc48/work/build/gcc'
68:info:build make[3]: Leaving directory `/opt/local/var/macports/build/_opt_local_var_macports_sources_rsync.macports.org_release_tarballs_ports_lang_gcc48/gcc48/work/build/gcc'
69:info:build Checking multilib configuration for libgcc...
70:info:build make[3]: Entering directory `/opt/local/var/macports/build/_opt_local_var_macports_sources_rsync.macports.org_release_tarballs_ports_lang_gcc48/gcc48/work/build/x86_64-apple-darwin15/libgcc'
71:info:build # If this is the top-level multilib, build all the other
72:info:build # multilibs.
73:info:build # Early copyback; see "all" above for the rationale.  The
74:info:build # early copy is necessary so that the gcc -B options find
75:info:build dest=../.././gcc/include/tmp$$-unwind.h; \
76:info:build     cp unwind.h $dest; \
77:info:build     chmod a+r $dest; \
78:info:build     sh /opt/local/var/macports/build/_opt_local_var_macports_sources_rsync.macports.org_release_tarballs_ports_lang_gcc48/gcc48/work/gcc-4.8.5/libgcc/../move-if-change $dest ../.././gcc/include/unwind.h
79:info:build # the right startup files when linking shared libgcc.
80:info:build /bin/sh /opt/local/var/macports/build/_opt_local_var_macports_sources_rsync.macports.org_release_tarballs_ports_lang_gcc48/gcc48/work/gcc-4.8.5/libgcc/../mkinstalldirs ../.././gcc
81:info:build parts="crt3.o crttms.o crttme.o crtprec32.o crtprec64.o crtprec80.o crtfastmath.o";                                 \
82:info:build     for file in $parts; do                                  \
83:info:build       rm -f ../.././gcc/$file;              \
84:info:build       /usr/bin/install -c -m 644 $file ../.././gcc/;        \
85:info:build       case $file in                                         \
86:info:build         *.a)                                                \
87:info:build           /opt/local/bin/ranlib ../.././gcc/$file ;;        \
88:info:build       esac;                                                 \
89:info:build     done
90:info:build # @multilib_flags@ is still needed because this may use
91:info:build # /opt/local/var/macports/build/_opt_local_var_macports_sources_rsync.macports.org_release_tarballs_ports_lang_gcc48/gcc48/work/build/./gcc/xgcc -B/opt/local/var/macports/build/_opt_local_var_macports_sources_rsync.macports.org_release_tarballs_ports_lang_gcc48/gcc48/work/build/./gcc/ -B/opt/local/x86_64-apple-darwin15/bin/ -B/opt/local/x86_64-apple-darwin15/lib/ -isystem /opt/local/x86_64-apple-darwin15/include -isystem /opt/local/x86_64-apple-darwin15/sys-include    and -O2  -g -O2 -pipe -Os -DIN_GCC   -W -Wall -Wno-narrowing -Wwrite-strings -Wcast-qual -Wstrict-prototypes -Wmissing-prototypes -Wold-style-definition  -isystem ./include   -pipe -fno-common -g -DIN_LIBGCC2 -fbuilding-libgcc -fno-stack-protector  directly.
92:info:build # @multilib_dir@ is not really necessary, but sometimes it has
93:info:build # more uses than just a directory name.
94:info:build /bin/sh /opt/local/var/macports/build/_opt_local_var_macports_sources_rsync.macports.org_release_tarballs_ports_lang_gcc48/gcc48/work/gcc-4.8.5/libgcc/../mkinstalldirs .
95:info:build /opt/local/var/macports/build/_opt_local_var_macports_sources_rsync.macports.org_release_tarballs_ports_lang_gcc48/gcc48/work/build/./gcc/xgcc -B/opt/local/var/macports/build/_opt_local_var_macports_sources_rsync.macports.org_release_tarballs_ports_lang_gcc48/gcc48/work/build/./gcc/ -B/opt/local/x86_64-apple-darwin15/bin/ -B/opt/local/x86_64-apple-darwin15/lib/ -isystem /opt/local/x86_64-apple-darwin15/include -isystem /opt/local/x86_64-apple-darwin15/sys-include    -O2  -g -O2 -pipe -Os -DIN_GCC   -W -Wall -Wno-narrowing -Wwrite-strings -Wcast-qual -Wstrict-prototypes -Wmissing-prototypes -Wold-style-definition  -isystem ./include   -pipe -fno-common -g -DIN_LIBGCC2 -fbuilding-libgcc -fno-stack-protector  -dynamiclib -nodefaultlibs -install_name /opt/local/lib/gcc48/libgcc_s.1.dylib -single_module -o ./libgcc_s.dylib -Wl,-exported_symbols_list,libgcc.map -compatibility_version 1 -current_version 1.0 -g -O2 -pipe -Os -B./ _muldi3_s.o _negdi2_s.o _lshrdi3_s.o _ashldi3_s.o _ashrdi3_s.o _cmpdi2_s.o _ucmpdi2_s.o _clear_cache_s.o _trampoline_s.o __main_s.o _absvsi2_s.o _absvdi2_s.o _addvsi3_s.o _addvdi3_s.o _subvsi3_s.o _subvdi3_s.o _mulvsi3_s.o _mulvdi3_s.o _negvsi2_s.o _negvdi2_s.o _ctors_s.o _ffssi2_s.o _ffsdi2_s.o _clz_s.o _clzsi2_s.o _clzdi2_s.o _ctzsi2_s.o _ctzdi2_s.o _popcount_tab_s.o _popcountsi2_s.o _popcountdi2_s.o _paritysi2_s.o _paritydi2_s.o _powisf2_s.o _powidf2_s.o _powixf2_s.o _powitf2_s.o _mulsc3_s.o _muldc3_s.o _mulxc3_s.o _multc3_s.o _divsc3_s.o _divdc3_s.o _divxc3_s.o _divtc3_s.o _bswapsi2_s.o _bswapdi2_s.o _clrsbsi2_s.o _clrsbdi2_s.o _fixunssfsi_s.o _fixunsdfsi_s.o _fixunsxfsi_s.o _fixsfdi_s.o _fixdfdi_s.o _fixxfdi_s.o _fixunssfdi_s.o _fixunsdfdi_s.o _fixunsxfdi_s.o _floatdisf_s.o _floatdidf_s.o _floatdixf_s.o _floatundisf_s.o _floatundidf_s.o _floatundixf_s.o _fixsfti_s.o _fixdfti_s.o _fixxfti_s.o _fixtfti_s.o _fixunssfti_s.o _fixunsdfti_s.o _fixunsxfti_s.o _fixunstfti_s.o _floattisf_s.o _floattidf_s.o _floattixf_s.o _floattitf_s.o _floatuntisf_s.o _floatuntidf_s.o _floatuntixf_s.o _floatuntitf_s.o _divdi3_s.o _moddi3_s.o _udivdi3_s.o _umoddi3_s.o _udiv_w_sdiv_s.o _udivmoddi4_s.o darwin-64_s.o cpuinfo_s.o sfp-exceptions_s.o addtf3_s.o divtf3_s.o eqtf2_s.o getf2_s.o letf2_s.o multf3_s.o negtf2_s.o subtf3_s.o unordtf2_s.o fixtfsi_s.o fixunstfsi_s.o floatsitf_s.o floatunsitf_s.o fixtfdi_s.o fixunstfdi_s.o floatditf_s.o floatunditf_s.o fixtfti_s.o fixunstfti_s.o floattitf_s.o floatuntitf_s.o extendsftf2_s.o extenddftf2_s.o extendxftf2_s.o trunctfsf2_s.o trunctfdf2_s.o trunctfxf2_s.o enable-execute-stack_s.o unwind-dw2_s.o unwind-dw2-fde-darwin_s.o unwind-sjlj_s.o unwind-c_s.o emutls_s.o libgcc.a -lc
96:info:build ld: warning: could not create compact unwind for __Unwind_RaiseException: non-standard register 0 being saved in prolog
97:info:build ld: warning: could not create compact unwind for __Unwind_ForcedUnwind: non-standard register 0 being saved in prolog
98:info:build ld: warning: could not create compact unwind for __Unwind_Resume: does not use RBP or RSP based frame
99:info:build ld: warning: could not create compact unwind for __Unwind_Resume_or_Rethrow: non-standard register 0 being saved in prolog
100:info:build MLIBS=`/opt/local/var/macports/build/_opt_local_var_macports_sources_rsync.macports.org_release_tarballs_ports_lang_gcc48/gcc48/work/build/./gcc/xgcc -B/opt/local/var/macports/build/_opt_local_var_macports_sources_rsync.macports.org_release_tarballs_ports_lang_gcc48/gcc48/work/build/./gcc/ -B/opt/local/x86_64-apple-darwin15/bin/ -B/opt/local/x86_64-apple-darwin15/lib/ -isystem /opt/local/x86_64-apple-darwin15/include -isystem /opt/local/x86_64-apple-darwin15/sys-include    --print-multi-lib | sed -e 's/;.*$//'` ; \
101:info:build     for mlib in $MLIBS ; do \
102:info:build       cp ../${mlib}/libgcc/${mlib}/libgcc_s.dylib  \
103:info:build         ./libgcc_s.1.dylib_T_${mlib} || exit 1 ; \
104:info:build     done
105:info:build MLIBS=`/opt/local/var/macports/build/_opt_local_var_macports_sources_rsync.macports.org_release_tarballs_ports_lang_gcc48/gcc48/work/build/./gcc/xgcc -B/opt/local/var/macports/build/_opt_local_var_macports_sources_rsync.macports.org_release_tarballs_ports_lang_gcc48/gcc48/work/build/./gcc/ -B/opt/local/x86_64-apple-darwin15/bin/ -B/opt/local/x86_64-apple-darwin15/lib/ -isystem /opt/local/x86_64-apple-darwin15/include -isystem /opt/local/x86_64-apple-darwin15/sys-include    --print-multi-lib | sed -e 's/;.*$//'` ; \
106:info:build     for mlib in $MLIBS ; do \
107:info:build       /opt/local/bin/strip -o libgcc_ext.10.4.dylib_T${mlib} \
108:info:build         -R /opt/local/var/macports/build/_opt_local_var_macports_sources_rsync.macports.org_release_tarballs_ports_lang_gcc48/gcc48/work/gcc-4.8.5/libgcc/config/i386/libgcc-darwin.10.4.ver -c -urx \
109:info:build         ../${mlib}/libgcc/${mlib}/libgcc_s.dylib || exit 1 ; \
110:info:build     done
111:info:build MLIBS=`/opt/local/var/macports/build/_opt_local_var_macports_sources_rsync.macports.org_release_tarballs_ports_lang_gcc48/gcc48/work/build/./gcc/xgcc -B/opt/local/var/macports/build/_opt_local_var_macports_sources_rsync.macports.org_release_tarballs_ports_lang_gcc48/gcc48/work/build/./gcc/ -B/opt/local/x86_64-apple-darwin15/bin/ -B/opt/local/x86_64-apple-darwin15/lib/ -isystem /opt/local/x86_64-apple-darwin15/include -isystem /opt/local/x86_64-apple-darwin15/sys-include    --print-multi-lib | sed -e 's/;.*$//'` ; \
112:info:build     for mlib in $MLIBS ; do \
113:info:build       /opt/local/bin/strip -o libgcc_ext.10.5.dylib_T${mlib} \
114:info:build         -R /opt/local/var/macports/build/_opt_local_var_macports_sources_rsync.macports.org_release_tarballs_ports_lang_gcc48/gcc48/work/gcc-4.8.5/libgcc/config/i386/libgcc-darwin.10.5.ver -c -urx \
115:info:build         ../${mlib}/libgcc/${mlib}/libgcc_s.dylib || exit 1 ; \
116:info:build     done
117:info:build lipo -output libgcc_s.1.dylib \
118:info:build       -create libgcc_s.1.dylib_T*
119:info:build lipo -output libgcc_ext.10.5.dylib -create libgcc_ext.10.5.dylib_T*
120:info:build lipo -output libgcc_ext.10.4.dylib -create libgcc_ext.10.4.dylib_T*
121:info:build rm libgcc_s.1.dylib_T*
122:info:build rm libgcc_ext.10.5.dylib_T*
123:info:build rm libgcc_ext.10.4.dylib_T*
124:info:build # Now that we have built all the objects, we need to copy
125:info:build # them back to the GCC directory.  Too many things (other
126:info:build # in-tree libraries, and DejaGNU) know about the layout
127:info:build # of the build tree, for now.
128:info:build /Applications/Xcode-beta.app/Contents/Developer/usr/bin/make install-leaf DESTDIR=../.././gcc \
129:info:build       slibdir= libsubdir= MULTIOSDIR=.
130:info:build make[4]: Entering directory `/opt/local/var/macports/build/_opt_local_var_macports_sources_rsync.macports.org_release_tarballs_ports_lang_gcc48/gcc48/work/build/x86_64-apple-darwin15/libgcc'
131:info:build /bin/sh /opt/local/var/macports/build/_opt_local_var_macports_sources_rsync.macports.org_release_tarballs_ports_lang_gcc48/gcc48/work/gcc-4.8.5/libgcc/../mkinstalldirs ../.././gcc
132:info:build /bin/sh /opt/local/var/macports/build/_opt_local_var_macports_sources_rsync.macports.org_release_tarballs_ports_lang_gcc48/gcc48/work/gcc-4.8.5/libgcc/../mkinstalldirs ../.././gcc
133:info:build for d in libgcc_s.1.dylib  libgcc_ext.10.4.dylib libgcc_ext.10.5.dylib ; do \
134:info:build       /usr/bin/install -c -m 644 $d ../.././gcc/$d || exit 1 ; \
135:info:build     done
136:info:build /usr/bin/install -c -m 644 libgcc_eh.a ../.././gcc/
137:info:build chmod 644 ../.././gcc/libgcc_eh.a
138:info:build /opt/local/bin/ranlib ../.././gcc/libgcc_eh.a
139:info:build /opt/local/bin/ranlib: file: ../.././gcc/libgcc_eh.a(unwind-sjlj.o) has no symbols
140:info:build if [ -f ../.././gcc/libgcc_s_ppc64.1.dylib ]; then \
141:info:build       rm -f ../.././gcc/libgcc_s_ppc64.1.dylib; \
142:info:build     else true; fi
143:info:build ln -s libgcc_s.1.dylib \
144:info:build             ../.././gcc/libgcc_s_ppc64.1.dylib
145:info:build if [ -f ../.././gcc/libgcc_s_x86_64.1.dylib ]; then \
146:info:build       rm -f ../.././gcc/libgcc_s_x86_64.1.dylib; \
147:info:build     else true; fi
148:info:build ln -s libgcc_s.1.dylib \
149:info:build             ../.././gcc/libgcc_s_x86_64.1.dylib
150:info:build /bin/sh /opt/local/var/macports/build/_opt_local_var_macports_sources_rsync.macports.org_release_tarballs_ports_lang_gcc48/gcc48/work/gcc-4.8.5/libgcc/../mkinstalldirs ../.././gcc
151:info:build /usr/bin/install -c -m 644 libgcc.a ../.././gcc/
152:info:build chmod 644 ../.././gcc/libgcc.a
153:info:build /opt/local/bin/ranlib ../.././gcc/libgcc.a
154:info:build /opt/local/bin/ranlib: file: ../.././gcc/libgcc.a(_trampoline.o) has no symbols
155:info:build /opt/local/bin/ranlib: file: ../.././gcc/libgcc.a(_ctors.o) has no symbols
156:info:build /opt/local/bin/ranlib: file: ../.././gcc/libgcc.a(_floatuntisf.o) has no symbols
157:info:build /opt/local/bin/ranlib: file: ../.././gcc/libgcc.a(_floatuntidf.o) has no symbols
158:info:build /opt/local/bin/ranlib: file: ../.././gcc/libgcc.a(_floatuntixf.o) has no symbols
159:info:build /opt/local/bin/ranlib: file: ../.././gcc/libgcc.a(_floatuntitf.o) has no symbols
160:info:build /usr/bin/install -c -m 644 libgcov.a ../.././gcc/
161:info:build chmod 644 ../.././gcc/libgcov.a
162:info:build /opt/local/bin/ranlib ../.././gcc/libgcov.a
163:info:build parts="crt3.o crttms.o crttme.o crtprec32.o crtprec64.o crtprec80.o crtfastmath.o";                         \
164:info:build     for file in $parts; do                                  \
165:info:build       rm -f ../.././gcc/$file;              \
166:info:build       /usr/bin/install -c -m 644 $file ../.././gcc/;        \
167:info:build       case $file in                                         \
168:info:build         *.a)                                                \
169:info:build           /opt/local/bin/ranlib ../.././gcc/$file ;;        \
170:info:build       esac;                                                 \
171:info:build     done
172:info:build make[4]: Leaving directory `/opt/local/var/macports/build/_opt_local_var_macports_sources_rsync.macports.org_release_tarballs_ports_lang_gcc48/gcc48/work/build/x86_64-apple-darwin15/libgcc'
173:info:build make[3]: Leaving directory `/opt/local/var/macports/build/_opt_local_var_macports_sources_rsync.macports.org_release_tarballs_ports_lang_gcc48/gcc48/work/build/x86_64-apple-darwin15/libgcc'
174:info:build Checking multilib configuration for libgomp...
175:info:build Checking multilib configuration for libstdc++-v3...
176:info:build make[3]: Entering directory `/opt/local/var/macports/build/_opt_local_var_macports_sources_rsync.macports.org_release_tarballs_ports_lang_gcc48/gcc48/work/build/x86_64-apple-darwin15/libgomp'
177:info:build /Applications/Xcode-beta.app/Contents/Developer/usr/bin/make  all-recursive
178:info:build make[3]: Entering directory `/opt/local/var/macports/build/_opt_local_var_macports_sources_rsync.macports.org_release_tarballs_ports_lang_gcc48/gcc48/work/build/x86_64-apple-darwin15/libstdc++-v3'
179:info:build /Applications/Xcode-beta.app/Contents/Developer/usr/bin/make "AR_FLAGS=rc" "CC_FOR_BUILD=/usr/bin/clang -arch x86_64" "CC_FOR_TARGET=/opt/local/var/macports/build/_opt_local_var_macports_sources_rsync.macports.org_release_tarballs_ports_lang_gcc48/gcc48/work/build/./gcc/xgcc -B/opt/local/var/macports/build/_opt_local_var_macports_sources_rsync.macports.org_release_tarballs_ports_lang_gcc48/gcc48/work/build/./gcc/" "CFLAGS=-g -O2 -pipe -Os" "CXXFLAGS=-g -O2 -pipe -Os" "CFLAGS_FOR_BUILD=-pipe -Os" "CFLAGS_FOR_TARGET=-g -O2 -pipe -Os" "INSTALL=/usr/bin/install -c" "INSTALL_DATA=/usr/bin/install -c -m 644" "INSTALL_PROGRAM=/usr/bin/install -c" "INSTALL_SCRIPT=/usr/bin/install -c" "LDFLAGS=" "LIBCFLAGS=-g -O2 -pipe -Os" "LIBCFLAGS_FOR_TARGET=-g -O2 -pipe -Os" "MAKE=/Applications/Xcode-beta.app/Contents/Developer/usr/bin/make" "MAKEINFO=makeinfo --split-size=5000000 --split-size=5000000 --split-size=5000000 " "SHELL=/bin/sh" "RUNTESTFLAGS=" "exec_prefix=/opt/local" "infodir=/opt/local/share/info" "libdir=/opt/local/lib/gcc48" "includedir=/opt/local/include/gcc48" "prefix=/opt/local" "tooldir=/opt/local/x86_64-apple-darwin15" "gxx_include_dir=/opt/local/include/gcc48/c++/" "AR=/opt/local/bin/ar" "AS=/opt/local/var/macports/build/_opt_local_var_macports_sources_rsync.macports.org_release_tarballs_ports_lang_gcc48/gcc48/work/build/./gcc/as" "LD=/opt/local/var/macports/build/_opt_local_var_macports_sources_rsync.macports.org_release_tarballs_ports_lang_gcc48/gcc48/work/build/./gcc/collect-ld" "RANLIB=/opt/local/bin/ranlib" "NM=/opt/local/var/macports/build/_opt_local_var_macports_sources_rsync.macports.org_release_tarballs_ports_lang_gcc48/gcc48/work/build/./gcc/nm" "NM_FOR_BUILD=" "NM_FOR_TARGET=/opt/local/bin/nm" "DESTDIR=" "WERROR=" all-recursive
180:info:build make[4]: Entering directory `/opt/local/var/macports/build/_opt_local_var_macports_sources_rsync.macports.org_release_tarballs_ports_lang_gcc48/gcc48/work/build/x86_64-apple-darwin15/libstdc++-v3'
181:info:build Making all in include
182:info:build make[4]: Entering directory `/opt/local/var/macports/build/_opt_local_var_macports_sources_rsync.macports.org_release_tarballs_ports_lang_gcc48/gcc48/work/build/x86_64-apple-darwin15/libgomp'
183:info:build Making all in testsuite
184:info:build make[5]: Entering directory `/opt/local/var/macports/build/_opt_local_var_macports_sources_rsync.macports.org_release_tarballs_ports_lang_gcc48/gcc48/work/build/x86_64-apple-darwin15/libgomp/testsuite'
185:info:build make[5]: Nothing to be done for `all'.
186:info:build make[5]: Leaving directory `/opt/local/var/macports/build/_opt_local_var_macports_sources_rsync.macports.org_release_tarballs_ports_lang_gcc48/gcc48/work/build/x86_64-apple-darwin15/libgomp/testsuite'
187:info:build make[5]: Entering directory `/opt/local/var/macports/build/_opt_local_var_macports_sources_rsync.macports.org_release_tarballs_ports_lang_gcc48/gcc48/work/build/x86_64-apple-darwin15/libstdc++-v3/include'
188:info:build make[5]: Nothing to be done for `all'.
189:info:build make[5]: Leaving directory `/opt/local/var/macports/build/_opt_local_var_macports_sources_rsync.macports.org_release_tarballs_ports_lang_gcc48/gcc48/work/build/x86_64-apple-darwin15/libstdc++-v3/include'
190:info:build Making all in libsupc++
191:info:build make[5]: Entering directory `/opt/local/var/macports/build/_opt_local_var_macports_sources_rsync.macports.org_release_tarballs_ports_lang_gcc48/gcc48/work/build/x86_64-apple-darwin15/libstdc++-v3/libsupc++'
192:info:build make[5]: Nothing to be done for `all'.
193:info:build make[5]: Leaving directory `/opt/local/var/macports/build/_opt_local_var_macports_sources_rsync.macports.org_release_tarballs_ports_lang_gcc48/gcc48/work/build/x86_64-apple-darwin15/libstdc++-v3/libsupc++'
194:info:build Making all in src
195:info:build make[5]: Entering directory `/opt/local/var/macports/build/_opt_local_var_macports_sources_rsync.macports.org_release_tarballs_ports_lang_gcc48/gcc48/work/build/x86_64-apple-darwin15/libstdc++-v3/src'
196:info:build Making all in c++98
197:info:build make[5]: Entering directory `/opt/local/var/macports/build/_opt_local_var_macports_sources_rsync.macports.org_release_tarballs_ports_lang_gcc48/gcc48/work/build/x86_64-apple-darwin15/libgomp'
198:info:build true  DO=all multi-do # /Applications/Xcode-beta.app/Contents/Developer/usr/bin/make
199:info:build make[6]: Entering directory `/opt/local/var/macports/build/_opt_local_var_macports_sources_rsync.macports.org_release_tarballs_ports_lang_gcc48/gcc48/work/build/x86_64-apple-darwin15/libstdc++-v3/src/c++98'
200:info:build make[6]: Nothing to be done for `all'.
201:info:build make[6]: Leaving directory `/opt/local/var/macports/build/_opt_local_var_macports_sources_rsync.macports.org_release_tarballs_ports_lang_gcc48/gcc48/work/build/x86_64-apple-darwin15/libstdc++-v3/src/c++98'
202:info:build Making all in c++11
203:info:build make[5]: Leaving directory `/opt/local/var/macports/build/_opt_local_var_macports_sources_rsync.macports.org_release_tarballs_ports_lang_gcc48/gcc48/work/build/x86_64-apple-darwin15/libgomp'
204:info:build make[4]: Leaving directory `/opt/local/var/macports/build/_opt_local_var_macports_sources_rsync.macports.org_release_tarballs_ports_lang_gcc48/gcc48/work/build/x86_64-apple-darwin15/libgomp'
205:info:build make[3]: Leaving directory `/opt/local/var/macports/build/_opt_local_var_macports_sources_rsync.macports.org_release_tarballs_ports_lang_gcc48/gcc48/work/build/x86_64-apple-darwin15/libgomp'
206:info:build make[6]: Entering directory `/opt/local/var/macports/build/_opt_local_var_macports_sources_rsync.macports.org_release_tarballs_ports_lang_gcc48/gcc48/work/build/x86_64-apple-darwin15/libstdc++-v3/src/c++11'
207:info:build make[6]: Nothing to be done for `all'.
208:info:build make[6]: Leaving directory `/opt/local/var/macports/build/_opt_local_var_macports_sources_rsync.macports.org_release_tarballs_ports_lang_gcc48/gcc48/work/build/x86_64-apple-darwin15/libstdc++-v3/src/c++11'
209:info:build make[6]: Entering directory `/opt/local/var/macports/build/_opt_local_var_macports_sources_rsync.macports.org_release_tarballs_ports_lang_gcc48/gcc48/work/build/x86_64-apple-darwin15/libstdc++-v3/src'
210:info:build make[6]: Nothing to be done for `all-am'.
211:info:build make[6]: Leaving directory `/opt/local/var/macports/build/_opt_local_var_macports_sources_rsync.macports.org_release_tarballs_ports_lang_gcc48/gcc48/work/build/x86_64-apple-darwin15/libstdc++-v3/src'
212:info:build make[5]: Leaving directory `/opt/local/var/macports/build/_opt_local_var_macports_sources_rsync.macports.org_release_tarballs_ports_lang_gcc48/gcc48/work/build/x86_64-apple-darwin15/libstdc++-v3/src'
213:info:build Making all in doc
214:info:build make[5]: Entering directory `/opt/local/var/macports/build/_opt_local_var_macports_sources_rsync.macports.org_release_tarballs_ports_lang_gcc48/gcc48/work/build/x86_64-apple-darwin15/libstdc++-v3/doc'
215:info:build make[5]: Nothing to be done for `all'.
216:info:build make[5]: Leaving directory `/opt/local/var/macports/build/_opt_local_var_macports_sources_rsync.macports.org_release_tarballs_ports_lang_gcc48/gcc48/work/build/x86_64-apple-darwin15/libstdc++-v3/doc'
217:info:build Making all in po
218:info:build make[5]: Entering directory `/opt/local/var/macports/build/_opt_local_var_macports_sources_rsync.macports.org_release_tarballs_ports_lang_gcc48/gcc48/work/build/x86_64-apple-darwin15/libstdc++-v3/po'
219:info:build make[5]: Nothing to be done for `all'.
220:info:build make[5]: Leaving directory `/opt/local/var/macports/build/_opt_local_var_macports_sources_rsync.macports.org_release_tarballs_ports_lang_gcc48/gcc48/work/build/x86_64-apple-darwin15/libstdc++-v3/po'
221:info:build Making all in testsuite
222:info:build make[5]: Entering directory `/opt/local/var/macports/build/_opt_local_var_macports_sources_rsync.macports.org_release_tarballs_ports_lang_gcc48/gcc48/work/build/x86_64-apple-darwin15/libstdc++-v3/testsuite'
223:info:build make[5]: Nothing to be done for `all'.
224:info:build make[5]: Leaving directory `/opt/local/var/macports/build/_opt_local_var_macports_sources_rsync.macports.org_release_tarballs_ports_lang_gcc48/gcc48/work/build/x86_64-apple-darwin15/libstdc++-v3/testsuite'
225:info:build Making all in python
226:info:build make[5]: Entering directory `/opt/local/var/macports/build/_opt_local_var_macports_sources_rsync.macports.org_release_tarballs_ports_lang_gcc48/gcc48/work/build/x86_64-apple-darwin15/libstdc++-v3/python'
227:info:build make[5]: Nothing to be done for `all'.
228:info:build make[5]: Leaving directory `/opt/local/var/macports/build/_opt_local_var_macports_sources_rsync.macports.org_release_tarballs_ports_lang_gcc48/gcc48/work/build/x86_64-apple-darwin15/libstdc++-v3/python'
229:info:build make[5]: Entering directory `/opt/local/var/macports/build/_opt_local_var_macports_sources_rsync.macports.org_release_tarballs_ports_lang_gcc48/gcc48/work/build/x86_64-apple-darwin15/libstdc++-v3'
230:info:build true "AR_FLAGS=rc" "CC_FOR_BUILD=/usr/bin/clang -arch x86_64" "CC_FOR_TARGET=/opt/local/var/macports/build/_opt_local_var_macports_sources_rsync.macports.org_release_tarballs_ports_lang_gcc48/gcc48/work/build/./gcc/xgcc -B/opt/local/var/macports/build/_opt_local_var_macports_sources_rsync.macports.org_release_tarballs_ports_lang_gcc48/gcc48/work/build/./gcc/" "CFLAGS=-g -O2 -pipe -Os" "CXXFLAGS=-g -O2 -pipe -Os" "CFLAGS_FOR_BUILD=-pipe -Os" "CFLAGS_FOR_TARGET=-g -O2 -pipe -Os" "INSTALL=/usr/bin/install -c" "INSTALL_DATA=/usr/bin/install -c -m 644" "INSTALL_PROGRAM=/usr/bin/install -c" "INSTALL_SCRIPT=/usr/bin/install -c" "LDFLAGS=" "LIBCFLAGS=-g -O2 -pipe -Os" "LIBCFLAGS_FOR_TARGET=-g -O2 -pipe -Os" "MAKE=/Applications/Xcode-beta.app/Contents/Developer/usr/bin/make" "MAKEINFO=makeinfo --split-size=5000000 --split-size=5000000 --split-size=5000000   " "SHELL=/bin/sh" "RUNTESTFLAGS=" "exec_prefix=/opt/local" "infodir=/opt/local/share/info" "libdir=/opt/local/lib/gcc48" "includedir=/opt/local/include/gcc48" "prefix=/opt/local" "tooldir=/opt/local/x86_64-apple-darwin15" "gxx_include_dir=/opt/local/include/gcc48/c++/" "AR=/opt/local/bin/ar" "AS=/opt/local/var/macports/build/_opt_local_var_macports_sources_rsync.macports.org_release_tarballs_ports_lang_gcc48/gcc48/work/build/./gcc/as" "LD=/opt/local/var/macports/build/_opt_local_var_macports_sources_rsync.macports.org_release_tarballs_ports_lang_gcc48/gcc48/work/build/./gcc/collect-ld" "RANLIB=/opt/local/bin/ranlib" "NM=/opt/local/var/macports/build/_opt_local_var_macports_sources_rsync.macports.org_release_tarballs_ports_lang_gcc48/gcc48/work/build/./gcc/nm" "NM_FOR_BUILD=" "NM_FOR_TARGET=/opt/local/bin/nm" "DESTDIR=" "WERROR=" DO=all multi-do # /Applications/Xcode-beta.app/Contents/Developer/usr/bin/make
231:info:build make[5]: Leaving directory `/opt/local/var/macports/build/_opt_local_var_macports_sources_rsync.macports.org_release_tarballs_ports_lang_gcc48/gcc48/work/build/x86_64-apple-darwin15/libstdc++-v3'
232:info:build make[4]: Leaving directory `/opt/local/var/macports/build/_opt_local_var_macports_sources_rsync.macports.org_release_tarballs_ports_lang_gcc48/gcc48/work/build/x86_64-apple-darwin15/libstdc++-v3'
233:info:build make[3]: Leaving directory `/opt/local/var/macports/build/_opt_local_var_macports_sources_rsync.macports.org_release_tarballs_ports_lang_gcc48/gcc48/work/build/x86_64-apple-darwin15/libstdc++-v3'
234:info:build Checking multilib configuration for libsanitizer...
235:info:build make[3]: Entering directory `/opt/local/var/macports/build/_opt_local_var_macports_sources_rsync.macports.org_release_tarballs_ports_lang_gcc48/gcc48/work/build/x86_64-apple-darwin15/libsanitizer'
236:info:build Making all in sanitizer_common
237:info:build make[4]: Entering directory `/opt/local/var/macports/build/_opt_local_var_macports_sources_rsync.macports.org_release_tarballs_ports_lang_gcc48/gcc48/work/build/x86_64-apple-darwin15/libsanitizer/sanitizer_common'
238:info:build /bin/sh ../libtool --tag=CXX   --mode=compile /opt/local/var/macports/build/_opt_local_var_macports_sources_rsync.macports.org_release_tarballs_ports_lang_gcc48/gcc48/work/build/./gcc/xgcc -shared-libgcc -B/opt/local/var/macports/build/_opt_local_var_macports_sources_rsync.macports.org_release_tarballs_ports_lang_gcc48/gcc48/work/build/./gcc -nostdinc++ -L/opt/local/var/macports/build/_opt_local_var_macports_sources_rsync.macports.org_release_tarballs_ports_lang_gcc48/gcc48/work/build/x86_64-apple-darwin15/libstdc++-v3/src -L/opt/local/var/macports/build/_opt_local_var_macports_sources_rsync.macports.org_release_tarballs_ports_lang_gcc48/gcc48/work/build/x86_64-apple-darwin15/libstdc++-v3/src/.libs -B/opt/local/x86_64-apple-darwin15/bin/ -B/opt/local/x86_64-apple-darwin15/lib/ -isystem /opt/local/x86_64-apple-darwin15/include -isystem /opt/local/x86_64-apple-darwin15/sys-include    -D_GNU_SOURCE -D_DEBUG -D__STDC_CONSTANT_MACROS -D__STDC_FORMAT_MACROS -D__STDC_LIMIT_MACROS  -I. -I/opt/local/var/macports/build/_opt_local_var_macports_sources_rsync.macports.org_release_tarballs_ports_lang_gcc48/gcc48/work/gcc-4.8.5/libsanitizer/sanitizer_common  -I /opt/local/var/macports/build/_opt_local_var_macports_sources_rsync.macports.org_release_tarballs_ports_lang_gcc48/gcc48/work/gcc-4.8.5/libsanitizer/include   -Wall -W -Wno-unused-parameter -Wwrite-strings -pedantic -Wno-long-long -fPIC -fno-builtin -fno-exceptions -fomit-frame-pointer -funwind-tables -fvisibility=hidden -Wno-variadic-macros -I../../libstdc++-v3/include     -I../../libstdc++-v3/include/x86_64-apple-darwin15     -I/opt/local/var/macports/build/_opt_local_var_macports_sources_rsync.macports.org_release_tarballs_ports_lang_gcc48/gcc48/work/gcc-4.8.5/libsanitizer/../libstdc++-v3/libsupc++ -g -O2 -pipe -Os -MT sanitizer_allocator.lo -MD -MP -MF .deps/sanitizer_allocator.Tpo -c -o sanitizer_allocator.lo /opt/local/var/macports/build/_opt_local_var_macports_sources_rsync.macports.org_release_tarballs_ports_lang_gcc48/gcc48/work/gcc-4.8.5/libsanitizer/sanitizer_common/sanitizer_allocator.cc
239:info:build /bin/sh ../libtool --tag=CXX   --mode=compile /opt/local/var/macports/build/_opt_local_var_macports_sources_rsync.macports.org_release_tarballs_ports_lang_gcc48/gcc48/work/build/./gcc/xgcc -shared-libgcc -B/opt/local/var/macports/build/_opt_local_var_macports_sources_rsync.macports.org_release_tarballs_ports_lang_gcc48/gcc48/work/build/./gcc -nostdinc++ -L/opt/local/var/macports/build/_opt_local_var_macports_sources_rsync.macports.org_release_tarballs_ports_lang_gcc48/gcc48/work/build/x86_64-apple-darwin15/libstdc++-v3/src -L/opt/local/var/macports/build/_opt_local_var_macports_sources_rsync.macports.org_release_tarballs_ports_lang_gcc48/gcc48/work/build/x86_64-apple-darwin15/libstdc++-v3/src/.libs -B/opt/local/x86_64-apple-darwin15/bin/ -B/opt/local/x86_64-apple-darwin15/lib/ -isystem /opt/local/x86_64-apple-darwin15/include -isystem /opt/local/x86_64-apple-darwin15/sys-include    -D_GNU_SOURCE -D_DEBUG -D__STDC_CONSTANT_MACROS -D__STDC_FORMAT_MACROS -D__STDC_LIMIT_MACROS  -I. -I/opt/local/var/macports/build/_opt_local_var_macports_sources_rsync.macports.org_release_tarballs_ports_lang_gcc48/gcc48/work/gcc-4.8.5/libsanitizer/sanitizer_common  -I /opt/local/var/macports/build/_opt_local_var_macports_sources_rsync.macports.org_release_tarballs_ports_lang_gcc48/gcc48/work/gcc-4.8.5/libsanitizer/include   -Wall -W -Wno-unused-parameter -Wwrite-strings -pedantic -Wno-long-long -fPIC -fno-builtin -fno-exceptions -fomit-frame-pointer -funwind-tables -fvisibility=hidden -Wno-variadic-macros -I../../libstdc++-v3/include     -I../../libstdc++-v3/include/x86_64-apple-darwin15     -I/opt/local/var/macports/build/_opt_local_var_macports_sources_rsync.macports.org_release_tarballs_ports_lang_gcc48/gcc48/work/gcc-4.8.5/libsanitizer/../libstdc++-v3/libsupc++ -g -O2 -pipe -Os -MT sanitizer_stackdepot.lo -MD -MP -MF .deps/sanitizer_stackdepot.Tpo -c -o sanitizer_stackdepot.lo /opt/local/var/macports/build/_opt_local_var_macports_sources_rsync.macports.org_release_tarballs_ports_lang_gcc48/gcc48/work/gcc-4.8.5/libsanitizer/sanitizer_common/sanitizer_stackdepot.cc
240:info:build /bin/sh ../libtool --tag=CXX   --mode=compile /opt/local/var/macports/build/_opt_local_var_macports_sources_rsync.macports.org_release_tarballs_ports_lang_gcc48/gcc48/work/build/./gcc/xgcc -shared-libgcc -B/opt/local/var/macports/build/_opt_local_var_macports_sources_rsync.macports.org_release_tarballs_ports_lang_gcc48/gcc48/work/build/./gcc -nostdinc++ -L/opt/local/var/macports/build/_opt_local_var_macports_sources_rsync.macports.org_release_tarballs_ports_lang_gcc48/gcc48/work/build/x86_64-apple-darwin15/libstdc++-v3/src -L/opt/local/var/macports/build/_opt_local_var_macports_sources_rsync.macports.org_release_tarballs_ports_lang_gcc48/gcc48/work/build/x86_64-apple-darwin15/libstdc++-v3/src/.libs -B/opt/local/x86_64-apple-darwin15/bin/ -B/opt/local/x86_64-apple-darwin15/lib/ -isystem /opt/local/x86_64-apple-darwin15/include -isystem /opt/local/x86_64-apple-darwin15/sys-include    -D_GNU_SOURCE -D_DEBUG -D__STDC_CONSTANT_MACROS -D__STDC_FORMAT_MACROS -D__STDC_LIMIT_MACROS  -I. -I/opt/local/var/macports/build/_opt_local_var_macports_sources_rsync.macports.org_release_tarballs_ports_lang_gcc48/gcc48/work/gcc-4.8.5/libsanitizer/sanitizer_common  -I /opt/local/var/macports/build/_opt_local_var_macports_sources_rsync.macports.org_release_tarballs_ports_lang_gcc48/gcc48/work/gcc-4.8.5/libsanitizer/include   -Wall -W -Wno-unused-parameter -Wwrite-strings -pedantic -Wno-long-long -fPIC -fno-builtin -fno-exceptions -fomit-frame-pointer -funwind-tables -fvisibility=hidden -Wno-variadic-macros -I../../libstdc++-v3/include     -I../../libstdc++-v3/include/x86_64-apple-darwin15     -I/opt/local/var/macports/build/_opt_local_var_macports_sources_rsync.macports.org_release_tarballs_ports_lang_gcc48/gcc48/work/gcc-4.8.5/libsanitizer/../libstdc++-v3/libsupc++ -g -O2 -pipe -Os -MT sanitizer_stacktrace.lo -MD -MP -MF .deps/sanitizer_stacktrace.Tpo -c -o sanitizer_stacktrace.lo /opt/local/var/macports/build/_opt_local_var_macports_sources_rsync.macports.org_release_tarballs_ports_lang_gcc48/gcc48/work/gcc-4.8.5/libsanitizer/sanitizer_common/sanitizer_stacktrace.cc
241:info:build /bin/sh ../libtool --tag=CXX   --mode=compile /opt/local/var/macports/build/_opt_local_var_macports_sources_rsync.macports.org_release_tarballs_ports_lang_gcc48/gcc48/work/build/./gcc/xgcc -shared-libgcc -B/opt/local/var/macports/build/_opt_local_var_macports_sources_rsync.macports.org_release_tarballs_ports_lang_gcc48/gcc48/work/build/./gcc -nostdinc++ -L/opt/local/var/macports/build/_opt_local_var_macports_sources_rsync.macports.org_release_tarballs_ports_lang_gcc48/gcc48/work/build/x86_64-apple-darwin15/libstdc++-v3/src -L/opt/local/var/macports/build/_opt_local_var_macports_sources_rsync.macports.org_release_tarballs_ports_lang_gcc48/gcc48/work/build/x86_64-apple-darwin15/libstdc++-v3/src/.libs -B/opt/local/x86_64-apple-darwin15/bin/ -B/opt/local/x86_64-apple-darwin15/lib/ -isystem /opt/local/x86_64-apple-darwin15/include -isystem /opt/local/x86_64-apple-darwin15/sys-include    -D_GNU_SOURCE -D_DEBUG -D__STDC_CONSTANT_MACROS -D__STDC_FORMAT_MACROS -D__STDC_LIMIT_MACROS  -I. -I/opt/local/var/macports/build/_opt_local_var_macports_sources_rsync.macports.org_release_tarballs_ports_lang_gcc48/gcc48/work/gcc-4.8.5/libsanitizer/sanitizer_common  -I /opt/local/var/macports/build/_opt_local_var_macports_sources_rsync.macports.org_release_tarballs_ports_lang_gcc48/gcc48/work/gcc-4.8.5/libsanitizer/include   -Wall -W -Wno-unused-parameter -Wwrite-strings -pedantic -Wno-long-long -fPIC -fno-builtin -fno-exceptions -fomit-frame-pointer -funwind-tables -fvisibility=hidden -Wno-variadic-macros -I../../libstdc++-v3/include     -I../../libstdc++-v3/include/x86_64-apple-darwin15     -I/opt/local/var/macports/build/_opt_local_var_macports_sources_rsync.macports.org_release_tarballs_ports_lang_gcc48/gcc48/work/gcc-4.8.5/libsanitizer/../libstdc++-v3/libsupc++ -g -O2 -pipe -Os -MT sanitizer_symbolizer.lo -MD -MP -MF .deps/sanitizer_symbolizer.Tpo -c -o sanitizer_symbolizer.lo /opt/local/var/macports/build/_opt_local_var_macports_sources_rsync.macports.org_release_tarballs_ports_lang_gcc48/gcc48/work/gcc-4.8.5/libsanitizer/sanitizer_common/sanitizer_symbolizer.cc
242:info:build /bin/sh ../libtool --tag=CXX   --mode=compile /opt/local/var/macports/build/_opt_local_var_macports_sources_rsync.macports.org_release_tarballs_ports_lang_gcc48/gcc48/work/build/./gcc/xgcc -shared-libgcc -B/opt/local/var/macports/build/_opt_local_var_macports_sources_rsync.macports.org_release_tarballs_ports_lang_gcc48/gcc48/work/build/./gcc -nostdinc++ -L/opt/local/var/macports/build/_opt_local_var_macports_sources_rsync.macports.org_release_tarballs_ports_lang_gcc48/gcc48/work/build/x86_64-apple-darwin15/libstdc++-v3/src -L/opt/local/var/macports/build/_opt_local_var_macports_sources_rsync.macports.org_release_tarballs_ports_lang_gcc48/gcc48/work/build/x86_64-apple-darwin15/libstdc++-v3/src/.libs -B/opt/local/x86_64-apple-darwin15/bin/ -B/opt/local/x86_64-apple-darwin15/lib/ -isystem /opt/local/x86_64-apple-darwin15/include -isystem /opt/local/x86_64-apple-darwin15/sys-include    -D_GNU_SOURCE -D_DEBUG -D__STDC_CONSTANT_MACROS -D__STDC_FORMAT_MACROS -D__STDC_LIMIT_MACROS  -I. -I/opt/local/var/macports/build/_opt_local_var_macports_sources_rsync.macports.org_release_tarballs_ports_lang_gcc48/gcc48/work/gcc-4.8.5/libsanitizer/sanitizer_common  -I /opt/local/var/macports/build/_opt_local_var_macports_sources_rsync.macports.org_release_tarballs_ports_lang_gcc48/gcc48/work/gcc-4.8.5/libsanitizer/include   -Wall -W -Wno-unused-parameter -Wwrite-strings -pedantic -Wno-long-long -fPIC -fno-builtin -fno-exceptions -fomit-frame-pointer -funwind-tables -fvisibility=hidden -Wno-variadic-macros -I../../libstdc++-v3/include     -I../../libstdc++-v3/include/x86_64-apple-darwin15     -I/opt/local/var/macports/build/_opt_local_var_macports_sources_rsync.macports.org_release_tarballs_ports_lang_gcc48/gcc48/work/gcc-4.8.5/libsanitizer/../libstdc++-v3/libsupc++ -g -O2 -pipe -Os -MT sanitizer_symbolizer_itanium.lo -MD -MP -MF .deps/sanitizer_symbolizer_itanium.Tpo -c -o sanitizer_symbolizer_itanium.lo /opt/local/var/macports/build/_opt_local_var_macports_sources_rsync.macports.org_release_tarballs_ports_lang_gcc48/gcc48/work/gcc-4.8.5/libsanitizer/sanitizer_common/sanitizer_symbolizer_itanium.cc
243:info:build /bin/sh ../libtool --tag=CXX   --mode=compile /opt/local/var/macports/build/_opt_local_var_macports_sources_rsync.macports.org_release_tarballs_ports_lang_gcc48/gcc48/work/build/./gcc/xgcc -shared-libgcc -B/opt/local/var/macports/build/_opt_local_var_macports_sources_rsync.macports.org_release_tarballs_ports_lang_gcc48/gcc48/work/build/./gcc -nostdinc++ -L/opt/local/var/macports/build/_opt_local_var_macports_sources_rsync.macports.org_release_tarballs_ports_lang_gcc48/gcc48/work/build/x86_64-apple-darwin15/libstdc++-v3/src -L/opt/local/var/macports/build/_opt_local_var_macports_sources_rsync.macports.org_release_tarballs_ports_lang_gcc48/gcc48/work/build/x86_64-apple-darwin15/libstdc++-v3/src/.libs -B/opt/local/x86_64-apple-darwin15/bin/ -B/opt/local/x86_64-apple-darwin15/lib/ -isystem /opt/local/x86_64-apple-darwin15/include -isystem /opt/local/x86_64-apple-darwin15/sys-include    -D_GNU_SOURCE -D_DEBUG -D__STDC_CONSTANT_MACROS -D__STDC_FORMAT_MACROS -D__STDC_LIMIT_MACROS  -I. -I/opt/local/var/macports/build/_opt_local_var_macports_sources_rsync.macports.org_release_tarballs_ports_lang_gcc48/gcc48/work/gcc-4.8.5/libsanitizer/sanitizer_common  -I /opt/local/var/macports/build/_opt_local_var_macports_sources_rsync.macports.org_release_tarballs_ports_lang_gcc48/gcc48/work/gcc-4.8.5/libsanitizer/include   -Wall -W -Wno-unused-parameter -Wwrite-strings -pedantic -Wno-long-long -fPIC -fno-builtin -fno-exceptions -fomit-frame-pointer -funwind-tables -fvisibility=hidden -Wno-variadic-macros -I../../libstdc++-v3/include     -I../../libstdc++-v3/include/x86_64-apple-darwin15     -I/opt/local/var/macports/build/_opt_local_var_macports_sources_rsync.macports.org_release_tarballs_ports_lang_gcc48/gcc48/work/gcc-4.8.5/libsanitizer/../libstdc++-v3/libsupc++ -g -O2 -pipe -Os -MT sanitizer_symbolizer_linux.lo -MD -MP -MF .deps/sanitizer_symbolizer_linux.Tpo -c -o sanitizer_symbolizer_linux.lo /opt/local/var/macports/build/_opt_local_var_macports_sources_rsync.macports.org_release_tarballs_ports_lang_gcc48/gcc48/work/gcc-4.8.5/libsanitizer/sanitizer_common/sanitizer_symbolizer_linux.cc
244:info:build /bin/sh ../libtool --tag=CXX   --mode=compile /opt/local/var/macports/build/_opt_local_var_macports_sources_rsync.macports.org_release_tarballs_ports_lang_gcc48/gcc48/work/build/./gcc/xgcc -shared-libgcc -B/opt/local/var/macports/build/_opt_local_var_macports_sources_rsync.macports.org_release_tarballs_ports_lang_gcc48/gcc48/work/build/./gcc -nostdinc++ -L/opt/local/var/macports/build/_opt_local_var_macports_sources_rsync.macports.org_release_tarballs_ports_lang_gcc48/gcc48/work/build/x86_64-apple-darwin15/libstdc++-v3/src -L/opt/local/var/macports/build/_opt_local_var_macports_sources_rsync.macports.org_release_tarballs_ports_lang_gcc48/gcc48/work/build/x86_64-apple-darwin15/libstdc++-v3/src/.libs -B/opt/local/x86_64-apple-darwin15/bin/ -B/opt/local/x86_64-apple-darwin15/lib/ -isystem /opt/local/x86_64-apple-darwin15/include -isystem /opt/local/x86_64-apple-darwin15/sys-include    -D_GNU_SOURCE -D_DEBUG -D__STDC_CONSTANT_MACROS -D__STDC_FORMAT_MACROS -D__STDC_LIMIT_MACROS  -I. -I/opt/local/var/macports/build/_opt_local_var_macports_sources_rsync.macports.org_release_tarballs_ports_lang_gcc48/gcc48/work/gcc-4.8.5/libsanitizer/sanitizer_common  -I /opt/local/var/macports/build/_opt_local_var_macports_sources_rsync.macports.org_release_tarballs_ports_lang_gcc48/gcc48/work/gcc-4.8.5/libsanitizer/include   -Wall -W -Wno-unused-parameter -Wwrite-strings -pedantic -Wno-long-long -fPIC -fno-builtin -fno-exceptions -fomit-frame-pointer -funwind-tables -fvisibility=hidden -Wno-variadic-macros -I../../libstdc++-v3/include     -I../../libstdc++-v3/include/x86_64-apple-darwin15     -I/opt/local/var/macports/build/_opt_local_var_macports_sources_rsync.macports.org_release_tarballs_ports_lang_gcc48/gcc48/work/gcc-4.8.5/libsanitizer/../libstdc++-v3/libsupc++ -g -O2 -pipe -Os -MT sanitizer_symbolizer_mac.lo -MD -MP -MF .deps/sanitizer_symbolizer_mac.Tpo -c -o sanitizer_symbolizer_mac.lo /opt/local/var/macports/build/_opt_local_var_macports_sources_rsync.macports.org_release_tarballs_ports_lang_gcc48/gcc48/work/gcc-4.8.5/libsanitizer/sanitizer_common/sanitizer_symbolizer_mac.cc
245:info:build /bin/sh ../libtool --tag=CXX   --mode=compile /opt/local/var/macports/build/_opt_local_var_macports_sources_rsync.macports.org_release_tarballs_ports_lang_gcc48/gcc48/work/build/./gcc/xgcc -shared-libgcc -B/opt/local/var/macports/build/_opt_local_var_macports_sources_rsync.macports.org_release_tarballs_ports_lang_gcc48/gcc48/work/build/./gcc -nostdinc++ -L/opt/local/var/macports/build/_opt_local_var_macports_sources_rsync.macports.org_release_tarballs_ports_lang_gcc48/gcc48/work/build/x86_64-apple-darwin15/libstdc++-v3/src -L/opt/local/var/macports/build/_opt_local_var_macports_sources_rsync.macports.org_release_tarballs_ports_lang_gcc48/gcc48/work/build/x86_64-apple-darwin15/libstdc++-v3/src/.libs -B/opt/local/x86_64-apple-darwin15/bin/ -B/opt/local/x86_64-apple-darwin15/lib/ -isystem /opt/local/x86_64-apple-darwin15/include -isystem /opt/local/x86_64-apple-darwin15/sys-include    -D_GNU_SOURCE -D_DEBUG -D__STDC_CONSTANT_MACROS -D__STDC_FORMAT_MACROS -D__STDC_LIMIT_MACROS  -I. -I/opt/local/var/macports/build/_opt_local_var_macports_sources_rsync.macports.org_release_tarballs_ports_lang_gcc48/gcc48/work/gcc-4.8.5/libsanitizer/sanitizer_common  -I /opt/local/var/macports/build/_opt_local_var_macports_sources_rsync.macports.org_release_tarballs_ports_lang_gcc48/gcc48/work/gcc-4.8.5/libsanitizer/include   -Wall -W -Wno-unused-parameter -Wwrite-strings -pedantic -Wno-long-long -fPIC -fno-builtin -fno-exceptions -fomit-frame-pointer -funwind-tables -fvisibility=hidden -Wno-variadic-macros -I../../libstdc++-v3/include     -I../../libstdc++-v3/include/x86_64-apple-darwin15     -I/opt/local/var/macports/build/_opt_local_var_macports_sources_rsync.macports.org_release_tarballs_ports_lang_gcc48/gcc48/work/gcc-4.8.5/libsanitizer/../libstdc++-v3/libsupc++ -g -O2 -pipe -Os -MT sanitizer_symbolizer_win.lo -MD -MP -MF .deps/sanitizer_symbolizer_win.Tpo -c -o sanitizer_symbolizer_win.lo /opt/local/var/macports/build/_opt_local_var_macports_sources_rsync.macports.org_release_tarballs_ports_lang_gcc48/gcc48/work/gcc-4.8.5/libsanitizer/sanitizer_common/sanitizer_symbolizer_win.cc
246:info:build libtool: compile:  /opt/local/var/macports/build/_opt_local_var_macports_sources_rsync.macports.org_release_tarballs_ports_lang_gcc48/gcc48/work/build/./gcc/xgcc -shared-libgcc -B/opt/local/var/macports/build/_opt_local_var_macports_sources_rsync.macports.org_release_tarballs_ports_lang_gcc48/gcc48/work/build/./gcc -nostdinc++ -L/opt/local/var/macports/build/_opt_local_var_macports_sources_rsync.macports.org_release_tarballs_ports_lang_gcc48/gcc48/work/build/x86_64-apple-darwin15/libstdc++-v3/src -L/opt/local/var/macports/build/_opt_local_var_macports_sources_rsync.macports.org_release_tarballs_ports_lang_gcc48/gcc48/work/build/x86_64-apple-darwin15/libstdc++-v3/src/.libs -B/opt/local/x86_64-apple-darwin15/bin/ -B/opt/local/x86_64-apple-darwin15/lib/ -isystem /opt/local/x86_64-apple-darwin15/include -isystem /opt/local/x86_64-apple-darwin15/sys-include -D_GNU_SOURCE -D_DEBUG -D__STDC_CONSTANT_MACROS -D__STDC_FORMAT_MACROS -D__STDC_LIMIT_MACROS -I. -I/opt/local/var/macports/build/_opt_local_var_macports_sources_rsync.macports.org_release_tarballs_ports_lang_gcc48/gcc48/work/gcc-4.8.5/libsanitizer/sanitizer_common -I /opt/local/var/macports/build/_opt_local_var_macports_sources_rsync.macports.org_release_tarballs_ports_lang_gcc48/gcc48/work/gcc-4.8.5/libsanitizer/include -Wall -W -Wno-unused-parameter -Wwrite-strings -pedantic -Wno-long-long -fPIC -fno-builtin -fno-exceptions -fomit-frame-pointer -funwind-tables -fvisibility=hidden -Wno-variadic-macros -I../../libstdc++-v3/include -I../../libstdc++-v3/include/x86_64-apple-darwin15 -I/opt/local/var/macports/build/_opt_local_var_macports_sources_rsync.macports.org_release_tarballs_ports_lang_gcc48/gcc48/work/gcc-4.8.5/libsanitizer/../libstdc++-v3/libsupc++ -g -O2 -pipe -Os -MT sanitizer_allocator.lo -MD -MP -MF .deps/sanitizer_allocator.Tpo -c /opt/local/var/macports/build/_opt_local_var_macports_sources_rsync.macports.org_release_tarballs_ports_lang_gcc48/gcc48/work/gcc-4.8.5/libsanitizer/sanitizer_common/sanitizer_allocator.cc  -fno-common -DPIC -o .libs/sanitizer_allocator.o
247:info:build libtool: compile:  /opt/local/var/macports/build/_opt_local_var_macports_sources_rsync.macports.org_release_tarballs_ports_lang_gcc48/gcc48/work/build/./gcc/xgcc -shared-libgcc -B/opt/local/var/macports/build/_opt_local_var_macports_sources_rsync.macports.org_release_tarballs_ports_lang_gcc48/gcc48/work/build/./gcc -nostdinc++ -L/opt/local/var/macports/build/_opt_local_var_macports_sources_rsync.macports.org_release_tarballs_ports_lang_gcc48/gcc48/work/build/x86_64-apple-darwin15/libstdc++-v3/src -L/opt/local/var/macports/build/_opt_local_var_macports_sources_rsync.macports.org_release_tarballs_ports_lang_gcc48/gcc48/work/build/x86_64-apple-darwin15/libstdc++-v3/src/.libs -B/opt/local/x86_64-apple-darwin15/bin/ -B/opt/local/x86_64-apple-darwin15/lib/ -isystem /opt/local/x86_64-apple-darwin15/include -isystem /opt/local/x86_64-apple-darwin15/sys-include -D_GNU_SOURCE -D_DEBUG -D__STDC_CONSTANT_MACROS -D__STDC_FORMAT_MACROS -D__STDC_LIMIT_MACROS -I. -I/opt/local/var/macports/build/_opt_local_var_macports_sources_rsync.macports.org_release_tarballs_ports_lang_gcc48/gcc48/work/gcc-4.8.5/libsanitizer/sanitizer_common -I /opt/local/var/macports/build/_opt_local_var_macports_sources_rsync.macports.org_release_tarballs_ports_lang_gcc48/gcc48/work/gcc-4.8.5/libsanitizer/include -Wall -W -Wno-unused-parameter -Wwrite-strings -pedantic -Wno-long-long -fPIC -fno-builtin -fno-exceptions -fomit-frame-pointer -funwind-tables -fvisibility=hidden -Wno-variadic-macros -I../../libstdc++-v3/include -I../../libstdc++-v3/include/x86_64-apple-darwin15 -I/opt/local/var/macports/build/_opt_local_var_macports_sources_rsync.macports.org_release_tarballs_ports_lang_gcc48/gcc48/work/gcc-4.8.5/libsanitizer/../libstdc++-v3/libsupc++ -g -O2 -pipe -Os -MT sanitizer_stackdepot.lo -MD -MP -MF .deps/sanitizer_stackdepot.Tpo -c /opt/local/var/macports/build/_opt_local_var_macports_sources_rsync.macports.org_release_tarballs_ports_lang_gcc48/gcc48/work/gcc-4.8.5/libsanitizer/sanitizer_common/sanitizer_stackdepot.cc  -fno-common -DPIC -o .libs/sanitizer_stackdepot.o
248:info:build libtool: compile:  /opt/local/var/macports/build/_opt_local_var_macports_sources_rsync.macports.org_release_tarballs_ports_lang_gcc48/gcc48/work/build/./gcc/xgcc -shared-libgcc -B/opt/local/var/macports/build/_opt_local_var_macports_sources_rsync.macports.org_release_tarballs_ports_lang_gcc48/gcc48/work/build/./gcc -nostdinc++ -L/opt/local/var/macports/build/_opt_local_var_macports_sources_rsync.macports.org_release_tarballs_ports_lang_gcc48/gcc48/work/build/x86_64-apple-darwin15/libstdc++-v3/src -L/opt/local/var/macports/build/_opt_local_var_macports_sources_rsync.macports.org_release_tarballs_ports_lang_gcc48/gcc48/work/build/x86_64-apple-darwin15/libstdc++-v3/src/.libs -B/opt/local/x86_64-apple-darwin15/bin/ -B/opt/local/x86_64-apple-darwin15/lib/ -isystem /opt/local/x86_64-apple-darwin15/include -isystem /opt/local/x86_64-apple-darwin15/sys-include -D_GNU_SOURCE -D_DEBUG -D__STDC_CONSTANT_MACROS -D__STDC_FORMAT_MACROS -D__STDC_LIMIT_MACROS -I. -I/opt/local/var/macports/build/_opt_local_var_macports_sources_rsync.macports.org_release_tarballs_ports_lang_gcc48/gcc48/work/gcc-4.8.5/libsanitizer/sanitizer_common -I /opt/local/var/macports/build/_opt_local_var_macports_sources_rsync.macports.org_release_tarballs_ports_lang_gcc48/gcc48/work/gcc-4.8.5/libsanitizer/include -Wall -W -Wno-unused-parameter -Wwrite-strings -pedantic -Wno-long-long -fPIC -fno-builtin -fno-exceptions -fomit-frame-pointer -funwind-tables -fvisibility=hidden -Wno-variadic-macros -I../../libstdc++-v3/include -I../../libstdc++-v3/include/x86_64-apple-darwin15 -I/opt/local/var/macports/build/_opt_local_var_macports_sources_rsync.macports.org_release_tarballs_ports_lang_gcc48/gcc48/work/gcc-4.8.5/libsanitizer/../libstdc++-v3/libsupc++ -g -O2 -pipe -Os -MT sanitizer_stacktrace.lo -MD -MP -MF .deps/sanitizer_stacktrace.Tpo -c /opt/local/var/macports/build/_opt_local_var_macports_sources_rsync.macports.org_release_tarballs_ports_lang_gcc48/gcc48/work/gcc-4.8.5/libsanitizer/sanitizer_common/sanitizer_stacktrace.cc  -fno-common -DPIC -o .libs/sanitizer_stacktrace.o
249:info:build libtool: compile:  /opt/local/var/macports/build/_opt_local_var_macports_sources_rsync.macports.org_release_tarballs_ports_lang_gcc48/gcc48/work/build/./gcc/xgcc -shared-libgcc -B/opt/local/var/macports/build/_opt_local_var_macports_sources_rsync.macports.org_release_tarballs_ports_lang_gcc48/gcc48/work/build/./gcc -nostdinc++ -L/opt/local/var/macports/build/_opt_local_var_macports_sources_rsync.macports.org_release_tarballs_ports_lang_gcc48/gcc48/work/build/x86_64-apple-darwin15/libstdc++-v3/src -L/opt/local/var/macports/build/_opt_local_var_macports_sources_rsync.macports.org_release_tarballs_ports_lang_gcc48/gcc48/work/build/x86_64-apple-darwin15/libstdc++-v3/src/.libs -B/opt/local/x86_64-apple-darwin15/bin/ -B/opt/local/x86_64-apple-darwin15/lib/ -isystem /opt/local/x86_64-apple-darwin15/include -isystem /opt/local/x86_64-apple-darwin15/sys-include -D_GNU_SOURCE -D_DEBUG -D__STDC_CONSTANT_MACROS -D__STDC_FORMAT_MACROS -D__STDC_LIMIT_MACROS -I. -I/opt/local/var/macports/build/_opt_local_var_macports_sources_rsync.macports.org_release_tarballs_ports_lang_gcc48/gcc48/work/gcc-4.8.5/libsanitizer/sanitizer_common -I /opt/local/var/macports/build/_opt_local_var_macports_sources_rsync.macports.org_release_tarballs_ports_lang_gcc48/gcc48/work/gcc-4.8.5/libsanitizer/include -Wall -W -Wno-unused-parameter -Wwrite-strings -pedantic -Wno-long-long -fPIC -fno-builtin -fno-exceptions -fomit-frame-pointer -funwind-tables -fvisibility=hidden -Wno-variadic-macros -I../../libstdc++-v3/include -I../../libstdc++-v3/include/x86_64-apple-darwin15 -I/opt/local/var/macports/build/_opt_local_var_macports_sources_rsync.macports.org_release_tarballs_ports_lang_gcc48/gcc48/work/gcc-4.8.5/libsanitizer/../libstdc++-v3/libsupc++ -g -O2 -pipe -Os -MT sanitizer_symbolizer_linux.lo -MD -MP -MF .deps/sanitizer_symbolizer_linux.Tpo -c /opt/local/var/macports/build/_opt_local_var_macports_sources_rsync.macports.org_release_tarballs_ports_lang_gcc48/gcc48/work/gcc-4.8.5/libsanitizer/sanitizer_common/sanitizer_symbolizer_linux.cc  -fno-common -DPIC -o .libs/sanitizer_symbolizer_linux.o
250:info:build libtool: compile:  /opt/local/var/macports/build/_opt_local_var_macports_sources_rsync.macports.org_release_tarballs_ports_lang_gcc48/gcc48/work/build/./gcc/xgcc -shared-libgcc -B/opt/local/var/macports/build/_opt_local_var_macports_sources_rsync.macports.org_release_tarballs_ports_lang_gcc48/gcc48/work/build/./gcc -nostdinc++ -L/opt/local/var/macports/build/_opt_local_var_macports_sources_rsync.macports.org_release_tarballs_ports_lang_gcc48/gcc48/work/build/x86_64-apple-darwin15/libstdc++-v3/src -L/opt/local/var/macports/build/_opt_local_var_macports_sources_rsync.macports.org_release_tarballs_ports_lang_gcc48/gcc48/work/build/x86_64-apple-darwin15/libstdc++-v3/src/.libs -B/opt/local/x86_64-apple-darwin15/bin/ -B/opt/local/x86_64-apple-darwin15/lib/ -isystem /opt/local/x86_64-apple-darwin15/include -isystem /opt/local/x86_64-apple-darwin15/sys-include -D_GNU_SOURCE -D_DEBUG -D__STDC_CONSTANT_MACROS -D__STDC_FORMAT_MACROS -D__STDC_LIMIT_MACROS -I. -I/opt/local/var/macports/build/_opt_local_var_macports_sources_rsync.macports.org_release_tarballs_ports_lang_gcc48/gcc48/work/gcc-4.8.5/libsanitizer/sanitizer_common -I /opt/local/var/macports/build/_opt_local_var_macports_sources_rsync.macports.org_release_tarballs_ports_lang_gcc48/gcc48/work/gcc-4.8.5/libsanitizer/include -Wall -W -Wno-unused-parameter -Wwrite-strings -pedantic -Wno-long-long -fPIC -fno-builtin -fno-exceptions -fomit-frame-pointer -funwind-tables -fvisibility=hidden -Wno-variadic-macros -I../../libstdc++-v3/include -I../../libstdc++-v3/include/x86_64-apple-darwin15 -I/opt/local/var/macports/build/_opt_local_var_macports_sources_rsync.macports.org_release_tarballs_ports_lang_gcc48/gcc48/work/gcc-4.8.5/libsanitizer/../libstdc++-v3/libsupc++ -g -O2 -pipe -Os -MT sanitizer_symbolizer_mac.lo -MD -MP -MF .deps/sanitizer_symbolizer_mac.Tpo -c /opt/local/var/macports/build/_opt_local_var_macports_sources_rsync.macports.org_release_tarballs_ports_lang_gcc48/gcc48/work/gcc-4.8.5/libsanitizer/sanitizer_common/sanitizer_symbolizer_mac.cc  -fno-common -DPIC -o .libs/sanitizer_symbolizer_mac.o
251:info:build libtool: compile:  /opt/local/var/macports/build/_opt_local_var_macports_sources_rsync.macports.org_release_tarballs_ports_lang_gcc48/gcc48/work/build/./gcc/xgcc -shared-libgcc -B/opt/local/var/macports/build/_opt_local_var_macports_sources_rsync.macports.org_release_tarballs_ports_lang_gcc48/gcc48/work/build/./gcc -nostdinc++ -L/opt/local/var/macports/build/_opt_local_var_macports_sources_rsync.macports.org_release_tarballs_ports_lang_gcc48/gcc48/work/build/x86_64-apple-darwin15/libstdc++-v3/src -L/opt/local/var/macports/build/_opt_local_var_macports_sources_rsync.macports.org_release_tarballs_ports_lang_gcc48/gcc48/work/build/x86_64-apple-darwin15/libstdc++-v3/src/.libs -B/opt/local/x86_64-apple-darwin15/bin/ -B/opt/local/x86_64-apple-darwin15/lib/ -isystem /opt/local/x86_64-apple-darwin15/include -isystem /opt/local/x86_64-apple-darwin15/sys-include -D_GNU_SOURCE -D_DEBUG -D__STDC_CONSTANT_MACROS -D__STDC_FORMAT_MACROS -D__STDC_LIMIT_MACROS -I. -I/opt/local/var/macports/build/_opt_local_var_macports_sources_rsync.macports.org_release_tarballs_ports_lang_gcc48/gcc48/work/gcc-4.8.5/libsanitizer/sanitizer_common -I /opt/local/var/macports/build/_opt_local_var_macports_sources_rsync.macports.org_release_tarballs_ports_lang_gcc48/gcc48/work/gcc-4.8.5/libsanitizer/include -Wall -W -Wno-unused-parameter -Wwrite-strings -pedantic -Wno-long-long -fPIC -fno-builtin -fno-exceptions -fomit-frame-pointer -funwind-tables -fvisibility=hidden -Wno-variadic-macros -I../../libstdc++-v3/include -I../../libstdc++-v3/include/x86_64-apple-darwin15 -I/opt/local/var/macports/build/_opt_local_var_macports_sources_rsync.macports.org_release_tarballs_ports_lang_gcc48/gcc48/work/gcc-4.8.5/libsanitizer/../libstdc++-v3/libsupc++ -g -O2 -pipe -Os -MT sanitizer_symbolizer.lo -MD -MP -MF .deps/sanitizer_symbolizer.Tpo -c /opt/local/var/macports/build/_opt_local_var_macports_sources_rsync.macports.org_release_tarballs_ports_lang_gcc48/gcc48/work/gcc-4.8.5/libsanitizer/sanitizer_common/sanitizer_symbolizer.cc  -fno-common -DPIC -o .libs/sanitizer_symbolizer.o
252:info:build libtool: compile:  /opt/local/var/macports/build/_opt_local_var_macports_sources_rsync.macports.org_release_tarballs_ports_lang_gcc48/gcc48/work/build/./gcc/xgcc -shared-libgcc -B/opt/local/var/macports/build/_opt_local_var_macports_sources_rsync.macports.org_release_tarballs_ports_lang_gcc48/gcc48/work/build/./gcc -nostdinc++ -L/opt/local/var/macports/build/_opt_local_var_macports_sources_rsync.macports.org_release_tarballs_ports_lang_gcc48/gcc48/work/build/x86_64-apple-darwin15/libstdc++-v3/src -L/opt/local/var/macports/build/_opt_local_var_macports_sources_rsync.macports.org_release_tarballs_ports_lang_gcc48/gcc48/work/build/x86_64-apple-darwin15/libstdc++-v3/src/.libs -B/opt/local/x86_64-apple-darwin15/bin/ -B/opt/local/x86_64-apple-darwin15/lib/ -isystem /opt/local/x86_64-apple-darwin15/include -isystem /opt/local/x86_64-apple-darwin15/sys-include -D_GNU_SOURCE -D_DEBUG -D__STDC_CONSTANT_MACROS -D__STDC_FORMAT_MACROS -D__STDC_LIMIT_MACROS -I. -I/opt/local/var/macports/build/_opt_local_var_macports_sources_rsync.macports.org_release_tarballs_ports_lang_gcc48/gcc48/work/gcc-4.8.5/libsanitizer/sanitizer_common -I /opt/local/var/macports/build/_opt_local_var_macports_sources_rsync.macports.org_release_tarballs_ports_lang_gcc48/gcc48/work/gcc-4.8.5/libsanitizer/include -Wall -W -Wno-unused-parameter -Wwrite-strings -pedantic -Wno-long-long -fPIC -fno-builtin -fno-exceptions -fomit-frame-pointer -funwind-tables -fvisibility=hidden -Wno-variadic-macros -I../../libstdc++-v3/include -I../../libstdc++-v3/include/x86_64-apple-darwin15 -I/opt/local/var/macports/build/_opt_local_var_macports_sources_rsync.macports.org_release_tarballs_ports_lang_gcc48/gcc48/work/gcc-4.8.5/libsanitizer/../libstdc++-v3/libsupc++ -g -O2 -pipe -Os -MT sanitizer_symbolizer_itanium.lo -MD -MP -MF .deps/sanitizer_symbolizer_itanium.Tpo -c /opt/local/var/macports/build/_opt_local_var_macports_sources_rsync.macports.org_release_tarballs_ports_lang_gcc48/gcc48/work/gcc-4.8.5/libsanitizer/sanitizer_common/sanitizer_symbolizer_itanium.cc  -fno-common -DPIC -o .libs/sanitizer_symbolizer_itanium.o
253:info:build libtool: compile:  /opt/local/var/macports/build/_opt_local_var_macports_sources_rsync.macports.org_release_tarballs_ports_lang_gcc48/gcc48/work/build/./gcc/xgcc -shared-libgcc -B/opt/local/var/macports/build/_opt_local_var_macports_sources_rsync.macports.org_release_tarballs_ports_lang_gcc48/gcc48/work/build/./gcc -nostdinc++ -L/opt/local/var/macports/build/_opt_local_var_macports_sources_rsync.macports.org_release_tarballs_ports_lang_gcc48/gcc48/work/build/x86_64-apple-darwin15/libstdc++-v3/src -L/opt/local/var/macports/build/_opt_local_var_macports_sources_rsync.macports.org_release_tarballs_ports_lang_gcc48/gcc48/work/build/x86_64-apple-darwin15/libstdc++-v3/src/.libs -B/opt/local/x86_64-apple-darwin15/bin/ -B/opt/local/x86_64-apple-darwin15/lib/ -isystem /opt/local/x86_64-apple-darwin15/include -isystem /opt/local/x86_64-apple-darwin15/sys-include -D_GNU_SOURCE -D_DEBUG -D__STDC_CONSTANT_MACROS -D__STDC_FORMAT_MACROS -D__STDC_LIMIT_MACROS -I. -I/opt/local/var/macports/build/_opt_local_var_macports_sources_rsync.macports.org_release_tarballs_ports_lang_gcc48/gcc48/work/gcc-4.8.5/libsanitizer/sanitizer_common -I /opt/local/var/macports/build/_opt_local_var_macports_sources_rsync.macports.org_release_tarballs_ports_lang_gcc48/gcc48/work/gcc-4.8.5/libsanitizer/include -Wall -W -Wno-unused-parameter -Wwrite-strings -pedantic -Wno-long-long -fPIC -fno-builtin -fno-exceptions -fomit-frame-pointer -funwind-tables -fvisibility=hidden -Wno-variadic-macros -I../../libstdc++-v3/include -I../../libstdc++-v3/include/x86_64-apple-darwin15 -I/opt/local/var/macports/build/_opt_local_var_macports_sources_rsync.macports.org_release_tarballs_ports_lang_gcc48/gcc48/work/gcc-4.8.5/libsanitizer/../libstdc++-v3/libsupc++ -g -O2 -pipe -Os -MT sanitizer_symbolizer_win.lo -MD -MP -MF .deps/sanitizer_symbolizer_win.Tpo -c /opt/local/var/macports/build/_opt_local_var_macports_sources_rsync.macports.org_release_tarballs_ports_lang_gcc48/gcc48/work/gcc-4.8.5/libsanitizer/sanitizer_common/sanitizer_symbolizer_win.cc  -fno-common -DPIC -o .libs/sanitizer_symbolizer_win.o
254:info:build In file included from /usr/include/stdlib.h:61:0,
255:info:build                  from /opt/local/var/macports/build/_opt_local_var_macports_sources_rsync.macports.org_release_tarballs_ports_lang_gcc48/gcc48/work/gcc-4.8.5/libsanitizer/sanitizer_common/sanitizer_allocator.cc:22:
256:info:build /usr/include/Availability.h:219:22: error: missing binary operator before token "("
257:info:build    #if __has_attribute(availability)
258:info:build                       ^
259:info:build /usr/include/Availability.h:241:22: error: missing binary operator before token "("
260:info:build    #if __has_attribute(availability)
261:info:build                       ^
262:info:build mv -f .deps/sanitizer_symbolizer_linux.Tpo .deps/sanitizer_symbolizer_linux.Plo
263:info:build mv -f .deps/sanitizer_symbolizer_win.Tpo .deps/sanitizer_symbolizer_win.Plo
264:info:build /bin/sh ../libtool --tag=CXX   --mode=compile /opt/local/var/macports/build/_opt_local_var_macports_sources_rsync.macports.org_release_tarballs_ports_lang_gcc48/gcc48/work/build/./gcc/xgcc -shared-libgcc -B/opt/local/var/macports/build/_opt_local_var_macports_sources_rsync.macports.org_release_tarballs_ports_lang_gcc48/gcc48/work/build/./gcc -nostdinc++ -L/opt/local/var/macports/build/_opt_local_var_macports_sources_rsync.macports.org_release_tarballs_ports_lang_gcc48/gcc48/work/build/x86_64-apple-darwin15/libstdc++-v3/src -L/opt/local/var/macports/build/_opt_local_var_macports_sources_rsync.macports.org_release_tarballs_ports_lang_gcc48/gcc48/work/build/x86_64-apple-darwin15/libstdc++-v3/src/.libs -B/opt/local/x86_64-apple-darwin15/bin/ -B/opt/local/x86_64-apple-darwin15/lib/ -isystem /opt/local/x86_64-apple-darwin15/include -isystem /opt/local/x86_64-apple-darwin15/sys-include    -D_GNU_SOURCE -D_DEBUG -D__STDC_CONSTANT_MACROS -D__STDC_FORMAT_MACROS -D__STDC_LIMIT_MACROS  -I. -I/opt/local/var/macports/build/_opt_local_var_macports_sources_rsync.macports.org_release_tarballs_ports_lang_gcc48/gcc48/work/gcc-4.8.5/libsanitizer/sanitizer_common  -I /opt/local/var/macports/build/_opt_local_var_macports_sources_rsync.macports.org_release_tarballs_ports_lang_gcc48/gcc48/work/gcc-4.8.5/libsanitizer/include   -Wall -W -Wno-unused-parameter -Wwrite-strings -pedantic -Wno-long-long -fPIC -fno-builtin -fno-exceptions -fomit-frame-pointer -funwind-tables -fvisibility=hidden -Wno-variadic-macros -I../../libstdc++-v3/include     -I../../libstdc++-v3/include/x86_64-apple-darwin15     -I/opt/local/var/macports/build/_opt_local_var_macports_sources_rsync.macports.org_release_tarballs_ports_lang_gcc48/gcc48/work/gcc-4.8.5/libsanitizer/../libstdc++-v3/libsupc++ -g -O2 -pipe -Os -MT sanitizer_win.lo -MD -MP -MF .deps/sanitizer_win.Tpo -c -o sanitizer_win.lo /opt/local/var/macports/build/_opt_local_var_macports_sources_rsync.macports.org_release_tarballs_ports_lang_gcc48/gcc48/work/gcc-4.8.5/libsanitizer/sanitizer_common/sanitizer_win.cc
265:info:build In file included from /usr/include/stdlib.h:61:0,
266:info:build                  from /opt/local/var/macports/build/_opt_local_var_macports_sources_rsync.macports.org_release_tarballs_ports_lang_gcc48/gcc48/work/gcc-4.8.5/libsanitizer/sanitizer_common/sanitizer_symbolizer_itanium.cc:15:
267:info:build /usr/include/Availability.h:219:22: error: missing binary operator before token "("
268:info:build    #if __has_attribute(availability)
269:info:build                       ^
270:info:build /usr/include/Availability.h:241:22: error: missing binary operator before token "("
271:info:build    #if __has_attribute(availability)
272:info:build                       ^
273:info:build mv -f .deps/sanitizer_symbolizer_mac.Tpo .deps/sanitizer_symbolizer_mac.Plo
274:info:build make[4]: *** [sanitizer_allocator.lo] Error 1
275:info:build make[4]: *** Waiting for unfinished jobs....
276:info:build make[4]: *** [sanitizer_symbolizer_itanium.lo] Error 1
277:info:build libtool: compile:  /opt/local/var/macports/build/_opt_local_var_macports_sources_rsync.macports.org_release_tarballs_ports_lang_gcc48/gcc48/work/build/./gcc/xgcc -shared-libgcc -B/opt/local/var/macports/build/_opt_local_var_macports_sources_rsync.macports.org_release_tarballs_ports_lang_gcc48/gcc48/work/build/./gcc -nostdinc++ -L/opt/local/var/macports/build/_opt_local_var_macports_sources_rsync.macports.org_release_tarballs_ports_lang_gcc48/gcc48/work/build/x86_64-apple-darwin15/libstdc++-v3/src -L/opt/local/var/macports/build/_opt_local_var_macports_sources_rsync.macports.org_release_tarballs_ports_lang_gcc48/gcc48/work/build/x86_64-apple-darwin15/libstdc++-v3/src/.libs -B/opt/local/x86_64-apple-darwin15/bin/ -B/opt/local/x86_64-apple-darwin15/lib/ -isystem /opt/local/x86_64-apple-darwin15/include -isystem /opt/local/x86_64-apple-darwin15/sys-include -D_GNU_SOURCE -D_DEBUG -D__STDC_CONSTANT_MACROS -D__STDC_FORMAT_MACROS -D__STDC_LIMIT_MACROS -I. -I/opt/local/var/macports/build/_opt_local_var_macports_sources_rsync.macports.org_release_tarballs_ports_lang_gcc48/gcc48/work/gcc-4.8.5/libsanitizer/sanitizer_common -I /opt/local/var/macports/build/_opt_local_var_macports_sources_rsync.macports.org_release_tarballs_ports_lang_gcc48/gcc48/work/gcc-4.8.5/libsanitizer/include -Wall -W -Wno-unused-parameter -Wwrite-strings -pedantic -Wno-long-long -fPIC -fno-builtin -fno-exceptions -fomit-frame-pointer -funwind-tables -fvisibility=hidden -Wno-variadic-macros -I../../libstdc++-v3/include -I../../libstdc++-v3/include/x86_64-apple-darwin15 -I/opt/local/var/macports/build/_opt_local_var_macports_sources_rsync.macports.org_release_tarballs_ports_lang_gcc48/gcc48/work/gcc-4.8.5/libsanitizer/../libstdc++-v3/libsupc++ -g -O2 -pipe -Os -MT sanitizer_win.lo -MD -MP -MF .deps/sanitizer_win.Tpo -c /opt/local/var/macports/build/_opt_local_var_macports_sources_rsync.macports.org_release_tarballs_ports_lang_gcc48/gcc48/work/gcc-4.8.5/libsanitizer/sanitizer_common/sanitizer_win.cc  -fno-common -DPIC -o .libs/sanitizer_win.o
278:info:build mv -f .deps/sanitizer_win.Tpo .deps/sanitizer_win.Plo
279:info:build mv -f .deps/sanitizer_stacktrace.Tpo .deps/sanitizer_stacktrace.Plo
280:info:build mv -f .deps/sanitizer_stackdepot.Tpo .deps/sanitizer_stackdepot.Plo
281:info:build mv -f .deps/sanitizer_symbolizer.Tpo .deps/sanitizer_symbolizer.Plo
282:info:build make[4]: Leaving directory `/opt/local/var/macports/build/_opt_local_var_macports_sources_rsync.macports.org_release_tarballs_ports_lang_gcc48/gcc48/work/build/x86_64-apple-darwin15/libsanitizer/sanitizer_common'
283:info:build make[3]: *** [all-recursive] Error 1
284:info:build make[3]: Leaving directory `/opt/local/var/macports/build/_opt_local_var_macports_sources_rsync.macports.org_release_tarballs_ports_lang_gcc48/gcc48/work/build/x86_64-apple-darwin15/libsanitizer'
285:info:build make[2]: *** [all-stage1-target-libsanitizer] Error 2
286:info:build make[2]: Leaving directory `/opt/local/var/macports/build/_opt_local_var_macports_sources_rsync.macports.org_release_tarballs_ports_lang_gcc48/gcc48/work/build'
287:info:build make[1]: *** [stage1-bubble] Error 2
288:info:build make[1]: Leaving directory `/opt/local/var/macports/build/_opt_local_var_macports_sources_rsync.macports.org_release_tarballs_ports_lang_gcc48/gcc48/work/build'
289:info:build make: *** [bootstrap] Error 2
290:info:build make: Leaving directory `/opt/local/var/macports/build/_opt_local_var_macports_sources_rsync.macports.org_release_tarballs_ports_lang_gcc48/gcc48/work/build'
291:info:build Command failed:  cd "/opt/local/var/macports/build/_opt_local_var_macports_sources_rsync.macports.org_release_tarballs_ports_lang_gcc48/gcc48/work/build" && /usr/bin/make -j8 -w bootstrap
292:info:build Exit code: 2
293:error:build org.macports.build for port gcc48 returned: command execution failed
294:debug:build Error code: CHILDSTATUS 88777 2
295:debug:build Backtrace: command execution failed
296    while executing
297"system -nice 0 $fullcmdstring"
298    ("eval" body line 1)
299    invoked from within
300"eval system $notty $nice \$fullcmdstring"
301    invoked from within
302"command_exec build"
303    (procedure "portbuild::build_main" line 8)
304    invoked from within
305"portbuild::build_main org.macports.build"
306    ("eval" body line 1)
307    invoked from within
308"eval $procedure $targetname"
309:info:build Warning: targets not executed for gcc48: org.macports.activate org.macports.build org.macports.destroot org.macports.install
310:error:build Failed to install gcc48
311:debug:build Registry error: gcc48 not registered as installed & active.
312    invoked from within
313"registry_active $subport"
314    invoked from within
315"$workername eval registry_active \$subport"
316:notice:build Please see the log file for port gcc48 for details:
317    /opt/local/var/macports/logs/_opt_local_var_macports_sources_rsync.macports.org_release_tarballs_ports_lang_gcc48/gcc48/main.log