Ticket #49570: main.log

File main.log, 178.2 KB (added by dbevans (David B. Evans), 7 years ago)

Build log showing build failure on Yosemite

Line 
1version:1
2:debug:main epoch: in tree: 0 installed: 0
3:debug:main ragel 6.9_0 exists in the ports tree
4:debug:main ragel 6.9_0  is the latest installed
5:debug:main ragel 6.9_0  is active
6:debug:main Merging existing variants '' into variants
7:debug:main new fully merged portvariants:
8:debug:main Changing to port directory: /opt/macports/trunk/dports/lang/ragel
9:debug:main OS darwin/14.5.0 (Mac OS X 10.10) arch i386
10:debug:main adding the default universal variant
11:debug:main Reading variant descriptions from /opt/macports/trunk/dports/_resources/port1.0/variant_descriptions.conf
12:debug:main Running callback portconfigure::add_automatic_compiler_dependencies
13:debug:main Finished running callback portconfigure::add_automatic_compiler_dependencies
14:debug:main Running callback portbuild::add_automatic_buildsystem_dependencies
15:debug:main Finished running callback portbuild::add_automatic_buildsystem_dependencies
16:debug:main No need to upgrade! ragel 6.9_0 >= ragel 6.9_0
17:debug:main epoch: in tree: 0 installed: 0
18:debug:main perl5.22 5.22.0_0 exists in the ports tree
19:debug:main perl5.22 5.22.0_0  is the latest installed
20:debug:main perl5.22 5.22.0_0  is active
21:debug:main Merging existing variants '' into variants
22:debug:main new fully merged portvariants:
23:debug:main Changing to port directory: /opt/macports/trunk/dports/lang/perl5.22
24:debug:main OS darwin/14.5.0 (Mac OS X 10.10) arch i386
25:debug:main adding the default universal variant
26:debug:main Reading variant descriptions from /opt/macports/trunk/dports/_resources/port1.0/variant_descriptions.conf
27:debug:main Running callback portconfigure::add_automatic_compiler_dependencies
28:debug:main Finished running callback portconfigure::add_automatic_compiler_dependencies
29:debug:main Running callback portbuild::add_automatic_buildsystem_dependencies
30:debug:main Finished running callback portbuild::add_automatic_buildsystem_dependencies
31:debug:main No need to upgrade! perl5.22 5.22.0_0 >= perl5.22 5.22.0_0
32:debug:main epoch: in tree: 0 installed: 0
33:debug:main gdbm 1.11_1 exists in the ports tree
34:debug:main gdbm 1.11_1  is the latest installed
35:debug:main gdbm 1.11_1  is active
36:debug:main Merging existing variants '' into variants
37:debug:main new fully merged portvariants:
38:debug:main Changing to port directory: /opt/macports/trunk/dports/databases/gdbm
39:debug:main OS darwin/14.5.0 (Mac OS X 10.10) arch i386
40:debug:main adding the default universal variant
41:debug:main Reading variant descriptions from /opt/macports/trunk/dports/_resources/port1.0/variant_descriptions.conf
42:debug:main Running callback portconfigure::add_automatic_compiler_dependencies
43:debug:main Finished running callback portconfigure::add_automatic_compiler_dependencies
44:debug:main Running callback portbuild::add_automatic_buildsystem_dependencies
45:debug:main Finished running callback portbuild::add_automatic_buildsystem_dependencies
46:debug:main No need to upgrade! gdbm 1.11_1 >= gdbm 1.11_1
47:debug:main epoch: in tree: 2 installed: 2
48:debug:main gettext 0.19.6_0 exists in the ports tree
49:debug:main gettext 0.19.6_0  is the latest installed
50:debug:main gettext 0.19.6_0  is active
51:debug:main Merging existing variants '' into variants
52:debug:main new fully merged portvariants:
53:debug:main Changing to port directory: /opt/macports/trunk/dports/devel/gettext
54:debug:main OS darwin/14.5.0 (Mac OS X 10.10) arch i386
55:debug:main Sourcing PortGroup compiler_blacklist_versions 1.0 from /opt/macports/trunk/dports/_resources/port1.0/group/compiler_blacklist_versions-1.0.tcl
56:debug:main Reading variant descriptions from /opt/macports/trunk/dports/_resources/port1.0/variant_descriptions.conf
57:debug:main Sourcing PortGroup muniversal 1.0 from /opt/macports/trunk/dports/_resources/port1.0/group/muniversal-1.0.tcl
58:debug:main compiler clang 700.1.76 not blacklisted because it doesn't match {clang < 211.10.1}
59:debug:main universal variant already exists, so not adding the default one
60:debug:main Running callback portconfigure::add_automatic_compiler_dependencies
61:debug:main Finished running callback portconfigure::add_automatic_compiler_dependencies
62:debug:main Running callback portbuild::add_automatic_buildsystem_dependencies
63:debug:main Finished running callback portbuild::add_automatic_buildsystem_dependencies
64:debug:main No need to upgrade! gettext 0.19.6_0 >= gettext 0.19.6_0
65:debug:main epoch: in tree: 0 installed: 0
66:debug:main expat 2.1.0_0 exists in the ports tree
67:debug:main expat 2.1.0_0  is the latest installed
68:debug:main expat 2.1.0_0  is active
69:debug:main Merging existing variants '' into variants
70:debug:main new fully merged portvariants:
71:debug:main Changing to port directory: /opt/macports/trunk/dports/textproc/expat
72:debug:main OS darwin/14.5.0 (Mac OS X 10.10) arch i386
73:debug:main adding the default universal variant
74:debug:main Reading variant descriptions from /opt/macports/trunk/dports/_resources/port1.0/variant_descriptions.conf
75:debug:main Running callback portconfigure::add_automatic_compiler_dependencies
76:debug:main Finished running callback portconfigure::add_automatic_compiler_dependencies
77:debug:main Running callback portbuild::add_automatic_buildsystem_dependencies
78:debug:main Finished running callback portbuild::add_automatic_buildsystem_dependencies
79:debug:main No need to upgrade! expat 2.1.0_0 >= expat 2.1.0_0
80:debug:main epoch: in tree: 0 installed: 0
81:debug:main libiconv 1.14_0 exists in the ports tree
82:debug:main libiconv 1.14_0  is the latest installed
83:debug:main libiconv 1.14_0  is active
84:debug:main Merging existing variants '' into variants
85:debug:main new fully merged portvariants:
86:debug:main Changing to port directory: /opt/macports/trunk/dports/textproc/libiconv
87:debug:main OS darwin/14.5.0 (Mac OS X 10.10) arch i386
88:debug:main Reading variant descriptions from /opt/macports/trunk/dports/_resources/port1.0/variant_descriptions.conf
89:debug:main Sourcing PortGroup muniversal 1.0 from /opt/macports/trunk/dports/_resources/port1.0/group/muniversal-1.0.tcl
90:debug:main universal variant already exists, so not adding the default one
91:debug:main Running callback portconfigure::add_automatic_compiler_dependencies
92:debug:main Finished running callback portconfigure::add_automatic_compiler_dependencies
93:debug:main Running callback portbuild::add_automatic_buildsystem_dependencies
94:debug:main Finished running callback portbuild::add_automatic_buildsystem_dependencies
95:debug:main No need to upgrade! libiconv 1.14_0 >= libiconv 1.14_0
96:debug:main epoch: in tree: 0 installed: 0
97:debug:main ncurses 6.0_0 exists in the ports tree
98:debug:main ncurses 6.0_0  is the latest installed
99:debug:main ncurses 6.0_0  is active
100:debug:main Merging existing variants '' into variants
101:debug:main new fully merged portvariants:
102:debug:main Changing to port directory: /opt/macports/trunk/dports/devel/ncurses
103:debug:main OS darwin/14.5.0 (Mac OS X 10.10) arch i386
104:debug:main adding the default universal variant
105:debug:main Reading variant descriptions from /opt/macports/trunk/dports/_resources/port1.0/variant_descriptions.conf
106:debug:main Running callback portconfigure::add_automatic_compiler_dependencies
107:debug:main Finished running callback portconfigure::add_automatic_compiler_dependencies
108:debug:main Running callback portbuild::add_automatic_buildsystem_dependencies
109:debug:main Finished running callback portbuild::add_automatic_buildsystem_dependencies
110:debug:main No need to upgrade! ncurses 6.0_0 >= ncurses 6.0_0
111:msg:main --->  Computing dependencies for ackmate:msg:main
112:debug:main Searching for dependency: ragel
113:debug:main Found Dependency: receipt exists for ragel
114:debug:main Searching for dependency: perl5.22
115:debug:main Found Dependency: receipt exists for perl5.22
116:debug:main Executing org.macports.main (ackmate)
117:debug:main changing euid/egid - current euid: 0 - current egid: 0
118:debug:main egid changed to: 501
119:debug:main euid changed to: 502
120:debug:fetch fetch phase started at Fri Nov  6 10:28:30 PST 2015
121:notice:fetch --->  Fetching distfiles for ackmate
122:debug:fetch Executing org.macports.fetch (ackmate)
123:debug:fetch Privilege de-escalation not attempted as not running as root.
124:debug:checksum checksum phase started at Fri Nov  6 10:28:30 PST 2015
125:notice:checksum --->  Verifying checksums for ackmate
126:debug:checksum Executing org.macports.checksum (ackmate)
127:info:checksum --->  Checksumming AckMate-f2515f9.tar.gz
128:debug:checksum Calculated (rmd160) is 7284a1bddc28316ff41ba75b7614c8209ff79fb8
129:debug:checksum Correct (rmd160) checksum for AckMate-f2515f9.tar.gz
130:debug:checksum Calculated (sha256) is f322c96d5c8bf2e6c6d5e3a5d2b2979de1fb8951ec0889b625dfa5666a433067
131:debug:checksum Correct (sha256) checksum for AckMate-f2515f9.tar.gz
132:debug:checksum Privilege de-escalation not attempted as not running as root.
133:debug:extract extract phase started at Fri Nov  6 10:28:30 PST 2015
134:notice:extract --->  Extracting ackmate
135:debug:extract Executing org.macports.extract (ackmate)
136:info:extract --->  Extracting AckMate-f2515f9.tar.gz
137:debug:extract setting option extract.args to '/opt/local/var/macports/distfiles/ackmate/AckMate-f2515f9.tar.gz'
138:debug:extract Environment:
139CC_PRINT_OPTIONS='YES'
140CC_PRINT_OPTIONS_FILE='/opt/local/var/macports/build/_opt_macports_trunk_dports_editors_ackmate/ackmate/work/.CC_PRINT_OPTIONS'
141CPATH='/opt/local/include'
142LIBRARY_PATH='/opt/local/lib'
143MACOSX_DEPLOYMENT_TARGET='10.10'
144:debug:extract Assembled command: 'cd "/opt/local/var/macports/build/_opt_macports_trunk_dports_editors_ackmate/ackmate/work" && /usr/bin/gzip -dc '/opt/local/var/macports/distfiles/ackmate/AckMate-f2515f9.tar.gz' | /usr/bin/tar -xf -'
145:debug:extract Executing command line:  cd "/opt/local/var/macports/build/_opt_macports_trunk_dports_editors_ackmate/ackmate/work" && /usr/bin/gzip -dc '/opt/local/var/macports/distfiles/ackmate/AckMate-f2515f9.tar.gz' | /usr/bin/tar -xf -
146:debug:extract euid/egid changed to: 0/0
147:debug:extract chowned /opt/local/var/macports/build/_opt_macports_trunk_dports_editors_ackmate/ackmate/work to macports
148:debug:extract euid/egid changed to: 502/501
149:debug:extract Executing proc-post-org.macports.extract-extract-0
150:debug:extract Privilege de-escalation not attempted as not running as root.
151:debug:patch patch phase started at Fri Nov  6 10:28:31 PST 2015
152:debug:patch Executing org.macports.patch (ackmate)
153:debug:patch Executing proc-post-org.macports.patch-patch-0
154:info:patch --->  Patching ackmate_ack.autogenerated: s|^#!/usr/bin/env perl|#!/opt/local/bin/perl5.22|
155:debug:patch Executing reinplace: /usr/bin/sed {s|^#!/usr/bin/env perl|#!/opt/local/bin/perl5.22|} < /opt/local/var/macports/build/_opt_macports_trunk_dports_editors_ackmate/ackmate/work/AckMate-f2515f9/bundle_extras/ackmate_ack.autogenerated >@ file10 2>@stderr
156:debug:patch euid/egid changed to: 0/0
157:debug:patch chowned /opt/local/var/macports/build/_opt_macports_trunk_dports_editors_ackmate/ackmate/work/AckMate-f2515f9/bundle_extras/ackmate_ack.autogenerated to macports
158:debug:patch euid/egid changed to: 502/501
159:debug:patch euid/egid changed to: 0/0
160:debug:patch setting attributes on /opt/local/var/macports/build/_opt_macports_trunk_dports_editors_ackmate/ackmate/work/AckMate-f2515f9/bundle_extras/ackmate_ack.autogenerated
161:debug:patch euid/egid changed to: 502/501
162:debug:patch Privilege de-escalation not attempted as not running as root.
163:debug:configure configure phase started at Fri Nov  6 10:28:31 PST 2015
164:notice:configure --->  Configuring ackmate
165:debug:configure Using compiler 'Xcode Clang'
166:debug:configure Executing org.macports.configure (ackmate)
167:debug:configure Privilege de-escalation not attempted as not running as root.
168:debug:build build phase started at Fri Nov  6 10:28:31 PST 2015
169:notice:build --->  Building ackmate
170:debug:build Executing org.macports.build (ackmate)
171:debug:build Assembled command: 'cd "/opt/local/var/macports/build/_opt_macports_trunk_dports_editors_ackmate/ackmate/work/AckMate-f2515f9" && /usr/bin/xcodebuild  -alltargets -configuration Deployment build OBJROOT=build/ SYMROOT=build/ MACOSX_DEPLOYMENT_TARGET=10.10 ARCHS=x86_64 SDKROOT="" GCC_VERSION=com.apple.compilers.llvm.clang.1_0 CLANG_CXX_LIBRARY="libc++" '
172:info:build Build settings from command line:
173:info:build     ARCHS = x86_64
174:info:build     CLANG_CXX_LIBRARY = libc++
175:info:build     GCC_VERSION = com.apple.compilers.llvm.clang.1_0
176:info:build     MACOSX_DEPLOYMENT_TARGET = 10.10
177:info:build     OBJROOT = build/
178:info:build     SDKROOT =
179:info:build     SYMROOT = build/
180:info:build
181:info:build 2015-11-06 10:28:31.678 xcodebuild[86028:602009]  DVTAssertions: Warning in /Library/Caches/com.apple.xbs/Sources/DVTiOSFrameworks/DVTiOSFrameworks-9063/IDEiOSSupportCore/DVTiPhoneSimulatorLocator.m:94
182:info:build Details:  [SimDeviceSet defaultSet] returned nil. Simulator device support disabled.
183:info:build Object:   <DVTiPhoneSimulatorLocator: 0x7fbf13de6670>
184:info:build Method:   -startLocating
185:info:build Thread:   <NSThread: 0x7fbf13f23d10>{number = 3, name = (null)}
186:info:build Please file a bug at http://bugreport.apple.com with this warning message and any useful information you can provide.
187:info:build --- xcodebuild: WARNING: Configuration Deployment is not in the project. Building default configuration.
188:info:build
189:info:build === BUILD TARGET AckMate OF PROJECT AckMate WITH THE DEFAULT CONFIGURATION (Release) ===
190:info:build
191:info:build Check dependencies
192:info:build
193:info:build Write auxiliary files
194:info:build /bin/mkdir -p /opt/local/var/macports/build/_opt_macports_trunk_dports_editors_ackmate/ackmate/work/AckMate-f2515f9/build/AckMate.build/Release/AckMate.build/Objects-normal/x86_64
195:info:build write-file /opt/local/var/macports/build/_opt_macports_trunk_dports_editors_ackmate/ackmate/work/AckMate-f2515f9/build/AckMate.build/Release/AckMate.build/Objects-normal/x86_64/AckMate.LinkFileList
196:info:build write-file /opt/local/var/macports/build/_opt_macports_trunk_dports_editors_ackmate/ackmate/work/AckMate-f2515f9/build/AckMate.build/Release/AckMate.build/Script-177E4DB50913322B0064163D.sh
197:info:build chmod 0755 /opt/local/var/macports/build/_opt_macports_trunk_dports_editors_ackmate/ackmate/work/AckMate-f2515f9/build/AckMate.build/Release/AckMate.build/Script-177E4DB50913322B0064163D.sh
198:info:build write-file /opt/local/var/macports/build/_opt_macports_trunk_dports_editors_ackmate/ackmate/work/AckMate-f2515f9/build/AckMate.build/Release/AckMate.build/AckMate.hmap
199:info:build
200:info:build Create product structure
201:info:build /bin/mkdir -p /opt/local/var/macports/build/_opt_macports_trunk_dports_editors_ackmate/ackmate/work/AckMate-f2515f9/build/Release/AckMate.tmplugin/Contents
202:info:build /bin/mkdir -p /opt/local/var/macports/build/_opt_macports_trunk_dports_editors_ackmate/ackmate/work/AckMate-f2515f9/build/Release/AckMate.tmplugin/Contents/MacOS
203:info:build /bin/mkdir -p /opt/local/var/macports/build/_opt_macports_trunk_dports_editors_ackmate/ackmate/work/AckMate-f2515f9/build/Release/AckMate.tmplugin/Contents/Resources
204:info:build
205:info:build CopyStringsFile build/Release/AckMate.tmplugin/Contents/Resources/English.lproj/InfoPlist.strings English.lproj/InfoPlist.strings
206:info:build     cd /opt/local/var/macports/build/_opt_macports_trunk_dports_editors_ackmate/ackmate/work/AckMate-f2515f9
207:info:build     builtin-copyStrings --validate --inputencoding utf-16 --outputencoding UTF-16 --outdir /opt/local/var/macports/build/_opt_macports_trunk_dports_editors_ackmate/ackmate/work/AckMate-f2515f9/build/Release/AckMate.tmplugin/Contents/Resources/English.lproj -- English.lproj/InfoPlist.strings
208:info:build
209:info:build CpResource bundle_extras/ackmateExpanded.pdf build/Release/AckMate.tmplugin/Contents/Resources/ackmateExpanded.pdf
210:info:build     cd /opt/local/var/macports/build/_opt_macports_trunk_dports_editors_ackmate/ackmate/work/AckMate-f2515f9
211:info:build     builtin-copy -exclude .DS_Store -exclude CVS -exclude .svn -exclude .git -exclude .hg -strip-debug-symbols -strip-tool /Applications/Xcode.app/Contents/Developer/Toolchains/XcodeDefault.xctoolchain/usr/bin/strip -resolve-src-symlinks /opt/local/var/macports/build/_opt_macports_trunk_dports_editors_ackmate/ackmate/work/AckMate-f2515f9/bundle_extras/ackmateExpanded.pdf /opt/local/var/macports/build/_opt_macports_trunk_dports_editors_ackmate/ackmate/work/AckMate-f2515f9/build/Release/AckMate.tmplugin/Contents/Resources
212:info:build
213:info:build CompileXIB English.lproj/JPAckWindow.xib
214:info:build     cd /opt/local/var/macports/build/_opt_macports_trunk_dports_editors_ackmate/ackmate/work/AckMate-f2515f9
215:info:build     export XCODE_DEVELOPER_USR_PATH=/Applications/Xcode.app/Contents/Developer/usr/bin/..
216:info:build     /Applications/Xcode.app/Contents/Developer/usr/bin/ibtool --errors --warnings --notices --module AckMate --output-partial-info-plist /opt/local/var/macports/build/_opt_macports_trunk_dports_editors_ackmate/ackmate/work/AckMate-f2515f9/build/AckMate.build/Release/AckMate.build/JPAckWindow-PartialInfo.plist --auto-activate-custom-fonts --target-device mac --minimum-deployment-target 10.10 --output-format human-readable-text --compile /opt/local/var/macports/build/_opt_macports_trunk_dports_editors_ackmate/ackmate/work/AckMate-f2515f9/build/Release/AckMate.tmplugin/Contents/Resources/English.lproj/JPAckWindow.nib /opt/local/var/macports/build/_opt_macports_trunk_dports_editors_ackmate/ackmate/work/AckMate-f2515f9/English.lproj/JPAckWindow.xib
217:info:build /* com.apple.ibtool.document.notices */
218:info:build /opt/local/var/macports/build/_opt_macports_trunk_dports_editors_ackmate/ackmate/work/AckMate-f2515f9/English.lproj/JPAckWindow.xib:137: note: View is clipping its content
219:info:build /opt/local/var/macports/build/_opt_macports_trunk_dports_editors_ackmate/ackmate/work/AckMate-f2515f9/English.lproj/JPAckWindow.xib:22: note: View is clipping its content
220:info:build
221:info:build CpResource bundle_extras/ackmateCollapsed.pdf build/Release/AckMate.tmplugin/Contents/Resources/ackmateCollapsed.pdf
222:info:build     cd /opt/local/var/macports/build/_opt_macports_trunk_dports_editors_ackmate/ackmate/work/AckMate-f2515f9
223:info:build     builtin-copy -exclude .DS_Store -exclude CVS -exclude .svn -exclude .git -exclude .hg -strip-debug-symbols -strip-tool /Applications/Xcode.app/Contents/Developer/Toolchains/XcodeDefault.xctoolchain/usr/bin/strip -resolve-src-symlinks /opt/local/var/macports/build/_opt_macports_trunk_dports_editors_ackmate/ackmate/work/AckMate-f2515f9/bundle_extras/ackmateCollapsed.pdf /opt/local/var/macports/build/_opt_macports_trunk_dports_editors_ackmate/ackmate/work/AckMate-f2515f9/build/Release/AckMate.tmplugin/Contents/Resources
224:info:build
225:info:build RuleScriptExecution bundle_extras/ackmate_ack.autogenerated normal x86_64
226:info:build     cd /opt/local/var/macports/build/_opt_macports_trunk_dports_editors_ackmate/ackmate/work/AckMate-f2515f9
227:info:build     export ACTION=build
228:info:build     export ALTERNATE_GROUP=macports
229:info:build     export ALTERNATE_MODE=u+w,go-w,a+rX
230:info:build     export ALTERNATE_OWNER=macports
231:info:build     export ALWAYS_SEARCH_USER_PATHS=YES
232:info:build     export ALWAYS_USE_SEPARATE_HEADERMAPS=NO
233:info:build     export APPLE_INTERNAL_DEVELOPER_DIR=/AppleInternal/Developer
234:info:build     export APPLE_INTERNAL_DIR=/AppleInternal
235:info:build     export APPLE_INTERNAL_DOCUMENTATION_DIR=/AppleInternal/Documentation
236:info:build     export APPLE_INTERNAL_LIBRARY_DIR=/AppleInternal/Library
237:info:build     export APPLE_INTERNAL_TOOLS=/AppleInternal/Developer/Tools
238:info:build     export APPLICATION_EXTENSION_API_ONLY=NO
239:info:build     export APPLY_RULES_IN_COPY_FILES=NO
240:info:build     export ARCHS=x86_64
241:info:build     export ARCHS_STANDARD=x86_64
242:info:build     export ARCHS_STANDARD_32_64_BIT="x86_64 i386"
243:info:build     export ARCHS_STANDARD_32_BIT=i386
244:info:build     export ARCHS_STANDARD_64_BIT=x86_64
245:info:build     export ARCHS_STANDARD_INCLUDING_64_BIT=x86_64
246:info:build     export AVAILABLE_PLATFORMS="watchos iphonesimulator macosx appletvsimulator watchsimulator appletvos iphoneos"
247:info:build     export BITCODE_GENERATION_MODE=marker
248:info:build     export BUILD_ACTIVE_RESOURCES_ONLY=NO
249:info:build     export BUILD_COMPONENTS="headers build"
250:info:build     export BUILD_DIR=/opt/local/var/macports/build/_opt_macports_trunk_dports_editors_ackmate/ackmate/work/AckMate-f2515f9/build
251:info:build     export BUILD_ROOT=/opt/local/var/macports/build/_opt_macports_trunk_dports_editors_ackmate/ackmate/work/AckMate-f2515f9/build
252:info:build     export BUILD_STYLE=
253:info:build     export BUILD_VARIANTS=normal
254:info:build     export BUILT_PRODUCTS_DIR=/opt/local/var/macports/build/_opt_macports_trunk_dports_editors_ackmate/ackmate/work/AckMate-f2515f9/build/Release
255:info:build     export CACHE_ROOT=/var/folders/kd/sc_9pj4j5js7wd5qmjqjvsbh0000gp/C/com.apple.DeveloperTools/7.1-7B91b/Xcode
256:info:build     export CCHROOT=/var/folders/kd/sc_9pj4j5js7wd5qmjqjvsbh0000gp/C/com.apple.DeveloperTools/7.1-7B91b/Xcode
257:info:build     export CHMOD=/bin/chmod
258:info:build     export CHOWN=/usr/sbin/chown
259:info:build     export CLANG_CXX_LIBRARY=libc++
260:info:build     export CLANG_MODULES_BUILD_SESSION_FILE=/var/folders/kd/sc_9pj4j5js7wd5qmjqjvsbh0000gp/C/org.llvm.clang/ModuleCache/Session.modulevalidation
261:info:build     export CLASS_FILE_DIR=/opt/local/var/macports/build/_opt_macports_trunk_dports_editors_ackmate/ackmate/work/AckMate-f2515f9/build/AckMate.build/Release/AckMate.build/JavaClasses
262:info:build     export CLEAN_PRECOMPS=YES
263:info:build     export CLONE_HEADERS=NO
264:info:build     export CODESIGNING_FOLDER_PATH=/opt/local/var/macports/build/_opt_macports_trunk_dports_editors_ackmate/ackmate/work/AckMate-f2515f9/build/Release/AckMate.tmplugin
265:info:build     export CODE_SIGNING_ALLOWED=YES
266:info:build     export COLOR_DIAGNOSTICS=NO
267:info:build     export COMBINE_HIDPI_IMAGES=NO
268:info:build     export COMPOSITE_SDK_DIRS=/var/folders/kd/sc_9pj4j5js7wd5qmjqjvsbh0000gp/C/com.apple.DeveloperTools/7.1-7B91b/Xcode/CompositeSDKs
269:info:build     export CONFIGURATION=Release
270:info:build     export CONFIGURATION_BUILD_DIR=/opt/local/var/macports/build/_opt_macports_trunk_dports_editors_ackmate/ackmate/work/AckMate-f2515f9/build/Release
271:info:build     export CONFIGURATION_TEMP_DIR=/opt/local/var/macports/build/_opt_macports_trunk_dports_editors_ackmate/ackmate/work/AckMate-f2515f9/build/AckMate.build/Release
272:info:build     export CONTENTS_FOLDER_PATH=AckMate.tmplugin/Contents
273:info:build     export COPYING_PRESERVES_HFS_DATA=NO
274:info:build     export COPY_HEADERS_RUN_UNIFDEF=NO
275:info:build     export COPY_PHASE_STRIP=YES
276:info:build     export COPY_RESOURCES_FROM_STATIC_FRAMEWORKS=YES
277:info:build     export CP=/bin/cp
278:info:build     export CREATE_INFOPLIST_SECTION_IN_BINARY=NO
279:info:build     export CURRENT_ARCH=x86_64
280:info:build     export CURRENT_VARIANT=normal
281:info:build     export DEAD_CODE_STRIPPING=NO
282:info:build     export DEBUGGING_SYMBOLS=YES
283:info:build     export DEBUG_INFORMATION_FORMAT=dwarf
284:info:build     export DEFAULT_COMPILER=com.apple.compilers.llvm.clang.1_0
285:info:build     export DEFAULT_KEXT_INSTALL_PATH=/Library/Extensions
286:info:build     export DEFINES_MODULE=NO
287:info:build     export DEPLOYMENT_LOCATION=NO
288:info:build     export DEPLOYMENT_POSTPROCESSING=NO
289:info:build     export DEPLOYMENT_TARGET_CLANG_ENV_NAME=MACOSX_DEPLOYMENT_TARGET
290:info:build     export DEPLOYMENT_TARGET_CLANG_FLAG_NAME=mmacosx-version-min
291:info:build     export DEPLOYMENT_TARGET_SETTING_NAME=MACOSX_DEPLOYMENT_TARGET
292:info:build     export DERIVED_FILES_DIR=/opt/local/var/macports/build/_opt_macports_trunk_dports_editors_ackmate/ackmate/work/AckMate-f2515f9/build/AckMate.build/Release/AckMate.build/DerivedSources
293:info:build     export DERIVED_FILE_DIR=/opt/local/var/macports/build/_opt_macports_trunk_dports_editors_ackmate/ackmate/work/AckMate-f2515f9/build/AckMate.build/Release/AckMate.build/DerivedSources
294:info:build     export DERIVED_SOURCES_DIR=/opt/local/var/macports/build/_opt_macports_trunk_dports_editors_ackmate/ackmate/work/AckMate-f2515f9/build/AckMate.build/Release/AckMate.build/DerivedSources
295:info:build     export DEVELOPER_APPLICATIONS_DIR=/Applications/Xcode.app/Contents/Developer/Applications
296:info:build     export DEVELOPER_BIN_DIR=/Applications/Xcode.app/Contents/Developer/usr/bin
297:info:build     export DEVELOPER_DIR=/Applications/Xcode.app/Contents/Developer
298:info:build     export DEVELOPER_FRAMEWORKS_DIR=/Applications/Xcode.app/Contents/Developer/Library/Frameworks
299:info:build     export DEVELOPER_FRAMEWORKS_DIR_QUOTED=/Applications/Xcode.app/Contents/Developer/Library/Frameworks
300:info:build     export DEVELOPER_LIBRARY_DIR=/Applications/Xcode.app/Contents/Developer/Library
301:info:build     export DEVELOPER_SDK_DIR=/Applications/Xcode.app/Contents/Developer/Platforms/MacOSX.platform/Developer/SDKs
302:info:build     export DEVELOPER_TOOLS_DIR=/Applications/Xcode.app/Contents/Developer/Tools
303:info:build     export DEVELOPER_USR_DIR=/Applications/Xcode.app/Contents/Developer/usr
304:info:build     export DEVELOPMENT_LANGUAGE=English
305:info:build     export DOCUMENTATION_FOLDER_PATH=AckMate.tmplugin/Contents/Resources/English.lproj/Documentation
306:info:build     export DO_HEADER_SCANNING_IN_JAM=NO
307:info:build     export DSTROOT=/tmp/AckMate.dst
308:info:build     export DT_TOOLCHAIN_DIR=/Applications/Xcode.app/Contents/Developer/Toolchains/XcodeDefault.xctoolchain
309:info:build     export DWARF_DSYM_FILE_NAME=AckMate.tmplugin.dSYM
310:info:build     export DWARF_DSYM_FILE_SHOULD_ACCOMPANY_PRODUCT=NO
311:info:build     export DWARF_DSYM_FOLDER_PATH=/opt/local/var/macports/build/_opt_macports_trunk_dports_editors_ackmate/ackmate/work/AckMate-f2515f9/build/Release
312:info:build     export EMBEDDED_CONTENT_CONTAINS_SWIFT=NO
313:info:build     export EMBEDDED_PROFILE_NAME=embedded.provisionprofile
314:info:build     export EMBED_ASSET_PACKS_IN_PRODUCT_BUNDLE=NO
315:info:build     export ENABLE_BITCODE=NO
316:info:build     export ENABLE_HEADER_DEPENDENCIES=YES
317:info:build     export ENABLE_ON_DEMAND_RESOURCES=NO
318:info:build     export ENABLE_TESTABILITY=NO
319:info:build     export EXCLUDED_INSTALLSRC_SUBDIRECTORY_PATTERNS=".DS_Store .svn .git .hg CVS"
320:info:build     export EXCLUDED_RECURSIVE_SEARCH_PATH_SUBDIRECTORIES="*.nib *.lproj *.framework *.gch *.xcode* *.xcassets (*) .DS_Store CVS .svn .git .hg *.pbproj *.pbxproj"
321:info:build     export EXECUTABLES_FOLDER_PATH=AckMate.tmplugin/Contents/Executables
322:info:build     export EXECUTABLE_FOLDER_PATH=AckMate.tmplugin/Contents/MacOS
323:info:build     export EXECUTABLE_NAME=AckMate
324:info:build     export EXECUTABLE_PATH=AckMate.tmplugin/Contents/MacOS/AckMate
325:info:build     export EXPANDED_CODE_SIGN_IDENTITY=
326:info:build     export EXPANDED_CODE_SIGN_IDENTITY_NAME=
327:info:build     export EXPANDED_PROVISIONING_PROFILE=
328:info:build     export FILE_LIST=/opt/local/var/macports/build/_opt_macports_trunk_dports_editors_ackmate/ackmate/work/AckMate-f2515f9/build/AckMate.build/Release/AckMate.build/Objects/LinkFileList
329:info:build     export FIXED_FILES_DIR=/opt/local/var/macports/build/_opt_macports_trunk_dports_editors_ackmate/ackmate/work/AckMate-f2515f9/build/AckMate.build/Release/AckMate.build/FixedFiles
330:info:build     export FRAMEWORKS_FOLDER_PATH=AckMate.tmplugin/Contents/Frameworks
331:info:build     export FRAMEWORK_FLAG_PREFIX=-framework
332:info:build     export FRAMEWORK_SEARCH_PATHS="/opt/local/var/macports/build/_opt_macports_trunk_dports_editors_ackmate/ackmate/work/AckMate-f2515f9/build/Release "
333:info:build     export FRAMEWORK_VERSION=A
334:info:build     export FULL_PRODUCT_NAME=AckMate.tmplugin
335:info:build     export GCC3_VERSION=3.3
336:info:build     export GCC_GENERATE_DEBUGGING_SYMBOLS=NO
337:info:build     export GCC_INLINES_ARE_PRIVATE_EXTERN=YES
338:info:build     export GCC_MODEL_TUNING=G5
339:info:build     export GCC_PFE_FILE_C_DIALECTS="c objective-c c++ objective-c++"
340:info:build     export GCC_PRECOMPILE_PREFIX_HEADER=YES
341:info:build     export GCC_PREFIX_HEADER=AckMate_Prefix.pch
342:info:build     export GCC_TREAT_WARNINGS_AS_ERRORS=NO
343:info:build     export GCC_VERSION=com.apple.compilers.llvm.clang.1_0
344:info:build     export GCC_VERSION_IDENTIFIER=com_apple_compilers_llvm_clang_1_0
345:info:build     export GCC_WARN_ABOUT_RETURN_TYPE=YES
346:info:build     export GCC_WARN_UNUSED_VARIABLE=YES
347:info:build     export GENERATE_MASTER_OBJECT_FILE=NO
348:info:build     export GENERATE_PKGINFO_FILE=NO
349:info:build     export GENERATE_PROFILING_CODE=NO
350:info:build     export GID=501
351:info:build     export GROUP=macports
352:info:build     export HEADERMAP_INCLUDES_FLAT_ENTRIES_FOR_TARGET_BEING_BUILT=YES
353:info:build     export HEADERMAP_INCLUDES_FRAMEWORK_ENTRIES_FOR_ALL_PRODUCT_TYPES=YES
354:info:build     export HEADERMAP_INCLUDES_NONPUBLIC_NONPRIVATE_HEADERS=YES
355:info:build     export HEADERMAP_INCLUDES_PROJECT_HEADERS=YES
356:info:build     export HEADERMAP_USES_FRAMEWORK_PREFIX_ENTRIES=YES
357:info:build     export HEADERMAP_USES_VFS=NO
358:info:build     export HEADER_SEARCH_PATHS="/opt/local/var/macports/build/_opt_macports_trunk_dports_editors_ackmate/ackmate/work/AckMate-f2515f9/build/Release/include "
359:info:build     export HIDE_BITCODE_SYMBOLS=YES
360:info:build     export HOME=/opt/local/var/macports/home
361:info:build     export ICONV=/usr/bin/iconv
362:info:build     export INFOPLIST_EXPAND_BUILD_SETTINGS=YES
363:info:build     export INFOPLIST_FILE=Info.plist
364:info:build     export INFOPLIST_OUTPUT_FORMAT=same-as-input
365:info:build     export INFOPLIST_PATH=AckMate.tmplugin/Contents/Info.plist
366:info:build     export INFOPLIST_PREPROCESS=NO
367:info:build     export INFOSTRINGS_PATH=AckMate.tmplugin/Contents/Resources/English.lproj/InfoPlist.strings
368:info:build     export INPUT_FILE_BASE=ackmate_ack
369:info:build     export INPUT_FILE_DIR=/opt/local/var/macports/build/_opt_macports_trunk_dports_editors_ackmate/ackmate/work/AckMate-f2515f9/bundle_extras
370:info:build     export INPUT_FILE_NAME=ackmate_ack.autogenerated
371:info:build     export INPUT_FILE_PATH=/opt/local/var/macports/build/_opt_macports_trunk_dports_editors_ackmate/ackmate/work/AckMate-f2515f9/bundle_extras/ackmate_ack.autogenerated
372:info:build     export INPUT_FILE_REGION_PATH_COMPONENT=
373:info:build     export INPUT_FILE_SUFFIX=.autogenerated
374:info:build     export INSTALL_DIR=/tmp/AckMate.dst/opt/local/var/macports/home/Library/Bundles
375:info:build     export INSTALL_GROUP=macports
376:info:build     export INSTALL_MODE_FLAG=u+w,go-w,a+rX
377:info:build     export INSTALL_OWNER=macports
378:info:build     export INSTALL_PATH=/opt/local/var/macports/home/Library/Bundles
379:info:build     export INSTALL_ROOT=/tmp/AckMate.dst
380:info:build     export JAVAC_DEFAULT_FLAGS="-J-Xms64m -J-XX:NewSize=4M -J-Dfile.encoding=UTF8"
381:info:build     export JAVA_APP_STUB=/System/Library/Frameworks/JavaVM.framework/Resources/MacOS/JavaApplicationStub
382:info:build     export JAVA_ARCHIVE_CLASSES=YES
383:info:build     export JAVA_ARCHIVE_TYPE=JAR
384:info:build     export JAVA_COMPILER=/usr/bin/javac
385:info:build     export JAVA_FOLDER_PATH=AckMate.tmplugin/Contents/Resources/Java
386:info:build     export JAVA_FRAMEWORK_RESOURCES_DIRS=Resources
387:info:build     export JAVA_JAR_FLAGS=cv
388:info:build     export JAVA_SOURCE_SUBDIR=.
389:info:build     export JAVA_USE_DEPENDENCIES=YES
390:info:build     export JAVA_ZIP_FLAGS=-urg
391:info:build     export JIKES_DEFAULT_FLAGS="+E +OLDCSO"
392:info:build     export KEEP_PRIVATE_EXTERNS=NO
393:info:build     export LD_DEPENDENCY_INFO_FILE=/opt/local/var/macports/build/_opt_macports_trunk_dports_editors_ackmate/ackmate/work/AckMate-f2515f9/build/AckMate.build/Release/AckMate.build/Objects-normal/x86_64/AckMate_dependency_info.dat
394:info:build     export LD_GENERATE_MAP_FILE=NO
395:info:build     export LD_MAP_FILE_PATH=/opt/local/var/macports/build/_opt_macports_trunk_dports_editors_ackmate/ackmate/work/AckMate-f2515f9/build/AckMate.build/Release/AckMate.build/AckMate-LinkMap-normal-x86_64.txt
396:info:build     export LD_NO_PIE=NO
397:info:build     export LD_QUOTE_LINKER_ARGUMENTS_FOR_COMPILER_DRIVER=YES
398:info:build     export LEGACY_DEVELOPER_DIR=/Applications/Xcode.app/Contents/PlugIns/Xcode3Core.ideplugin/Contents/SharedSupport/Developer
399:info:build     export LEX=lex
400:info:build     export LIBRARY_FLAG_NOSPACE=YES
401:info:build     export LIBRARY_FLAG_PREFIX=-l
402:info:build     export LIBRARY_KEXT_INSTALL_PATH=/Library/Extensions
403:info:build     export LIBRARY_SEARCH_PATHS="/opt/local/var/macports/build/_opt_macports_trunk_dports_editors_ackmate/ackmate/work/AckMate-f2515f9/build/Release "
404:info:build     export LINKER_DISPLAYS_MANGLED_NAMES=NO
405:info:build     export LINK_FILE_LIST_normal_x86_64=/opt/local/var/macports/build/_opt_macports_trunk_dports_editors_ackmate/ackmate/work/AckMate-f2515f9/build/AckMate.build/Release/AckMate.build/Objects-normal/x86_64/AckMate.LinkFileList
406:info:build     export LINK_WITH_STANDARD_LIBRARIES=YES
407:info:build     export LOCALIZABLE_CONTENT_DIR=
408:info:build     export LOCALIZED_RESOURCES_FOLDER_PATH=AckMate.tmplugin/Contents/Resources/English.lproj
409:info:build     export LOCAL_ADMIN_APPS_DIR=/Applications/Utilities
410:info:build     export LOCAL_APPS_DIR=/Applications
411:info:build     export LOCAL_DEVELOPER_DIR=/Library/Developer
412:info:build     export LOCAL_LIBRARY_DIR=/Library
413:info:build     export LOCROOT=
414:info:build     export LOCSYMROOT=
415:info:build     export MACH_O_TYPE=mh_bundle
416:info:build     export MACOSX_DEPLOYMENT_TARGET=10.10
417:info:build     export MAC_OS_X_PRODUCT_BUILD_VERSION=14F1021
418:info:build     export MAC_OS_X_VERSION_ACTUAL=101005
419:info:build     export MAC_OS_X_VERSION_MAJOR=101000
420:info:build     export MAC_OS_X_VERSION_MINOR=1005
421:info:build     export NATIVE_ARCH=i386
422:info:build     export NATIVE_ARCH_32_BIT=i386
423:info:build     export NATIVE_ARCH_64_BIT=x86_64
424:info:build     export NATIVE_ARCH_ACTUAL=x86_64
425:info:build     export NO_COMMON=YES
426:info:build     export OBJECT_FILE_DIR=/opt/local/var/macports/build/_opt_macports_trunk_dports_editors_ackmate/ackmate/work/AckMate-f2515f9/build/AckMate.build/Release/AckMate.build/Objects
427:info:build     export OBJECT_FILE_DIR_normal=/opt/local/var/macports/build/_opt_macports_trunk_dports_editors_ackmate/ackmate/work/AckMate-f2515f9/build/AckMate.build/Release/AckMate.build/Objects-normal
428:info:build     export OBJROOT=/opt/local/var/macports/build/_opt_macports_trunk_dports_editors_ackmate/ackmate/work/AckMate-f2515f9/build
429:info:build     export ONLY_ACTIVE_ARCH=NO
430:info:build     export OPTIMIZATION_LEVEL=0
431:info:build     export OS=MACOS
432:info:build     export OSAC=/usr/bin/osacompile
433:info:build     export OTHER_INPUT_FILE_FLAGS=
434:info:build     export PACKAGE_TYPE=com.apple.package-type.wrapper
435:info:build     export PASCAL_STRINGS=YES
436:info:build     export PATH="/Applications/Xcode.app/Contents/Developer/Toolchains/XcodeDefault.xctoolchain/usr/bin:/Applications/Xcode.app/Contents/Developer/Toolchains/XcodeDefault.xctoolchain/usr/libexec:/Applications/Xcode.app/Contents/Developer/Platforms/MacOSX.platform/Developer/usr/bin:/Applications/Xcode.app/Contents/Developer/Platforms/MacOSX.platform/Developer/usr/local/bin:/Applications/Xcode.app/Contents/Developer/Platforms/MacOSX.platform/usr/bin:/Applications/Xcode.app/Contents/Developer/Platforms/MacOSX.platform/usr/local/bin:/Applications/Xcode.app/Contents/Developer/usr/bin:/Applications/Xcode.app/Contents/Developer/usr/local/bin:/Applications/Xcode.app/Contents/Developer/Tools:/opt/local/bin:/opt/local/sbin:/bin:/sbin:/usr/bin:/usr/sbin"
437:info:build     export PATH_PREFIXES_EXCLUDED_FROM_HEADER_DEPENDENCIES="/usr/include /usr/local/include /System/Library/Frameworks /System/Library/PrivateFrameworks /Applications/Xcode.app/Contents/Developer/Headers /Applications/Xcode.app/Contents/Developer/SDKs /Applications/Xcode.app/Contents/Developer/Platforms"
438:info:build     export PBDEVELOPMENTPLIST_PATH=AckMate.tmplugin/Contents/pbdevelopment.plist
439:info:build     export PFE_FILE_C_DIALECTS=objective-c
440:info:build     export PKGINFO_FILE_PATH=/opt/local/var/macports/build/_opt_macports_trunk_dports_editors_ackmate/ackmate/work/AckMate-f2515f9/build/AckMate.build/Release/AckMate.build/PkgInfo
441:info:build     export PKGINFO_PATH=AckMate.tmplugin/Contents/PkgInfo
442:info:build     export PLATFORM_DEVELOPER_APPLICATIONS_DIR=/Applications/Xcode.app/Contents/Developer/Applications
443:info:build     export PLATFORM_DEVELOPER_BIN_DIR=/Applications/Xcode.app/Contents/Developer/usr/bin
444:info:build     export PLATFORM_DEVELOPER_LIBRARY_DIR=/Applications/Xcode.app/Contents/Developer/Library
445:info:build     export PLATFORM_DEVELOPER_SDK_DIR=/Applications/Xcode.app/Contents/Developer/Platforms/MacOSX.platform/Developer/SDKs
446:info:build     export PLATFORM_DEVELOPER_TOOLS_DIR=/Applications/Xcode.app/Contents/Developer/Tools
447:info:build     export PLATFORM_DEVELOPER_USR_DIR=/Applications/Xcode.app/Contents/Developer/usr
448:info:build     export PLATFORM_DIR=/Applications/Xcode.app/Contents/Developer/Platforms/MacOSX.platform
449:info:build     export PLATFORM_DISPLAY_NAME="OS X"
450:info:build     export PLATFORM_NAME=macosx
451:info:build     export PLATFORM_PREFERRED_ARCH=x86_64
452:info:build     export PLATFORM_PRODUCT_BUILD_VERSION=7B91b
453:info:build     export PLIST_FILE_OUTPUT_FORMAT=same-as-input
454:info:build     export PLUGINS_FOLDER_PATH=AckMate.tmplugin/Contents/PlugIns
455:info:build     export PREBINDING=NO
456:info:build     export PRECOMPS_INCLUDE_HEADERS_FROM_BUILT_PRODUCTS_DIR=YES
457:info:build     export PRECOMP_DESTINATION_DIR=/opt/local/var/macports/build/_opt_macports_trunk_dports_editors_ackmate/ackmate/work/AckMate-f2515f9/build/AckMate.build/Release/AckMate.build/PrefixHeaders
458:info:build     export PRESERVE_DEAD_CODE_INITS_AND_TERMS=NO
459:info:build     export PRIVATE_HEADERS_FOLDER_PATH=AckMate.tmplugin/Contents/PrivateHeaders
460:info:build     export PRODUCT_MODULE_NAME=AckMate
461:info:build     export PRODUCT_NAME=AckMate
462:info:build     export PRODUCT_SETTINGS_PATH=/opt/local/var/macports/build/_opt_macports_trunk_dports_editors_ackmate/ackmate/work/AckMate-f2515f9/Info.plist
463:info:build     export PRODUCT_TYPE=com.apple.product-type.bundle
464:info:build     export PROFILING_CODE=NO
465:info:build     export PROJECT=AckMate
466:info:build     export PROJECT_DERIVED_FILE_DIR=/opt/local/var/macports/build/_opt_macports_trunk_dports_editors_ackmate/ackmate/work/AckMate-f2515f9/build/AckMate.build/DerivedSources
467:info:build     export PROJECT_DIR=/opt/local/var/macports/build/_opt_macports_trunk_dports_editors_ackmate/ackmate/work/AckMate-f2515f9
468:info:build     export PROJECT_FILE_PATH=/opt/local/var/macports/build/_opt_macports_trunk_dports_editors_ackmate/ackmate/work/AckMate-f2515f9/AckMate.xcodeproj
469:info:build     export PROJECT_NAME=AckMate
470:info:build     export PROJECT_TEMP_DIR=/opt/local/var/macports/build/_opt_macports_trunk_dports_editors_ackmate/ackmate/work/AckMate-f2515f9/build/AckMate.build
471:info:build     export PROJECT_TEMP_ROOT=/opt/local/var/macports/build/_opt_macports_trunk_dports_editors_ackmate/ackmate/work/AckMate-f2515f9/build
472:info:build     export PUBLIC_HEADERS_FOLDER_PATH=AckMate.tmplugin/Contents/Headers
473:info:build     export RECURSIVE_SEARCH_PATHS_FOLLOW_SYMLINKS=YES
474:info:build     export REMOVE_CVS_FROM_RESOURCES=YES
475:info:build     export REMOVE_GIT_FROM_RESOURCES=YES
476:info:build     export REMOVE_HEADERS_FROM_EMBEDDED_BUNDLES=YES
477:info:build     export REMOVE_HG_FROM_RESOURCES=YES
478:info:build     export REMOVE_SVN_FROM_RESOURCES=YES
479:info:build     export REZ_COLLECTOR_DIR=/opt/local/var/macports/build/_opt_macports_trunk_dports_editors_ackmate/ackmate/work/AckMate-f2515f9/build/AckMate.build/Release/AckMate.build/ResourceManagerResources
480:info:build     export REZ_OBJECTS_DIR=/opt/local/var/macports/build/_opt_macports_trunk_dports_editors_ackmate/ackmate/work/AckMate-f2515f9/build/AckMate.build/Release/AckMate.build/ResourceManagerResources/Objects
481:info:build     export REZ_SEARCH_PATHS="/opt/local/var/macports/build/_opt_macports_trunk_dports_editors_ackmate/ackmate/work/AckMate-f2515f9/build/Release "
482:info:build     export SCAN_ALL_SOURCE_FILES_FOR_INCLUDES=NO
483:info:build     export SCRIPTS_FOLDER_PATH=AckMate.tmplugin/Contents/Resources/Scripts
484:info:build     export SCRIPT_INPUT_FILE=/opt/local/var/macports/build/_opt_macports_trunk_dports_editors_ackmate/ackmate/work/AckMate-f2515f9/bundle_extras/ackmate_ack.autogenerated
485:info:build     export SCRIPT_OUTPUT_FILE_0=/opt/local/var/macports/build/_opt_macports_trunk_dports_editors_ackmate/ackmate/work/AckMate-f2515f9/build/AckMate.build/Release/AckMate.build/DerivedSources/ackmate_ack
486:info:build     export SCRIPT_OUTPUT_FILE_COUNT=1
487:info:build     export SDKROOT=/Applications/Xcode.app/Contents/Developer/Platforms/MacOSX.platform/Developer/SDKs/MacOSX10.11.sdk
488:info:build     export SDK_DIR=/Applications/Xcode.app/Contents/Developer/Platforms/MacOSX.platform/Developer/SDKs/MacOSX10.11.sdk
489:info:build     export SDK_DIR_macosx10_11=/Applications/Xcode.app/Contents/Developer/Platforms/MacOSX.platform/Developer/SDKs/MacOSX10.11.sdk
490:info:build     export SDK_NAME=macosx10.11
491:info:build     export SDK_NAMES=macosx10.11
492:info:build     export SDK_PRODUCT_BUILD_VERSION=15A278
493:info:build     export SDK_VERSION=10.11
494:info:build     export SDK_VERSION_ACTUAL=101100
495:info:build     export SDK_VERSION_MAJOR=101100
496:info:build     export SDK_VERSION_MINOR=1100
497:info:build     export SED=/usr/bin/sed
498:info:build     export SEPARATE_STRIP=NO
499:info:build     export SEPARATE_SYMBOL_EDIT=NO
500:info:build     export SET_DIR_MODE_OWNER_GROUP=YES
501:info:build     export SET_FILE_MODE_OWNER_GROUP=NO
502:info:build     export SHALLOW_BUNDLE=NO
503:info:build     export SHARED_DERIVED_FILE_DIR=/opt/local/var/macports/build/_opt_macports_trunk_dports_editors_ackmate/ackmate/work/AckMate-f2515f9/build/Release/DerivedSources
504:info:build     export SHARED_FRAMEWORKS_FOLDER_PATH=AckMate.tmplugin/Contents/SharedFrameworks
505:info:build     export SHARED_PRECOMPS_DIR=/var/folders/kd/sc_9pj4j5js7wd5qmjqjvsbh0000gp/C/com.apple.DeveloperTools/7.1-7B91b/Xcode/SharedPrecompiledHeaders
506:info:build     export SHARED_SUPPORT_FOLDER_PATH=AckMate.tmplugin/Contents/SharedSupport
507:info:build     export SKIP_INSTALL=NO
508:info:build     export SOURCE_ROOT=/opt/local/var/macports/build/_opt_macports_trunk_dports_editors_ackmate/ackmate/work/AckMate-f2515f9
509:info:build     export SRCROOT=/opt/local/var/macports/build/_opt_macports_trunk_dports_editors_ackmate/ackmate/work/AckMate-f2515f9
510:info:build     export STRINGS_FILE_OUTPUT_ENCODING=UTF-16
511:info:build     export STRIP_BITCODE_FROM_COPIED_FILES=NO
512:info:build     export STRIP_INSTALLED_PRODUCT=YES
513:info:build     export STRIP_STYLE=non-global
514:info:build     export SUPPORTED_PLATFORMS=macosx
515:info:build     export SUPPORTS_TEXT_BASED_API=NO
516:info:build     export SWIFT_PLATFORM_TARGET_PREFIX=macosx
517:info:build     export SYMROOT=/opt/local/var/macports/build/_opt_macports_trunk_dports_editors_ackmate/ackmate/work/AckMate-f2515f9/build
518:info:build     export SYSTEM_ADMIN_APPS_DIR=/Applications/Utilities
519:info:build     export SYSTEM_APPS_DIR=/Applications
520:info:build     export SYSTEM_CORE_SERVICES_DIR=/System/Library/CoreServices
521:info:build     export SYSTEM_DEMOS_DIR=/Applications/Extras
522:info:build     export SYSTEM_DEVELOPER_APPS_DIR=/Applications/Xcode.app/Contents/Developer/Applications
523:info:build     export SYSTEM_DEVELOPER_BIN_DIR=/Applications/Xcode.app/Contents/Developer/usr/bin
524:info:build     export SYSTEM_DEVELOPER_DEMOS_DIR="/Applications/Xcode.app/Contents/Developer/Applications/Utilities/Built Examples"
525:info:build     export SYSTEM_DEVELOPER_DIR=/Applications/Xcode.app/Contents/Developer
526:info:build     export SYSTEM_DEVELOPER_DOC_DIR="/Applications/Xcode.app/Contents/Developer/ADC Reference Library"
527:info:build     export SYSTEM_DEVELOPER_GRAPHICS_TOOLS_DIR="/Applications/Xcode.app/Contents/Developer/Applications/Graphics Tools"
528:info:build     export SYSTEM_DEVELOPER_JAVA_TOOLS_DIR="/Applications/Xcode.app/Contents/Developer/Applications/Java Tools"
529:info:build     export SYSTEM_DEVELOPER_PERFORMANCE_TOOLS_DIR="/Applications/Xcode.app/Contents/Developer/Applications/Performance Tools"
530:info:build     export SYSTEM_DEVELOPER_RELEASENOTES_DIR="/Applications/Xcode.app/Contents/Developer/ADC Reference Library/releasenotes"
531:info:build     export SYSTEM_DEVELOPER_TOOLS=/Applications/Xcode.app/Contents/Developer/Tools
532:info:build     export SYSTEM_DEVELOPER_TOOLS_DOC_DIR="/Applications/Xcode.app/Contents/Developer/ADC Reference Library/documentation/DeveloperTools"
533:info:build     export SYSTEM_DEVELOPER_TOOLS_RELEASENOTES_DIR="/Applications/Xcode.app/Contents/Developer/ADC Reference Library/releasenotes/DeveloperTools"
534:info:build     export SYSTEM_DEVELOPER_USR_DIR=/Applications/Xcode.app/Contents/Developer/usr
535:info:build     export SYSTEM_DEVELOPER_UTILITIES_DIR=/Applications/Xcode.app/Contents/Developer/Applications/Utilities
536:info:build     export SYSTEM_DOCUMENTATION_DIR=/Library/Documentation
537:info:build     export SYSTEM_KEXT_INSTALL_PATH=/System/Library/Extensions
538:info:build     export SYSTEM_LIBRARY_DIR=/System/Library
539:info:build     export TARGETNAME=AckMate
540:info:build     export TARGET_BUILD_DIR=/opt/local/var/macports/build/_opt_macports_trunk_dports_editors_ackmate/ackmate/work/AckMate-f2515f9/build/Release
541:info:build     export TARGET_NAME=AckMate
542:info:build     export TARGET_TEMP_DIR=/opt/local/var/macports/build/_opt_macports_trunk_dports_editors_ackmate/ackmate/work/AckMate-f2515f9/build/AckMate.build/Release/AckMate.build
543:info:build     export TEMP_DIR=/opt/local/var/macports/build/_opt_macports_trunk_dports_editors_ackmate/ackmate/work/AckMate-f2515f9/build/AckMate.build/Release/AckMate.build
544:info:build     export TEMP_FILES_DIR=/opt/local/var/macports/build/_opt_macports_trunk_dports_editors_ackmate/ackmate/work/AckMate-f2515f9/build/AckMate.build/Release/AckMate.build
545:info:build     export TEMP_FILE_DIR=/opt/local/var/macports/build/_opt_macports_trunk_dports_editors_ackmate/ackmate/work/AckMate-f2515f9/build/AckMate.build/Release/AckMate.build
546:info:build     export TEMP_ROOT=/opt/local/var/macports/build/_opt_macports_trunk_dports_editors_ackmate/ackmate/work/AckMate-f2515f9/build
547:info:build     export TOOLCHAINS=com.apple.dt.toolchain.XcodeDefault
548:info:build     export TOOLCHAIN_DIR=/Applications/Xcode.app/Contents/Developer/Toolchains/XcodeDefault.xctoolchain
549:info:build     export TREAT_MISSING_BASELINES_AS_TEST_FAILURES=NO
550:info:build     export UID=502
551:info:build     export UNLOCALIZED_RESOURCES_FOLDER_PATH=AckMate.tmplugin/Contents/Resources
552:info:build     export UNSTRIPPED_PRODUCT=NO
553:info:build     export USER=macports
554:info:build     export USER_APPS_DIR=/opt/local/var/macports/home/Applications
555:info:build     export USER_LIBRARY_DIR=/opt/local/var/macports/home/Library
556:info:build     export USE_DYNAMIC_NO_PIC=YES
557:info:build     export USE_HEADERMAP=YES
558:info:build     export USE_HEADER_SYMLINKS=NO
559:info:build     export VALIDATE_PRODUCT=NO
560:info:build     export VALID_ARCHS="i386 x86_64"
561:info:build     export VERBOSE_PBXCP=NO
562:info:build     export VERSIONPLIST_PATH=AckMate.tmplugin/Contents/version.plist
563:info:build     export VERSION_INFO_BUILDER=macports
564:info:build     export VERSION_INFO_FILE=AckMate_vers.c
565:info:build     export VERSION_INFO_STRING="\"@(#)PROGRAM:AckMate  PROJECT:AckMate-\""
566:info:build     export WRAPPER_EXTENSION=tmplugin
567:info:build     export WRAPPER_NAME=AckMate.tmplugin
568:info:build     export WRAPPER_SUFFIX=.tmplugin
569:info:build     export WRAP_ASSET_PACKS_IN_SEPARATE_DIRECTORIES=NO
570:info:build     export XCODE_APP_SUPPORT_DIR=/Applications/Xcode.app/Contents/Developer/Library/Xcode
571:info:build     export XCODE_PRODUCT_BUILD_VERSION=7B91b
572:info:build     export XCODE_VERSION_ACTUAL=0710
573:info:build     export XCODE_VERSION_MAJOR=0700
574:info:build     export XCODE_VERSION_MINOR=0710
575:info:build     export XPCSERVICES_FOLDER_PATH=AckMate.tmplugin/Contents/XPCServices
576:info:build     export YACC=yacc
577:info:build     export arch=x86_64
578:info:build     export variant=normal
579:info:build     /bin/sh -c cp\ ${INPUT_FILE_DIR}/${INPUT_FILE_BASE}.autogenerated\ ${DERIVED_FILES_DIR}/${INPUT_FILE_BASE}\
580:info:build chmod\ 555\ ${DERIVED_FILES_DIR}/${INPUT_FILE_BASE}
581:info:build
582:info:build ProcessInfoPlistFile build/Release/AckMate.tmplugin/Contents/Info.plist Info.plist
583:info:build     cd /opt/local/var/macports/build/_opt_macports_trunk_dports_editors_ackmate/ackmate/work/AckMate-f2515f9
584:info:build     builtin-infoPlistUtility /opt/local/var/macports/build/_opt_macports_trunk_dports_editors_ackmate/ackmate/work/AckMate-f2515f9/Info.plist -expandbuildsettings -platform macosx -additionalcontentfile /opt/local/var/macports/build/_opt_macports_trunk_dports_editors_ackmate/ackmate/work/AckMate-f2515f9/build/AckMate.build/Release/AckMate.build/JPAckWindow-PartialInfo.plist -o /opt/local/var/macports/build/_opt_macports_trunk_dports_editors_ackmate/ackmate/work/AckMate-f2515f9/build/Release/AckMate.tmplugin/Contents/Info.plist
585:info:build
586:info:build CpResource build/AckMate.build/Release/AckMate.build/DerivedSources/ackmate_ack build/Release/AckMate.tmplugin/Contents/Resources/ackmate_ack
587:info:build     cd /opt/local/var/macports/build/_opt_macports_trunk_dports_editors_ackmate/ackmate/work/AckMate-f2515f9
588:info:build     builtin-copy -exclude .DS_Store -exclude CVS -exclude .svn -exclude .git -exclude .hg -strip-debug-symbols -strip-tool /Applications/Xcode.app/Contents/Developer/Toolchains/XcodeDefault.xctoolchain/usr/bin/strip -resolve-src-symlinks /opt/local/var/macports/build/_opt_macports_trunk_dports_editors_ackmate/ackmate/work/AckMate-f2515f9/build/AckMate.build/Release/AckMate.build/DerivedSources/ackmate_ack /opt/local/var/macports/build/_opt_macports_trunk_dports_editors_ackmate/ackmate/work/AckMate-f2515f9/build/Release/AckMate.tmplugin/Contents/Resources
589:info:build
590:info:build RuleScriptExecution source/controllers/JPAckProcess+Parsing.m.rl normal x86_64
591:info:build     cd /opt/local/var/macports/build/_opt_macports_trunk_dports_editors_ackmate/ackmate/work/AckMate-f2515f9
592:info:build     export ACTION=build
593:info:build     export ALTERNATE_GROUP=macports
594:info:build     export ALTERNATE_MODE=u+w,go-w,a+rX
595:info:build     export ALTERNATE_OWNER=macports
596:info:build     export ALWAYS_SEARCH_USER_PATHS=YES
597:info:build     export ALWAYS_USE_SEPARATE_HEADERMAPS=NO
598:info:build     export APPLE_INTERNAL_DEVELOPER_DIR=/AppleInternal/Developer
599:info:build     export APPLE_INTERNAL_DIR=/AppleInternal
600:info:build     export APPLE_INTERNAL_DOCUMENTATION_DIR=/AppleInternal/Documentation
601:info:build     export APPLE_INTERNAL_LIBRARY_DIR=/AppleInternal/Library
602:info:build     export APPLE_INTERNAL_TOOLS=/AppleInternal/Developer/Tools
603:info:build     export APPLICATION_EXTENSION_API_ONLY=NO
604:info:build     export APPLY_RULES_IN_COPY_FILES=NO
605:info:build     export ARCHS=x86_64
606:info:build     export ARCHS_STANDARD=x86_64
607:info:build     export ARCHS_STANDARD_32_64_BIT="x86_64 i386"
608:info:build     export ARCHS_STANDARD_32_BIT=i386
609:info:build     export ARCHS_STANDARD_64_BIT=x86_64
610:info:build     export ARCHS_STANDARD_INCLUDING_64_BIT=x86_64
611:info:build     export AVAILABLE_PLATFORMS="watchos iphonesimulator macosx appletvsimulator watchsimulator appletvos iphoneos"
612:info:build     export BITCODE_GENERATION_MODE=marker
613:info:build     export BUILD_ACTIVE_RESOURCES_ONLY=NO
614:info:build     export BUILD_COMPONENTS="headers build"
615:info:build     export BUILD_DIR=/opt/local/var/macports/build/_opt_macports_trunk_dports_editors_ackmate/ackmate/work/AckMate-f2515f9/build
616:info:build     export BUILD_ROOT=/opt/local/var/macports/build/_opt_macports_trunk_dports_editors_ackmate/ackmate/work/AckMate-f2515f9/build
617:info:build     export BUILD_STYLE=
618:info:build     export BUILD_VARIANTS=normal
619:info:build     export BUILT_PRODUCTS_DIR=/opt/local/var/macports/build/_opt_macports_trunk_dports_editors_ackmate/ackmate/work/AckMate-f2515f9/build/Release
620:info:build     export CACHE_ROOT=/var/folders/kd/sc_9pj4j5js7wd5qmjqjvsbh0000gp/C/com.apple.DeveloperTools/7.1-7B91b/Xcode
621:info:build     export CCHROOT=/var/folders/kd/sc_9pj4j5js7wd5qmjqjvsbh0000gp/C/com.apple.DeveloperTools/7.1-7B91b/Xcode
622:info:build     export CHMOD=/bin/chmod
623:info:build     export CHOWN=/usr/sbin/chown
624:info:build     export CLANG_CXX_LIBRARY=libc++
625:info:build     export CLANG_MODULES_BUILD_SESSION_FILE=/var/folders/kd/sc_9pj4j5js7wd5qmjqjvsbh0000gp/C/org.llvm.clang/ModuleCache/Session.modulevalidation
626:info:build     export CLASS_FILE_DIR=/opt/local/var/macports/build/_opt_macports_trunk_dports_editors_ackmate/ackmate/work/AckMate-f2515f9/build/AckMate.build/Release/AckMate.build/JavaClasses
627:info:build     export CLEAN_PRECOMPS=YES
628:info:build     export CLONE_HEADERS=NO
629:info:build     export CODESIGNING_FOLDER_PATH=/opt/local/var/macports/build/_opt_macports_trunk_dports_editors_ackmate/ackmate/work/AckMate-f2515f9/build/Release/AckMate.tmplugin
630:info:build     export CODE_SIGNING_ALLOWED=YES
631:info:build     export COLOR_DIAGNOSTICS=NO
632:info:build     export COMBINE_HIDPI_IMAGES=NO
633:info:build     export COMPOSITE_SDK_DIRS=/var/folders/kd/sc_9pj4j5js7wd5qmjqjvsbh0000gp/C/com.apple.DeveloperTools/7.1-7B91b/Xcode/CompositeSDKs
634:info:build     export CONFIGURATION=Release
635:info:build     export CONFIGURATION_BUILD_DIR=/opt/local/var/macports/build/_opt_macports_trunk_dports_editors_ackmate/ackmate/work/AckMate-f2515f9/build/Release
636:info:build     export CONFIGURATION_TEMP_DIR=/opt/local/var/macports/build/_opt_macports_trunk_dports_editors_ackmate/ackmate/work/AckMate-f2515f9/build/AckMate.build/Release
637:info:build     export CONTENTS_FOLDER_PATH=AckMate.tmplugin/Contents
638:info:build     export COPYING_PRESERVES_HFS_DATA=NO
639:info:build     export COPY_HEADERS_RUN_UNIFDEF=NO
640:info:build     export COPY_PHASE_STRIP=YES
641:info:build     export COPY_RESOURCES_FROM_STATIC_FRAMEWORKS=YES
642:info:build     export CP=/bin/cp
643:info:build     export CREATE_INFOPLIST_SECTION_IN_BINARY=NO
644:info:build     export CURRENT_ARCH=x86_64
645:info:build     export CURRENT_VARIANT=normal
646:info:build     export DEAD_CODE_STRIPPING=NO
647:info:build     export DEBUGGING_SYMBOLS=YES
648:info:build     export DEBUG_INFORMATION_FORMAT=dwarf
649:info:build     export DEFAULT_COMPILER=com.apple.compilers.llvm.clang.1_0
650:info:build     export DEFAULT_KEXT_INSTALL_PATH=/Library/Extensions
651:info:build     export DEFINES_MODULE=NO
652:info:build     export DEPLOYMENT_LOCATION=NO
653:info:build     export DEPLOYMENT_POSTPROCESSING=NO
654:info:build     export DEPLOYMENT_TARGET_CLANG_ENV_NAME=MACOSX_DEPLOYMENT_TARGET
655:info:build     export DEPLOYMENT_TARGET_CLANG_FLAG_NAME=mmacosx-version-min
656:info:build     export DEPLOYMENT_TARGET_SETTING_NAME=MACOSX_DEPLOYMENT_TARGET
657:info:build     export DERIVED_FILES_DIR=/opt/local/var/macports/build/_opt_macports_trunk_dports_editors_ackmate/ackmate/work/AckMate-f2515f9/build/AckMate.build/Release/AckMate.build/DerivedSources
658:info:build     export DERIVED_FILE_DIR=/opt/local/var/macports/build/_opt_macports_trunk_dports_editors_ackmate/ackmate/work/AckMate-f2515f9/build/AckMate.build/Release/AckMate.build/DerivedSources
659:info:build     export DERIVED_SOURCES_DIR=/opt/local/var/macports/build/_opt_macports_trunk_dports_editors_ackmate/ackmate/work/AckMate-f2515f9/build/AckMate.build/Release/AckMate.build/DerivedSources
660:info:build     export DEVELOPER_APPLICATIONS_DIR=/Applications/Xcode.app/Contents/Developer/Applications
661:info:build     export DEVELOPER_BIN_DIR=/Applications/Xcode.app/Contents/Developer/usr/bin
662:info:build     export DEVELOPER_DIR=/Applications/Xcode.app/Contents/Developer
663:info:build     export DEVELOPER_FRAMEWORKS_DIR=/Applications/Xcode.app/Contents/Developer/Library/Frameworks
664:info:build     export DEVELOPER_FRAMEWORKS_DIR_QUOTED=/Applications/Xcode.app/Contents/Developer/Library/Frameworks
665:info:build     export DEVELOPER_LIBRARY_DIR=/Applications/Xcode.app/Contents/Developer/Library
666:info:build     export DEVELOPER_SDK_DIR=/Applications/Xcode.app/Contents/Developer/Platforms/MacOSX.platform/Developer/SDKs
667:info:build     export DEVELOPER_TOOLS_DIR=/Applications/Xcode.app/Contents/Developer/Tools
668:info:build     export DEVELOPER_USR_DIR=/Applications/Xcode.app/Contents/Developer/usr
669:info:build     export DEVELOPMENT_LANGUAGE=English
670:info:build     export DOCUMENTATION_FOLDER_PATH=AckMate.tmplugin/Contents/Resources/English.lproj/Documentation
671:info:build     export DO_HEADER_SCANNING_IN_JAM=NO
672:info:build     export DSTROOT=/tmp/AckMate.dst
673:info:build     export DT_TOOLCHAIN_DIR=/Applications/Xcode.app/Contents/Developer/Toolchains/XcodeDefault.xctoolchain
674:info:build     export DWARF_DSYM_FILE_NAME=AckMate.tmplugin.dSYM
675:info:build     export DWARF_DSYM_FILE_SHOULD_ACCOMPANY_PRODUCT=NO
676:info:build     export DWARF_DSYM_FOLDER_PATH=/opt/local/var/macports/build/_opt_macports_trunk_dports_editors_ackmate/ackmate/work/AckMate-f2515f9/build/Release
677:info:build     export EMBEDDED_CONTENT_CONTAINS_SWIFT=NO
678:info:build     export EMBEDDED_PROFILE_NAME=embedded.provisionprofile
679:info:build     export EMBED_ASSET_PACKS_IN_PRODUCT_BUNDLE=NO
680:info:build     export ENABLE_BITCODE=NO
681:info:build     export ENABLE_HEADER_DEPENDENCIES=YES
682:info:build     export ENABLE_ON_DEMAND_RESOURCES=NO
683:info:build     export ENABLE_TESTABILITY=NO
684:info:build     export EXCLUDED_INSTALLSRC_SUBDIRECTORY_PATTERNS=".DS_Store .svn .git .hg CVS"
685:info:build     export EXCLUDED_RECURSIVE_SEARCH_PATH_SUBDIRECTORIES="*.nib *.lproj *.framework *.gch *.xcode* *.xcassets (*) .DS_Store CVS .svn .git .hg *.pbproj *.pbxproj"
686:info:build     export EXECUTABLES_FOLDER_PATH=AckMate.tmplugin/Contents/Executables
687:info:build     export EXECUTABLE_FOLDER_PATH=AckMate.tmplugin/Contents/MacOS
688:info:build     export EXECUTABLE_NAME=AckMate
689:info:build     export EXECUTABLE_PATH=AckMate.tmplugin/Contents/MacOS/AckMate
690:info:build     export EXPANDED_CODE_SIGN_IDENTITY=
691:info:build     export EXPANDED_CODE_SIGN_IDENTITY_NAME=
692:info:build     export EXPANDED_PROVISIONING_PROFILE=
693:info:build     export FILE_LIST=/opt/local/var/macports/build/_opt_macports_trunk_dports_editors_ackmate/ackmate/work/AckMate-f2515f9/build/AckMate.build/Release/AckMate.build/Objects/LinkFileList
694:info:build     export FIXED_FILES_DIR=/opt/local/var/macports/build/_opt_macports_trunk_dports_editors_ackmate/ackmate/work/AckMate-f2515f9/build/AckMate.build/Release/AckMate.build/FixedFiles
695:info:build     export FRAMEWORKS_FOLDER_PATH=AckMate.tmplugin/Contents/Frameworks
696:info:build     export FRAMEWORK_FLAG_PREFIX=-framework
697:info:build     export FRAMEWORK_SEARCH_PATHS="/opt/local/var/macports/build/_opt_macports_trunk_dports_editors_ackmate/ackmate/work/AckMate-f2515f9/build/Release "
698:info:build     export FRAMEWORK_VERSION=A
699:info:build     export FULL_PRODUCT_NAME=AckMate.tmplugin
700:info:build     export GCC3_VERSION=3.3
701:info:build     export GCC_GENERATE_DEBUGGING_SYMBOLS=NO
702:info:build     export GCC_INLINES_ARE_PRIVATE_EXTERN=YES
703:info:build     export GCC_MODEL_TUNING=G5
704:info:build     export GCC_PFE_FILE_C_DIALECTS="c objective-c c++ objective-c++"
705:info:build     export GCC_PRECOMPILE_PREFIX_HEADER=YES
706:info:build     export GCC_PREFIX_HEADER=AckMate_Prefix.pch
707:info:build     export GCC_TREAT_WARNINGS_AS_ERRORS=NO
708:info:build     export GCC_VERSION=com.apple.compilers.llvm.clang.1_0
709:info:build     export GCC_VERSION_IDENTIFIER=com_apple_compilers_llvm_clang_1_0
710:info:build     export GCC_WARN_ABOUT_RETURN_TYPE=YES
711:info:build     export GCC_WARN_UNUSED_VARIABLE=YES
712:info:build     export GENERATE_MASTER_OBJECT_FILE=NO
713:info:build     export GENERATE_PKGINFO_FILE=NO
714:info:build     export GENERATE_PROFILING_CODE=NO
715:info:build     export GID=501
716:info:build     export GROUP=macports
717:info:build     export HEADERMAP_INCLUDES_FLAT_ENTRIES_FOR_TARGET_BEING_BUILT=YES
718:info:build     export HEADERMAP_INCLUDES_FRAMEWORK_ENTRIES_FOR_ALL_PRODUCT_TYPES=YES
719:info:build     export HEADERMAP_INCLUDES_NONPUBLIC_NONPRIVATE_HEADERS=YES
720:info:build     export HEADERMAP_INCLUDES_PROJECT_HEADERS=YES
721:info:build     export HEADERMAP_USES_FRAMEWORK_PREFIX_ENTRIES=YES
722:info:build     export HEADERMAP_USES_VFS=NO
723:info:build     export HEADER_SEARCH_PATHS="/opt/local/var/macports/build/_opt_macports_trunk_dports_editors_ackmate/ackmate/work/AckMate-f2515f9/build/Release/include "
724:info:build     export HIDE_BITCODE_SYMBOLS=YES
725:info:build     export HOME=/opt/local/var/macports/home
726:info:build     export ICONV=/usr/bin/iconv
727:info:build     export INFOPLIST_EXPAND_BUILD_SETTINGS=YES
728:info:build     export INFOPLIST_FILE=Info.plist
729:info:build     export INFOPLIST_OUTPUT_FORMAT=same-as-input
730:info:build     export INFOPLIST_PATH=AckMate.tmplugin/Contents/Info.plist
731:info:build     export INFOPLIST_PREPROCESS=NO
732:info:build     export INFOSTRINGS_PATH=AckMate.tmplugin/Contents/Resources/English.lproj/InfoPlist.strings
733:info:build     export INPUT_FILE_BASE=JPAckProcess+Parsing.m
734:info:build     export INPUT_FILE_DIR=/opt/local/var/macports/build/_opt_macports_trunk_dports_editors_ackmate/ackmate/work/AckMate-f2515f9/source/controllers
735:info:build     export INPUT_FILE_NAME=JPAckProcess+Parsing.m.rl
736:info:build     export INPUT_FILE_PATH=/opt/local/var/macports/build/_opt_macports_trunk_dports_editors_ackmate/ackmate/work/AckMate-f2515f9/source/controllers/JPAckProcess+Parsing.m.rl
737:info:build     export INPUT_FILE_REGION_PATH_COMPONENT=
738:info:build     export INPUT_FILE_SUFFIX=.rl
739:info:build     export INSTALL_DIR=/tmp/AckMate.dst/opt/local/var/macports/home/Library/Bundles
740:info:build     export INSTALL_GROUP=macports
741:info:build     export INSTALL_MODE_FLAG=u+w,go-w,a+rX
742:info:build     export INSTALL_OWNER=macports
743:info:build     export INSTALL_PATH=/opt/local/var/macports/home/Library/Bundles
744:info:build     export INSTALL_ROOT=/tmp/AckMate.dst
745:info:build     export JAVAC_DEFAULT_FLAGS="-J-Xms64m -J-XX:NewSize=4M -J-Dfile.encoding=UTF8"
746:info:build     export JAVA_APP_STUB=/System/Library/Frameworks/JavaVM.framework/Resources/MacOS/JavaApplicationStub
747:info:build     export JAVA_ARCHIVE_CLASSES=YES
748:info:build     export JAVA_ARCHIVE_TYPE=JAR
749:info:build     export JAVA_COMPILER=/usr/bin/javac
750:info:build     export JAVA_FOLDER_PATH=AckMate.tmplugin/Contents/Resources/Java
751:info:build     export JAVA_FRAMEWORK_RESOURCES_DIRS=Resources
752:info:build     export JAVA_JAR_FLAGS=cv
753:info:build     export JAVA_SOURCE_SUBDIR=.
754:info:build     export JAVA_USE_DEPENDENCIES=YES
755:info:build     export JAVA_ZIP_FLAGS=-urg
756:info:build     export JIKES_DEFAULT_FLAGS="+E +OLDCSO"
757:info:build     export KEEP_PRIVATE_EXTERNS=NO
758:info:build     export LD_DEPENDENCY_INFO_FILE=/opt/local/var/macports/build/_opt_macports_trunk_dports_editors_ackmate/ackmate/work/AckMate-f2515f9/build/AckMate.build/Release/AckMate.build/Objects-normal/x86_64/AckMate_dependency_info.dat
759:info:build     export LD_GENERATE_MAP_FILE=NO
760:info:build     export LD_MAP_FILE_PATH=/opt/local/var/macports/build/_opt_macports_trunk_dports_editors_ackmate/ackmate/work/AckMate-f2515f9/build/AckMate.build/Release/AckMate.build/AckMate-LinkMap-normal-x86_64.txt
761:info:build     export LD_NO_PIE=NO
762:info:build     export LD_QUOTE_LINKER_ARGUMENTS_FOR_COMPILER_DRIVER=YES
763:info:build     export LEGACY_DEVELOPER_DIR=/Applications/Xcode.app/Contents/PlugIns/Xcode3Core.ideplugin/Contents/SharedSupport/Developer
764:info:build     export LEX=lex
765:info:build     export LIBRARY_FLAG_NOSPACE=YES
766:info:build     export LIBRARY_FLAG_PREFIX=-l
767:info:build     export LIBRARY_KEXT_INSTALL_PATH=/Library/Extensions
768:info:build     export LIBRARY_SEARCH_PATHS="/opt/local/var/macports/build/_opt_macports_trunk_dports_editors_ackmate/ackmate/work/AckMate-f2515f9/build/Release "
769:info:build     export LINKER_DISPLAYS_MANGLED_NAMES=NO
770:info:build     export LINK_FILE_LIST_normal_x86_64=/opt/local/var/macports/build/_opt_macports_trunk_dports_editors_ackmate/ackmate/work/AckMate-f2515f9/build/AckMate.build/Release/AckMate.build/Objects-normal/x86_64/AckMate.LinkFileList
771:info:build     export LINK_WITH_STANDARD_LIBRARIES=YES
772:info:build     export LOCALIZABLE_CONTENT_DIR=
773:info:build     export LOCALIZED_RESOURCES_FOLDER_PATH=AckMate.tmplugin/Contents/Resources/English.lproj
774:info:build     export LOCAL_ADMIN_APPS_DIR=/Applications/Utilities
775:info:build     export LOCAL_APPS_DIR=/Applications
776:info:build     export LOCAL_DEVELOPER_DIR=/Library/Developer
777:info:build     export LOCAL_LIBRARY_DIR=/Library
778:info:build     export LOCROOT=
779:info:build     export LOCSYMROOT=
780:info:build     export MACH_O_TYPE=mh_bundle
781:info:build     export MACOSX_DEPLOYMENT_TARGET=10.10
782:info:build     export MAC_OS_X_PRODUCT_BUILD_VERSION=14F1021
783:info:build     export MAC_OS_X_VERSION_ACTUAL=101005
784:info:build     export MAC_OS_X_VERSION_MAJOR=101000
785:info:build     export MAC_OS_X_VERSION_MINOR=1005
786:info:build     export NATIVE_ARCH=i386
787:info:build     export NATIVE_ARCH_32_BIT=i386
788:info:build     export NATIVE_ARCH_64_BIT=x86_64
789:info:build     export NATIVE_ARCH_ACTUAL=x86_64
790:info:build     export NO_COMMON=YES
791:info:build     export OBJECT_FILE_DIR=/opt/local/var/macports/build/_opt_macports_trunk_dports_editors_ackmate/ackmate/work/AckMate-f2515f9/build/AckMate.build/Release/AckMate.build/Objects
792:info:build     export OBJECT_FILE_DIR_normal=/opt/local/var/macports/build/_opt_macports_trunk_dports_editors_ackmate/ackmate/work/AckMate-f2515f9/build/AckMate.build/Release/AckMate.build/Objects-normal
793:info:build     export OBJROOT=/opt/local/var/macports/build/_opt_macports_trunk_dports_editors_ackmate/ackmate/work/AckMate-f2515f9/build
794:info:build     export ONLY_ACTIVE_ARCH=NO
795:info:build     export OPTIMIZATION_LEVEL=0
796:info:build     export OS=MACOS
797:info:build     export OSAC=/usr/bin/osacompile
798:info:build     export OTHER_INPUT_FILE_FLAGS=
799:info:build     export PACKAGE_TYPE=com.apple.package-type.wrapper
800:info:build     export PASCAL_STRINGS=YES
801:info:build     export PATH="/Applications/Xcode.app/Contents/Developer/Toolchains/XcodeDefault.xctoolchain/usr/bin:/Applications/Xcode.app/Contents/Developer/Toolchains/XcodeDefault.xctoolchain/usr/libexec:/Applications/Xcode.app/Contents/Developer/Platforms/MacOSX.platform/Developer/usr/bin:/Applications/Xcode.app/Contents/Developer/Platforms/MacOSX.platform/Developer/usr/local/bin:/Applications/Xcode.app/Contents/Developer/Platforms/MacOSX.platform/usr/bin:/Applications/Xcode.app/Contents/Developer/Platforms/MacOSX.platform/usr/local/bin:/Applications/Xcode.app/Contents/Developer/usr/bin:/Applications/Xcode.app/Contents/Developer/usr/local/bin:/Applications/Xcode.app/Contents/Developer/Tools:/opt/local/bin:/opt/local/sbin:/bin:/sbin:/usr/bin:/usr/sbin"
802:info:build     export PATH_PREFIXES_EXCLUDED_FROM_HEADER_DEPENDENCIES="/usr/include /usr/local/include /System/Library/Frameworks /System/Library/PrivateFrameworks /Applications/Xcode.app/Contents/Developer/Headers /Applications/Xcode.app/Contents/Developer/SDKs /Applications/Xcode.app/Contents/Developer/Platforms"
803:info:build     export PBDEVELOPMENTPLIST_PATH=AckMate.tmplugin/Contents/pbdevelopment.plist
804:info:build     export PFE_FILE_C_DIALECTS=objective-c
805:info:build     export PKGINFO_FILE_PATH=/opt/local/var/macports/build/_opt_macports_trunk_dports_editors_ackmate/ackmate/work/AckMate-f2515f9/build/AckMate.build/Release/AckMate.build/PkgInfo
806:info:build     export PKGINFO_PATH=AckMate.tmplugin/Contents/PkgInfo
807:info:build     export PLATFORM_DEVELOPER_APPLICATIONS_DIR=/Applications/Xcode.app/Contents/Developer/Applications
808:info:build     export PLATFORM_DEVELOPER_BIN_DIR=/Applications/Xcode.app/Contents/Developer/usr/bin
809:info:build     export PLATFORM_DEVELOPER_LIBRARY_DIR=/Applications/Xcode.app/Contents/Developer/Library
810:info:build     export PLATFORM_DEVELOPER_SDK_DIR=/Applications/Xcode.app/Contents/Developer/Platforms/MacOSX.platform/Developer/SDKs
811:info:build     export PLATFORM_DEVELOPER_TOOLS_DIR=/Applications/Xcode.app/Contents/Developer/Tools
812:info:build     export PLATFORM_DEVELOPER_USR_DIR=/Applications/Xcode.app/Contents/Developer/usr
813:info:build     export PLATFORM_DIR=/Applications/Xcode.app/Contents/Developer/Platforms/MacOSX.platform
814:info:build     export PLATFORM_DISPLAY_NAME="OS X"
815:info:build     export PLATFORM_NAME=macosx
816:info:build     export PLATFORM_PREFERRED_ARCH=x86_64
817:info:build     export PLATFORM_PRODUCT_BUILD_VERSION=7B91b
818:info:build     export PLIST_FILE_OUTPUT_FORMAT=same-as-input
819:info:build     export PLUGINS_FOLDER_PATH=AckMate.tmplugin/Contents/PlugIns
820:info:build     export PREBINDING=NO
821:info:build     export PRECOMPS_INCLUDE_HEADERS_FROM_BUILT_PRODUCTS_DIR=YES
822:info:build     export PRECOMP_DESTINATION_DIR=/opt/local/var/macports/build/_opt_macports_trunk_dports_editors_ackmate/ackmate/work/AckMate-f2515f9/build/AckMate.build/Release/AckMate.build/PrefixHeaders
823:info:build     export PRESERVE_DEAD_CODE_INITS_AND_TERMS=NO
824:info:build     export PRIVATE_HEADERS_FOLDER_PATH=AckMate.tmplugin/Contents/PrivateHeaders
825:info:build     export PRODUCT_MODULE_NAME=AckMate
826:info:build     export PRODUCT_NAME=AckMate
827:info:build     export PRODUCT_SETTINGS_PATH=/opt/local/var/macports/build/_opt_macports_trunk_dports_editors_ackmate/ackmate/work/AckMate-f2515f9/Info.plist
828:info:build     export PRODUCT_TYPE=com.apple.product-type.bundle
829:info:build     export PROFILING_CODE=NO
830:info:build     export PROJECT=AckMate
831:info:build     export PROJECT_DERIVED_FILE_DIR=/opt/local/var/macports/build/_opt_macports_trunk_dports_editors_ackmate/ackmate/work/AckMate-f2515f9/build/AckMate.build/DerivedSources
832:info:build     export PROJECT_DIR=/opt/local/var/macports/build/_opt_macports_trunk_dports_editors_ackmate/ackmate/work/AckMate-f2515f9
833:info:build     export PROJECT_FILE_PATH=/opt/local/var/macports/build/_opt_macports_trunk_dports_editors_ackmate/ackmate/work/AckMate-f2515f9/AckMate.xcodeproj
834:info:build     export PROJECT_NAME=AckMate
835:info:build     export PROJECT_TEMP_DIR=/opt/local/var/macports/build/_opt_macports_trunk_dports_editors_ackmate/ackmate/work/AckMate-f2515f9/build/AckMate.build
836:info:build     export PROJECT_TEMP_ROOT=/opt/local/var/macports/build/_opt_macports_trunk_dports_editors_ackmate/ackmate/work/AckMate-f2515f9/build
837:info:build     export PUBLIC_HEADERS_FOLDER_PATH=AckMate.tmplugin/Contents/Headers
838:info:build     export RECURSIVE_SEARCH_PATHS_FOLLOW_SYMLINKS=YES
839:info:build     export REMOVE_CVS_FROM_RESOURCES=YES
840:info:build     export REMOVE_GIT_FROM_RESOURCES=YES
841:info:build     export REMOVE_HEADERS_FROM_EMBEDDED_BUNDLES=YES
842:info:build     export REMOVE_HG_FROM_RESOURCES=YES
843:info:build     export REMOVE_SVN_FROM_RESOURCES=YES
844:info:build     export REZ_COLLECTOR_DIR=/opt/local/var/macports/build/_opt_macports_trunk_dports_editors_ackmate/ackmate/work/AckMate-f2515f9/build/AckMate.build/Release/AckMate.build/ResourceManagerResources
845:info:build     export REZ_OBJECTS_DIR=/opt/local/var/macports/build/_opt_macports_trunk_dports_editors_ackmate/ackmate/work/AckMate-f2515f9/build/AckMate.build/Release/AckMate.build/ResourceManagerResources/Objects
846:info:build     export REZ_SEARCH_PATHS="/opt/local/var/macports/build/_opt_macports_trunk_dports_editors_ackmate/ackmate/work/AckMate-f2515f9/build/Release "
847:info:build     export SCAN_ALL_SOURCE_FILES_FOR_INCLUDES=NO
848:info:build     export SCRIPTS_FOLDER_PATH=AckMate.tmplugin/Contents/Resources/Scripts
849:info:build     export SCRIPT_INPUT_FILE=/opt/local/var/macports/build/_opt_macports_trunk_dports_editors_ackmate/ackmate/work/AckMate-f2515f9/source/controllers/JPAckProcess+Parsing.m.rl
850:info:build     export SCRIPT_OUTPUT_FILE_0=/opt/local/var/macports/build/_opt_macports_trunk_dports_editors_ackmate/ackmate/work/AckMate-f2515f9/build/AckMate.build/Release/AckMate.build/DerivedSources/JPAckProcess+Parsing.m
851:info:build     export SCRIPT_OUTPUT_FILE_COUNT=1
852:info:build     export SDKROOT=/Applications/Xcode.app/Contents/Developer/Platforms/MacOSX.platform/Developer/SDKs/MacOSX10.11.sdk
853:info:build     export SDK_DIR=/Applications/Xcode.app/Contents/Developer/Platforms/MacOSX.platform/Developer/SDKs/MacOSX10.11.sdk
854:info:build     export SDK_DIR_macosx10_11=/Applications/Xcode.app/Contents/Developer/Platforms/MacOSX.platform/Developer/SDKs/MacOSX10.11.sdk
855:info:build     export SDK_NAME=macosx10.11
856:info:build     export SDK_NAMES=macosx10.11
857:info:build     export SDK_PRODUCT_BUILD_VERSION=15A278
858:info:build     export SDK_VERSION=10.11
859:info:build     export SDK_VERSION_ACTUAL=101100
860:info:build     export SDK_VERSION_MAJOR=101100
861:info:build     export SDK_VERSION_MINOR=1100
862:info:build     export SED=/usr/bin/sed
863:info:build     export SEPARATE_STRIP=NO
864:info:build     export SEPARATE_SYMBOL_EDIT=NO
865:info:build     export SET_DIR_MODE_OWNER_GROUP=YES
866:info:build     export SET_FILE_MODE_OWNER_GROUP=NO
867:info:build     export SHALLOW_BUNDLE=NO
868:info:build     export SHARED_DERIVED_FILE_DIR=/opt/local/var/macports/build/_opt_macports_trunk_dports_editors_ackmate/ackmate/work/AckMate-f2515f9/build/Release/DerivedSources
869:info:build     export SHARED_FRAMEWORKS_FOLDER_PATH=AckMate.tmplugin/Contents/SharedFrameworks
870:info:build     export SHARED_PRECOMPS_DIR=/var/folders/kd/sc_9pj4j5js7wd5qmjqjvsbh0000gp/C/com.apple.DeveloperTools/7.1-7B91b/Xcode/SharedPrecompiledHeaders
871:info:build     export SHARED_SUPPORT_FOLDER_PATH=AckMate.tmplugin/Contents/SharedSupport
872:info:build     export SKIP_INSTALL=NO
873:info:build     export SOURCE_ROOT=/opt/local/var/macports/build/_opt_macports_trunk_dports_editors_ackmate/ackmate/work/AckMate-f2515f9
874:info:build     export SRCROOT=/opt/local/var/macports/build/_opt_macports_trunk_dports_editors_ackmate/ackmate/work/AckMate-f2515f9
875:info:build     export STRINGS_FILE_OUTPUT_ENCODING=UTF-16
876:info:build     export STRIP_BITCODE_FROM_COPIED_FILES=NO
877:info:build     export STRIP_INSTALLED_PRODUCT=YES
878:info:build     export STRIP_STYLE=non-global
879:info:build     export SUPPORTED_PLATFORMS=macosx
880:info:build     export SUPPORTS_TEXT_BASED_API=NO
881:info:build     export SWIFT_PLATFORM_TARGET_PREFIX=macosx
882:info:build     export SYMROOT=/opt/local/var/macports/build/_opt_macports_trunk_dports_editors_ackmate/ackmate/work/AckMate-f2515f9/build
883:info:build     export SYSTEM_ADMIN_APPS_DIR=/Applications/Utilities
884:info:build     export SYSTEM_APPS_DIR=/Applications
885:info:build     export SYSTEM_CORE_SERVICES_DIR=/System/Library/CoreServices
886:info:build     export SYSTEM_DEMOS_DIR=/Applications/Extras
887:info:build     export SYSTEM_DEVELOPER_APPS_DIR=/Applications/Xcode.app/Contents/Developer/Applications
888:info:build     export SYSTEM_DEVELOPER_BIN_DIR=/Applications/Xcode.app/Contents/Developer/usr/bin
889:info:build     export SYSTEM_DEVELOPER_DEMOS_DIR="/Applications/Xcode.app/Contents/Developer/Applications/Utilities/Built Examples"
890:info:build     export SYSTEM_DEVELOPER_DIR=/Applications/Xcode.app/Contents/Developer
891:info:build     export SYSTEM_DEVELOPER_DOC_DIR="/Applications/Xcode.app/Contents/Developer/ADC Reference Library"
892:info:build     export SYSTEM_DEVELOPER_GRAPHICS_TOOLS_DIR="/Applications/Xcode.app/Contents/Developer/Applications/Graphics Tools"
893:info:build     export SYSTEM_DEVELOPER_JAVA_TOOLS_DIR="/Applications/Xcode.app/Contents/Developer/Applications/Java Tools"
894:info:build     export SYSTEM_DEVELOPER_PERFORMANCE_TOOLS_DIR="/Applications/Xcode.app/Contents/Developer/Applications/Performance Tools"
895:info:build     export SYSTEM_DEVELOPER_RELEASENOTES_DIR="/Applications/Xcode.app/Contents/Developer/ADC Reference Library/releasenotes"
896:info:build     export SYSTEM_DEVELOPER_TOOLS=/Applications/Xcode.app/Contents/Developer/Tools
897:info:build     export SYSTEM_DEVELOPER_TOOLS_DOC_DIR="/Applications/Xcode.app/Contents/Developer/ADC Reference Library/documentation/DeveloperTools"
898:info:build     export SYSTEM_DEVELOPER_TOOLS_RELEASENOTES_DIR="/Applications/Xcode.app/Contents/Developer/ADC Reference Library/releasenotes/DeveloperTools"
899:info:build     export SYSTEM_DEVELOPER_USR_DIR=/Applications/Xcode.app/Contents/Developer/usr
900:info:build     export SYSTEM_DEVELOPER_UTILITIES_DIR=/Applications/Xcode.app/Contents/Developer/Applications/Utilities
901:info:build     export SYSTEM_DOCUMENTATION_DIR=/Library/Documentation
902:info:build     export SYSTEM_KEXT_INSTALL_PATH=/System/Library/Extensions
903:info:build     export SYSTEM_LIBRARY_DIR=/System/Library
904:info:build     export TARGETNAME=AckMate
905:info:build     export TARGET_BUILD_DIR=/opt/local/var/macports/build/_opt_macports_trunk_dports_editors_ackmate/ackmate/work/AckMate-f2515f9/build/Release
906:info:build     export TARGET_NAME=AckMate
907:info:build     export TARGET_TEMP_DIR=/opt/local/var/macports/build/_opt_macports_trunk_dports_editors_ackmate/ackmate/work/AckMate-f2515f9/build/AckMate.build/Release/AckMate.build
908:info:build     export TEMP_DIR=/opt/local/var/macports/build/_opt_macports_trunk_dports_editors_ackmate/ackmate/work/AckMate-f2515f9/build/AckMate.build/Release/AckMate.build
909:info:build     export TEMP_FILES_DIR=/opt/local/var/macports/build/_opt_macports_trunk_dports_editors_ackmate/ackmate/work/AckMate-f2515f9/build/AckMate.build/Release/AckMate.build
910:info:build     export TEMP_FILE_DIR=/opt/local/var/macports/build/_opt_macports_trunk_dports_editors_ackmate/ackmate/work/AckMate-f2515f9/build/AckMate.build/Release/AckMate.build
911:info:build     export TEMP_ROOT=/opt/local/var/macports/build/_opt_macports_trunk_dports_editors_ackmate/ackmate/work/AckMate-f2515f9/build
912:info:build     export TOOLCHAINS=com.apple.dt.toolchain.XcodeDefault
913:info:build     export TOOLCHAIN_DIR=/Applications/Xcode.app/Contents/Developer/Toolchains/XcodeDefault.xctoolchain
914:info:build     export TREAT_MISSING_BASELINES_AS_TEST_FAILURES=NO
915:info:build     export UID=502
916:info:build     export UNLOCALIZED_RESOURCES_FOLDER_PATH=AckMate.tmplugin/Contents/Resources
917:info:build     export UNSTRIPPED_PRODUCT=NO
918:info:build     export USER=macports
919:info:build     export USER_APPS_DIR=/opt/local/var/macports/home/Applications
920:info:build     export USER_LIBRARY_DIR=/opt/local/var/macports/home/Library
921:info:build     export USE_DYNAMIC_NO_PIC=YES
922:info:build     export USE_HEADERMAP=YES
923:info:build     export USE_HEADER_SYMLINKS=NO
924:info:build     export VALIDATE_PRODUCT=NO
925:info:build     export VALID_ARCHS="i386 x86_64"
926:info:build     export VERBOSE_PBXCP=NO
927:info:build     export VERSIONPLIST_PATH=AckMate.tmplugin/Contents/version.plist
928:info:build     export VERSION_INFO_BUILDER=macports
929:info:build     export VERSION_INFO_FILE=AckMate_vers.c
930:info:build     export VERSION_INFO_STRING="\"@(#)PROGRAM:AckMate  PROJECT:AckMate-\""
931:info:build     export WRAPPER_EXTENSION=tmplugin
932:info:build     export WRAPPER_NAME=AckMate.tmplugin
933:info:build     export WRAPPER_SUFFIX=.tmplugin
934:info:build     export WRAP_ASSET_PACKS_IN_SEPARATE_DIRECTORIES=NO
935:info:build     export XCODE_APP_SUPPORT_DIR=/Applications/Xcode.app/Contents/Developer/Library/Xcode
936:info:build     export XCODE_PRODUCT_BUILD_VERSION=7B91b
937:info:build     export XCODE_VERSION_ACTUAL=0710
938:info:build     export XCODE_VERSION_MAJOR=0700
939:info:build     export XCODE_VERSION_MINOR=0710
940:info:build     export XPCSERVICES_FOLDER_PATH=AckMate.tmplugin/Contents/XPCServices
941:info:build     export YACC=yacc
942:info:build     export arch=x86_64
943:info:build     export variant=normal
944:info:build     /bin/sh -c /usr/bin/env\ ragel\ ${INPUT_FILE_DIR}/${INPUT_FILE_BASE}.rl\ -o\ ${DERIVED_FILES_DIR}/${INPUT_FILE_BASE}
945:info:build
946:info:build CompileC build/AckMate.build/Release/AckMate.build/Objects-normal/x86_64/JPAckProcess+Parsing.o build/AckMate.build/Release/AckMate.build/DerivedSources/JPAckProcess+Parsing.m normal x86_64 objective-c com.apple.compilers.llvm.clang.1_0.compiler
947:info:build     cd /opt/local/var/macports/build/_opt_macports_trunk_dports_editors_ackmate/ackmate/work/AckMate-f2515f9
948:info:build     export LANG=en_US.US-ASCII
949:info:build     /Applications/Xcode.app/Contents/Developer/Toolchains/XcodeDefault.xctoolchain/usr/bin/clang -x objective-c -arch x86_64 -fmessage-length=0 -fdiagnostics-show-note-include-stack -fmacro-backtrace-limit=0 -Wno-trigraphs -fpascal-strings -Os -Wno-missing-field-initializers -Wno-missing-prototypes -Wno-implicit-atomic-properties -Wno-arc-repeated-use-of-weak -Wno-missing-braces -Wparentheses -Wswitch -Wno-unused-function -Wno-unused-label -Wno-unused-parameter -Wunused-variable -Wunused-value -Wno-empty-body -Wno-uninitialized -Wno-unknown-pragmas -Wno-shadow -Wno-four-char-constants -Wno-conversion -Wno-constant-conversion -Wno-int-conversion -Wno-bool-conversion -Wno-enum-conversion -Wno-shorten-64-to-32 -Wpointer-sign -Wno-newline-eof -Wno-selector -Wno-strict-selector-match -Wno-undeclared-selector -Wno-deprecated-implementations -isysroot /Applications/Xcode.app/Contents/Developer/Platforms/MacOSX.platform/Developer/SDKs/MacOSX10.11.sdk -fasm-blocks -fstrict-aliasing -Wprotocol -Wdeprecated-declarations -mmacosx-version-min=10.10 -Wno-sign-conversion -I/opt/local/var/macports/build/_opt_macports_trunk_dports_editors_ackmate/ackmate/work/AckMate-f2515f9/build/AckMate.build/Release/AckMate.build/AckMate.hmap -I/opt/local/var/macports/build/_opt_macports_trunk_dports_editors_ackmate/ackmate/work/AckMate-f2515f9/build/Release/include -I/opt/local/var/macports/build/_opt_macports_trunk_dports_editors_ackmate/ackmate/work/AckMate-f2515f9/build/AckMate.build/Release/AckMate.build/DerivedSources/x86_64 -I/opt/local/var/macports/build/_opt_macports_trunk_dports_editors_ackmate/ackmate/work/AckMate-f2515f9/build/AckMate.build/Release/AckMate.build/DerivedSources -F/opt/local/var/macports/build/_opt_macports_trunk_dports_editors_ackmate/ackmate/work/AckMate-f2515f9/build/Release -include /var/folders/kd/sc_9pj4j5js7wd5qmjqjvsbh0000gp/C/com.apple.DeveloperTools/7.1-7B91b/Xcode/SharedPrecompiledHeaders/AckMate_Prefix-gkimuosxfazvvcfqsqnfrvjjijyv/AckMate_Prefix.pch -MMD -MT dependencies -MF /opt/local/var/macports/build/_opt_macports_trunk_dports_editors_ackmate/ackmate/work/AckMate-f2515f9/build/AckMate.build/Release/AckMate.build/Objects-normal/x86_64/JPAckProcess+Parsing.d --serialize-diagnostics /opt/local/var/macports/build/_opt_macports_trunk_dports_editors_ackmate/ackmate/work/AckMate-f2515f9/build/AckMate.build/Release/AckMate.build/Objects-normal/x86_64/JPAckProcess+Parsing.dia -c /opt/local/var/macports/build/_opt_macports_trunk_dports_editors_ackmate/ackmate/work/AckMate-f2515f9/build/AckMate.build/Release/AckMate.build/DerivedSources/JPAckProcess+Parsing.m -o /opt/local/var/macports/build/_opt_macports_trunk_dports_editors_ackmate/ackmate/work/AckMate-f2515f9/build/AckMate.build/Release/AckMate.build/Objects-normal/x86_64/JPAckProcess+Parsing.o
950:info:build /opt/local/var/macports/build/_opt_macports_trunk_dports_editors_ackmate/ackmate/work/AckMate-f2515f9/build/AckMate.build/Release/AckMate.build/DerivedSources/JPAckProcess+Parsing.m:61:18: warning: unused variable 'lineconsumer_first_final' [-Wunused-const-variable]
951:info:build static const int lineconsumer_first_final = 2;
952:info:build                  ^
953:info:build /opt/local/var/macports/build/_opt_macports_trunk_dports_editors_ackmate/ackmate/work/AckMate-f2515f9/build/AckMate.build/Release/AckMate.build/DerivedSources/JPAckProcess+Parsing.m:62:18: warning: unused variable 'lineconsumer_error' [-Wunused-const-variable]
954:info:build static const int lineconsumer_error = -1;
955:info:build                  ^
956:info:build /opt/local/var/macports/build/_opt_macports_trunk_dports_editors_ackmate/ackmate/work/AckMate-f2515f9/build/AckMate.build/Release/AckMate.build/DerivedSources/JPAckProcess+Parsing.m:64:18: warning: unused variable 'lineconsumer_en_main' [-Wunused-const-variable]
957:info:build static const int lineconsumer_en_main = 0;
958:info:build                  ^
959:info:build /opt/local/var/macports/build/_opt_macports_trunk_dports_editors_ackmate/ackmate/work/AckMate-f2515f9/build/AckMate.build/Release/AckMate.build/DerivedSources/JPAckProcess+Parsing.m:272:18: warning: unused variable 'resultextractor_first_final' [-Wunused-const-variable]
960:info:build static const int resultextractor_first_final = 14;
961:info:build                  ^
962:info:build /opt/local/var/macports/build/_opt_macports_trunk_dports_editors_ackmate/ackmate/work/AckMate-f2515f9/build/AckMate.build/Release/AckMate.build/DerivedSources/JPAckProcess+Parsing.m:273:18: warning: unused variable 'resultextractor_error' [-Wunused-const-variable]
963:info:build static const int resultextractor_error = 0;
964:info:build                  ^
965:info:build /opt/local/var/macports/build/_opt_macports_trunk_dports_editors_ackmate/ackmate/work/AckMate-f2515f9/build/AckMate.build/Release/AckMate.build/DerivedSources/JPAckProcess+Parsing.m:275:18: warning: unused variable 'resultextractor_en_main' [-Wunused-const-variable]
966:info:build static const int resultextractor_en_main = 14;
967:info:build                  ^
968:info:build 6 warnings generated.
969:info:build
970:info:build CompileC build/AckMate.build/Release/AckMate.build/Objects-normal/x86_64/NSImage-NoodleExtensions.o source/external/NSImage-NoodleExtensions.m normal x86_64 objective-c com.apple.compilers.llvm.clang.1_0.compiler
971:info:build     cd /opt/local/var/macports/build/_opt_macports_trunk_dports_editors_ackmate/ackmate/work/AckMate-f2515f9
972:info:build     export LANG=en_US.US-ASCII
973:info:build     /Applications/Xcode.app/Contents/Developer/Toolchains/XcodeDefault.xctoolchain/usr/bin/clang -x objective-c -arch x86_64 -fmessage-length=0 -fdiagnostics-show-note-include-stack -fmacro-backtrace-limit=0 -Wno-trigraphs -fpascal-strings -Os -Wno-missing-field-initializers -Wno-missing-prototypes -Wno-implicit-atomic-properties -Wno-arc-repeated-use-of-weak -Wno-missing-braces -Wparentheses -Wswitch -Wno-unused-function -Wno-unused-label -Wno-unused-parameter -Wunused-variable -Wunused-value -Wno-empty-body -Wno-uninitialized -Wno-unknown-pragmas -Wno-shadow -Wno-four-char-constants -Wno-conversion -Wno-constant-conversion -Wno-int-conversion -Wno-bool-conversion -Wno-enum-conversion -Wno-shorten-64-to-32 -Wpointer-sign -Wno-newline-eof -Wno-selector -Wno-strict-selector-match -Wno-undeclared-selector -Wno-deprecated-implementations -isysroot /Applications/Xcode.app/Contents/Developer/Platforms/MacOSX.platform/Developer/SDKs/MacOSX10.11.sdk -fasm-blocks -fstrict-aliasing -Wprotocol -Wdeprecated-declarations -mmacosx-version-min=10.10 -Wno-sign-conversion -I/opt/local/var/macports/build/_opt_macports_trunk_dports_editors_ackmate/ackmate/work/AckMate-f2515f9/build/AckMate.build/Release/AckMate.build/AckMate.hmap -I/opt/local/var/macports/build/_opt_macports_trunk_dports_editors_ackmate/ackmate/work/AckMate-f2515f9/build/Release/include -I/opt/local/var/macports/build/_opt_macports_trunk_dports_editors_ackmate/ackmate/work/AckMate-f2515f9/build/AckMate.build/Release/AckMate.build/DerivedSources/x86_64 -I/opt/local/var/macports/build/_opt_macports_trunk_dports_editors_ackmate/ackmate/work/AckMate-f2515f9/build/AckMate.build/Release/AckMate.build/DerivedSources -F/opt/local/var/macports/build/_opt_macports_trunk_dports_editors_ackmate/ackmate/work/AckMate-f2515f9/build/Release -include /var/folders/kd/sc_9pj4j5js7wd5qmjqjvsbh0000gp/C/com.apple.DeveloperTools/7.1-7B91b/Xcode/SharedPrecompiledHeaders/AckMate_Prefix-gkimuosxfazvvcfqsqnfrvjjijyv/AckMate_Prefix.pch -MMD -MT dependencies -MF /opt/local/var/macports/build/_opt_macports_trunk_dports_editors_ackmate/ackmate/work/AckMate-f2515f9/build/AckMate.build/Release/AckMate.build/Objects-normal/x86_64/NSImage-NoodleExtensions.d --serialize-diagnostics /opt/local/var/macports/build/_opt_macports_trunk_dports_editors_ackmate/ackmate/work/AckMate-f2515f9/build/AckMate.build/Release/AckMate.build/Objects-normal/x86_64/NSImage-NoodleExtensions.dia -c /opt/local/var/macports/build/_opt_macports_trunk_dports_editors_ackmate/ackmate/work/AckMate-f2515f9/source/external/NSImage-NoodleExtensions.m -o /opt/local/var/macports/build/_opt_macports_trunk_dports_editors_ackmate/ackmate/work/AckMate-f2515f9/build/AckMate.build/Release/AckMate.build/Objects-normal/x86_64/NSImage-NoodleExtensions.o
974:info:build /opt/local/var/macports/build/_opt_macports_trunk_dports_editors_ackmate/ackmate/work/AckMate-f2515f9/source/external/NSImage-NoodleExtensions.m:75:12: warning: 'isFlipped' is deprecated: first deprecated in OS X 10.6 [-Wdeprecated-declarations]
975:info:build         if ([self isFlipped])
976:info:build                   ^
977:info:build In file included from /opt/local/var/macports/build/_opt_macports_trunk_dports_editors_ackmate/ackmate/work/AckMate-f2515f9/source/external/NSImage-NoodleExtensions.m:1:
978:info:build In file included from /opt/local/var/macports/build/_opt_macports_trunk_dports_editors_ackmate/ackmate/work/AckMate-f2515f9/AckMate_Prefix.pch:6:
979:info:build In file included from /Applications/Xcode.app/Contents/Developer/Platforms/MacOSX.platform/Developer/SDKs/MacOSX10.11.sdk/System/Library/Frameworks/Cocoa.framework/Headers/Cocoa.h:13:
980:info:build In file included from /Applications/Xcode.app/Contents/Developer/Platforms/MacOSX.platform/Developer/SDKs/MacOSX10.11.sdk/System/Library/Frameworks/AppKit.framework/Headers/AppKit.h:75:
981:info:build /Applications/Xcode.app/Contents/Developer/Platforms/MacOSX.platform/Developer/SDKs/MacOSX10.11.sdk/System/Library/Frameworks/AppKit.framework/Headers/NSImage.h:250:1: note: 'isFlipped' has been explicitly marked deprecated here
982:info:build - (BOOL)isFlipped NS_DEPRECATED_MAC(10_0, 10_6);
983:info:build ^
984:info:build 1 warning generated.
985:info:build
986:info:build CompileC build/AckMate.build/Release/AckMate.build/Objects-normal/x86_64/NSTableView+NoodleExtensions.o source/external/NSTableView+NoodleExtensions.m normal x86_64 objective-c com.apple.compilers.llvm.clang.1_0.compiler
987:info:build     cd /opt/local/var/macports/build/_opt_macports_trunk_dports_editors_ackmate/ackmate/work/AckMate-f2515f9
988:info:build     export LANG=en_US.US-ASCII
989:info:build     /Applications/Xcode.app/Contents/Developer/Toolchains/XcodeDefault.xctoolchain/usr/bin/clang -x objective-c -arch x86_64 -fmessage-length=0 -fdiagnostics-show-note-include-stack -fmacro-backtrace-limit=0 -Wno-trigraphs -fpascal-strings -Os -Wno-missing-field-initializers -Wno-missing-prototypes -Wno-implicit-atomic-properties -Wno-arc-repeated-use-of-weak -Wno-missing-braces -Wparentheses -Wswitch -Wno-unused-function -Wno-unused-label -Wno-unused-parameter -Wunused-variable -Wunused-value -Wno-empty-body -Wno-uninitialized -Wno-unknown-pragmas -Wno-shadow -Wno-four-char-constants -Wno-conversion -Wno-constant-conversion -Wno-int-conversion -Wno-bool-conversion -Wno-enum-conversion -Wno-shorten-64-to-32 -Wpointer-sign -Wno-newline-eof -Wno-selector -Wno-strict-selector-match -Wno-undeclared-selector -Wno-deprecated-implementations -isysroot /Applications/Xcode.app/Contents/Developer/Platforms/MacOSX.platform/Developer/SDKs/MacOSX10.11.sdk -fasm-blocks -fstrict-aliasing -Wprotocol -Wdeprecated-declarations -mmacosx-version-min=10.10 -Wno-sign-conversion -I/opt/local/var/macports/build/_opt_macports_trunk_dports_editors_ackmate/ackmate/work/AckMate-f2515f9/build/AckMate.build/Release/AckMate.build/AckMate.hmap -I/opt/local/var/macports/build/_opt_macports_trunk_dports_editors_ackmate/ackmate/work/AckMate-f2515f9/build/Release/include -I/opt/local/var/macports/build/_opt_macports_trunk_dports_editors_ackmate/ackmate/work/AckMate-f2515f9/build/AckMate.build/Release/AckMate.build/DerivedSources/x86_64 -I/opt/local/var/macports/build/_opt_macports_trunk_dports_editors_ackmate/ackmate/work/AckMate-f2515f9/build/AckMate.build/Release/AckMate.build/DerivedSources -F/opt/local/var/macports/build/_opt_macports_trunk_dports_editors_ackmate/ackmate/work/AckMate-f2515f9/build/Release -include /var/folders/kd/sc_9pj4j5js7wd5qmjqjvsbh0000gp/C/com.apple.DeveloperTools/7.1-7B91b/Xcode/SharedPrecompiledHeaders/AckMate_Prefix-gkimuosxfazvvcfqsqnfrvjjijyv/AckMate_Prefix.pch -MMD -MT dependencies -MF /opt/local/var/macports/build/_opt_macports_trunk_dports_editors_ackmate/ackmate/work/AckMate-f2515f9/build/AckMate.build/Release/AckMate.build/Objects-normal/x86_64/NSTableView+NoodleExtensions.d --serialize-diagnostics /opt/local/var/macports/build/_opt_macports_trunk_dports_editors_ackmate/ackmate/work/AckMate-f2515f9/build/AckMate.build/Release/AckMate.build/Objects-normal/x86_64/NSTableView+NoodleExtensions.dia -c /opt/local/var/macports/build/_opt_macports_trunk_dports_editors_ackmate/ackmate/work/AckMate-f2515f9/source/external/NSTableView+NoodleExtensions.m -o /opt/local/var/macports/build/_opt_macports_trunk_dports_editors_ackmate/ackmate/work/AckMate-f2515f9/build/AckMate.build/Release/AckMate.build/Objects-normal/x86_64/NSTableView+NoodleExtensions.o
990:info:build /opt/local/var/macports/build/_opt_macports_trunk_dports_editors_ackmate/ackmate/work/AckMate-f2515f9/source/external/NSTableView+NoodleExtensions.m:100:29: warning: instance method '-tableView:contextMenuForRow:' not found (return type defaults to 'id') [-Wobjc-method-access]
991:info:build     return [[self delegate] tableView:self contextMenuForRow:row];
992:info:build                             ^~~~~~~~~~~~~~~~~~~~~~~~~~~~~~~~
993:info:build /opt/local/var/macports/build/_opt_macports_trunk_dports_editors_ackmate/ackmate/work/AckMate-f2515f9/source/external/NSTableView+NoodleExtensions.m:117:9: warning: null passed to a callee that requires a non-null argument [-Wnonnull]
994:info:build                 [view setTitle:nil];
995:info:build                       ^        ~~~
996:info:build /opt/local/var/macports/build/_opt_macports_trunk_dports_editors_ackmate/ackmate/work/AckMate-f2515f9/source/external/NSTableView+NoodleExtensions.m:163:17: warning: 'preparedCellAtColumn:row:' is deprecated: first deprecated in OS X 10.10 - Use View Based TableView and -viewAtColumn:row: [-Wdeprecated-declarations]
997:info:build                         cell = [self preparedCellAtColumn:colIndex row:row];
998:info:build                                      ^
999:info:build In file included from /opt/local/var/macports/build/_opt_macports_trunk_dports_editors_ackmate/ackmate/work/AckMate-f2515f9/source/external/NSTableView+NoodleExtensions.m:1:
1000:info:build In file included from /opt/local/var/macports/build/_opt_macports_trunk_dports_editors_ackmate/ackmate/work/AckMate-f2515f9/AckMate_Prefix.pch:6:
1001:info:build In file included from /Applications/Xcode.app/Contents/Developer/Platforms/MacOSX.platform/Developer/SDKs/MacOSX10.11.sdk/System/Library/Frameworks/Cocoa.framework/Headers/Cocoa.h:13:
1002:info:build In file included from /Applications/Xcode.app/Contents/Developer/Platforms/MacOSX.platform/Developer/SDKs/MacOSX10.11.sdk/System/Library/Frameworks/AppKit.framework/Headers/AppKit.h:129:
1003:info:build In file included from /Applications/Xcode.app/Contents/Developer/Platforms/MacOSX.platform/Developer/SDKs/MacOSX10.11.sdk/System/Library/Frameworks/AppKit.framework/Headers/NSTableCellView.h:15:
1004:info:build /Applications/Xcode.app/Contents/Developer/Platforms/MacOSX.platform/Developer/SDKs/MacOSX10.11.sdk/System/Library/Frameworks/AppKit.framework/Headers/NSTableView.h:873:1: note: 'preparedCellAtColumn:row:' has been explicitly marked deprecated here
1005:info:build - (nullable NSCell *)preparedCellAtColumn:(NSInteger)column row:(NSInteger)row  NS_DEPRECATED_MAC(10_5, 10_10, "Use View Based TableView and -viewAtColumn:row:");
1006:info:build ^
1007:info:build /opt/local/var/macports/build/_opt_macports_trunk_dports_editors_ackmate/ackmate/work/AckMate-f2515f9/source/external/NSTableView+NoodleExtensions.m:206:10: warning: 'setFlipped:' is deprecated: first deprecated in OS X 10.6 [-Wdeprecated-declarations]
1008:info:build                 [image setFlipped:[self isFlipped]];
1009:info:build                        ^
1010:info:build In file included from /opt/local/var/macports/build/_opt_macports_trunk_dports_editors_ackmate/ackmate/work/AckMate-f2515f9/source/external/NSTableView+NoodleExtensions.m:1:
1011:info:build In file included from /opt/local/var/macports/build/_opt_macports_trunk_dports_editors_ackmate/ackmate/work/AckMate-f2515f9/AckMate_Prefix.pch:6:
1012:info:build In file included from /Applications/Xcode.app/Contents/Developer/Platforms/MacOSX.platform/Developer/SDKs/MacOSX10.11.sdk/System/Library/Frameworks/Cocoa.framework/Headers/Cocoa.h:13:
1013:info:build In file included from /Applications/Xcode.app/Contents/Developer/Platforms/MacOSX.platform/Developer/SDKs/MacOSX10.11.sdk/System/Library/Frameworks/AppKit.framework/Headers/AppKit.h:75:
1014:info:build /Applications/Xcode.app/Contents/Developer/Platforms/MacOSX.platform/Developer/SDKs/MacOSX10.11.sdk/System/Library/Frameworks/AppKit.framework/Headers/NSImage.h:249:1: note: 'setFlipped:' has been explicitly marked deprecated here
1015:info:build - (void)setFlipped:(BOOL)flag NS_DEPRECATED_MAC(10_0, 10_6);
1016:info:build ^
1017:info:build /opt/local/var/macports/build/_opt_macports_trunk_dports_editors_ackmate/ackmate/work/AckMate-f2515f9/source/external/NSTableView+NoodleExtensions.m:252:14: warning: 'setFlipped:' is deprecated: first deprecated in OS X 10.6 [-Wdeprecated-declarations]
1018:info:build                         [rowImage setFlipped:[self isFlipped]];
1019:info:build                                   ^
1020:info:build In file included from /opt/local/var/macports/build/_opt_macports_trunk_dports_editors_ackmate/ackmate/work/AckMate-f2515f9/source/external/NSTableView+NoodleExtensions.m:1:
1021:info:build In file included from /opt/local/var/macports/build/_opt_macports_trunk_dports_editors_ackmate/ackmate/work/AckMate-f2515f9/AckMate_Prefix.pch:6:
1022:info:build In file included from /Applications/Xcode.app/Contents/Developer/Platforms/MacOSX.platform/Developer/SDKs/MacOSX10.11.sdk/System/Library/Frameworks/Cocoa.framework/Headers/Cocoa.h:13:
1023:info:build In file included from /Applications/Xcode.app/Contents/Developer/Platforms/MacOSX.platform/Developer/SDKs/MacOSX10.11.sdk/System/Library/Frameworks/AppKit.framework/Headers/AppKit.h:75:
1024:info:build /Applications/Xcode.app/Contents/Developer/Platforms/MacOSX.platform/Developer/SDKs/MacOSX10.11.sdk/System/Library/Frameworks/AppKit.framework/Headers/NSImage.h:249:1: note: 'setFlipped:' has been explicitly marked deprecated here
1025:info:build - (void)setFlipped:(BOOL)flag NS_DEPRECATED_MAC(10_0, 10_6);
1026:info:build ^
1027:info:build /opt/local/var/macports/build/_opt_macports_trunk_dports_editors_ackmate/ackmate/work/AckMate-f2515f9/source/external/NSTableView+NoodleExtensions.m:304:1: warning: category is implementing a method which will also be implemented by its primary class [-Wobjc-protocol-method-implementation]
1028:info:build - (NSInteger)_previousStickyRow
1029:info:build ^
1030:info:build /opt/local/var/macports/build/_opt_macports_trunk_dports_editors_ackmate/ackmate/work/AckMate-f2515f9/source/external/NSTableView+NoodleExtensions.m:25:1: note: method '_previousStickyRow' declared here
1031:info:build - (NSInteger)_previousStickyRow;
1032:info:build ^
1033:info:build /opt/local/var/macports/build/_opt_macports_trunk_dports_editors_ackmate/ackmate/work/AckMate-f2515f9/source/external/NSTableView+NoodleExtensions.m:323:1: warning: category is implementing a method which will also be implemented by its primary class [-Wobjc-protocol-method-implementation]
1034:info:build - (NSInteger)_nextStickyRow
1035:info:build ^
1036:info:build /opt/local/var/macports/build/_opt_macports_trunk_dports_editors_ackmate/ackmate/work/AckMate-f2515f9/source/external/NSTableView+NoodleExtensions.m:28:1: note: method '_nextStickyRow' declared here
1037:info:build - (NSInteger)_nextStickyRow;
1038:info:build ^
1039:info:build /opt/local/var/macports/build/_opt_macports_trunk_dports_editors_ackmate/ackmate/work/AckMate-f2515f9/source/external/NSTableView+NoodleExtensions.m:178:1: warning: category is implementing a method which will also be implemented by its primary class [-Wobjc-protocol-method-implementation]
1040:info:build - (void)_updateStickyRowHeaderImageWithRow:(NSInteger)row
1041:info:build ^
1042:info:build /opt/local/var/macports/build/_opt_macports_trunk_dports_editors_ackmate/ackmate/work/AckMate-f2515f9/source/external/NSTableView+NoodleExtensions.m:30:1: note: method '_updateStickyRowHeaderImageWithRow:' declared here
1043:info:build - (void)_updateStickyRowHeaderImageWithRow:(NSInteger)row;
1044:info:build ^
1045:info:build /opt/local/var/macports/build/_opt_macports_trunk_dports_editors_ackmate/ackmate/work/AckMate-f2515f9/source/external/NSTableView+NoodleExtensions.m:105:1: warning: category is implementing a method which will also be implemented by its primary class [-Wobjc-protocol-method-implementation]
1046:info:build - (id)_stickyRowHeaderView
1047:info:build ^
1048:info:build /opt/local/var/macports/build/_opt_macports_trunk_dports_editors_ackmate/ackmate/work/AckMate-f2515f9/source/external/NSTableView+NoodleExtensions.m:33:1: note: method '_stickyRowHeaderView' declared here
1049:info:build - (id)_stickyRowHeaderView;
1050:info:build ^
1051:info:build 9 warnings generated.
1052:info:build
1053:info:build CompileC build/AckMate.build/Release/AckMate.build/Objects-normal/x86_64/SDFoundation.o source/external/SDFoundation.m normal x86_64 objective-c com.apple.compilers.llvm.clang.1_0.compiler
1054:info:build     cd /opt/local/var/macports/build/_opt_macports_trunk_dports_editors_ackmate/ackmate/work/AckMate-f2515f9
1055:info:build     export LANG=en_US.US-ASCII
1056:info:build     /Applications/Xcode.app/Contents/Developer/Toolchains/XcodeDefault.xctoolchain/usr/bin/clang -x objective-c -arch x86_64 -fmessage-length=0 -fdiagnostics-show-note-include-stack -fmacro-backtrace-limit=0 -Wno-trigraphs -fpascal-strings -Os -Wno-missing-field-initializers -Wno-missing-prototypes -Wno-implicit-atomic-properties -Wno-arc-repeated-use-of-weak -Wno-missing-braces -Wparentheses -Wswitch -Wno-unused-function -Wno-unused-label -Wno-unused-parameter -Wunused-variable -Wunused-value -Wno-empty-body -Wno-uninitialized -Wno-unknown-pragmas -Wno-shadow -Wno-four-char-constants -Wno-conversion -Wno-constant-conversion -Wno-int-conversion -Wno-bool-conversion -Wno-enum-conversion -Wno-shorten-64-to-32 -Wpointer-sign -Wno-newline-eof -Wno-selector -Wno-strict-selector-match -Wno-undeclared-selector -Wno-deprecated-implementations -isysroot /Applications/Xcode.app/Contents/Developer/Platforms/MacOSX.platform/Developer/SDKs/MacOSX10.11.sdk -fasm-blocks -fstrict-aliasing -Wprotocol -Wdeprecated-declarations -mmacosx-version-min=10.10 -Wno-sign-conversion -I/opt/local/var/macports/build/_opt_macports_trunk_dports_editors_ackmate/ackmate/work/AckMate-f2515f9/build/AckMate.build/Release/AckMate.build/AckMate.hmap -I/opt/local/var/macports/build/_opt_macports_trunk_dports_editors_ackmate/ackmate/work/AckMate-f2515f9/build/Release/include -I/opt/local/var/macports/build/_opt_macports_trunk_dports_editors_ackmate/ackmate/work/AckMate-f2515f9/build/AckMate.build/Release/AckMate.build/DerivedSources/x86_64 -I/opt/local/var/macports/build/_opt_macports_trunk_dports_editors_ackmate/ackmate/work/AckMate-f2515f9/build/AckMate.build/Release/AckMate.build/DerivedSources -F/opt/local/var/macports/build/_opt_macports_trunk_dports_editors_ackmate/ackmate/work/AckMate-f2515f9/build/Release -include /var/folders/kd/sc_9pj4j5js7wd5qmjqjvsbh0000gp/C/com.apple.DeveloperTools/7.1-7B91b/Xcode/SharedPrecompiledHeaders/AckMate_Prefix-gkimuosxfazvvcfqsqnfrvjjijyv/AckMate_Prefix.pch -MMD -MT dependencies -MF /opt/local/var/macports/build/_opt_macports_trunk_dports_editors_ackmate/ackmate/work/AckMate-f2515f9/build/AckMate.build/Release/AckMate.build/Objects-normal/x86_64/SDFoundation.d --serialize-diagnostics /opt/local/var/macports/build/_opt_macports_trunk_dports_editors_ackmate/ackmate/work/AckMate-f2515f9/build/AckMate.build/Release/AckMate.build/Objects-normal/x86_64/SDFoundation.dia -c /opt/local/var/macports/build/_opt_macports_trunk_dports_editors_ackmate/ackmate/work/AckMate-f2515f9/source/external/SDFoundation.m -o /opt/local/var/macports/build/_opt_macports_trunk_dports_editors_ackmate/ackmate/work/AckMate-f2515f9/build/AckMate.build/Release/AckMate.build/Objects-normal/x86_64/SDFoundation.o
1057:info:build
1058:info:build CompileC build/AckMate.build/Release/AckMate.build/Objects-normal/x86_64/JPAckControlView.o source/views/JPAckControlView.m normal x86_64 objective-c com.apple.compilers.llvm.clang.1_0.compiler
1059:info:build     cd /opt/local/var/macports/build/_opt_macports_trunk_dports_editors_ackmate/ackmate/work/AckMate-f2515f9
1060:info:build     export LANG=en_US.US-ASCII
1061:info:build     /Applications/Xcode.app/Contents/Developer/Toolchains/XcodeDefault.xctoolchain/usr/bin/clang -x objective-c -arch x86_64 -fmessage-length=0 -fdiagnostics-show-note-include-stack -fmacro-backtrace-limit=0 -Wno-trigraphs -fpascal-strings -Os -Wno-missing-field-initializers -Wno-missing-prototypes -Wno-implicit-atomic-properties -Wno-arc-repeated-use-of-weak -Wno-missing-braces -Wparentheses -Wswitch -Wno-unused-function -Wno-unused-label -Wno-unused-parameter -Wunused-variable -Wunused-value -Wno-empty-body -Wno-uninitialized -Wno-unknown-pragmas -Wno-shadow -Wno-four-char-constants -Wno-conversion -Wno-constant-conversion -Wno-int-conversion -Wno-bool-conversion -Wno-enum-conversion -Wno-shorten-64-to-32 -Wpointer-sign -Wno-newline-eof -Wno-selector -Wno-strict-selector-match -Wno-undeclared-selector -Wno-deprecated-implementations -isysroot /Applications/Xcode.app/Contents/Developer/Platforms/MacOSX.platform/Developer/SDKs/MacOSX10.11.sdk -fasm-blocks -fstrict-aliasing -Wprotocol -Wdeprecated-declarations -mmacosx-version-min=10.10 -Wno-sign-conversion -I/opt/local/var/macports/build/_opt_macports_trunk_dports_editors_ackmate/ackmate/work/AckMate-f2515f9/build/AckMate.build/Release/AckMate.build/AckMate.hmap -I/opt/local/var/macports/build/_opt_macports_trunk_dports_editors_ackmate/ackmate/work/AckMate-f2515f9/build/Release/include -I/opt/local/var/macports/build/_opt_macports_trunk_dports_editors_ackmate/ackmate/work/AckMate-f2515f9/build/AckMate.build/Release/AckMate.build/DerivedSources/x86_64 -I/opt/local/var/macports/build/_opt_macports_trunk_dports_editors_ackmate/ackmate/work/AckMate-f2515f9/build/AckMate.build/Release/AckMate.build/DerivedSources -F/opt/local/var/macports/build/_opt_macports_trunk_dports_editors_ackmate/ackmate/work/AckMate-f2515f9/build/Release -include /var/folders/kd/sc_9pj4j5js7wd5qmjqjvsbh0000gp/C/com.apple.DeveloperTools/7.1-7B91b/Xcode/SharedPrecompiledHeaders/AckMate_Prefix-gkimuosxfazvvcfqsqnfrvjjijyv/AckMate_Prefix.pch -MMD -MT dependencies -MF /opt/local/var/macports/build/_opt_macports_trunk_dports_editors_ackmate/ackmate/work/AckMate-f2515f9/build/AckMate.build/Release/AckMate.build/Objects-normal/x86_64/JPAckControlView.d --serialize-diagnostics /opt/local/var/macports/build/_opt_macports_trunk_dports_editors_ackmate/ackmate/work/AckMate-f2515f9/build/AckMate.build/Release/AckMate.build/Objects-normal/x86_64/JPAckControlView.dia -c /opt/local/var/macports/build/_opt_macports_trunk_dports_editors_ackmate/ackmate/work/AckMate-f2515f9/source/views/JPAckControlView.m -o /opt/local/var/macports/build/_opt_macports_trunk_dports_editors_ackmate/ackmate/work/AckMate-f2515f9/build/AckMate.build/Release/AckMate.build/Objects-normal/x86_64/JPAckControlView.o
1062:info:build
1063:info:build CompileC build/AckMate.build/Release/AckMate.build/Objects-normal/x86_64/JPAckResultCell.o source/views/JPAckResultCell.m normal x86_64 objective-c com.apple.compilers.llvm.clang.1_0.compiler
1064:info:build     cd /opt/local/var/macports/build/_opt_macports_trunk_dports_editors_ackmate/ackmate/work/AckMate-f2515f9
1065:info:build     export LANG=en_US.US-ASCII
1066:info:build     /Applications/Xcode.app/Contents/Developer/Toolchains/XcodeDefault.xctoolchain/usr/bin/clang -x objective-c -arch x86_64 -fmessage-length=0 -fdiagnostics-show-note-include-stack -fmacro-backtrace-limit=0 -Wno-trigraphs -fpascal-strings -Os -Wno-missing-field-initializers -Wno-missing-prototypes -Wno-implicit-atomic-properties -Wno-arc-repeated-use-of-weak -Wno-missing-braces -Wparentheses -Wswitch -Wno-unused-function -Wno-unused-label -Wno-unused-parameter -Wunused-variable -Wunused-value -Wno-empty-body -Wno-uninitialized -Wno-unknown-pragmas -Wno-shadow -Wno-four-char-constants -Wno-conversion -Wno-constant-conversion -Wno-int-conversion -Wno-bool-conversion -Wno-enum-conversion -Wno-shorten-64-to-32 -Wpointer-sign -Wno-newline-eof -Wno-selector -Wno-strict-selector-match -Wno-undeclared-selector -Wno-deprecated-implementations -isysroot /Applications/Xcode.app/Contents/Developer/Platforms/MacOSX.platform/Developer/SDKs/MacOSX10.11.sdk -fasm-blocks -fstrict-aliasing -Wprotocol -Wdeprecated-declarations -mmacosx-version-min=10.10 -Wno-sign-conversion -I/opt/local/var/macports/build/_opt_macports_trunk_dports_editors_ackmate/ackmate/work/AckMate-f2515f9/build/AckMate.build/Release/AckMate.build/AckMate.hmap -I/opt/local/var/macports/build/_opt_macports_trunk_dports_editors_ackmate/ackmate/work/AckMate-f2515f9/build/Release/include -I/opt/local/var/macports/build/_opt_macports_trunk_dports_editors_ackmate/ackmate/work/AckMate-f2515f9/build/AckMate.build/Release/AckMate.build/DerivedSources/x86_64 -I/opt/local/var/macports/build/_opt_macports_trunk_dports_editors_ackmate/ackmate/work/AckMate-f2515f9/build/AckMate.build/Release/AckMate.build/DerivedSources -F/opt/local/var/macports/build/_opt_macports_trunk_dports_editors_ackmate/ackmate/work/AckMate-f2515f9/build/Release -include /var/folders/kd/sc_9pj4j5js7wd5qmjqjvsbh0000gp/C/com.apple.DeveloperTools/7.1-7B91b/Xcode/SharedPrecompiledHeaders/AckMate_Prefix-gkimuosxfazvvcfqsqnfrvjjijyv/AckMate_Prefix.pch -MMD -MT dependencies -MF /opt/local/var/macports/build/_opt_macports_trunk_dports_editors_ackmate/ackmate/work/AckMate-f2515f9/build/AckMate.build/Release/AckMate.build/Objects-normal/x86_64/JPAckResultCell.d --serialize-diagnostics /opt/local/var/macports/build/_opt_macports_trunk_dports_editors_ackmate/ackmate/work/AckMate-f2515f9/build/AckMate.build/Release/AckMate.build/Objects-normal/x86_64/JPAckResultCell.dia -c /opt/local/var/macports/build/_opt_macports_trunk_dports_editors_ackmate/ackmate/work/AckMate-f2515f9/source/views/JPAckResultCell.m -o /opt/local/var/macports/build/_opt_macports_trunk_dports_editors_ackmate/ackmate/work/AckMate-f2515f9/build/AckMate.build/Release/AckMate.build/Objects-normal/x86_64/JPAckResultCell.o
1067:info:build /opt/local/var/macports/build/_opt_macports_trunk_dports_editors_ackmate/ackmate/work/AckMate-f2515f9/source/views/JPAckResultCell.m:87:124: warning: conflicting parameter types in implementation of 'selectWithFrame:inView:editor:delegate:start:length:': 'NSInteger' (aka 'long') vs 'int' [-Wmismatched-parameter-types]
1068:info:build - (void)selectWithFrame:(NSRect)aRect inView:(NSView*)controlView editor:(NSText*)textObj delegate:(id)anObject start:(int)selStart length:(int)selLength
1069:info:build                                                                                                                        ~~~ ^
1070:info:build In file included from /opt/local/var/macports/build/_opt_macports_trunk_dports_editors_ackmate/ackmate/work/AckMate-f2515f9/source/views/JPAckResultCell.m:1:
1071:info:build In file included from /opt/local/var/macports/build/_opt_macports_trunk_dports_editors_ackmate/ackmate/work/AckMate-f2515f9/AckMate_Prefix.pch:6:
1072:info:build In file included from /Applications/Xcode.app/Contents/Developer/Platforms/MacOSX.platform/Developer/SDKs/MacOSX10.11.sdk/System/Library/Frameworks/Cocoa.framework/Headers/Cocoa.h:13:
1073:info:build In file included from /Applications/Xcode.app/Contents/Developer/Platforms/MacOSX.platform/Developer/SDKs/MacOSX10.11.sdk/System/Library/Frameworks/AppKit.framework/Headers/AppKit.h:15:
1074:info:build In file included from /Applications/Xcode.app/Contents/Developer/Platforms/MacOSX.platform/Developer/SDKs/MacOSX10.11.sdk/System/Library/Frameworks/AppKit.framework/Headers/NSActionCell.h:8:
1075:info:build /Applications/Xcode.app/Contents/Developer/Platforms/MacOSX.platform/Developer/SDKs/MacOSX10.11.sdk/System/Library/Frameworks/AppKit.framework/Headers/NSCell.h:233:141: note: previous definition is here
1076:info:build - (void)selectWithFrame:(NSRect)aRect inView:(NSView *)controlView editor:(NSText *)textObj delegate:(nullable id)anObject start:(NSInteger)selStart length:(NSInteger)selLength;
1077:info:build                                                                                                                                   ~~~~~~~~~ ^
1078:info:build /opt/local/var/macports/build/_opt_macports_trunk_dports_editors_ackmate/ackmate/work/AckMate-f2515f9/source/views/JPAckResultCell.m:87:145: warning: conflicting parameter types in implementation of 'selectWithFrame:inView:editor:delegate:start:length:': 'NSInteger' (aka 'long') vs 'int' [-Wmismatched-parameter-types]
1079:info:build - (void)selectWithFrame:(NSRect)aRect inView:(NSView*)controlView editor:(NSText*)textObj delegate:(id)anObject start:(int)selStart length:(int)selLength
1080:info:build                                                                                                                                             ~~~ ^
1081:info:build In file included from /opt/local/var/macports/build/_opt_macports_trunk_dports_editors_ackmate/ackmate/work/AckMate-f2515f9/source/views/JPAckResultCell.m:1:
1082:info:build In file included from /opt/local/var/macports/build/_opt_macports_trunk_dports_editors_ackmate/ackmate/work/AckMate-f2515f9/AckMate_Prefix.pch:6:
1083:info:build In file included from /Applications/Xcode.app/Contents/Developer/Platforms/MacOSX.platform/Developer/SDKs/MacOSX10.11.sdk/System/Library/Frameworks/Cocoa.framework/Headers/Cocoa.h:13:
1084:info:build In file included from /Applications/Xcode.app/Contents/Developer/Platforms/MacOSX.platform/Developer/SDKs/MacOSX10.11.sdk/System/Library/Frameworks/AppKit.framework/Headers/AppKit.h:15:
1085:info:build In file included from /Applications/Xcode.app/Contents/Developer/Platforms/MacOSX.platform/Developer/SDKs/MacOSX10.11.sdk/System/Library/Frameworks/AppKit.framework/Headers/NSActionCell.h:8:
1086:info:build /Applications/Xcode.app/Contents/Developer/Platforms/MacOSX.platform/Developer/SDKs/MacOSX10.11.sdk/System/Library/Frameworks/AppKit.framework/Headers/NSCell.h:233:168: note: previous definition is here
1087:info:build - (void)selectWithFrame:(NSRect)aRect inView:(NSView *)controlView editor:(NSText *)textObj delegate:(nullable id)anObject start:(NSInteger)selStart length:(NSInteger)selLength;
1088:info:build                                                                                                                                                              ~~~~~~~~~ ^
1089:info:build 2 warnings generated.
1090:info:build
1091:info:build CompileC build/AckMate.build/Release/AckMate.build/Objects-normal/x86_64/JPAckResultTableView.o source/views/JPAckResultTableView.m normal x86_64 objective-c com.apple.compilers.llvm.clang.1_0.compiler
1092:info:build     cd /opt/local/var/macports/build/_opt_macports_trunk_dports_editors_ackmate/ackmate/work/AckMate-f2515f9
1093:info:build     export LANG=en_US.US-ASCII
1094:info:build     /Applications/Xcode.app/Contents/Developer/Toolchains/XcodeDefault.xctoolchain/usr/bin/clang -x objective-c -arch x86_64 -fmessage-length=0 -fdiagnostics-show-note-include-stack -fmacro-backtrace-limit=0 -Wno-trigraphs -fpascal-strings -Os -Wno-missing-field-initializers -Wno-missing-prototypes -Wno-implicit-atomic-properties -Wno-arc-repeated-use-of-weak -Wno-missing-braces -Wparentheses -Wswitch -Wno-unused-function -Wno-unused-label -Wno-unused-parameter -Wunused-variable -Wunused-value -Wno-empty-body -Wno-uninitialized -Wno-unknown-pragmas -Wno-shadow -Wno-four-char-constants -Wno-conversion -Wno-constant-conversion -Wno-int-conversion -Wno-bool-conversion -Wno-enum-conversion -Wno-shorten-64-to-32 -Wpointer-sign -Wno-newline-eof -Wno-selector -Wno-strict-selector-match -Wno-undeclared-selector -Wno-deprecated-implementations -isysroot /Applications/Xcode.app/Contents/Developer/Platforms/MacOSX.platform/Developer/SDKs/MacOSX10.11.sdk -fasm-blocks -fstrict-aliasing -Wprotocol -Wdeprecated-declarations -mmacosx-version-min=10.10 -Wno-sign-conversion -I/opt/local/var/macports/build/_opt_macports_trunk_dports_editors_ackmate/ackmate/work/AckMate-f2515f9/build/AckMate.build/Release/AckMate.build/AckMate.hmap -I/opt/local/var/macports/build/_opt_macports_trunk_dports_editors_ackmate/ackmate/work/AckMate-f2515f9/build/Release/include -I/opt/local/var/macports/build/_opt_macports_trunk_dports_editors_ackmate/ackmate/work/AckMate-f2515f9/build/AckMate.build/Release/AckMate.build/DerivedSources/x86_64 -I/opt/local/var/macports/build/_opt_macports_trunk_dports_editors_ackmate/ackmate/work/AckMate-f2515f9/build/AckMate.build/Release/AckMate.build/DerivedSources -F/opt/local/var/macports/build/_opt_macports_trunk_dports_editors_ackmate/ackmate/work/AckMate-f2515f9/build/Release -include /var/folders/kd/sc_9pj4j5js7wd5qmjqjvsbh0000gp/C/com.apple.DeveloperTools/7.1-7B91b/Xcode/SharedPrecompiledHeaders/AckMate_Prefix-gkimuosxfazvvcfqsqnfrvjjijyv/AckMate_Prefix.pch -MMD -MT dependencies -MF /opt/local/var/macports/build/_opt_macports_trunk_dports_editors_ackmate/ackmate/work/AckMate-f2515f9/build/AckMate.build/Release/AckMate.build/Objects-normal/x86_64/JPAckResultTableView.d --serialize-diagnostics /opt/local/var/macports/build/_opt_macports_trunk_dports_editors_ackmate/ackmate/work/AckMate-f2515f9/build/AckMate.build/Release/AckMate.build/Objects-normal/x86_64/JPAckResultTableView.dia -c /opt/local/var/macports/build/_opt_macports_trunk_dports_editors_ackmate/ackmate/work/AckMate-f2515f9/source/views/JPAckResultTableView.m -o /opt/local/var/macports/build/_opt_macports_trunk_dports_editors_ackmate/ackmate/work/AckMate-f2515f9/build/AckMate.build/Release/AckMate.build/Objects-normal/x86_64/JPAckResultTableView.o
1095:info:build /opt/local/var/macports/build/_opt_macports_trunk_dports_editors_ackmate/ackmate/work/AckMate-f2515f9/source/views/JPAckResultTableView.m:28:61: warning: 'convertScreenToBase:' is deprecated: first deprecated in OS X 10.7 - Use -convertRectFromScreen: instead [-Wdeprecated-declarations]
1096:info:build   NSPoint mouseLocation = [self convertPoint:[[self window] convertScreenToBase:[NSEvent mouseLocation]] fromView:nil];
1097:info:build                                                             ^
1098:info:build In file included from /opt/local/var/macports/build/_opt_macports_trunk_dports_editors_ackmate/ackmate/work/AckMate-f2515f9/source/views/JPAckResultTableView.m:1:
1099:info:build In file included from /opt/local/var/macports/build/_opt_macports_trunk_dports_editors_ackmate/ackmate/work/AckMate-f2515f9/AckMate_Prefix.pch:6:
1100:info:build In file included from /Applications/Xcode.app/Contents/Developer/Platforms/MacOSX.platform/Developer/SDKs/MacOSX10.11.sdk/System/Library/Frameworks/Cocoa.framework/Headers/Cocoa.h:13:
1101:info:build In file included from /Applications/Xcode.app/Contents/Developer/Platforms/MacOSX.platform/Developer/SDKs/MacOSX10.11.sdk/System/Library/Frameworks/AppKit.framework/Headers/AppKit.h:37:
1102:info:build In file included from /Applications/Xcode.app/Contents/Developer/Platforms/MacOSX.platform/Developer/SDKs/MacOSX10.11.sdk/System/Library/Frameworks/AppKit.framework/Headers/NSFontPanel.h:8:
1103:info:build In file included from /Applications/Xcode.app/Contents/Developer/Platforms/MacOSX.platform/Developer/SDKs/MacOSX10.11.sdk/System/Library/Frameworks/AppKit.framework/Headers/NSPanel.h:8:
1104:info:build /Applications/Xcode.app/Contents/Developer/Platforms/MacOSX.platform/Developer/SDKs/MacOSX10.11.sdk/System/Library/Frameworks/AppKit.framework/Headers/NSWindow.h:693:1: note: 'convertScreenToBase:' has been explicitly marked deprecated here
1105:info:build - (NSPoint)convertScreenToBase:(NSPoint)aPoint NS_DEPRECATED_MAC(10_0, 10_7, "Use -convertRectFromScreen: instead");
1106:info:build ^
1107:info:build /opt/local/var/macports/build/_opt_macports_trunk_dports_editors_ackmate/ackmate/work/AckMate-f2515f9/source/views/JPAckResultTableView.m:34:24: warning: instance method '-tableView:isStickyRow:' not found (return type defaults to 'id') [-Wobjc-method-access]
1108:info:build   if ([[self delegate] tableView:self isStickyRow:row])
1109:info:build                        ^~~~~~~~~~~~~~~~~~~~~~~~~~
1110:info:build /opt/local/var/macports/build/_opt_macports_trunk_dports_editors_ackmate/ackmate/work/AckMate-f2515f9/source/views/JPAckResultTableView.m:44:29: warning: instance method '-tableView:activateSelectedRow:atPoint:' not found (return type defaults to 'id') [-Wobjc-method-access]
1111:info:build     return [[self delegate] tableView:self activateSelectedRow:row atPoint:point];
1112:info:build                             ^~~~~~~~~~~~~~~~~~~~~~~~~~~~~~~~~~~~~~~~~~~~~~
1113:info:build /opt/local/var/macports/build/_opt_macports_trunk_dports_editors_ackmate/ackmate/work/AckMate-f2515f9/source/views/JPAckResultTableView.m:51:20: warning: instance method '-tableView:activateSelectedRow:atPoint:' not found (return type defaults to 'id') [-Wobjc-method-access]
1114:info:build   [[self delegate] tableView:self activateSelectedRow:row atPoint:NSMakePoint(0,0)]; //dummy point hint - sticky row was clicked, not the real row
1115:info:build                    ^~~~~~~~~~~~~~~~~~~~~~~~~~~~~~~~~~~~~~~~~~~~~~
1116:info:build /opt/local/var/macports/build/_opt_macports_trunk_dports_editors_ackmate/ackmate/work/AckMate-f2515f9/source/views/JPAckResultTableView.m:73:49: warning: instance method '-tableView:contextMenuForRow:' not found (return type defaults to 'id') [-Wobjc-method-access]
1117:info:build   return (row != NSNotFound) ? [[self delegate] tableView:self contextMenuForRow:row] : nil;
1118:info:build                                                 ^~~~~~~~~~~~~~~~~~~~~~~~~~~~~~~~
1119:info:build /opt/local/var/macports/build/_opt_macports_trunk_dports_editors_ackmate/ackmate/work/AckMate-f2515f9/source/views/JPAckResultTableView.m:88:29: warning: instance method '-tableView:spanningColumnForRow:' not found (return type defaults to 'id') [-Wobjc-method-access]
1120:info:build     return [[self delegate] tableView:self spanningColumnForRow:rowIndex];
1121:info:build                             ^~~~~~~~~~~~~~~~~~~~~~~~~~~~~~~~~~~
1122:info:build /opt/local/var/macports/build/_opt_macports_trunk_dports_editors_ackmate/ackmate/work/AckMate-f2515f9/source/views/JPAckResultTableView.m:197:26: warning: 'preparedCellAtColumn:row:' is deprecated: first deprecated in OS X 10.10 - Use View Based TableView and -viewAtColumn:row: [-Wdeprecated-declarations]
1123:info:build     NSCell* cell = [self preparedCellAtColumn:scol row:rowIndex];
1124:info:build                          ^
1125:info:build In file included from /opt/local/var/macports/build/_opt_macports_trunk_dports_editors_ackmate/ackmate/work/AckMate-f2515f9/source/views/JPAckResultTableView.m:1:
1126:info:build In file included from /opt/local/var/macports/build/_opt_macports_trunk_dports_editors_ackmate/ackmate/work/AckMate-f2515f9/AckMate_Prefix.pch:6:
1127:info:build In file included from /Applications/Xcode.app/Contents/Developer/Platforms/MacOSX.platform/Developer/SDKs/MacOSX10.11.sdk/System/Library/Frameworks/Cocoa.framework/Headers/Cocoa.h:13:
1128:info:build In file included from /Applications/Xcode.app/Contents/Developer/Platforms/MacOSX.platform/Developer/SDKs/MacOSX10.11.sdk/System/Library/Frameworks/AppKit.framework/Headers/AppKit.h:129:
1129:info:build In file included from /Applications/Xcode.app/Contents/Developer/Platforms/MacOSX.platform/Developer/SDKs/MacOSX10.11.sdk/System/Library/Frameworks/AppKit.framework/Headers/NSTableCellView.h:15:
1130:info:build /Applications/Xcode.app/Contents/Developer/Platforms/MacOSX.platform/Developer/SDKs/MacOSX10.11.sdk/System/Library/Frameworks/AppKit.framework/Headers/NSTableView.h:873:1: note: 'preparedCellAtColumn:row:' has been explicitly marked deprecated here
1131:info:build - (nullable NSCell *)preparedCellAtColumn:(NSInteger)column row:(NSInteger)row  NS_DEPRECATED_MAC(10_5, 10_10, "Use View Based TableView and -viewAtColumn:row:");
1132:info:build ^
1133:info:build 7 warnings generated.
1134:info:build
1135:info:build CompileC build/AckMate.build/Release/AckMate.build/Objects-normal/x86_64/JPAckProcess.o source/controllers/JPAckProcess.m normal x86_64 objective-c com.apple.compilers.llvm.clang.1_0.compiler
1136:info:build     cd /opt/local/var/macports/build/_opt_macports_trunk_dports_editors_ackmate/ackmate/work/AckMate-f2515f9
1137:info:build     export LANG=en_US.US-ASCII
1138:info:build     /Applications/Xcode.app/Contents/Developer/Toolchains/XcodeDefault.xctoolchain/usr/bin/clang -x objective-c -arch x86_64 -fmessage-length=0 -fdiagnostics-show-note-include-stack -fmacro-backtrace-limit=0 -Wno-trigraphs -fpascal-strings -Os -Wno-missing-field-initializers -Wno-missing-prototypes -Wno-implicit-atomic-properties -Wno-arc-repeated-use-of-weak -Wno-missing-braces -Wparentheses -Wswitch -Wno-unused-function -Wno-unused-label -Wno-unused-parameter -Wunused-variable -Wunused-value -Wno-empty-body -Wno-uninitialized -Wno-unknown-pragmas -Wno-shadow -Wno-four-char-constants -Wno-conversion -Wno-constant-conversion -Wno-int-conversion -Wno-bool-conversion -Wno-enum-conversion -Wno-shorten-64-to-32 -Wpointer-sign -Wno-newline-eof -Wno-selector -Wno-strict-selector-match -Wno-undeclared-selector -Wno-deprecated-implementations -isysroot /Applications/Xcode.app/Contents/Developer/Platforms/MacOSX.platform/Developer/SDKs/MacOSX10.11.sdk -fasm-blocks -fstrict-aliasing -Wprotocol -Wdeprecated-declarations -mmacosx-version-min=10.10 -Wno-sign-conversion -I/opt/local/var/macports/build/_opt_macports_trunk_dports_editors_ackmate/ackmate/work/AckMate-f2515f9/build/AckMate.build/Release/AckMate.build/AckMate.hmap -I/opt/local/var/macports/build/_opt_macports_trunk_dports_editors_ackmate/ackmate/work/AckMate-f2515f9/build/Release/include -I/opt/local/var/macports/build/_opt_macports_trunk_dports_editors_ackmate/ackmate/work/AckMate-f2515f9/build/AckMate.build/Release/AckMate.build/DerivedSources/x86_64 -I/opt/local/var/macports/build/_opt_macports_trunk_dports_editors_ackmate/ackmate/work/AckMate-f2515f9/build/AckMate.build/Release/AckMate.build/DerivedSources -F/opt/local/var/macports/build/_opt_macports_trunk_dports_editors_ackmate/ackmate/work/AckMate-f2515f9/build/Release -include /var/folders/kd/sc_9pj4j5js7wd5qmjqjvsbh0000gp/C/com.apple.DeveloperTools/7.1-7B91b/Xcode/SharedPrecompiledHeaders/AckMate_Prefix-gkimuosxfazvvcfqsqnfrvjjijyv/AckMate_Prefix.pch -MMD -MT dependencies -MF /opt/local/var/macports/build/_opt_macports_trunk_dports_editors_ackmate/ackmate/work/AckMate-f2515f9/build/AckMate.build/Release/AckMate.build/Objects-normal/x86_64/JPAckProcess.d --serialize-diagnostics /opt/local/var/macports/build/_opt_macports_trunk_dports_editors_ackmate/ackmate/work/AckMate-f2515f9/build/AckMate.build/Release/AckMate.build/Objects-normal/x86_64/JPAckProcess.dia -c /opt/local/var/macports/build/_opt_macports_trunk_dports_editors_ackmate/ackmate/work/AckMate-f2515f9/source/controllers/JPAckProcess.m -o /opt/local/var/macports/build/_opt_macports_trunk_dports_editors_ackmate/ackmate/work/AckMate-f2515f9/build/AckMate.build/Release/AckMate.build/Objects-normal/x86_64/JPAckProcess.o
1139:info:build
1140:info:build CompileC build/AckMate.build/Release/AckMate.build/Objects-normal/x86_64/JPAckResultSource.o source/controllers/JPAckResultSource.m normal x86_64 objective-c com.apple.compilers.llvm.clang.1_0.compiler
1141:info:build     cd /opt/local/var/macports/build/_opt_macports_trunk_dports_editors_ackmate/ackmate/work/AckMate-f2515f9
1142:info:build     export LANG=en_US.US-ASCII
1143:info:build     /Applications/Xcode.app/Contents/Developer/Toolchains/XcodeDefault.xctoolchain/usr/bin/clang -x objective-c -arch x86_64 -fmessage-length=0 -fdiagnostics-show-note-include-stack -fmacro-backtrace-limit=0 -Wno-trigraphs -fpascal-strings -Os -Wno-missing-field-initializers -Wno-missing-prototypes -Wno-implicit-atomic-properties -Wno-arc-repeated-use-of-weak -Wno-missing-braces -Wparentheses -Wswitch -Wno-unused-function -Wno-unused-label -Wno-unused-parameter -Wunused-variable -Wunused-value -Wno-empty-body -Wno-uninitialized -Wno-unknown-pragmas -Wno-shadow -Wno-four-char-constants -Wno-conversion -Wno-constant-conversion -Wno-int-conversion -Wno-bool-conversion -Wno-enum-conversion -Wno-shorten-64-to-32 -Wpointer-sign -Wno-newline-eof -Wno-selector -Wno-strict-selector-match -Wno-undeclared-selector -Wno-deprecated-implementations -isysroot /Applications/Xcode.app/Contents/Developer/Platforms/MacOSX.platform/Developer/SDKs/MacOSX10.11.sdk -fasm-blocks -fstrict-aliasing -Wprotocol -Wdeprecated-declarations -mmacosx-version-min=10.10 -Wno-sign-conversion -I/opt/local/var/macports/build/_opt_macports_trunk_dports_editors_ackmate/ackmate/work/AckMate-f2515f9/build/AckMate.build/Release/AckMate.build/AckMate.hmap -I/opt/local/var/macports/build/_opt_macports_trunk_dports_editors_ackmate/ackmate/work/AckMate-f2515f9/build/Release/include -I/opt/local/var/macports/build/_opt_macports_trunk_dports_editors_ackmate/ackmate/work/AckMate-f2515f9/build/AckMate.build/Release/AckMate.build/DerivedSources/x86_64 -I/opt/local/var/macports/build/_opt_macports_trunk_dports_editors_ackmate/ackmate/work/AckMate-f2515f9/build/AckMate.build/Release/AckMate.build/DerivedSources -F/opt/local/var/macports/build/_opt_macports_trunk_dports_editors_ackmate/ackmate/work/AckMate-f2515f9/build/Release -include /var/folders/kd/sc_9pj4j5js7wd5qmjqjvsbh0000gp/C/com.apple.DeveloperTools/7.1-7B91b/Xcode/SharedPrecompiledHeaders/AckMate_Prefix-gkimuosxfazvvcfqsqnfrvjjijyv/AckMate_Prefix.pch -MMD -MT dependencies -MF /opt/local/var/macports/build/_opt_macports_trunk_dports_editors_ackmate/ackmate/work/AckMate-f2515f9/build/AckMate.build/Release/AckMate.build/Objects-normal/x86_64/JPAckResultSource.d --serialize-diagnostics /opt/local/var/macports/build/_opt_macports_trunk_dports_editors_ackmate/ackmate/work/AckMate-f2515f9/build/AckMate.build/Release/AckMate.build/Objects-normal/x86_64/JPAckResultSource.dia -c /opt/local/var/macports/build/_opt_macports_trunk_dports_editors_ackmate/ackmate/work/AckMate-f2515f9/source/controllers/JPAckResultSource.m -o /opt/local/var/macports/build/_opt_macports_trunk_dports_editors_ackmate/ackmate/work/AckMate-f2515f9/build/AckMate.build/Release/AckMate.build/Objects-normal/x86_64/JPAckResultSource.o
1144:info:build /opt/local/var/macports/build/_opt_macports_trunk_dports_editors_ackmate/ackmate/work/AckMate-f2515f9/source/controllers/JPAckResultSource.m:71:93: warning: values of type 'NSUInteger' should not be used as format arguments; add an explicit cast to 'unsigned long' instead [-Wformat]
1145:info:build   self.resultStats = [NSString stringWithFormat:@"%@%d line%@ matched in %d file%@", insel, matchedLines, (matchedLines == 1) ? @"" : @"s", matchedFiles, (matchedFiles == 1) ? @"" : @"s"];
1146:info:build                                                     ~~                                      ^~~~~~~~~~~~
1147:info:build                                                     %lu                                     (unsigned long)
1148:info:build /opt/local/var/macports/build/_opt_macports_trunk_dports_editors_ackmate/ackmate/work/AckMate-f2515f9/source/controllers/JPAckResultSource.m:71:141: warning: values of type 'NSUInteger' should not be used as format arguments; add an explicit cast to 'unsigned long' instead [-Wformat]
1149:info:build   self.resultStats = [NSString stringWithFormat:@"%@%d line%@ matched in %d file%@", insel, matchedLines, (matchedLines == 1) ? @"" : @"s", matchedFiles, (matchedFiles == 1) ? @"" : @"s"];
1150:info:build                                                                          ~~                                                                 ^~~~~~~~~~~~
1151:info:build                                                                          %lu                                                                (unsigned long)
1152:info:build 2 warnings generated.
1153:info:build
1154:info:build CompileC build/AckMate.build/Release/AckMate.build/Objects-normal/x86_64/JPAckWindowController.o source/controllers/JPAckWindowController.m normal x86_64 objective-c com.apple.compilers.llvm.clang.1_0.compiler
1155:info:build     cd /opt/local/var/macports/build/_opt_macports_trunk_dports_editors_ackmate/ackmate/work/AckMate-f2515f9
1156:info:build     export LANG=en_US.US-ASCII
1157:info:build     /Applications/Xcode.app/Contents/Developer/Toolchains/XcodeDefault.xctoolchain/usr/bin/clang -x objective-c -arch x86_64 -fmessage-length=0 -fdiagnostics-show-note-include-stack -fmacro-backtrace-limit=0 -Wno-trigraphs -fpascal-strings -Os -Wno-missing-field-initializers -Wno-missing-prototypes -Wno-implicit-atomic-properties -Wno-arc-repeated-use-of-weak -Wno-missing-braces -Wparentheses -Wswitch -Wno-unused-function -Wno-unused-label -Wno-unused-parameter -Wunused-variable -Wunused-value -Wno-empty-body -Wno-uninitialized -Wno-unknown-pragmas -Wno-shadow -Wno-four-char-constants -Wno-conversion -Wno-constant-conversion -Wno-int-conversion -Wno-bool-conversion -Wno-enum-conversion -Wno-shorten-64-to-32 -Wpointer-sign -Wno-newline-eof -Wno-selector -Wno-strict-selector-match -Wno-undeclared-selector -Wno-deprecated-implementations -isysroot /Applications/Xcode.app/Contents/Developer/Platforms/MacOSX.platform/Developer/SDKs/MacOSX10.11.sdk -fasm-blocks -fstrict-aliasing -Wprotocol -Wdeprecated-declarations -mmacosx-version-min=10.10 -Wno-sign-conversion -I/opt/local/var/macports/build/_opt_macports_trunk_dports_editors_ackmate/ackmate/work/AckMate-f2515f9/build/AckMate.build/Release/AckMate.build/AckMate.hmap -I/opt/local/var/macports/build/_opt_macports_trunk_dports_editors_ackmate/ackmate/work/AckMate-f2515f9/build/Release/include -I/opt/local/var/macports/build/_opt_macports_trunk_dports_editors_ackmate/ackmate/work/AckMate-f2515f9/build/AckMate.build/Release/AckMate.build/DerivedSources/x86_64 -I/opt/local/var/macports/build/_opt_macports_trunk_dports_editors_ackmate/ackmate/work/AckMate-f2515f9/build/AckMate.build/Release/AckMate.build/DerivedSources -F/opt/local/var/macports/build/_opt_macports_trunk_dports_editors_ackmate/ackmate/work/AckMate-f2515f9/build/Release -include /var/folders/kd/sc_9pj4j5js7wd5qmjqjvsbh0000gp/C/com.apple.DeveloperTools/7.1-7B91b/Xcode/SharedPrecompiledHeaders/AckMate_Prefix-gkimuosxfazvvcfqsqnfrvjjijyv/AckMate_Prefix.pch -MMD -MT dependencies -MF /opt/local/var/macports/build/_opt_macports_trunk_dports_editors_ackmate/ackmate/work/AckMate-f2515f9/build/AckMate.build/Release/AckMate.build/Objects-normal/x86_64/JPAckWindowController.d --serialize-diagnostics /opt/local/var/macports/build/_opt_macports_trunk_dports_editors_ackmate/ackmate/work/AckMate-f2515f9/build/AckMate.build/Release/AckMate.build/Objects-normal/x86_64/JPAckWindowController.dia -c /opt/local/var/macports/build/_opt_macports_trunk_dports_editors_ackmate/ackmate/work/AckMate-f2515f9/source/controllers/JPAckWindowController.m -o /opt/local/var/macports/build/_opt_macports_trunk_dports_editors_ackmate/ackmate/work/AckMate-f2515f9/build/AckMate.build/Release/AckMate.build/Objects-normal/x86_64/JPAckWindowController.o
1158:info:build
1159:info:build CompileC build/AckMate.build/Release/AckMate.build/Objects-normal/x86_64/AckMatePlugin.o source/controllers/AckMatePlugin.m normal x86_64 objective-c com.apple.compilers.llvm.clang.1_0.compiler
1160:info:build     cd /opt/local/var/macports/build/_opt_macports_trunk_dports_editors_ackmate/ackmate/work/AckMate-f2515f9
1161:info:build     export LANG=en_US.US-ASCII
1162:info:build     /Applications/Xcode.app/Contents/Developer/Toolchains/XcodeDefault.xctoolchain/usr/bin/clang -x objective-c -arch x86_64 -fmessage-length=0 -fdiagnostics-show-note-include-stack -fmacro-backtrace-limit=0 -Wno-trigraphs -fpascal-strings -Os -Wno-missing-field-initializers -Wno-missing-prototypes -Wno-implicit-atomic-properties -Wno-arc-repeated-use-of-weak -Wno-missing-braces -Wparentheses -Wswitch -Wno-unused-function -Wno-unused-label -Wno-unused-parameter -Wunused-variable -Wunused-value -Wno-empty-body -Wno-uninitialized -Wno-unknown-pragmas -Wno-shadow -Wno-four-char-constants -Wno-conversion -Wno-constant-conversion -Wno-int-conversion -Wno-bool-conversion -Wno-enum-conversion -Wno-shorten-64-to-32 -Wpointer-sign -Wno-newline-eof -Wno-selector -Wno-strict-selector-match -Wno-undeclared-selector -Wno-deprecated-implementations -isysroot /Applications/Xcode.app/Contents/Developer/Platforms/MacOSX.platform/Developer/SDKs/MacOSX10.11.sdk -fasm-blocks -fstrict-aliasing -Wprotocol -Wdeprecated-declarations -mmacosx-version-min=10.10 -Wno-sign-conversion -I/opt/local/var/macports/build/_opt_macports_trunk_dports_editors_ackmate/ackmate/work/AckMate-f2515f9/build/AckMate.build/Release/AckMate.build/AckMate.hmap -I/opt/local/var/macports/build/_opt_macports_trunk_dports_editors_ackmate/ackmate/work/AckMate-f2515f9/build/Release/include -I/opt/local/var/macports/build/_opt_macports_trunk_dports_editors_ackmate/ackmate/work/AckMate-f2515f9/build/AckMate.build/Release/AckMate.build/DerivedSources/x86_64 -I/opt/local/var/macports/build/_opt_macports_trunk_dports_editors_ackmate/ackmate/work/AckMate-f2515f9/build/AckMate.build/Release/AckMate.build/DerivedSources -F/opt/local/var/macports/build/_opt_macports_trunk_dports_editors_ackmate/ackmate/work/AckMate-f2515f9/build/Release -include /var/folders/kd/sc_9pj4j5js7wd5qmjqjvsbh0000gp/C/com.apple.DeveloperTools/7.1-7B91b/Xcode/SharedPrecompiledHeaders/AckMate_Prefix-gkimuosxfazvvcfqsqnfrvjjijyv/AckMate_Prefix.pch -MMD -MT dependencies -MF /opt/local/var/macports/build/_opt_macports_trunk_dports_editors_ackmate/ackmate/work/AckMate-f2515f9/build/AckMate.build/Release/AckMate.build/Objects-normal/x86_64/AckMatePlugin.d --serialize-diagnostics /opt/local/var/macports/build/_opt_macports_trunk_dports_editors_ackmate/ackmate/work/AckMate-f2515f9/build/AckMate.build/Release/AckMate.build/Objects-normal/x86_64/AckMatePlugin.dia -c /opt/local/var/macports/build/_opt_macports_trunk_dports_editors_ackmate/ackmate/work/AckMate-f2515f9/source/controllers/AckMatePlugin.m -o /opt/local/var/macports/build/_opt_macports_trunk_dports_editors_ackmate/ackmate/work/AckMate-f2515f9/build/AckMate.build/Release/AckMate.build/Objects-normal/x86_64/AckMatePlugin.o
1163:info:build
1164:info:build CompileC build/AckMate.build/Release/AckMate.build/Objects-normal/x86_64/JPAckTypesProcess.o source/controllers/JPAckTypesProcess.m normal x86_64 objective-c com.apple.compilers.llvm.clang.1_0.compiler
1165:info:build     cd /opt/local/var/macports/build/_opt_macports_trunk_dports_editors_ackmate/ackmate/work/AckMate-f2515f9
1166:info:build     export LANG=en_US.US-ASCII
1167:info:build     /Applications/Xcode.app/Contents/Developer/Toolchains/XcodeDefault.xctoolchain/usr/bin/clang -x objective-c -arch x86_64 -fmessage-length=0 -fdiagnostics-show-note-include-stack -fmacro-backtrace-limit=0 -Wno-trigraphs -fpascal-strings -Os -Wno-missing-field-initializers -Wno-missing-prototypes -Wno-implicit-atomic-properties -Wno-arc-repeated-use-of-weak -Wno-missing-braces -Wparentheses -Wswitch -Wno-unused-function -Wno-unused-label -Wno-unused-parameter -Wunused-variable -Wunused-value -Wno-empty-body -Wno-uninitialized -Wno-unknown-pragmas -Wno-shadow -Wno-four-char-constants -Wno-conversion -Wno-constant-conversion -Wno-int-conversion -Wno-bool-conversion -Wno-enum-conversion -Wno-shorten-64-to-32 -Wpointer-sign -Wno-newline-eof -Wno-selector -Wno-strict-selector-match -Wno-undeclared-selector -Wno-deprecated-implementations -isysroot /Applications/Xcode.app/Contents/Developer/Platforms/MacOSX.platform/Developer/SDKs/MacOSX10.11.sdk -fasm-blocks -fstrict-aliasing -Wprotocol -Wdeprecated-declarations -mmacosx-version-min=10.10 -Wno-sign-conversion -I/opt/local/var/macports/build/_opt_macports_trunk_dports_editors_ackmate/ackmate/work/AckMate-f2515f9/build/AckMate.build/Release/AckMate.build/AckMate.hmap -I/opt/local/var/macports/build/_opt_macports_trunk_dports_editors_ackmate/ackmate/work/AckMate-f2515f9/build/Release/include -I/opt/local/var/macports/build/_opt_macports_trunk_dports_editors_ackmate/ackmate/work/AckMate-f2515f9/build/AckMate.build/Release/AckMate.build/DerivedSources/x86_64 -I/opt/local/var/macports/build/_opt_macports_trunk_dports_editors_ackmate/ackmate/work/AckMate-f2515f9/build/AckMate.build/Release/AckMate.build/DerivedSources -F/opt/local/var/macports/build/_opt_macports_trunk_dports_editors_ackmate/ackmate/work/AckMate-f2515f9/build/Release -include /var/folders/kd/sc_9pj4j5js7wd5qmjqjvsbh0000gp/C/com.apple.DeveloperTools/7.1-7B91b/Xcode/SharedPrecompiledHeaders/AckMate_Prefix-gkimuosxfazvvcfqsqnfrvjjijyv/AckMate_Prefix.pch -MMD -MT dependencies -MF /opt/local/var/macports/build/_opt_macports_trunk_dports_editors_ackmate/ackmate/work/AckMate-f2515f9/build/AckMate.build/Release/AckMate.build/Objects-normal/x86_64/JPAckTypesProcess.d --serialize-diagnostics /opt/local/var/macports/build/_opt_macports_trunk_dports_editors_ackmate/ackmate/work/AckMate-f2515f9/build/AckMate.build/Release/AckMate.build/Objects-normal/x86_64/JPAckTypesProcess.dia -c /opt/local/var/macports/build/_opt_macports_trunk_dports_editors_ackmate/ackmate/work/AckMate-f2515f9/source/controllers/JPAckTypesProcess.m -o /opt/local/var/macports/build/_opt_macports_trunk_dports_editors_ackmate/ackmate/work/AckMate-f2515f9/build/AckMate.build/Release/AckMate.build/Objects-normal/x86_64/JPAckTypesProcess.o
1168:info:build
1169:info:build CompileC build/AckMate.build/Release/AckMate.build/Objects-normal/x86_64/JPAckResultRep.o source/models/JPAckResultRep.m normal x86_64 objective-c com.apple.compilers.llvm.clang.1_0.compiler
1170:info:build     cd /opt/local/var/macports/build/_opt_macports_trunk_dports_editors_ackmate/ackmate/work/AckMate-f2515f9
1171:info:build     export LANG=en_US.US-ASCII
1172:info:build     /Applications/Xcode.app/Contents/Developer/Toolchains/XcodeDefault.xctoolchain/usr/bin/clang -x objective-c -arch x86_64 -fmessage-length=0 -fdiagnostics-show-note-include-stack -fmacro-backtrace-limit=0 -Wno-trigraphs -fpascal-strings -Os -Wno-missing-field-initializers -Wno-missing-prototypes -Wno-implicit-atomic-properties -Wno-arc-repeated-use-of-weak -Wno-missing-braces -Wparentheses -Wswitch -Wno-unused-function -Wno-unused-label -Wno-unused-parameter -Wunused-variable -Wunused-value -Wno-empty-body -Wno-uninitialized -Wno-unknown-pragmas -Wno-shadow -Wno-four-char-constants -Wno-conversion -Wno-constant-conversion -Wno-int-conversion -Wno-bool-conversion -Wno-enum-conversion -Wno-shorten-64-to-32 -Wpointer-sign -Wno-newline-eof -Wno-selector -Wno-strict-selector-match -Wno-undeclared-selector -Wno-deprecated-implementations -isysroot /Applications/Xcode.app/Contents/Developer/Platforms/MacOSX.platform/Developer/SDKs/MacOSX10.11.sdk -fasm-blocks -fstrict-aliasing -Wprotocol -Wdeprecated-declarations -mmacosx-version-min=10.10 -Wno-sign-conversion -I/opt/local/var/macports/build/_opt_macports_trunk_dports_editors_ackmate/ackmate/work/AckMate-f2515f9/build/AckMate.build/Release/AckMate.build/AckMate.hmap -I/opt/local/var/macports/build/_opt_macports_trunk_dports_editors_ackmate/ackmate/work/AckMate-f2515f9/build/Release/include -I/opt/local/var/macports/build/_opt_macports_trunk_dports_editors_ackmate/ackmate/work/AckMate-f2515f9/build/AckMate.build/Release/AckMate.build/DerivedSources/x86_64 -I/opt/local/var/macports/build/_opt_macports_trunk_dports_editors_ackmate/ackmate/work/AckMate-f2515f9/build/AckMate.build/Release/AckMate.build/DerivedSources -F/opt/local/var/macports/build/_opt_macports_trunk_dports_editors_ackmate/ackmate/work/AckMate-f2515f9/build/Release -include /var/folders/kd/sc_9pj4j5js7wd5qmjqjvsbh0000gp/C/com.apple.DeveloperTools/7.1-7B91b/Xcode/SharedPrecompiledHeaders/AckMate_Prefix-gkimuosxfazvvcfqsqnfrvjjijyv/AckMate_Prefix.pch -MMD -MT dependencies -MF /opt/local/var/macports/build/_opt_macports_trunk_dports_editors_ackmate/ackmate/work/AckMate-f2515f9/build/AckMate.build/Release/AckMate.build/Objects-normal/x86_64/JPAckResultRep.d --serialize-diagnostics /opt/local/var/macports/build/_opt_macports_trunk_dports_editors_ackmate/ackmate/work/AckMate-f2515f9/build/AckMate.build/Release/AckMate.build/Objects-normal/x86_64/JPAckResultRep.dia -c /opt/local/var/macports/build/_opt_macports_trunk_dports_editors_ackmate/ackmate/work/AckMate-f2515f9/source/models/JPAckResultRep.m -o /opt/local/var/macports/build/_opt_macports_trunk_dports_editors_ackmate/ackmate/work/AckMate-f2515f9/build/AckMate.build/Release/AckMate.build/Objects-normal/x86_64/JPAckResultRep.o
1173:info:build
1174:info:build CompileC build/AckMate.build/Release/AckMate.build/Objects-normal/x86_64/JPAckResult.o source/models/JPAckResult.m normal x86_64 objective-c com.apple.compilers.llvm.clang.1_0.compiler
1175:info:build     cd /opt/local/var/macports/build/_opt_macports_trunk_dports_editors_ackmate/ackmate/work/AckMate-f2515f9
1176:info:build     export LANG=en_US.US-ASCII
1177:info:build     /Applications/Xcode.app/Contents/Developer/Toolchains/XcodeDefault.xctoolchain/usr/bin/clang -x objective-c -arch x86_64 -fmessage-length=0 -fdiagnostics-show-note-include-stack -fmacro-backtrace-limit=0 -Wno-trigraphs -fpascal-strings -Os -Wno-missing-field-initializers -Wno-missing-prototypes -Wno-implicit-atomic-properties -Wno-arc-repeated-use-of-weak -Wno-missing-braces -Wparentheses -Wswitch -Wno-unused-function -Wno-unused-label -Wno-unused-parameter -Wunused-variable -Wunused-value -Wno-empty-body -Wno-uninitialized -Wno-unknown-pragmas -Wno-shadow -Wno-four-char-constants -Wno-conversion -Wno-constant-conversion -Wno-int-conversion -Wno-bool-conversion -Wno-enum-conversion -Wno-shorten-64-to-32 -Wpointer-sign -Wno-newline-eof -Wno-selector -Wno-strict-selector-match -Wno-undeclared-selector -Wno-deprecated-implementations -isysroot /Applications/Xcode.app/Contents/Developer/Platforms/MacOSX.platform/Developer/SDKs/MacOSX10.11.sdk -fasm-blocks -fstrict-aliasing -Wprotocol -Wdeprecated-declarations -mmacosx-version-min=10.10 -Wno-sign-conversion -I/opt/local/var/macports/build/_opt_macports_trunk_dports_editors_ackmate/ackmate/work/AckMate-f2515f9/build/AckMate.build/Release/AckMate.build/AckMate.hmap -I/opt/local/var/macports/build/_opt_macports_trunk_dports_editors_ackmate/ackmate/work/AckMate-f2515f9/build/Release/include -I/opt/local/var/macports/build/_opt_macports_trunk_dports_editors_ackmate/ackmate/work/AckMate-f2515f9/build/AckMate.build/Release/AckMate.build/DerivedSources/x86_64 -I/opt/local/var/macports/build/_opt_macports_trunk_dports_editors_ackmate/ackmate/work/AckMate-f2515f9/build/AckMate.build/Release/AckMate.build/DerivedSources -F/opt/local/var/macports/build/_opt_macports_trunk_dports_editors_ackmate/ackmate/work/AckMate-f2515f9/build/Release -include /var/folders/kd/sc_9pj4j5js7wd5qmjqjvsbh0000gp/C/com.apple.DeveloperTools/7.1-7B91b/Xcode/SharedPrecompiledHeaders/AckMate_Prefix-gkimuosxfazvvcfqsqnfrvjjijyv/AckMate_Prefix.pch -MMD -MT dependencies -MF /opt/local/var/macports/build/_opt_macports_trunk_dports_editors_ackmate/ackmate/work/AckMate-f2515f9/build/AckMate.build/Release/AckMate.build/Objects-normal/x86_64/JPAckResult.d --serialize-diagnostics /opt/local/var/macports/build/_opt_macports_trunk_dports_editors_ackmate/ackmate/work/AckMate-f2515f9/build/AckMate.build/Release/AckMate.build/Objects-normal/x86_64/JPAckResult.dia -c /opt/local/var/macports/build/_opt_macports_trunk_dports_editors_ackmate/ackmate/work/AckMate-f2515f9/source/models/JPAckResult.m -o /opt/local/var/macports/build/_opt_macports_trunk_dports_editors_ackmate/ackmate/work/AckMate-f2515f9/build/AckMate.build/Release/AckMate.build/Objects-normal/x86_64/JPAckResult.o
1178:info:build
1179:info:build CompileC build/AckMate.build/Release/AckMate.build/Objects-normal/x86_64/JPAckSearchButton.o source/views/JPAckSearchButton.m normal x86_64 objective-c com.apple.compilers.llvm.clang.1_0.compiler
1180:info:build     cd /opt/local/var/macports/build/_opt_macports_trunk_dports_editors_ackmate/ackmate/work/AckMate-f2515f9
1181:info:build     export LANG=en_US.US-ASCII
1182:info:build     /Applications/Xcode.app/Contents/Developer/Toolchains/XcodeDefault.xctoolchain/usr/bin/clang -x objective-c -arch x86_64 -fmessage-length=0 -fdiagnostics-show-note-include-stack -fmacro-backtrace-limit=0 -Wno-trigraphs -fpascal-strings -Os -Wno-missing-field-initializers -Wno-missing-prototypes -Wno-implicit-atomic-properties -Wno-arc-repeated-use-of-weak -Wno-missing-braces -Wparentheses -Wswitch -Wno-unused-function -Wno-unused-label -Wno-unused-parameter -Wunused-variable -Wunused-value -Wno-empty-body -Wno-uninitialized -Wno-unknown-pragmas -Wno-shadow -Wno-four-char-constants -Wno-conversion -Wno-constant-conversion -Wno-int-conversion -Wno-bool-conversion -Wno-enum-conversion -Wno-shorten-64-to-32 -Wpointer-sign -Wno-newline-eof -Wno-selector -Wno-strict-selector-match -Wno-undeclared-selector -Wno-deprecated-implementations -isysroot /Applications/Xcode.app/Contents/Developer/Platforms/MacOSX.platform/Developer/SDKs/MacOSX10.11.sdk -fasm-blocks -fstrict-aliasing -Wprotocol -Wdeprecated-declarations -mmacosx-version-min=10.10 -Wno-sign-conversion -I/opt/local/var/macports/build/_opt_macports_trunk_dports_editors_ackmate/ackmate/work/AckMate-f2515f9/build/AckMate.build/Release/AckMate.build/AckMate.hmap -I/opt/local/var/macports/build/_opt_macports_trunk_dports_editors_ackmate/ackmate/work/AckMate-f2515f9/build/Release/include -I/opt/local/var/macports/build/_opt_macports_trunk_dports_editors_ackmate/ackmate/work/AckMate-f2515f9/build/AckMate.build/Release/AckMate.build/DerivedSources/x86_64 -I/opt/local/var/macports/build/_opt_macports_trunk_dports_editors_ackmate/ackmate/work/AckMate-f2515f9/build/AckMate.build/Release/AckMate.build/DerivedSources -F/opt/local/var/macports/build/_opt_macports_trunk_dports_editors_ackmate/ackmate/work/AckMate-f2515f9/build/Release -include /var/folders/kd/sc_9pj4j5js7wd5qmjqjvsbh0000gp/C/com.apple.DeveloperTools/7.1-7B91b/Xcode/SharedPrecompiledHeaders/AckMate_Prefix-gkimuosxfazvvcfqsqnfrvjjijyv/AckMate_Prefix.pch -MMD -MT dependencies -MF /opt/local/var/macports/build/_opt_macports_trunk_dports_editors_ackmate/ackmate/work/AckMate-f2515f9/build/AckMate.build/Release/AckMate.build/Objects-normal/x86_64/JPAckSearchButton.d --serialize-diagnostics /opt/local/var/macports/build/_opt_macports_trunk_dports_editors_ackmate/ackmate/work/AckMate-f2515f9/build/AckMate.build/Release/AckMate.build/Objects-normal/x86_64/JPAckSearchButton.dia -c /opt/local/var/macports/build/_opt_macports_trunk_dports_editors_ackmate/ackmate/work/AckMate-f2515f9/source/views/JPAckSearchButton.m -o /opt/local/var/macports/build/_opt_macports_trunk_dports_editors_ackmate/ackmate/work/AckMate-f2515f9/build/AckMate.build/Release/AckMate.build/Objects-normal/x86_64/JPAckSearchButton.o
1183:info:build
1184:info:build Ld build/Release/AckMate.tmplugin/Contents/MacOS/AckMate normal x86_64
1185:info:build     cd /opt/local/var/macports/build/_opt_macports_trunk_dports_editors_ackmate/ackmate/work/AckMate-f2515f9
1186:info:build     export MACOSX_DEPLOYMENT_TARGET=10.10
1187:info:build     /Applications/Xcode.app/Contents/Developer/Toolchains/XcodeDefault.xctoolchain/usr/bin/clang -arch x86_64 -bundle -isysroot /Applications/Xcode.app/Contents/Developer/Platforms/MacOSX.platform/Developer/SDKs/MacOSX10.11.sdk -L/opt/local/var/macports/build/_opt_macports_trunk_dports_editors_ackmate/ackmate/work/AckMate-f2515f9/build/Release -F/opt/local/var/macports/build/_opt_macports_trunk_dports_editors_ackmate/ackmate/work/AckMate-f2515f9/build/Release -filelist /opt/local/var/macports/build/_opt_macports_trunk_dports_editors_ackmate/ackmate/work/AckMate-f2515f9/build/AckMate.build/Release/AckMate.build/Objects-normal/x86_64/AckMate.LinkFileList -mmacosx-version-min=10.10 -fobjc-link-runtime -framework Cocoa -Xlinker -dependency_info -Xlinker /opt/local/var/macports/build/_opt_macports_trunk_dports_editors_ackmate/ackmate/work/AckMate-f2515f9/build/AckMate.build/Release/AckMate.build/Objects-normal/x86_64/AckMate_dependency_info.dat -o /opt/local/var/macports/build/_opt_macports_trunk_dports_editors_ackmate/ackmate/work/AckMate-f2515f9/build/Release/AckMate.tmplugin/Contents/MacOS/AckMate
1188:info:build
1189:info:build PhaseScriptExecution Run\ Script build/AckMate.build/Release/AckMate.build/Script-177E4DB50913322B0064163D.sh
1190:info:build     cd /opt/local/var/macports/build/_opt_macports_trunk_dports_editors_ackmate/ackmate/work/AckMate-f2515f9
1191:info:build     export ACTION=build
1192:info:build     export ALTERNATE_GROUP=macports
1193:info:build     export ALTERNATE_MODE=u+w,go-w,a+rX
1194:info:build     export ALTERNATE_OWNER=macports
1195:info:build     export ALWAYS_SEARCH_USER_PATHS=YES
1196:info:build     export ALWAYS_USE_SEPARATE_HEADERMAPS=NO
1197:info:build     export APPLE_INTERNAL_DEVELOPER_DIR=/AppleInternal/Developer
1198:info:build     export APPLE_INTERNAL_DIR=/AppleInternal
1199:info:build     export APPLE_INTERNAL_DOCUMENTATION_DIR=/AppleInternal/Documentation
1200:info:build     export APPLE_INTERNAL_LIBRARY_DIR=/AppleInternal/Library
1201:info:build     export APPLE_INTERNAL_TOOLS=/AppleInternal/Developer/Tools
1202:info:build     export APPLICATION_EXTENSION_API_ONLY=NO
1203:info:build     export APPLY_RULES_IN_COPY_FILES=NO
1204:info:build     export ARCHS=x86_64
1205:info:build     export ARCHS_STANDARD=x86_64
1206:info:build     export ARCHS_STANDARD_32_64_BIT="x86_64 i386"
1207:info:build     export ARCHS_STANDARD_32_BIT=i386
1208:info:build     export ARCHS_STANDARD_64_BIT=x86_64
1209:info:build     export ARCHS_STANDARD_INCLUDING_64_BIT=x86_64
1210:info:build     export AVAILABLE_PLATFORMS="watchos iphonesimulator macosx appletvsimulator watchsimulator appletvos iphoneos"
1211:info:build     export BITCODE_GENERATION_MODE=marker
1212:info:build     export BUILD_ACTIVE_RESOURCES_ONLY=NO
1213:info:build     export BUILD_COMPONENTS="headers build"
1214:info:build     export BUILD_DIR=/opt/local/var/macports/build/_opt_macports_trunk_dports_editors_ackmate/ackmate/work/AckMate-f2515f9/build
1215:info:build     export BUILD_ROOT=/opt/local/var/macports/build/_opt_macports_trunk_dports_editors_ackmate/ackmate/work/AckMate-f2515f9/build
1216:info:build     export BUILD_STYLE=
1217:info:build     export BUILD_VARIANTS=normal
1218:info:build     export BUILT_PRODUCTS_DIR=/opt/local/var/macports/build/_opt_macports_trunk_dports_editors_ackmate/ackmate/work/AckMate-f2515f9/build/Release
1219:info:build     export CACHE_ROOT=/var/folders/kd/sc_9pj4j5js7wd5qmjqjvsbh0000gp/C/com.apple.DeveloperTools/7.1-7B91b/Xcode
1220:info:build     export CCHROOT=/var/folders/kd/sc_9pj4j5js7wd5qmjqjvsbh0000gp/C/com.apple.DeveloperTools/7.1-7B91b/Xcode
1221:info:build     export CHMOD=/bin/chmod
1222:info:build     export CHOWN=/usr/sbin/chown
1223:info:build     export CLANG_CXX_LIBRARY=libc++
1224:info:build     export CLANG_MODULES_BUILD_SESSION_FILE=/var/folders/kd/sc_9pj4j5js7wd5qmjqjvsbh0000gp/C/org.llvm.clang/ModuleCache/Session.modulevalidation
1225:info:build     export CLASS_FILE_DIR=/opt/local/var/macports/build/_opt_macports_trunk_dports_editors_ackmate/ackmate/work/AckMate-f2515f9/build/AckMate.build/Release/AckMate.build/JavaClasses
1226:info:build     export CLEAN_PRECOMPS=YES
1227:info:build     export CLONE_HEADERS=NO
1228:info:build     export CODESIGNING_FOLDER_PATH=/opt/local/var/macports/build/_opt_macports_trunk_dports_editors_ackmate/ackmate/work/AckMate-f2515f9/build/Release/AckMate.tmplugin
1229:info:build     export CODE_SIGNING_ALLOWED=YES
1230:info:build     export COLOR_DIAGNOSTICS=NO
1231:info:build     export COMBINE_HIDPI_IMAGES=NO
1232:info:build     export COMMAND_MODE=legacy
1233:info:build     export COMPOSITE_SDK_DIRS=/var/folders/kd/sc_9pj4j5js7wd5qmjqjvsbh0000gp/C/com.apple.DeveloperTools/7.1-7B91b/Xcode/CompositeSDKs
1234:info:build     export CONFIGURATION=Release
1235:info:build     export CONFIGURATION_BUILD_DIR=/opt/local/var/macports/build/_opt_macports_trunk_dports_editors_ackmate/ackmate/work/AckMate-f2515f9/build/Release
1236:info:build     export CONFIGURATION_TEMP_DIR=/opt/local/var/macports/build/_opt_macports_trunk_dports_editors_ackmate/ackmate/work/AckMate-f2515f9/build/AckMate.build/Release
1237:info:build     export CONTENTS_FOLDER_PATH=AckMate.tmplugin/Contents
1238:info:build     export COPYING_PRESERVES_HFS_DATA=NO
1239:info:build     export COPY_HEADERS_RUN_UNIFDEF=NO
1240:info:build     export COPY_PHASE_STRIP=YES
1241:info:build     export COPY_RESOURCES_FROM_STATIC_FRAMEWORKS=YES
1242:info:build     export CP=/bin/cp
1243:info:build     export CREATE_INFOPLIST_SECTION_IN_BINARY=NO
1244:info:build     export CURRENT_ARCH=x86_64
1245:info:build     export CURRENT_VARIANT=normal
1246:info:build     export DEAD_CODE_STRIPPING=NO
1247:info:build     export DEBUGGING_SYMBOLS=YES
1248:info:build     export DEBUG_INFORMATION_FORMAT=dwarf
1249:info:build     export DEFAULT_COMPILER=com.apple.compilers.llvm.clang.1_0
1250:info:build     export DEFAULT_KEXT_INSTALL_PATH=/Library/Extensions
1251:info:build     export DEFINES_MODULE=NO
1252:info:build     export DEPLOYMENT_LOCATION=NO
1253:info:build     export DEPLOYMENT_POSTPROCESSING=NO
1254:info:build     export DEPLOYMENT_TARGET_CLANG_ENV_NAME=MACOSX_DEPLOYMENT_TARGET
1255:info:build     export DEPLOYMENT_TARGET_CLANG_FLAG_NAME=mmacosx-version-min
1256:info:build     export DEPLOYMENT_TARGET_SETTING_NAME=MACOSX_DEPLOYMENT_TARGET
1257:info:build     export DERIVED_FILES_DIR=/opt/local/var/macports/build/_opt_macports_trunk_dports_editors_ackmate/ackmate/work/AckMate-f2515f9/build/AckMate.build/Release/AckMate.build/DerivedSources
1258:info:build     export DERIVED_FILE_DIR=/opt/local/var/macports/build/_opt_macports_trunk_dports_editors_ackmate/ackmate/work/AckMate-f2515f9/build/AckMate.build/Release/AckMate.build/DerivedSources
1259:info:build     export DERIVED_SOURCES_DIR=/opt/local/var/macports/build/_opt_macports_trunk_dports_editors_ackmate/ackmate/work/AckMate-f2515f9/build/AckMate.build/Release/AckMate.build/DerivedSources
1260:info:build     export DEVELOPER_APPLICATIONS_DIR=/Applications/Xcode.app/Contents/Developer/Applications
1261:info:build     export DEVELOPER_BIN_DIR=/Applications/Xcode.app/Contents/Developer/usr/bin
1262:info:build     export DEVELOPER_DIR=/Applications/Xcode.app/Contents/Developer
1263:info:build     export DEVELOPER_FRAMEWORKS_DIR=/Applications/Xcode.app/Contents/Developer/Library/Frameworks
1264:info:build     export DEVELOPER_FRAMEWORKS_DIR_QUOTED=/Applications/Xcode.app/Contents/Developer/Library/Frameworks
1265:info:build     export DEVELOPER_LIBRARY_DIR=/Applications/Xcode.app/Contents/Developer/Library
1266:info:build     export DEVELOPER_SDK_DIR=/Applications/Xcode.app/Contents/Developer/Platforms/MacOSX.platform/Developer/SDKs
1267:info:build     export DEVELOPER_TOOLS_DIR=/Applications/Xcode.app/Contents/Developer/Tools
1268:info:build     export DEVELOPER_USR_DIR=/Applications/Xcode.app/Contents/Developer/usr
1269:info:build     export DEVELOPMENT_LANGUAGE=English
1270:info:build     export DOCUMENTATION_FOLDER_PATH=AckMate.tmplugin/Contents/Resources/English.lproj/Documentation
1271:info:build     export DO_HEADER_SCANNING_IN_JAM=NO
1272:info:build     export DSTROOT=/tmp/AckMate.dst
1273:info:build     export DT_TOOLCHAIN_DIR=/Applications/Xcode.app/Contents/Developer/Toolchains/XcodeDefault.xctoolchain
1274:info:build     export DWARF_DSYM_FILE_NAME=AckMate.tmplugin.dSYM
1275:info:build     export DWARF_DSYM_FILE_SHOULD_ACCOMPANY_PRODUCT=NO
1276:info:build     export DWARF_DSYM_FOLDER_PATH=/opt/local/var/macports/build/_opt_macports_trunk_dports_editors_ackmate/ackmate/work/AckMate-f2515f9/build/Release
1277:info:build     export EMBEDDED_CONTENT_CONTAINS_SWIFT=NO
1278:info:build     export EMBEDDED_PROFILE_NAME=embedded.provisionprofile
1279:info:build     export EMBED_ASSET_PACKS_IN_PRODUCT_BUNDLE=NO
1280:info:build     export ENABLE_BITCODE=NO
1281:info:build     export ENABLE_HEADER_DEPENDENCIES=YES
1282:info:build     export ENABLE_ON_DEMAND_RESOURCES=NO
1283:info:build     export ENABLE_TESTABILITY=NO
1284:info:build     export EXCLUDED_INSTALLSRC_SUBDIRECTORY_PATTERNS=".DS_Store .svn .git .hg CVS"
1285:info:build     export EXCLUDED_RECURSIVE_SEARCH_PATH_SUBDIRECTORIES="*.nib *.lproj *.framework *.gch *.xcode* *.xcassets (*) .DS_Store CVS .svn .git .hg *.pbproj *.pbxproj"
1286:info:build     export EXECUTABLES_FOLDER_PATH=AckMate.tmplugin/Contents/Executables
1287:info:build     export EXECUTABLE_FOLDER_PATH=AckMate.tmplugin/Contents/MacOS
1288:info:build     export EXECUTABLE_NAME=AckMate
1289:info:build     export EXECUTABLE_PATH=AckMate.tmplugin/Contents/MacOS/AckMate
1290:info:build     export EXPANDED_CODE_SIGN_IDENTITY=
1291:info:build     export EXPANDED_CODE_SIGN_IDENTITY_NAME=
1292:info:build     export EXPANDED_PROVISIONING_PROFILE=
1293:info:build     export FILE_LIST=/opt/local/var/macports/build/_opt_macports_trunk_dports_editors_ackmate/ackmate/work/AckMate-f2515f9/build/AckMate.build/Release/AckMate.build/Objects/LinkFileList
1294:info:build     export FIXED_FILES_DIR=/opt/local/var/macports/build/_opt_macports_trunk_dports_editors_ackmate/ackmate/work/AckMate-f2515f9/build/AckMate.build/Release/AckMate.build/FixedFiles
1295:info:build     export FRAMEWORKS_FOLDER_PATH=AckMate.tmplugin/Contents/Frameworks
1296:info:build     export FRAMEWORK_FLAG_PREFIX=-framework
1297:info:build     export FRAMEWORK_SEARCH_PATHS="/opt/local/var/macports/build/_opt_macports_trunk_dports_editors_ackmate/ackmate/work/AckMate-f2515f9/build/Release "
1298:info:build     export FRAMEWORK_VERSION=A
1299:info:build     export FULL_PRODUCT_NAME=AckMate.tmplugin
1300:info:build     export GCC3_VERSION=3.3
1301:info:build     export GCC_GENERATE_DEBUGGING_SYMBOLS=NO
1302:info:build     export GCC_INLINES_ARE_PRIVATE_EXTERN=YES
1303:info:build     export GCC_MODEL_TUNING=G5
1304:info:build     export GCC_PFE_FILE_C_DIALECTS="c objective-c c++ objective-c++"
1305:info:build     export GCC_PRECOMPILE_PREFIX_HEADER=YES
1306:info:build     export GCC_PREFIX_HEADER=AckMate_Prefix.pch
1307:info:build     export GCC_TREAT_WARNINGS_AS_ERRORS=NO
1308:info:build     export GCC_VERSION=com.apple.compilers.llvm.clang.1_0
1309:info:build     export GCC_VERSION_IDENTIFIER=com_apple_compilers_llvm_clang_1_0
1310:info:build     export GCC_WARN_ABOUT_RETURN_TYPE=YES
1311:info:build     export GCC_WARN_UNUSED_VARIABLE=YES
1312:info:build     export GENERATE_MASTER_OBJECT_FILE=NO
1313:info:build     export GENERATE_PKGINFO_FILE=NO
1314:info:build     export GENERATE_PROFILING_CODE=NO
1315:info:build     export GID=501
1316:info:build     export GROUP=macports
1317:info:build     export HEADERMAP_INCLUDES_FLAT_ENTRIES_FOR_TARGET_BEING_BUILT=YES
1318:info:build     export HEADERMAP_INCLUDES_FRAMEWORK_ENTRIES_FOR_ALL_PRODUCT_TYPES=YES
1319:info:build     export HEADERMAP_INCLUDES_NONPUBLIC_NONPRIVATE_HEADERS=YES
1320:info:build     export HEADERMAP_INCLUDES_PROJECT_HEADERS=YES
1321:info:build     export HEADERMAP_USES_FRAMEWORK_PREFIX_ENTRIES=YES
1322:info:build     export HEADERMAP_USES_VFS=NO
1323:info:build     export HEADER_SEARCH_PATHS="/opt/local/var/macports/build/_opt_macports_trunk_dports_editors_ackmate/ackmate/work/AckMate-f2515f9/build/Release/include "
1324:info:build     export HIDE_BITCODE_SYMBOLS=YES
1325:info:build     export HOME=/opt/local/var/macports/home
1326:info:build     export ICONV=/usr/bin/iconv
1327:info:build     export INFOPLIST_EXPAND_BUILD_SETTINGS=YES
1328:info:build     export INFOPLIST_FILE=Info.plist
1329:info:build     export INFOPLIST_OUTPUT_FORMAT=same-as-input
1330:info:build     export INFOPLIST_PATH=AckMate.tmplugin/Contents/Info.plist
1331:info:build     export INFOPLIST_PREPROCESS=NO
1332:info:build     export INFOSTRINGS_PATH=AckMate.tmplugin/Contents/Resources/English.lproj/InfoPlist.strings
1333:info:build     export INSTALL_DIR=/tmp/AckMate.dst/opt/local/var/macports/home/Library/Bundles
1334:info:build     export INSTALL_GROUP=macports
1335:info:build     export INSTALL_MODE_FLAG=u+w,go-w,a+rX
1336:info:build     export INSTALL_OWNER=macports
1337:info:build     export INSTALL_PATH=/opt/local/var/macports/home/Library/Bundles
1338:info:build     export INSTALL_ROOT=/tmp/AckMate.dst
1339:info:build     export JAVAC_DEFAULT_FLAGS="-J-Xms64m -J-XX:NewSize=4M -J-Dfile.encoding=UTF8"
1340:info:build     export JAVA_APP_STUB=/System/Library/Frameworks/JavaVM.framework/Resources/MacOS/JavaApplicationStub
1341:info:build     export JAVA_ARCHIVE_CLASSES=YES
1342:info:build     export JAVA_ARCHIVE_TYPE=JAR
1343:info:build     export JAVA_COMPILER=/usr/bin/javac
1344:info:build     export JAVA_FOLDER_PATH=AckMate.tmplugin/Contents/Resources/Java
1345:info:build     export JAVA_FRAMEWORK_RESOURCES_DIRS=Resources
1346:info:build     export JAVA_JAR_FLAGS=cv
1347:info:build     export JAVA_SOURCE_SUBDIR=.
1348:info:build     export JAVA_USE_DEPENDENCIES=YES
1349:info:build     export JAVA_ZIP_FLAGS=-urg
1350:info:build     export JIKES_DEFAULT_FLAGS="+E +OLDCSO"
1351:info:build     export KEEP_PRIVATE_EXTERNS=NO
1352:info:build     export LD_DEPENDENCY_INFO_FILE=/opt/local/var/macports/build/_opt_macports_trunk_dports_editors_ackmate/ackmate/work/AckMate-f2515f9/build/AckMate.build/Release/AckMate.build/Objects-normal/x86_64/AckMate_dependency_info.dat
1353:info:build     export LD_GENERATE_MAP_FILE=NO
1354:info:build     export LD_MAP_FILE_PATH=/opt/local/var/macports/build/_opt_macports_trunk_dports_editors_ackmate/ackmate/work/AckMate-f2515f9/build/AckMate.build/Release/AckMate.build/AckMate-LinkMap-normal-x86_64.txt
1355:info:build     export LD_NO_PIE=NO
1356:info:build     export LD_QUOTE_LINKER_ARGUMENTS_FOR_COMPILER_DRIVER=YES
1357:info:build     export LEGACY_DEVELOPER_DIR=/Applications/Xcode.app/Contents/PlugIns/Xcode3Core.ideplugin/Contents/SharedSupport/Developer
1358:info:build     export LEX=lex
1359:info:build     export LIBRARY_FLAG_NOSPACE=YES
1360:info:build     export LIBRARY_FLAG_PREFIX=-l
1361:info:build     export LIBRARY_KEXT_INSTALL_PATH=/Library/Extensions
1362:info:build     export LIBRARY_SEARCH_PATHS="/opt/local/var/macports/build/_opt_macports_trunk_dports_editors_ackmate/ackmate/work/AckMate-f2515f9/build/Release "
1363:info:build     export LINKER_DISPLAYS_MANGLED_NAMES=NO
1364:info:build     export LINK_FILE_LIST_normal_x86_64=/opt/local/var/macports/build/_opt_macports_trunk_dports_editors_ackmate/ackmate/work/AckMate-f2515f9/build/AckMate.build/Release/AckMate.build/Objects-normal/x86_64/AckMate.LinkFileList
1365:info:build     export LINK_WITH_STANDARD_LIBRARIES=YES
1366:info:build     export LOCALIZABLE_CONTENT_DIR=
1367:info:build     export LOCALIZED_RESOURCES_FOLDER_PATH=AckMate.tmplugin/Contents/Resources/English.lproj
1368:info:build     export LOCAL_ADMIN_APPS_DIR=/Applications/Utilities
1369:info:build     export LOCAL_APPS_DIR=/Applications
1370:info:build     export LOCAL_DEVELOPER_DIR=/Library/Developer
1371:info:build     export LOCAL_LIBRARY_DIR=/Library
1372:info:build     export LOCROOT=
1373:info:build     export LOCSYMROOT=
1374:info:build     export MACH_O_TYPE=mh_bundle
1375:info:build     export MACOSX_DEPLOYMENT_TARGET=10.10
1376:info:build     export MAC_OS_X_PRODUCT_BUILD_VERSION=14F1021
1377:info:build     export MAC_OS_X_VERSION_ACTUAL=101005
1378:info:build     export MAC_OS_X_VERSION_MAJOR=101000
1379:info:build     export MAC_OS_X_VERSION_MINOR=1005
1380:info:build     export NATIVE_ARCH=i386
1381:info:build     export NATIVE_ARCH_32_BIT=i386
1382:info:build     export NATIVE_ARCH_64_BIT=x86_64
1383:info:build     export NATIVE_ARCH_ACTUAL=x86_64
1384:info:build     export NO_COMMON=YES
1385:info:build     export OBJECT_FILE_DIR=/opt/local/var/macports/build/_opt_macports_trunk_dports_editors_ackmate/ackmate/work/AckMate-f2515f9/build/AckMate.build/Release/AckMate.build/Objects
1386:info:build     export OBJECT_FILE_DIR_normal=/opt/local/var/macports/build/_opt_macports_trunk_dports_editors_ackmate/ackmate/work/AckMate-f2515f9/build/AckMate.build/Release/AckMate.build/Objects-normal
1387:info:build     export OBJROOT=/opt/local/var/macports/build/_opt_macports_trunk_dports_editors_ackmate/ackmate/work/AckMate-f2515f9/build
1388:info:build     export ONLY_ACTIVE_ARCH=NO
1389:info:build     export OPTIMIZATION_LEVEL=0
1390:info:build     export OS=MACOS
1391:info:build     export OSAC=/usr/bin/osacompile
1392:info:build     export PACKAGE_TYPE=com.apple.package-type.wrapper
1393:info:build     export PASCAL_STRINGS=YES
1394:info:build     export PATH="/Applications/Xcode.app/Contents/Developer/Toolchains/XcodeDefault.xctoolchain/usr/bin:/Applications/Xcode.app/Contents/Developer/Toolchains/XcodeDefault.xctoolchain/usr/libexec:/Applications/Xcode.app/Contents/Developer/Platforms/MacOSX.platform/Developer/usr/bin:/Applications/Xcode.app/Contents/Developer/Platforms/MacOSX.platform/Developer/usr/local/bin:/Applications/Xcode.app/Contents/Developer/Platforms/MacOSX.platform/usr/bin:/Applications/Xcode.app/Contents/Developer/Platforms/MacOSX.platform/usr/local/bin:/Applications/Xcode.app/Contents/Developer/usr/bin:/Applications/Xcode.app/Contents/Developer/usr/local/bin:/Applications/Xcode.app/Contents/Developer/Tools:/opt/local/bin:/opt/local/sbin:/bin:/sbin:/usr/bin:/usr/sbin"
1395:info:build     export PATH_PREFIXES_EXCLUDED_FROM_HEADER_DEPENDENCIES="/usr/include /usr/local/include /System/Library/Frameworks /System/Library/PrivateFrameworks /Applications/Xcode.app/Contents/Developer/Headers /Applications/Xcode.app/Contents/Developer/SDKs /Applications/Xcode.app/Contents/Developer/Platforms"
1396:info:build     export PBDEVELOPMENTPLIST_PATH=AckMate.tmplugin/Contents/pbdevelopment.plist
1397:info:build     export PFE_FILE_C_DIALECTS=objective-c
1398:info:build     export PKGINFO_FILE_PATH=/opt/local/var/macports/build/_opt_macports_trunk_dports_editors_ackmate/ackmate/work/AckMate-f2515f9/build/AckMate.build/Release/AckMate.build/PkgInfo
1399:info:build     export PKGINFO_PATH=AckMate.tmplugin/Contents/PkgInfo
1400:info:build     export PLATFORM_DEVELOPER_APPLICATIONS_DIR=/Applications/Xcode.app/Contents/Developer/Applications
1401:info:build     export PLATFORM_DEVELOPER_BIN_DIR=/Applications/Xcode.app/Contents/Developer/usr/bin
1402:info:build     export PLATFORM_DEVELOPER_LIBRARY_DIR=/Applications/Xcode.app/Contents/Developer/Library
1403:info:build     export PLATFORM_DEVELOPER_SDK_DIR=/Applications/Xcode.app/Contents/Developer/Platforms/MacOSX.platform/Developer/SDKs
1404:info:build     export PLATFORM_DEVELOPER_TOOLS_DIR=/Applications/Xcode.app/Contents/Developer/Tools
1405:info:build     export PLATFORM_DEVELOPER_USR_DIR=/Applications/Xcode.app/Contents/Developer/usr
1406:info:build     export PLATFORM_DIR=/Applications/Xcode.app/Contents/Developer/Platforms/MacOSX.platform
1407:info:build     export PLATFORM_DISPLAY_NAME="OS X"
1408:info:build     export PLATFORM_NAME=macosx
1409:info:build     export PLATFORM_PREFERRED_ARCH=x86_64
1410:info:build     export PLATFORM_PRODUCT_BUILD_VERSION=7B91b
1411:info:build     export PLIST_FILE_OUTPUT_FORMAT=same-as-input
1412:info:build     export PLUGINS_FOLDER_PATH=AckMate.tmplugin/Contents/PlugIns
1413:info:build     export PREBINDING=NO
1414:info:build     export PRECOMPS_INCLUDE_HEADERS_FROM_BUILT_PRODUCTS_DIR=YES
1415:info:build     export PRECOMP_DESTINATION_DIR=/opt/local/var/macports/build/_opt_macports_trunk_dports_editors_ackmate/ackmate/work/AckMate-f2515f9/build/AckMate.build/Release/AckMate.build/PrefixHeaders
1416:info:build     export PRESERVE_DEAD_CODE_INITS_AND_TERMS=NO
1417:info:build     export PRIVATE_HEADERS_FOLDER_PATH=AckMate.tmplugin/Contents/PrivateHeaders
1418:info:build     export PRODUCT_MODULE_NAME=AckMate
1419:info:build     export PRODUCT_NAME=AckMate
1420:info:build     export PRODUCT_SETTINGS_PATH=/opt/local/var/macports/build/_opt_macports_trunk_dports_editors_ackmate/ackmate/work/AckMate-f2515f9/Info.plist
1421:info:build     export PRODUCT_TYPE=com.apple.product-type.bundle
1422:info:build     export PROFILING_CODE=NO
1423:info:build     export PROJECT=AckMate
1424:info:build     export PROJECT_DERIVED_FILE_DIR=/opt/local/var/macports/build/_opt_macports_trunk_dports_editors_ackmate/ackmate/work/AckMate-f2515f9/build/AckMate.build/DerivedSources
1425:info:build     export PROJECT_DIR=/opt/local/var/macports/build/_opt_macports_trunk_dports_editors_ackmate/ackmate/work/AckMate-f2515f9
1426:info:build     export PROJECT_FILE_PATH=/opt/local/var/macports/build/_opt_macports_trunk_dports_editors_ackmate/ackmate/work/AckMate-f2515f9/AckMate.xcodeproj
1427:info:build     export PROJECT_NAME=AckMate
1428:info:build     export PROJECT_TEMP_DIR=/opt/local/var/macports/build/_opt_macports_trunk_dports_editors_ackmate/ackmate/work/AckMate-f2515f9/build/AckMate.build
1429:info:build     export PROJECT_TEMP_ROOT=/opt/local/var/macports/build/_opt_macports_trunk_dports_editors_ackmate/ackmate/work/AckMate-f2515f9/build
1430:info:build     export PUBLIC_HEADERS_FOLDER_PATH=AckMate.tmplugin/Contents/Headers
1431:info:build     export RECURSIVE_SEARCH_PATHS_FOLLOW_SYMLINKS=YES
1432:info:build     export REMOVE_CVS_FROM_RESOURCES=YES
1433:info:build     export REMOVE_GIT_FROM_RESOURCES=YES
1434:info:build     export REMOVE_HEADERS_FROM_EMBEDDED_BUNDLES=YES
1435:info:build     export REMOVE_HG_FROM_RESOURCES=YES
1436:info:build     export REMOVE_SVN_FROM_RESOURCES=YES
1437:info:build     export REZ_COLLECTOR_DIR=/opt/local/var/macports/build/_opt_macports_trunk_dports_editors_ackmate/ackmate/work/AckMate-f2515f9/build/AckMate.build/Release/AckMate.build/ResourceManagerResources
1438:info:build     export REZ_OBJECTS_DIR=/opt/local/var/macports/build/_opt_macports_trunk_dports_editors_ackmate/ackmate/work/AckMate-f2515f9/build/AckMate.build/Release/AckMate.build/ResourceManagerResources/Objects
1439:info:build     export REZ_SEARCH_PATHS="/opt/local/var/macports/build/_opt_macports_trunk_dports_editors_ackmate/ackmate/work/AckMate-f2515f9/build/Release "
1440:info:build     export SCAN_ALL_SOURCE_FILES_FOR_INCLUDES=NO
1441:info:build     export SCRIPTS_FOLDER_PATH=AckMate.tmplugin/Contents/Resources/Scripts
1442:info:build     export SCRIPT_INPUT_FILE_COUNT=0
1443:info:build     export SCRIPT_OUTPUT_FILE_COUNT=0
1444:info:build     export SDKROOT=/Applications/Xcode.app/Contents/Developer/Platforms/MacOSX.platform/Developer/SDKs/MacOSX10.11.sdk
1445:info:build     export SDK_DIR=/Applications/Xcode.app/Contents/Developer/Platforms/MacOSX.platform/Developer/SDKs/MacOSX10.11.sdk
1446:info:build     export SDK_DIR_macosx10_11=/Applications/Xcode.app/Contents/Developer/Platforms/MacOSX.platform/Developer/SDKs/MacOSX10.11.sdk
1447:info:build     export SDK_NAME=macosx10.11
1448:info:build     export SDK_NAMES=macosx10.11
1449:info:build     export SDK_PRODUCT_BUILD_VERSION=15A278
1450:info:build     export SDK_VERSION=10.11
1451:info:build     export SDK_VERSION_ACTUAL=101100
1452:info:build     export SDK_VERSION_MAJOR=101100
1453:info:build     export SDK_VERSION_MINOR=1100
1454:info:build     export SED=/usr/bin/sed
1455:info:build     export SEPARATE_STRIP=NO
1456:info:build     export SEPARATE_SYMBOL_EDIT=NO
1457:info:build     export SET_DIR_MODE_OWNER_GROUP=YES
1458:info:build     export SET_FILE_MODE_OWNER_GROUP=NO
1459:info:build     export SHALLOW_BUNDLE=NO
1460:info:build     export SHARED_DERIVED_FILE_DIR=/opt/local/var/macports/build/_opt_macports_trunk_dports_editors_ackmate/ackmate/work/AckMate-f2515f9/build/Release/DerivedSources
1461:info:build     export SHARED_FRAMEWORKS_FOLDER_PATH=AckMate.tmplugin/Contents/SharedFrameworks
1462:info:build     export SHARED_PRECOMPS_DIR=/var/folders/kd/sc_9pj4j5js7wd5qmjqjvsbh0000gp/C/com.apple.DeveloperTools/7.1-7B91b/Xcode/SharedPrecompiledHeaders
1463:info:build     export SHARED_SUPPORT_FOLDER_PATH=AckMate.tmplugin/Contents/SharedSupport
1464:info:build     export SKIP_INSTALL=NO
1465:info:build     export SOURCE_ROOT=/opt/local/var/macports/build/_opt_macports_trunk_dports_editors_ackmate/ackmate/work/AckMate-f2515f9
1466:info:build     export SRCROOT=/opt/local/var/macports/build/_opt_macports_trunk_dports_editors_ackmate/ackmate/work/AckMate-f2515f9
1467:info:build     export STRINGS_FILE_OUTPUT_ENCODING=UTF-16
1468:info:build     export STRIP_BITCODE_FROM_COPIED_FILES=NO
1469:info:build     export STRIP_INSTALLED_PRODUCT=YES
1470:info:build     export STRIP_STYLE=non-global
1471:info:build     export SUPPORTED_PLATFORMS=macosx
1472:info:build     export SUPPORTS_TEXT_BASED_API=NO
1473:info:build     export SWIFT_PLATFORM_TARGET_PREFIX=macosx
1474:info:build     export SYMROOT=/opt/local/var/macports/build/_opt_macports_trunk_dports_editors_ackmate/ackmate/work/AckMate-f2515f9/build
1475:info:build     export SYSTEM_ADMIN_APPS_DIR=/Applications/Utilities
1476:info:build     export SYSTEM_APPS_DIR=/Applications
1477:info:build     export SYSTEM_CORE_SERVICES_DIR=/System/Library/CoreServices
1478:info:build     export SYSTEM_DEMOS_DIR=/Applications/Extras
1479:info:build     export SYSTEM_DEVELOPER_APPS_DIR=/Applications/Xcode.app/Contents/Developer/Applications
1480:info:build     export SYSTEM_DEVELOPER_BIN_DIR=/Applications/Xcode.app/Contents/Developer/usr/bin
1481:info:build     export SYSTEM_DEVELOPER_DEMOS_DIR="/Applications/Xcode.app/Contents/Developer/Applications/Utilities/Built Examples"
1482:info:build     export SYSTEM_DEVELOPER_DIR=/Applications/Xcode.app/Contents/Developer
1483:info:build     export SYSTEM_DEVELOPER_DOC_DIR="/Applications/Xcode.app/Contents/Developer/ADC Reference Library"
1484:info:build     export SYSTEM_DEVELOPER_GRAPHICS_TOOLS_DIR="/Applications/Xcode.app/Contents/Developer/Applications/Graphics Tools"
1485:info:build     export SYSTEM_DEVELOPER_JAVA_TOOLS_DIR="/Applications/Xcode.app/Contents/Developer/Applications/Java Tools"
1486:info:build     export SYSTEM_DEVELOPER_PERFORMANCE_TOOLS_DIR="/Applications/Xcode.app/Contents/Developer/Applications/Performance Tools"
1487:info:build     export SYSTEM_DEVELOPER_RELEASENOTES_DIR="/Applications/Xcode.app/Contents/Developer/ADC Reference Library/releasenotes"
1488:info:build     export SYSTEM_DEVELOPER_TOOLS=/Applications/Xcode.app/Contents/Developer/Tools
1489:info:build     export SYSTEM_DEVELOPER_TOOLS_DOC_DIR="/Applications/Xcode.app/Contents/Developer/ADC Reference Library/documentation/DeveloperTools"
1490:info:build     export SYSTEM_DEVELOPER_TOOLS_RELEASENOTES_DIR="/Applications/Xcode.app/Contents/Developer/ADC Reference Library/releasenotes/DeveloperTools"
1491:info:build     export SYSTEM_DEVELOPER_USR_DIR=/Applications/Xcode.app/Contents/Developer/usr
1492:info:build     export SYSTEM_DEVELOPER_UTILITIES_DIR=/Applications/Xcode.app/Contents/Developer/Applications/Utilities
1493:info:build     export SYSTEM_DOCUMENTATION_DIR=/Library/Documentation
1494:info:build     export SYSTEM_KEXT_INSTALL_PATH=/System/Library/Extensions
1495:info:build     export SYSTEM_LIBRARY_DIR=/System/Library
1496:info:build     export TARGETNAME=AckMate
1497:info:build     export TARGET_BUILD_DIR=/opt/local/var/macports/build/_opt_macports_trunk_dports_editors_ackmate/ackmate/work/AckMate-f2515f9/build/Release
1498:info:build     export TARGET_NAME=AckMate
1499:info:build     export TARGET_TEMP_DIR=/opt/local/var/macports/build/_opt_macports_trunk_dports_editors_ackmate/ackmate/work/AckMate-f2515f9/build/AckMate.build/Release/AckMate.build
1500:info:build     export TEMP_DIR=/opt/local/var/macports/build/_opt_macports_trunk_dports_editors_ackmate/ackmate/work/AckMate-f2515f9/build/AckMate.build/Release/AckMate.build
1501:info:build     export TEMP_FILES_DIR=/opt/local/var/macports/build/_opt_macports_trunk_dports_editors_ackmate/ackmate/work/AckMate-f2515f9/build/AckMate.build/Release/AckMate.build
1502:info:build     export TEMP_FILE_DIR=/opt/local/var/macports/build/_opt_macports_trunk_dports_editors_ackmate/ackmate/work/AckMate-f2515f9/build/AckMate.build/Release/AckMate.build
1503:info:build     export TEMP_ROOT=/opt/local/var/macports/build/_opt_macports_trunk_dports_editors_ackmate/ackmate/work/AckMate-f2515f9/build
1504:info:build     export TOOLCHAINS=com.apple.dt.toolchain.XcodeDefault
1505:info:build     export TOOLCHAIN_DIR=/Applications/Xcode.app/Contents/Developer/Toolchains/XcodeDefault.xctoolchain
1506:info:build     export TREAT_MISSING_BASELINES_AS_TEST_FAILURES=NO
1507:info:build     export UID=502
1508:info:build     export UNLOCALIZED_RESOURCES_FOLDER_PATH=AckMate.tmplugin/Contents/Resources
1509:info:build     export UNSTRIPPED_PRODUCT=NO
1510:info:build     export USER=macports
1511:info:build     export USER_APPS_DIR=/opt/local/var/macports/home/Applications
1512:info:build     export USER_LIBRARY_DIR=/opt/local/var/macports/home/Library
1513:info:build     export USE_DYNAMIC_NO_PIC=YES
1514:info:build     export USE_HEADERMAP=YES
1515:info:build     export USE_HEADER_SYMLINKS=NO
1516:info:build     export VALIDATE_PRODUCT=NO
1517:info:build     export VALID_ARCHS="i386 x86_64"
1518:info:build     export VERBOSE_PBXCP=NO
1519:info:build     export VERSIONPLIST_PATH=AckMate.tmplugin/Contents/version.plist
1520:info:build     export VERSION_INFO_BUILDER=macports
1521:info:build     export VERSION_INFO_FILE=AckMate_vers.c
1522:info:build     export VERSION_INFO_STRING="\"@(#)PROGRAM:AckMate  PROJECT:AckMate-\""
1523:info:build     export WRAPPER_EXTENSION=tmplugin
1524:info:build     export WRAPPER_NAME=AckMate.tmplugin
1525:info:build     export WRAPPER_SUFFIX=.tmplugin
1526:info:build     export WRAP_ASSET_PACKS_IN_SEPARATE_DIRECTORIES=NO
1527:info:build     export XCODE_APP_SUPPORT_DIR=/Applications/Xcode.app/Contents/Developer/Library/Xcode
1528:info:build     export XCODE_PRODUCT_BUILD_VERSION=7B91b
1529:info:build     export XCODE_VERSION_ACTUAL=0710
1530:info:build     export XCODE_VERSION_MAJOR=0700
1531:info:build     export XCODE_VERSION_MINOR=0710
1532:info:build     export XPCSERVICES_FOLDER_PATH=AckMate.tmplugin/Contents/XPCServices
1533:info:build     export YACC=yacc
1534:info:build     export arch=x86_64
1535:info:build     export variant=normal
1536:info:build     /bin/sh -c /opt/local/var/macports/build/_opt_macports_trunk_dports_editors_ackmate/ackmate/work/AckMate-f2515f9/build/AckMate.build/Release/AckMate.build/Script-177E4DB50913322B0064163D.sh
1537:info:build mkdir: /opt/local/var/macports/home/Library/Application Support/TextMate/PlugIns: Operation not permitted
1538:info:build cp: /opt/local/var/macports/home/Library/Application Support/TextMate/PlugIns: No such file or directory
1539:info:build
1540:info:build ** BUILD FAILED **
1541:info:build
1542:info:build
1543:info:build The following build commands failed:
1544:info:build     PhaseScriptExecution Run\ Script build/AckMate.build/Release/AckMate.build/Script-177E4DB50913322B0064163D.sh
1545:info:build (1 failure)
1546:info:build Command failed: cd "/opt/local/var/macports/build/_opt_macports_trunk_dports_editors_ackmate/ackmate/work/AckMate-f2515f9" && /usr/bin/xcodebuild  -alltargets -configuration Deployment build OBJROOT=build/ SYMROOT=build/ MACOSX_DEPLOYMENT_TARGET=10.10 ARCHS=x86_64 SDKROOT="" GCC_VERSION=com.apple.compilers.llvm.clang.1_0 CLANG_CXX_LIBRARY="libc++"
1547:info:build Exit code: 65
1548:error:build org.macports.build for port ackmate returned: command execution failed
1549:debug:build Error code: NONE
1550:debug:build Backtrace: command execution failed
1551    while executing
1552"proc-org.macports.build-build-0 org.macports.build"
1553    ("eval" body line 1)
1554    invoked from within
1555"eval $procedure $targetname"
1556:info:build Warning: targets not executed for ackmate: org.macports.build
1557:notice:build Please see the log file for port ackmate for details:
1558    /opt/local/var/macports/logs/_opt_macports_trunk_dports_editors_ackmate/ackmate/main.log