| 1 | version:1 |
|---|
| 2 | :msg:main ---> Computing dependencies for openssl:info:main .:debug:main Checking for conflicts against openssl |
|---|
| 3 | :debug:main Searching for dependency: libressl |
|---|
| 4 | :debug:main Didn't find receipt, going to depspec regex for: libressl |
|---|
| 5 | :debug:main Searching for dependency: zlib |
|---|
| 6 | :debug:main Found Dependency: receipt exists for zlib |
|---|
| 7 | :msg:main |
|---|
| 8 | :debug:main Executing org.macports.main (openssl) |
|---|
| 9 | :debug:main changing euid/egid - current euid: 0 - current egid: 0 |
|---|
| 10 | :debug:main egid changed to: 515 |
|---|
| 11 | :debug:main euid changed to: 501 |
|---|
| 12 | :debug:main Skipping completed org.macports.archivefetch (openssl) |
|---|
| 13 | :debug:main Privilege de-escalation not attempted as not running as root. |
|---|
| 14 | :debug:fetch fetch phase started at Wed Mar 2 09:40:05 CET 2016 |
|---|
| 15 | :notice:fetch ---> Fetching distfiles for openssl |
|---|
| 16 | :debug:fetch Executing org.macports.fetch (openssl) |
|---|
| 17 | :info:fetch ---> openssl-1.0.2g.tar.gz doesn't seem to exist in /opt/local/var/macports/distfiles/openssl |
|---|
| 18 | :notice:fetch ---> Attempting to fetch openssl-1.0.2g.tar.gz from http://distfiles.macports.org/openssl |
|---|
| 19 | :debug:fetch Fetching distfile failed: The requested URL returned error: 404 |
|---|
| 20 | :notice:fetch ---> Attempting to fetch openssl-1.0.2g.tar.gz from http://www.openssl.org/source |
|---|
| 21 | :debug:fetch Privilege de-escalation not attempted as not running as root. |
|---|
| 22 | :debug:checksum checksum phase started at Wed Mar 2 09:40:27 CET 2016 |
|---|
| 23 | :notice:checksum ---> Verifying checksums for openssl |
|---|
| 24 | :debug:checksum Executing org.macports.checksum (openssl) |
|---|
| 25 | :info:checksum ---> Checksumming openssl-1.0.2g.tar.gz |
|---|
| 26 | :debug:checksum Calculated (rmd160) is b5a697ac0195dc84e17f2089b0e649d7129b36c2 |
|---|
| 27 | :debug:checksum Correct (rmd160) checksum for openssl-1.0.2g.tar.gz |
|---|
| 28 | :debug:checksum Calculated (sha256) is b784b1b3907ce39abf4098702dade6365522a253ad1552e267a9a0e89594aa33 |
|---|
| 29 | :debug:checksum Correct (sha256) checksum for openssl-1.0.2g.tar.gz |
|---|
| 30 | :debug:checksum Privilege de-escalation not attempted as not running as root. |
|---|
| 31 | :debug:extract extract phase started at Wed Mar 2 09:40:27 CET 2016 |
|---|
| 32 | :notice:extract ---> Extracting openssl |
|---|
| 33 | :debug:extract Executing org.macports.extract (openssl) |
|---|
| 34 | :info:extract ---> Extracting openssl-1.0.2g.tar.gz |
|---|
| 35 | :debug:extract setting option extract.args to '/opt/local/var/macports/distfiles/openssl/openssl-1.0.2g.tar.gz' |
|---|
| 36 | :debug:extract Environment: |
|---|
| 37 | CC_PRINT_OPTIONS='YES' |
|---|
| 38 | CC_PRINT_OPTIONS_FILE='/opt/local/var/macports/build/_opt_local_var_macports_sources_rsync.macports.org_release_tarballs_ports_devel_openssl/openssl/work/.CC_PRINT_OPTIONS' |
|---|
| 39 | CPATH='/opt/local/include' |
|---|
| 40 | LIBRARY_PATH='/opt/local/lib' |
|---|
| 41 | MACOSX_DEPLOYMENT_TARGET='10.6' |
|---|
| 42 | :debug:extract Assembled command: 'cd "/opt/local/var/macports/build/_opt_local_var_macports_sources_rsync.macports.org_release_tarballs_ports_devel_openssl/openssl/work" && /usr/bin/gzip -dc '/opt/local/var/macports/distfiles/openssl/openssl-1.0.2g.tar.gz' | /usr/bin/gnutar --no-same-owner -xf -' |
|---|
| 43 | :debug:extract Executing command line: cd "/opt/local/var/macports/build/_opt_local_var_macports_sources_rsync.macports.org_release_tarballs_ports_devel_openssl/openssl/work" && /usr/bin/gzip -dc '/opt/local/var/macports/distfiles/openssl/openssl-1.0.2g.tar.gz' | /usr/bin/gnutar --no-same-owner -xf - |
|---|
| 44 | :debug:extract euid/egid changed to: 0/0 |
|---|
| 45 | :debug:extract chowned /opt/local/var/macports/build/_opt_local_var_macports_sources_rsync.macports.org_release_tarballs_ports_devel_openssl/openssl/work to macports |
|---|
| 46 | :debug:extract euid/egid changed to: 501/515 |
|---|
| 47 | :debug:extract Privilege de-escalation not attempted as not running as root. |
|---|
| 48 | :debug:patch patch phase started at Wed Mar 2 09:40:28 CET 2016 |
|---|
| 49 | :debug:patch Executing org.macports.patch (openssl) |
|---|
| 50 | :notice:patch ---> Applying patches to openssl |
|---|
| 51 | :info:patch ---> Applying install-headers-HFS+.patch |
|---|
| 52 | :debug:patch Environment: |
|---|
| 53 | CC_PRINT_OPTIONS='YES' |
|---|
| 54 | CC_PRINT_OPTIONS_FILE='/opt/local/var/macports/build/_opt_local_var_macports_sources_rsync.macports.org_release_tarballs_ports_devel_openssl/openssl/work/.CC_PRINT_OPTIONS' |
|---|
| 55 | CPATH='/opt/local/include' |
|---|
| 56 | LIBRARY_PATH='/opt/local/lib' |
|---|
| 57 | MACOSX_DEPLOYMENT_TARGET='10.6' |
|---|
| 58 | :debug:patch Assembled command: 'cd "/opt/local/var/macports/build/_opt_local_var_macports_sources_rsync.macports.org_release_tarballs_ports_devel_openssl/openssl/work/openssl-1.0.2g" && /usr/bin/patch -p0' |
|---|
| 59 | :debug:patch Executing command line: cd "/opt/local/var/macports/build/_opt_local_var_macports_sources_rsync.macports.org_release_tarballs_ports_devel_openssl/openssl/work/openssl-1.0.2g" && /usr/bin/patch -p0 < '/opt/local/var/macports/sources/rsync.macports.org/release/tarballs/ports/devel/openssl/files/install-headers-HFS+.patch' |
|---|
| 60 | :info:patch patching file crypto/bf/Makefile |
|---|
| 61 | :info:patch patching file crypto/des/Makefile |
|---|
| 62 | :info:patch ---> Applying parallel-building.patch |
|---|
| 63 | :debug:patch Environment: |
|---|
| 64 | CC_PRINT_OPTIONS='YES' |
|---|
| 65 | CC_PRINT_OPTIONS_FILE='/opt/local/var/macports/build/_opt_local_var_macports_sources_rsync.macports.org_release_tarballs_ports_devel_openssl/openssl/work/.CC_PRINT_OPTIONS' |
|---|
| 66 | CPATH='/opt/local/include' |
|---|
| 67 | LIBRARY_PATH='/opt/local/lib' |
|---|
| 68 | MACOSX_DEPLOYMENT_TARGET='10.6' |
|---|
| 69 | :debug:patch Assembled command: 'cd "/opt/local/var/macports/build/_opt_local_var_macports_sources_rsync.macports.org_release_tarballs_ports_devel_openssl/openssl/work/openssl-1.0.2g" && /usr/bin/patch -p0' |
|---|
| 70 | :debug:patch Executing command line: cd "/opt/local/var/macports/build/_opt_local_var_macports_sources_rsync.macports.org_release_tarballs_ports_devel_openssl/openssl/work/openssl-1.0.2g" && /usr/bin/patch -p0 < '/opt/local/var/macports/sources/rsync.macports.org/release/tarballs/ports/devel/openssl/files/parallel-building.patch' |
|---|
| 71 | :info:patch patching file Makefile.org |
|---|
| 72 | :info:patch Hunk #1 succeeded at 528 with fuzz 2 (offset 1 line). |
|---|
| 73 | :info:patch Hunk #2 succeeded at 628 (offset 1 line). |
|---|
| 74 | :info:patch ---> Applying remove-duplicate-bn_print-doc.patch |
|---|
| 75 | :debug:patch Environment: |
|---|
| 76 | CC_PRINT_OPTIONS='YES' |
|---|
| 77 | CC_PRINT_OPTIONS_FILE='/opt/local/var/macports/build/_opt_local_var_macports_sources_rsync.macports.org_release_tarballs_ports_devel_openssl/openssl/work/.CC_PRINT_OPTIONS' |
|---|
| 78 | CPATH='/opt/local/include' |
|---|
| 79 | LIBRARY_PATH='/opt/local/lib' |
|---|
| 80 | MACOSX_DEPLOYMENT_TARGET='10.6' |
|---|
| 81 | :debug:patch Assembled command: 'cd "/opt/local/var/macports/build/_opt_local_var_macports_sources_rsync.macports.org_release_tarballs_ports_devel_openssl/openssl/work/openssl-1.0.2g" && /usr/bin/patch -p0' |
|---|
| 82 | :debug:patch Executing command line: cd "/opt/local/var/macports/build/_opt_local_var_macports_sources_rsync.macports.org_release_tarballs_ports_devel_openssl/openssl/work/openssl-1.0.2g" && /usr/bin/patch -p0 < '/opt/local/var/macports/sources/rsync.macports.org/release/tarballs/ports/devel/openssl/files/remove-duplicate-bn_print-doc.patch' |
|---|
| 83 | :info:patch patching file doc/crypto/bn_internal.pod |
|---|
| 84 | :info:patch ---> Applying x86_64-asm-on-i386.patch |
|---|
| 85 | :debug:patch Environment: |
|---|
| 86 | CC_PRINT_OPTIONS='YES' |
|---|
| 87 | CC_PRINT_OPTIONS_FILE='/opt/local/var/macports/build/_opt_local_var_macports_sources_rsync.macports.org_release_tarballs_ports_devel_openssl/openssl/work/.CC_PRINT_OPTIONS' |
|---|
| 88 | CPATH='/opt/local/include' |
|---|
| 89 | LIBRARY_PATH='/opt/local/lib' |
|---|
| 90 | MACOSX_DEPLOYMENT_TARGET='10.6' |
|---|
| 91 | :debug:patch Assembled command: 'cd "/opt/local/var/macports/build/_opt_local_var_macports_sources_rsync.macports.org_release_tarballs_ports_devel_openssl/openssl/work/openssl-1.0.2g" && /usr/bin/patch -p0' |
|---|
| 92 | :debug:patch Executing command line: cd "/opt/local/var/macports/build/_opt_local_var_macports_sources_rsync.macports.org_release_tarballs_ports_devel_openssl/openssl/work/openssl-1.0.2g" && /usr/bin/patch -p0 < '/opt/local/var/macports/sources/rsync.macports.org/release/tarballs/ports/devel/openssl/files/x86_64-asm-on-i386.patch' |
|---|
| 93 | :info:patch patching file crypto/perlasm/x86_64-xlate.pl |
|---|
| 94 | :info:patch ---> Applying fix-Apple-clang-version-detection.patch |
|---|
| 95 | :debug:patch Environment: |
|---|
| 96 | CC_PRINT_OPTIONS='YES' |
|---|
| 97 | CC_PRINT_OPTIONS_FILE='/opt/local/var/macports/build/_opt_local_var_macports_sources_rsync.macports.org_release_tarballs_ports_devel_openssl/openssl/work/.CC_PRINT_OPTIONS' |
|---|
| 98 | CPATH='/opt/local/include' |
|---|
| 99 | LIBRARY_PATH='/opt/local/lib' |
|---|
| 100 | MACOSX_DEPLOYMENT_TARGET='10.6' |
|---|
| 101 | :debug:patch Assembled command: 'cd "/opt/local/var/macports/build/_opt_local_var_macports_sources_rsync.macports.org_release_tarballs_ports_devel_openssl/openssl/work/openssl-1.0.2g" && /usr/bin/patch -p0' |
|---|
| 102 | :debug:patch Executing command line: cd "/opt/local/var/macports/build/_opt_local_var_macports_sources_rsync.macports.org_release_tarballs_ports_devel_openssl/openssl/work/openssl-1.0.2g" && /usr/bin/patch -p0 < '/opt/local/var/macports/sources/rsync.macports.org/release/tarballs/ports/devel/openssl/files/fix-Apple-clang-version-detection.patch' |
|---|
| 103 | :info:patch patching file ./crypto/aes/asm/aesni-mb-x86_64.pl |
|---|
| 104 | :info:patch patching file ./crypto/aes/asm/aesni-sha1-x86_64.pl |
|---|
| 105 | :info:patch patching file ./crypto/aes/asm/aesni-sha256-x86_64.pl |
|---|
| 106 | :info:patch patching file ./crypto/bn/asm/rsaz-x86_64.pl |
|---|
| 107 | :info:patch patching file ./crypto/bn/asm/x86_64-mont.pl |
|---|
| 108 | :info:patch patching file ./crypto/bn/asm/x86_64-mont5.pl |
|---|
| 109 | :info:patch patching file ./crypto/ec/asm/ecp_nistz256-x86_64.pl |
|---|
| 110 | :info:patch patching file ./crypto/modes/asm/aesni-gcm-x86_64.pl |
|---|
| 111 | :info:patch patching file ./crypto/modes/asm/ghash-x86_64.pl |
|---|
| 112 | :info:patch patching file ./crypto/sha/asm/sha1-mb-x86_64.pl |
|---|
| 113 | :info:patch patching file ./crypto/sha/asm/sha1-x86_64.pl |
|---|
| 114 | :info:patch patching file ./crypto/sha/asm/sha256-mb-x86_64.pl |
|---|
| 115 | :info:patch patching file ./crypto/sha/asm/sha512-x86_64.pl |
|---|
| 116 | :debug:patch Privilege de-escalation not attempted as not running as root. |
|---|
| 117 | :debug:configure configure phase started at Wed Mar 2 09:40:28 CET 2016 |
|---|
| 118 | :notice:configure ---> Configuring openssl |
|---|
| 119 | :debug:configure Using compiler 'Xcode GCC 4.2' |
|---|
| 120 | :debug:configure Executing org.macports.configure (openssl) |
|---|
| 121 | :debug:configure Environment: |
|---|
| 122 | CC='/usr/bin/gcc-4.2' |
|---|
| 123 | CC_PRINT_OPTIONS='YES' |
|---|
| 124 | CC_PRINT_OPTIONS_FILE='/opt/local/var/macports/build/_opt_local_var_macports_sources_rsync.macports.org_release_tarballs_ports_devel_openssl/openssl/work/.CC_PRINT_OPTIONS' |
|---|
| 125 | CFLAGS='-pipe -Os -arch x86_64' |
|---|
| 126 | CPATH='/opt/local/include' |
|---|
| 127 | CPPFLAGS='-I/opt/local/include' |
|---|
| 128 | CXX='/usr/bin/g++-4.2' |
|---|
| 129 | CXXFLAGS='-pipe -Os -arch x86_64' |
|---|
| 130 | F77FLAGS='-m64' |
|---|
| 131 | F90FLAGS='-pipe -Os -m64' |
|---|
| 132 | FCFLAGS='-pipe -Os -m64' |
|---|
| 133 | FFLAGS='-pipe -Os' |
|---|
| 134 | INSTALL='/usr/bin/install -c' |
|---|
| 135 | LDFLAGS='-L/opt/local/lib -Wl,-headerpad_max_install_names -arch x86_64' |
|---|
| 136 | LIBRARY_PATH='/opt/local/lib' |
|---|
| 137 | MACOSX_DEPLOYMENT_TARGET='10.6' |
|---|
| 138 | OBJC='/usr/bin/gcc-4.2' |
|---|
| 139 | OBJCFLAGS='-pipe -Os -arch x86_64' |
|---|
| 140 | OBJCXX='/usr/bin/g++-4.2' |
|---|
| 141 | OBJCXXFLAGS='-pipe -Os -arch x86_64' |
|---|
| 142 | PERL='/usr/bin/perl' |
|---|
| 143 | :debug:configure Assembled command: 'cd "/opt/local/var/macports/build/_opt_local_var_macports_sources_rsync.macports.org_release_tarballs_ports_devel_openssl/openssl/work/openssl-1.0.2g" && ./Configure --prefix=/opt/local -L/opt/local/lib no-krb5 --openssldir=/opt/local/etc/openssl shared zlib darwin64-x86_64-cc' |
|---|
| 144 | :debug:configure Executing command line: cd "/opt/local/var/macports/build/_opt_local_var_macports_sources_rsync.macports.org_release_tarballs_ports_devel_openssl/openssl/work/openssl-1.0.2g" && ./Configure --prefix=/opt/local -L/opt/local/lib no-krb5 --openssldir=/opt/local/etc/openssl shared zlib darwin64-x86_64-cc |
|---|
| 145 | :info:configure Configuring for darwin64-x86_64-cc |
|---|
| 146 | :info:configure no-ec_nistp_64_gcc_128 [default] OPENSSL_NO_EC_NISTP_64_GCC_128 (skip dir) |
|---|
| 147 | :info:configure no-gmp [default] OPENSSL_NO_GMP (skip dir) |
|---|
| 148 | :info:configure no-jpake [experimental] OPENSSL_NO_JPAKE (skip dir) |
|---|
| 149 | :info:configure no-krb5 [krb5-flavor not specified] OPENSSL_NO_KRB5 |
|---|
| 150 | :info:configure no-libunbound [experimental] OPENSSL_NO_LIBUNBOUND (skip dir) |
|---|
| 151 | :info:configure no-md2 [default] OPENSSL_NO_MD2 (skip dir) |
|---|
| 152 | :info:configure no-rc5 [default] OPENSSL_NO_RC5 (skip dir) |
|---|
| 153 | :info:configure no-rfc3779 [default] OPENSSL_NO_RFC3779 (skip dir) |
|---|
| 154 | :info:configure no-sctp [default] OPENSSL_NO_SCTP (skip dir) |
|---|
| 155 | :info:configure no-ssl-trace [default] OPENSSL_NO_SSL_TRACE (skip dir) |
|---|
| 156 | :info:configure no-ssl2 [default] OPENSSL_NO_SSL2 (skip dir) |
|---|
| 157 | :info:configure no-store [experimental] OPENSSL_NO_STORE (skip dir) |
|---|
| 158 | :info:configure no-unit-test [default] OPENSSL_NO_UNIT_TEST (skip dir) |
|---|
| 159 | :info:configure no-weak-ssl-ciphers [default] OPENSSL_NO_WEAK_SSL_CIPHERS (skip dir) |
|---|
| 160 | :info:configure no-zlib-dynamic [default] |
|---|
| 161 | :info:configure IsMK1MF=0 |
|---|
| 162 | :info:configure CC =/usr/bin/gcc-4.2 |
|---|
| 163 | :info:configure CFLAG =-fPIC -fno-common -DOPENSSL_PIC -DZLIB -DOPENSSL_THREADS -D_REENTRANT -DDSO_DLFCN -DHAVE_DLFCN_H -arch x86_64 -O3 -DL_ENDIAN -Wall -DOPENSSL_IA32_SSE2 -DOPENSSL_BN_ASM_MONT -DOPENSSL_BN_ASM_MONT5 -DOPENSSL_BN_ASM_GF2m -DSHA1_ASM -DSHA256_ASM -DSHA512_ASM -DMD5_ASM -DAES_ASM -DVPAES_ASM -DBSAES_ASM -DWHIRLPOOL_ASM -DGHASH_ASM -DECP_NISTZ256_ASM |
|---|
| 164 | :info:configure EX_LIBS =-L/opt/local/lib -lz |
|---|
| 165 | :info:configure CPUID_OBJ =x86_64cpuid.o |
|---|
| 166 | :info:configure BN_ASM =x86_64-gcc.o x86_64-mont.o x86_64-mont5.o x86_64-gf2m.o rsaz_exp.o rsaz-x86_64.o rsaz-avx2.o |
|---|
| 167 | :info:configure EC_ASM =ecp_nistz256.o ecp_nistz256-x86_64.o |
|---|
| 168 | :info:configure DES_ENC =des_enc.o fcrypt_b.o |
|---|
| 169 | :info:configure AES_ENC =aes-x86_64.o vpaes-x86_64.o bsaes-x86_64.o aesni-x86_64.o aesni-sha1-x86_64.o aesni-sha256-x86_64.o aesni-mb-x86_64.o |
|---|
| 170 | :info:configure BF_ENC =bf_enc.o |
|---|
| 171 | :info:configure CAST_ENC =c_enc.o |
|---|
| 172 | :info:configure RC4_ENC =rc4_enc.o rc4_skey.o |
|---|
| 173 | :info:configure RC5_ENC =rc5_enc.o |
|---|
| 174 | :info:configure MD5_OBJ_ASM =md5-x86_64.o |
|---|
| 175 | :info:configure SHA1_OBJ_ASM =sha1-x86_64.o sha256-x86_64.o sha512-x86_64.o sha1-mb-x86_64.o sha256-mb-x86_64.o |
|---|
| 176 | :info:configure RMD160_OBJ_ASM= |
|---|
| 177 | :info:configure CMLL_ENC =cmll-x86_64.o cmll_misc.o |
|---|
| 178 | :info:configure MODES_OBJ =ghash-x86_64.o aesni-gcm-x86_64.o |
|---|
| 179 | :info:configure ENGINES_OBJ = |
|---|
| 180 | :info:configure PROCESSOR = |
|---|
| 181 | :info:configure RANLIB =/usr/bin/ranlib |
|---|
| 182 | :info:configure ARFLAGS = |
|---|
| 183 | :info:configure PERL =/usr/bin/perl |
|---|
| 184 | :info:configure SIXTY_FOUR_BIT_LONG mode |
|---|
| 185 | :info:configure DES_UNROLL used |
|---|
| 186 | :info:configure DES_INT used |
|---|
| 187 | :info:configure RC4_CHUNK is unsigned long |
|---|
| 188 | :info:configure created directory `include/openssl' |
|---|
| 189 | :info:configure e_os2.h => include/openssl/e_os2.h |
|---|
| 190 | :info:configure making links in crypto... |
|---|
| 191 | :info:configure crypto.h => ../include/openssl/crypto.h |
|---|
| 192 | :info:configure opensslv.h => ../include/openssl/opensslv.h |
|---|
| 193 | :info:configure opensslconf.h => ../include/openssl/opensslconf.h |
|---|
| 194 | :info:configure ebcdic.h => ../include/openssl/ebcdic.h |
|---|
| 195 | :info:configure symhacks.h => ../include/openssl/symhacks.h |
|---|
| 196 | :info:configure ossl_typ.h => ../include/openssl/ossl_typ.h |
|---|
| 197 | :info:configure constant_time_test.c => ../test/constant_time_test.c |
|---|
| 198 | :info:configure making links in crypto/objects... |
|---|
| 199 | :info:configure objects.h => ../../include/openssl/objects.h |
|---|
| 200 | :info:configure obj_mac.h => ../../include/openssl/obj_mac.h |
|---|
| 201 | :info:configure making links in crypto/md4... |
|---|
| 202 | :info:configure md4.h => ../../include/openssl/md4.h |
|---|
| 203 | :info:configure md4test.c => ../../test/md4test.c |
|---|
| 204 | :info:configure md4.c => ../../apps/md4.c |
|---|
| 205 | :info:configure making links in crypto/md5... |
|---|
| 206 | :info:configure md5.h => ../../include/openssl/md5.h |
|---|
| 207 | :info:configure md5test.c => ../../test/md5test.c |
|---|
| 208 | :info:configure making links in crypto/sha... |
|---|
| 209 | :info:configure sha.h => ../../include/openssl/sha.h |
|---|
| 210 | :info:configure shatest.c => ../../test/shatest.c |
|---|
| 211 | :info:configure sha1test.c => ../../test/sha1test.c |
|---|
| 212 | :info:configure sha256t.c => ../../test/sha256t.c |
|---|
| 213 | :info:configure sha512t.c => ../../test/sha512t.c |
|---|
| 214 | :info:configure making links in crypto/mdc2... |
|---|
| 215 | :info:configure mdc2.h => ../../include/openssl/mdc2.h |
|---|
| 216 | :info:configure mdc2test.c => ../../test/mdc2test.c |
|---|
| 217 | :info:configure making links in crypto/hmac... |
|---|
| 218 | :info:configure hmac.h => ../../include/openssl/hmac.h |
|---|
| 219 | :info:configure hmactest.c => ../../test/hmactest.c |
|---|
| 220 | :info:configure making links in crypto/ripemd... |
|---|
| 221 | :info:configure ripemd.h => ../../include/openssl/ripemd.h |
|---|
| 222 | :info:configure rmdtest.c => ../../test/rmdtest.c |
|---|
| 223 | :info:configure making links in crypto/whrlpool... |
|---|
| 224 | :info:configure whrlpool.h => ../../include/openssl/whrlpool.h |
|---|
| 225 | :info:configure wp_test.c => ../../test/wp_test.c |
|---|
| 226 | :info:configure making links in crypto/des... |
|---|
| 227 | :info:configure des.h => ../../include/openssl/des.h |
|---|
| 228 | :info:configure des_old.h => ../../include/openssl/des_old.h |
|---|
| 229 | :info:configure destest.c => ../../test/destest.c |
|---|
| 230 | :info:configure making links in crypto/aes... |
|---|
| 231 | :info:configure aes.h => ../../include/openssl/aes.h |
|---|
| 232 | :info:configure making links in crypto/rc2... |
|---|
| 233 | :info:configure rc2.h => ../../include/openssl/rc2.h |
|---|
| 234 | :info:configure rc2test.c => ../../test/rc2test.c |
|---|
| 235 | :info:configure making links in crypto/rc4... |
|---|
| 236 | :info:configure rc4.h => ../../include/openssl/rc4.h |
|---|
| 237 | :info:configure rc4test.c => ../../test/rc4test.c |
|---|
| 238 | :info:configure making links in crypto/idea... |
|---|
| 239 | :info:configure idea.h => ../../include/openssl/idea.h |
|---|
| 240 | :info:configure ideatest.c => ../../test/ideatest.c |
|---|
| 241 | :info:configure making links in crypto/bf... |
|---|
| 242 | :info:configure blowfish.h => ../../include/openssl/blowfish.h |
|---|
| 243 | :info:configure bftest.c => ../../test/bftest.c |
|---|
| 244 | :info:configure making links in crypto/cast... |
|---|
| 245 | :info:configure cast.h => ../../include/openssl/cast.h |
|---|
| 246 | :info:configure casttest.c => ../../test/casttest.c |
|---|
| 247 | :info:configure making links in crypto/camellia... |
|---|
| 248 | :info:configure camellia.h => ../../include/openssl/camellia.h |
|---|
| 249 | :info:configure making links in crypto/seed... |
|---|
| 250 | :info:configure seed.h => ../../include/openssl/seed.h |
|---|
| 251 | :info:configure making links in crypto/modes... |
|---|
| 252 | :info:configure modes.h => ../../include/openssl/modes.h |
|---|
| 253 | :info:configure making links in crypto/bn... |
|---|
| 254 | :info:configure bn.h => ../../include/openssl/bn.h |
|---|
| 255 | :info:configure bntest.c => ../../test/bntest.c |
|---|
| 256 | :info:configure exptest.c => ../../test/exptest.c |
|---|
| 257 | :info:configure making links in crypto/ec... |
|---|
| 258 | :info:configure ec.h => ../../include/openssl/ec.h |
|---|
| 259 | :info:configure ectest.c => ../../test/ectest.c |
|---|
| 260 | :info:configure making links in crypto/rsa... |
|---|
| 261 | :info:configure rsa.h => ../../include/openssl/rsa.h |
|---|
| 262 | :info:configure rsa_test.c => ../../test/rsa_test.c |
|---|
| 263 | :info:configure making links in crypto/dsa... |
|---|
| 264 | :info:configure dsa.h => ../../include/openssl/dsa.h |
|---|
| 265 | :info:configure dsatest.c => ../../test/dsatest.c |
|---|
| 266 | :info:configure making links in crypto/ecdsa... |
|---|
| 267 | :info:configure ecdsa.h => ../../include/openssl/ecdsa.h |
|---|
| 268 | :info:configure ecdsatest.c => ../../test/ecdsatest.c |
|---|
| 269 | :info:configure making links in crypto/dh... |
|---|
| 270 | :info:configure dh.h => ../../include/openssl/dh.h |
|---|
| 271 | :info:configure dhtest.c => ../../test/dhtest.c |
|---|
| 272 | :info:configure making links in crypto/ecdh... |
|---|
| 273 | :info:configure ecdh.h => ../../include/openssl/ecdh.h |
|---|
| 274 | :info:configure ecdhtest.c => ../../test/ecdhtest.c |
|---|
| 275 | :info:configure making links in crypto/dso... |
|---|
| 276 | :info:configure dso.h => ../../include/openssl/dso.h |
|---|
| 277 | :info:configure making links in crypto/engine... |
|---|
| 278 | :info:configure engine.h => ../../include/openssl/engine.h |
|---|
| 279 | :info:configure enginetest.c => ../../test/enginetest.c |
|---|
| 280 | :info:configure making links in crypto/buffer... |
|---|
| 281 | :info:configure buffer.h => ../../include/openssl/buffer.h |
|---|
| 282 | :info:configure making links in crypto/bio... |
|---|
| 283 | :info:configure bio.h => ../../include/openssl/bio.h |
|---|
| 284 | :info:configure making links in crypto/stack... |
|---|
| 285 | :info:configure stack.h => ../../include/openssl/stack.h |
|---|
| 286 | :info:configure safestack.h => ../../include/openssl/safestack.h |
|---|
| 287 | :info:configure making links in crypto/lhash... |
|---|
| 288 | :info:configure lhash.h => ../../include/openssl/lhash.h |
|---|
| 289 | :info:configure making links in crypto/rand... |
|---|
| 290 | :info:configure rand.h => ../../include/openssl/rand.h |
|---|
| 291 | :info:configure randtest.c => ../../test/randtest.c |
|---|
| 292 | :info:configure making links in crypto/err... |
|---|
| 293 | :info:configure err.h => ../../include/openssl/err.h |
|---|
| 294 | :info:configure making links in crypto/evp... |
|---|
| 295 | :info:configure evp.h => ../../include/openssl/evp.h |
|---|
| 296 | :info:configure evp_test.c => ../../test/evp_test.c |
|---|
| 297 | :info:configure evp_extra_test.c => ../../test/evp_extra_test.c |
|---|
| 298 | :info:configure evptests.txt -> ../../test/evptests.txt |
|---|
| 299 | :info:configure making links in crypto/asn1... |
|---|
| 300 | :info:configure asn1.h => ../../include/openssl/asn1.h |
|---|
| 301 | :info:configure asn1_mac.h => ../../include/openssl/asn1_mac.h |
|---|
| 302 | :info:configure asn1t.h => ../../include/openssl/asn1t.h |
|---|
| 303 | :info:configure making links in crypto/pem... |
|---|
| 304 | :info:configure pem.h => ../../include/openssl/pem.h |
|---|
| 305 | :info:configure pem2.h => ../../include/openssl/pem2.h |
|---|
| 306 | :info:configure making links in crypto/x509... |
|---|
| 307 | :info:configure x509.h => ../../include/openssl/x509.h |
|---|
| 308 | :info:configure x509_vfy.h => ../../include/openssl/x509_vfy.h |
|---|
| 309 | :info:configure verify_extra_test.c => ../../test/verify_extra_test.c |
|---|
| 310 | :info:configure making links in crypto/x509v3... |
|---|
| 311 | :info:configure x509v3.h => ../../include/openssl/x509v3.h |
|---|
| 312 | :info:configure v3nametest.c => ../../test/v3nametest.c |
|---|
| 313 | :info:configure making links in crypto/conf... |
|---|
| 314 | :info:configure conf.h => ../../include/openssl/conf.h |
|---|
| 315 | :info:configure conf_api.h => ../../include/openssl/conf_api.h |
|---|
| 316 | :info:configure making links in crypto/txt_db... |
|---|
| 317 | :info:configure txt_db.h => ../../include/openssl/txt_db.h |
|---|
| 318 | :info:configure making links in crypto/pkcs7... |
|---|
| 319 | :info:configure pkcs7.h => ../../include/openssl/pkcs7.h |
|---|
| 320 | :info:configure making links in crypto/pkcs12... |
|---|
| 321 | :info:configure pkcs12.h => ../../include/openssl/pkcs12.h |
|---|
| 322 | :info:configure making links in crypto/comp... |
|---|
| 323 | :info:configure comp.h => ../../include/openssl/comp.h |
|---|
| 324 | :info:configure making links in crypto/ocsp... |
|---|
| 325 | :info:configure ocsp.h => ../../include/openssl/ocsp.h |
|---|
| 326 | :info:configure making links in crypto/ui... |
|---|
| 327 | :info:configure ui.h => ../../include/openssl/ui.h |
|---|
| 328 | :info:configure ui_compat.h => ../../include/openssl/ui_compat.h |
|---|
| 329 | :info:configure making links in crypto/krb5... |
|---|
| 330 | :info:configure krb5_asn.h => ../../include/openssl/krb5_asn.h |
|---|
| 331 | :info:configure making links in crypto/cms... |
|---|
| 332 | :info:configure cms.h => ../../include/openssl/cms.h |
|---|
| 333 | :info:configure making links in crypto/pqueue... |
|---|
| 334 | :info:configure pqueue.h => ../../include/openssl/pqueue.h |
|---|
| 335 | :info:configure making links in crypto/ts... |
|---|
| 336 | :info:configure ts.h => ../../include/openssl/ts.h |
|---|
| 337 | :info:configure making links in crypto/srp... |
|---|
| 338 | :info:configure srp.h => ../../include/openssl/srp.h |
|---|
| 339 | :info:configure srptest.c => ../../test/srptest.c |
|---|
| 340 | :info:configure making links in crypto/cmac... |
|---|
| 341 | :info:configure cmac.h => ../../include/openssl/cmac.h |
|---|
| 342 | :info:configure making links in ssl... |
|---|
| 343 | :info:configure ssl.h => ../include/openssl/ssl.h |
|---|
| 344 | :info:configure ssl2.h => ../include/openssl/ssl2.h |
|---|
| 345 | :info:configure ssl3.h => ../include/openssl/ssl3.h |
|---|
| 346 | :info:configure ssl23.h => ../include/openssl/ssl23.h |
|---|
| 347 | :info:configure tls1.h => ../include/openssl/tls1.h |
|---|
| 348 | :info:configure dtls1.h => ../include/openssl/dtls1.h |
|---|
| 349 | :info:configure kssl.h => ../include/openssl/kssl.h |
|---|
| 350 | :info:configure srtp.h => ../include/openssl/srtp.h |
|---|
| 351 | :info:configure ssltest.c => ../test/ssltest.c |
|---|
| 352 | :info:configure heartbeat_test.c => ../test/heartbeat_test.c |
|---|
| 353 | :info:configure clienthellotest.c => ../test/clienthellotest.c |
|---|
| 354 | :info:configure sslv2conftest.c => ../test/sslv2conftest.c |
|---|
| 355 | :info:configure making links in engines... |
|---|
| 356 | :info:configure making links in engines/ccgost... |
|---|
| 357 | :info:configure make[2]: Nothing to be done for `links'. |
|---|
| 358 | :info:configure making links in apps... |
|---|
| 359 | :info:configure make[1]: Nothing to be done for `links'. |
|---|
| 360 | :info:configure making links in test... |
|---|
| 361 | :info:configure make[1]: Nothing to be done for `links'. |
|---|
| 362 | :info:configure making links in tools... |
|---|
| 363 | :info:configure make[1]: Nothing to be done for `links'. |
|---|
| 364 | :info:configure generating dummy tests (if needed)... |
|---|
| 365 | :info:configure md2test.c => dummytest.c |
|---|
| 366 | :info:configure rc5test.c => dummytest.c |
|---|
| 367 | :info:configure jpaketest.c => dummytest.c |
|---|
| 368 | :info:configure |
|---|
| 369 | :info:configure Configured for darwin64-x86_64-cc. |
|---|
| 370 | :info:configure |
|---|
| 371 | :info:configure *** Because of configuration changes, you MUST do the following before |
|---|
| 372 | :info:configure *** building: |
|---|
| 373 | :info:configure |
|---|
| 374 | :info:configure make depend |
|---|
| 375 | :debug:configure Privilege de-escalation not attempted as not running as root. |
|---|
| 376 | :debug:build build phase started at Wed Mar 2 09:40:32 CET 2016 |
|---|
| 377 | :notice:build ---> Building openssl |
|---|
| 378 | :debug:build Executing org.macports.build (openssl) |
|---|
| 379 | :debug:build port disallows a parallel build |
|---|
| 380 | :debug:build Environment: |
|---|
| 381 | CC_PRINT_OPTIONS='YES' |
|---|
| 382 | CC_PRINT_OPTIONS_FILE='/opt/local/var/macports/build/_opt_local_var_macports_sources_rsync.macports.org_release_tarballs_ports_devel_openssl/openssl/work/.CC_PRINT_OPTIONS' |
|---|
| 383 | CPATH='/opt/local/include' |
|---|
| 384 | LIBRARY_PATH='/opt/local/lib' |
|---|
| 385 | MACOSX_DEPLOYMENT_TARGET='10.6' |
|---|
| 386 | :debug:build Assembled command: 'cd "/opt/local/var/macports/build/_opt_local_var_macports_sources_rsync.macports.org_release_tarballs_ports_devel_openssl/openssl/work/openssl-1.0.2g" && /usr/bin/make -w all' |
|---|
| 387 | :debug:build Executing command line: cd "/opt/local/var/macports/build/_opt_local_var_macports_sources_rsync.macports.org_release_tarballs_ports_devel_openssl/openssl/work/openssl-1.0.2g" && /usr/bin/make -w all |
|---|
| 388 | :info:build make: Entering directory `/opt/local/var/macports/build/_opt_local_var_macports_sources_rsync.macports.org_release_tarballs_ports_devel_openssl/openssl/work/openssl-1.0.2g' |
|---|
| 389 | :info:build making all in crypto... |
|---|
| 390 | :info:build make[1]: Entering directory `/opt/local/var/macports/build/_opt_local_var_macports_sources_rsync.macports.org_release_tarballs_ports_devel_openssl/openssl/work/openssl-1.0.2g/crypto' |
|---|
| 391 | :info:build /usr/bin/perl ../util/mkbuildinf.pl "/usr/bin/gcc-4.2 -I. -I.. -I../include -fPIC -fno-common -DOPENSSL_PIC -DZLIB -DOPENSSL_THREADS -D_REENTRANT -DDSO_DLFCN -DHAVE_DLFCN_H -arch x86_64 -O3 -DL_ENDIAN -Wall -DOPENSSL_IA32_SSE2 -DOPENSSL_BN_ASM_MONT -DOPENSSL_BN_ASM_MONT5 -DOPENSSL_BN_ASM_GF2m -DSHA1_ASM -DSHA256_ASM -DSHA512_ASM -DMD5_ASM -DAES_ASM -DVPAES_ASM -DBSAES_ASM -DWHIRLPOOL_ASM -DGHASH_ASM -DECP_NISTZ256_ASM" "darwin64-x86_64-cc" >buildinf.h |
|---|
| 392 | :info:build /usr/bin/gcc-4.2 -I. -I.. -I../include -fPIC -fno-common -DOPENSSL_PIC -DZLIB -DOPENSSL_THREADS -D_REENTRANT -DDSO_DLFCN -DHAVE_DLFCN_H -arch x86_64 -O3 -DL_ENDIAN -Wall -DOPENSSL_IA32_SSE2 -DOPENSSL_BN_ASM_MONT -DOPENSSL_BN_ASM_MONT5 -DOPENSSL_BN_ASM_GF2m -DSHA1_ASM -DSHA256_ASM -DSHA512_ASM -DMD5_ASM -DAES_ASM -DVPAES_ASM -DBSAES_ASM -DWHIRLPOOL_ASM -DGHASH_ASM -DECP_NISTZ256_ASM -c -o cryptlib.o cryptlib.c |
|---|
| 393 | :info:build /usr/bin/gcc-4.2 -I. -I.. -I../include -fPIC -fno-common -DOPENSSL_PIC -DZLIB -DOPENSSL_THREADS -D_REENTRANT -DDSO_DLFCN -DHAVE_DLFCN_H -arch x86_64 -O3 -DL_ENDIAN -Wall -DOPENSSL_IA32_SSE2 -DOPENSSL_BN_ASM_MONT -DOPENSSL_BN_ASM_MONT5 -DOPENSSL_BN_ASM_GF2m -DSHA1_ASM -DSHA256_ASM -DSHA512_ASM -DMD5_ASM -DAES_ASM -DVPAES_ASM -DBSAES_ASM -DWHIRLPOOL_ASM -DGHASH_ASM -DECP_NISTZ256_ASM -c -o mem.o mem.c |
|---|
| 394 | :info:build /usr/bin/gcc-4.2 -I. -I.. -I../include -fPIC -fno-common -DOPENSSL_PIC -DZLIB -DOPENSSL_THREADS -D_REENTRANT -DDSO_DLFCN -DHAVE_DLFCN_H -arch x86_64 -O3 -DL_ENDIAN -Wall -DOPENSSL_IA32_SSE2 -DOPENSSL_BN_ASM_MONT -DOPENSSL_BN_ASM_MONT5 -DOPENSSL_BN_ASM_GF2m -DSHA1_ASM -DSHA256_ASM -DSHA512_ASM -DMD5_ASM -DAES_ASM -DVPAES_ASM -DBSAES_ASM -DWHIRLPOOL_ASM -DGHASH_ASM -DECP_NISTZ256_ASM -c -o mem_dbg.o mem_dbg.c |
|---|
| 395 | :info:build /usr/bin/gcc-4.2 -I. -I.. -I../include -fPIC -fno-common -DOPENSSL_PIC -DZLIB -DOPENSSL_THREADS -D_REENTRANT -DDSO_DLFCN -DHAVE_DLFCN_H -arch x86_64 -O3 -DL_ENDIAN -Wall -DOPENSSL_IA32_SSE2 -DOPENSSL_BN_ASM_MONT -DOPENSSL_BN_ASM_MONT5 -DOPENSSL_BN_ASM_GF2m -DSHA1_ASM -DSHA256_ASM -DSHA512_ASM -DMD5_ASM -DAES_ASM -DVPAES_ASM -DBSAES_ASM -DWHIRLPOOL_ASM -DGHASH_ASM -DECP_NISTZ256_ASM -c -o cversion.o cversion.c |
|---|
| 396 | :info:build /usr/bin/gcc-4.2 -I. -I.. -I../include -fPIC -fno-common -DOPENSSL_PIC -DZLIB -DOPENSSL_THREADS -D_REENTRANT -DDSO_DLFCN -DHAVE_DLFCN_H -arch x86_64 -O3 -DL_ENDIAN -Wall -DOPENSSL_IA32_SSE2 -DOPENSSL_BN_ASM_MONT -DOPENSSL_BN_ASM_MONT5 -DOPENSSL_BN_ASM_GF2m -DSHA1_ASM -DSHA256_ASM -DSHA512_ASM -DMD5_ASM -DAES_ASM -DVPAES_ASM -DBSAES_ASM -DWHIRLPOOL_ASM -DGHASH_ASM -DECP_NISTZ256_ASM -c -o ex_data.o ex_data.c |
|---|
| 397 | :info:build /usr/bin/gcc-4.2 -I. -I.. -I../include -fPIC -fno-common -DOPENSSL_PIC -DZLIB -DOPENSSL_THREADS -D_REENTRANT -DDSO_DLFCN -DHAVE_DLFCN_H -arch x86_64 -O3 -DL_ENDIAN -Wall -DOPENSSL_IA32_SSE2 -DOPENSSL_BN_ASM_MONT -DOPENSSL_BN_ASM_MONT5 -DOPENSSL_BN_ASM_GF2m -DSHA1_ASM -DSHA256_ASM -DSHA512_ASM -DMD5_ASM -DAES_ASM -DVPAES_ASM -DBSAES_ASM -DWHIRLPOOL_ASM -DGHASH_ASM -DECP_NISTZ256_ASM -c -o cpt_err.o cpt_err.c |
|---|
| 398 | :info:build /usr/bin/gcc-4.2 -I. -I.. -I../include -fPIC -fno-common -DOPENSSL_PIC -DZLIB -DOPENSSL_THREADS -D_REENTRANT -DDSO_DLFCN -DHAVE_DLFCN_H -arch x86_64 -O3 -DL_ENDIAN -Wall -DOPENSSL_IA32_SSE2 -DOPENSSL_BN_ASM_MONT -DOPENSSL_BN_ASM_MONT5 -DOPENSSL_BN_ASM_GF2m -DSHA1_ASM -DSHA256_ASM -DSHA512_ASM -DMD5_ASM -DAES_ASM -DVPAES_ASM -DBSAES_ASM -DWHIRLPOOL_ASM -DGHASH_ASM -DECP_NISTZ256_ASM -c -o ebcdic.o ebcdic.c |
|---|
| 399 | :info:build /usr/bin/gcc-4.2 -I. -I.. -I../include -fPIC -fno-common -DOPENSSL_PIC -DZLIB -DOPENSSL_THREADS -D_REENTRANT -DDSO_DLFCN -DHAVE_DLFCN_H -arch x86_64 -O3 -DL_ENDIAN -Wall -DOPENSSL_IA32_SSE2 -DOPENSSL_BN_ASM_MONT -DOPENSSL_BN_ASM_MONT5 -DOPENSSL_BN_ASM_GF2m -DSHA1_ASM -DSHA256_ASM -DSHA512_ASM -DMD5_ASM -DAES_ASM -DVPAES_ASM -DBSAES_ASM -DWHIRLPOOL_ASM -DGHASH_ASM -DECP_NISTZ256_ASM -c -o uid.o uid.c |
|---|
| 400 | :info:build /usr/bin/gcc-4.2 -I. -I.. -I../include -fPIC -fno-common -DOPENSSL_PIC -DZLIB -DOPENSSL_THREADS -D_REENTRANT -DDSO_DLFCN -DHAVE_DLFCN_H -arch x86_64 -O3 -DL_ENDIAN -Wall -DOPENSSL_IA32_SSE2 -DOPENSSL_BN_ASM_MONT -DOPENSSL_BN_ASM_MONT5 -DOPENSSL_BN_ASM_GF2m -DSHA1_ASM -DSHA256_ASM -DSHA512_ASM -DMD5_ASM -DAES_ASM -DVPAES_ASM -DBSAES_ASM -DWHIRLPOOL_ASM -DGHASH_ASM -DECP_NISTZ256_ASM -c -o o_time.o o_time.c |
|---|
| 401 | :info:build /usr/bin/gcc-4.2 -I. -I.. -I../include -fPIC -fno-common -DOPENSSL_PIC -DZLIB -DOPENSSL_THREADS -D_REENTRANT -DDSO_DLFCN -DHAVE_DLFCN_H -arch x86_64 -O3 -DL_ENDIAN -Wall -DOPENSSL_IA32_SSE2 -DOPENSSL_BN_ASM_MONT -DOPENSSL_BN_ASM_MONT5 -DOPENSSL_BN_ASM_GF2m -DSHA1_ASM -DSHA256_ASM -DSHA512_ASM -DMD5_ASM -DAES_ASM -DVPAES_ASM -DBSAES_ASM -DWHIRLPOOL_ASM -DGHASH_ASM -DECP_NISTZ256_ASM -c -o o_str.o o_str.c |
|---|
| 402 | :info:build /usr/bin/gcc-4.2 -I. -I.. -I../include -fPIC -fno-common -DOPENSSL_PIC -DZLIB -DOPENSSL_THREADS -D_REENTRANT -DDSO_DLFCN -DHAVE_DLFCN_H -arch x86_64 -O3 -DL_ENDIAN -Wall -DOPENSSL_IA32_SSE2 -DOPENSSL_BN_ASM_MONT -DOPENSSL_BN_ASM_MONT5 -DOPENSSL_BN_ASM_GF2m -DSHA1_ASM -DSHA256_ASM -DSHA512_ASM -DMD5_ASM -DAES_ASM -DVPAES_ASM -DBSAES_ASM -DWHIRLPOOL_ASM -DGHASH_ASM -DECP_NISTZ256_ASM -c -o o_dir.o o_dir.c |
|---|
| 403 | :info:build /usr/bin/gcc-4.2 -I. -I.. -I../include -fPIC -fno-common -DOPENSSL_PIC -DZLIB -DOPENSSL_THREADS -D_REENTRANT -DDSO_DLFCN -DHAVE_DLFCN_H -arch x86_64 -O3 -DL_ENDIAN -Wall -DOPENSSL_IA32_SSE2 -DOPENSSL_BN_ASM_MONT -DOPENSSL_BN_ASM_MONT5 -DOPENSSL_BN_ASM_GF2m -DSHA1_ASM -DSHA256_ASM -DSHA512_ASM -DMD5_ASM -DAES_ASM -DVPAES_ASM -DBSAES_ASM -DWHIRLPOOL_ASM -DGHASH_ASM -DECP_NISTZ256_ASM -c -o o_fips.o o_fips.c |
|---|
| 404 | :info:build /usr/bin/gcc-4.2 -I. -I.. -I../include -fPIC -fno-common -DOPENSSL_PIC -DZLIB -DOPENSSL_THREADS -D_REENTRANT -DDSO_DLFCN -DHAVE_DLFCN_H -arch x86_64 -O3 -DL_ENDIAN -Wall -DOPENSSL_IA32_SSE2 -DOPENSSL_BN_ASM_MONT -DOPENSSL_BN_ASM_MONT5 -DOPENSSL_BN_ASM_GF2m -DSHA1_ASM -DSHA256_ASM -DSHA512_ASM -DMD5_ASM -DAES_ASM -DVPAES_ASM -DBSAES_ASM -DWHIRLPOOL_ASM -DGHASH_ASM -DECP_NISTZ256_ASM -c -o o_init.o o_init.c |
|---|
| 405 | :info:build /usr/bin/gcc-4.2 -I. -I.. -I../include -fPIC -fno-common -DOPENSSL_PIC -DZLIB -DOPENSSL_THREADS -D_REENTRANT -DDSO_DLFCN -DHAVE_DLFCN_H -arch x86_64 -O3 -DL_ENDIAN -Wall -DOPENSSL_IA32_SSE2 -DOPENSSL_BN_ASM_MONT -DOPENSSL_BN_ASM_MONT5 -DOPENSSL_BN_ASM_GF2m -DSHA1_ASM -DSHA256_ASM -DSHA512_ASM -DMD5_ASM -DAES_ASM -DVPAES_ASM -DBSAES_ASM -DWHIRLPOOL_ASM -DGHASH_ASM -DECP_NISTZ256_ASM -c -o fips_ers.o fips_ers.c |
|---|
| 406 | :info:build /usr/bin/perl x86_64cpuid.pl macosx > x86_64cpuid.s |
|---|
| 407 | :info:build /usr/bin/gcc-4.2 -I. -I.. -I../include -fPIC -fno-common -DOPENSSL_PIC -DZLIB -DOPENSSL_THREADS -D_REENTRANT -DDSO_DLFCN -DHAVE_DLFCN_H -arch x86_64 -O3 -DL_ENDIAN -Wall -DOPENSSL_IA32_SSE2 -DOPENSSL_BN_ASM_MONT -DOPENSSL_BN_ASM_MONT5 -DOPENSSL_BN_ASM_GF2m -DSHA1_ASM -DSHA256_ASM -DSHA512_ASM -DMD5_ASM -DAES_ASM -DVPAES_ASM -DBSAES_ASM -DWHIRLPOOL_ASM -DGHASH_ASM -DECP_NISTZ256_ASM -c -o x86_64cpuid.o x86_64cpuid.s |
|---|
| 408 | :info:build ar r ../libcrypto.a cryptlib.o mem.o mem_dbg.o cversion.o ex_data.o cpt_err.o ebcdic.o uid.o o_time.o o_str.o o_dir.o o_fips.o o_init.o fips_ers.o x86_64cpuid.o |
|---|
| 409 | :info:build ar: creating archive ../libcrypto.a |
|---|
| 410 | :info:build /usr/bin/ranlib: file: ../libcrypto.a(ebcdic.o) has no symbols |
|---|
| 411 | :info:build /usr/bin/ranlib: file: ../libcrypto.a(fips_ers.o) has no symbols |
|---|
| 412 | :info:build test -z "" || ar r ../libcrypto.a fipscanister.o |
|---|
| 413 | :info:build /usr/bin/ranlib ../libcrypto.a || echo Never mind. |
|---|
| 414 | :info:build /usr/bin/ranlib: file: ../libcrypto.a(ebcdic.o) has no symbols |
|---|
| 415 | :info:build /usr/bin/ranlib: file: ../libcrypto.a(fips_ers.o) has no symbols |
|---|
| 416 | :info:build making all in crypto/objects... |
|---|
| 417 | :info:build make[2]: Entering directory `/opt/local/var/macports/build/_opt_local_var_macports_sources_rsync.macports.org_release_tarballs_ports_devel_openssl/openssl/work/openssl-1.0.2g/crypto/objects' |
|---|
| 418 | :info:build /usr/bin/gcc-4.2 -I.. -I../.. -I../modes -I../asn1 -I../evp -I../../include -fPIC -fno-common -DOPENSSL_PIC -DZLIB -DOPENSSL_THREADS -D_REENTRANT -DDSO_DLFCN -DHAVE_DLFCN_H -arch x86_64 -O3 -DL_ENDIAN -Wall -DOPENSSL_IA32_SSE2 -DOPENSSL_BN_ASM_MONT -DOPENSSL_BN_ASM_MONT5 -DOPENSSL_BN_ASM_GF2m -DSHA1_ASM -DSHA256_ASM -DSHA512_ASM -DMD5_ASM -DAES_ASM -DVPAES_ASM -DBSAES_ASM -DWHIRLPOOL_ASM -DGHASH_ASM -DECP_NISTZ256_ASM -c -o o_names.o o_names.c |
|---|
| 419 | :info:build /usr/bin/gcc-4.2 -I.. -I../.. -I../modes -I../asn1 -I../evp -I../../include -fPIC -fno-common -DOPENSSL_PIC -DZLIB -DOPENSSL_THREADS -D_REENTRANT -DDSO_DLFCN -DHAVE_DLFCN_H -arch x86_64 -O3 -DL_ENDIAN -Wall -DOPENSSL_IA32_SSE2 -DOPENSSL_BN_ASM_MONT -DOPENSSL_BN_ASM_MONT5 -DOPENSSL_BN_ASM_GF2m -DSHA1_ASM -DSHA256_ASM -DSHA512_ASM -DMD5_ASM -DAES_ASM -DVPAES_ASM -DBSAES_ASM -DWHIRLPOOL_ASM -DGHASH_ASM -DECP_NISTZ256_ASM -c -o obj_dat.o obj_dat.c |
|---|
| 420 | :info:build /usr/bin/gcc-4.2 -I.. -I../.. -I../modes -I../asn1 -I../evp -I../../include -fPIC -fno-common -DOPENSSL_PIC -DZLIB -DOPENSSL_THREADS -D_REENTRANT -DDSO_DLFCN -DHAVE_DLFCN_H -arch x86_64 -O3 -DL_ENDIAN -Wall -DOPENSSL_IA32_SSE2 -DOPENSSL_BN_ASM_MONT -DOPENSSL_BN_ASM_MONT5 -DOPENSSL_BN_ASM_GF2m -DSHA1_ASM -DSHA256_ASM -DSHA512_ASM -DMD5_ASM -DAES_ASM -DVPAES_ASM -DBSAES_ASM -DWHIRLPOOL_ASM -DGHASH_ASM -DECP_NISTZ256_ASM -c -o obj_lib.o obj_lib.c |
|---|
| 421 | :info:build /usr/bin/gcc-4.2 -I.. -I../.. -I../modes -I../asn1 -I../evp -I../../include -fPIC -fno-common -DOPENSSL_PIC -DZLIB -DOPENSSL_THREADS -D_REENTRANT -DDSO_DLFCN -DHAVE_DLFCN_H -arch x86_64 -O3 -DL_ENDIAN -Wall -DOPENSSL_IA32_SSE2 -DOPENSSL_BN_ASM_MONT -DOPENSSL_BN_ASM_MONT5 -DOPENSSL_BN_ASM_GF2m -DSHA1_ASM -DSHA256_ASM -DSHA512_ASM -DMD5_ASM -DAES_ASM -DVPAES_ASM -DBSAES_ASM -DWHIRLPOOL_ASM -DGHASH_ASM -DECP_NISTZ256_ASM -c -o obj_err.o obj_err.c |
|---|
| 422 | :info:build /usr/bin/gcc-4.2 -I.. -I../.. -I../modes -I../asn1 -I../evp -I../../include -fPIC -fno-common -DOPENSSL_PIC -DZLIB -DOPENSSL_THREADS -D_REENTRANT -DDSO_DLFCN -DHAVE_DLFCN_H -arch x86_64 -O3 -DL_ENDIAN -Wall -DOPENSSL_IA32_SSE2 -DOPENSSL_BN_ASM_MONT -DOPENSSL_BN_ASM_MONT5 -DOPENSSL_BN_ASM_GF2m -DSHA1_ASM -DSHA256_ASM -DSHA512_ASM -DMD5_ASM -DAES_ASM -DVPAES_ASM -DBSAES_ASM -DWHIRLPOOL_ASM -DGHASH_ASM -DECP_NISTZ256_ASM -c -o obj_xref.o obj_xref.c |
|---|
| 423 | :info:build ar r ../../libcrypto.a o_names.o obj_dat.o obj_lib.o obj_err.o obj_xref.o |
|---|
| 424 | :info:build /usr/bin/ranlib: file: ../../libcrypto.a(ebcdic.o) has no symbols |
|---|
| 425 | :info:build /usr/bin/ranlib: file: ../../libcrypto.a(fips_ers.o) has no symbols |
|---|
| 426 | :info:build /usr/bin/ranlib ../../libcrypto.a || echo Never mind. |
|---|
| 427 | :info:build /usr/bin/ranlib: file: ../../libcrypto.a(ebcdic.o) has no symbols |
|---|
| 428 | :info:build /usr/bin/ranlib: file: ../../libcrypto.a(fips_ers.o) has no symbols |
|---|
| 429 | :info:build make[2]: Leaving directory `/opt/local/var/macports/build/_opt_local_var_macports_sources_rsync.macports.org_release_tarballs_ports_devel_openssl/openssl/work/openssl-1.0.2g/crypto/objects' |
|---|
| 430 | :info:build making all in crypto/md4... |
|---|
| 431 | :info:build make[2]: Entering directory `/opt/local/var/macports/build/_opt_local_var_macports_sources_rsync.macports.org_release_tarballs_ports_devel_openssl/openssl/work/openssl-1.0.2g/crypto/md4' |
|---|
| 432 | :info:build /usr/bin/gcc-4.2 -I.. -I../.. -I../modes -I../asn1 -I../evp -I../../include -fPIC -fno-common -DOPENSSL_PIC -DZLIB -DOPENSSL_THREADS -D_REENTRANT -DDSO_DLFCN -DHAVE_DLFCN_H -arch x86_64 -O3 -DL_ENDIAN -Wall -DOPENSSL_IA32_SSE2 -DOPENSSL_BN_ASM_MONT -DOPENSSL_BN_ASM_MONT5 -DOPENSSL_BN_ASM_GF2m -DSHA1_ASM -DSHA256_ASM -DSHA512_ASM -DMD5_ASM -DAES_ASM -DVPAES_ASM -DBSAES_ASM -DWHIRLPOOL_ASM -DGHASH_ASM -DECP_NISTZ256_ASM -c -o md4_dgst.o md4_dgst.c |
|---|
| 433 | :info:build /usr/bin/gcc-4.2 -I.. -I../.. -I../modes -I../asn1 -I../evp -I../../include -fPIC -fno-common -DOPENSSL_PIC -DZLIB -DOPENSSL_THREADS -D_REENTRANT -DDSO_DLFCN -DHAVE_DLFCN_H -arch x86_64 -O3 -DL_ENDIAN -Wall -DOPENSSL_IA32_SSE2 -DOPENSSL_BN_ASM_MONT -DOPENSSL_BN_ASM_MONT5 -DOPENSSL_BN_ASM_GF2m -DSHA1_ASM -DSHA256_ASM -DSHA512_ASM -DMD5_ASM -DAES_ASM -DVPAES_ASM -DBSAES_ASM -DWHIRLPOOL_ASM -DGHASH_ASM -DECP_NISTZ256_ASM -c -o md4_one.o md4_one.c |
|---|
| 434 | :info:build ar r ../../libcrypto.a md4_dgst.o md4_one.o |
|---|
| 435 | :info:build /usr/bin/ranlib: file: ../../libcrypto.a(ebcdic.o) has no symbols |
|---|
| 436 | :info:build /usr/bin/ranlib: file: ../../libcrypto.a(fips_ers.o) has no symbols |
|---|
| 437 | :info:build /usr/bin/ranlib ../../libcrypto.a || echo Never mind. |
|---|
| 438 | :info:build /usr/bin/ranlib: file: ../../libcrypto.a(ebcdic.o) has no symbols |
|---|
| 439 | :info:build /usr/bin/ranlib: file: ../../libcrypto.a(fips_ers.o) has no symbols |
|---|
| 440 | :info:build make[2]: Leaving directory `/opt/local/var/macports/build/_opt_local_var_macports_sources_rsync.macports.org_release_tarballs_ports_devel_openssl/openssl/work/openssl-1.0.2g/crypto/md4' |
|---|
| 441 | :info:build making all in crypto/md5... |
|---|
| 442 | :info:build make[2]: Entering directory `/opt/local/var/macports/build/_opt_local_var_macports_sources_rsync.macports.org_release_tarballs_ports_devel_openssl/openssl/work/openssl-1.0.2g/crypto/md5' |
|---|
| 443 | :info:build /usr/bin/gcc-4.2 -I.. -I../.. -I../modes -I../asn1 -I../evp -I../../include -fPIC -fno-common -DOPENSSL_PIC -DZLIB -DOPENSSL_THREADS -D_REENTRANT -DDSO_DLFCN -DHAVE_DLFCN_H -arch x86_64 -O3 -DL_ENDIAN -Wall -DOPENSSL_IA32_SSE2 -DOPENSSL_BN_ASM_MONT -DOPENSSL_BN_ASM_MONT5 -DOPENSSL_BN_ASM_GF2m -DSHA1_ASM -DSHA256_ASM -DSHA512_ASM -DMD5_ASM -DAES_ASM -DVPAES_ASM -DBSAES_ASM -DWHIRLPOOL_ASM -DGHASH_ASM -DECP_NISTZ256_ASM -c -o md5_dgst.o md5_dgst.c |
|---|
| 444 | :info:build /usr/bin/gcc-4.2 -I.. -I../.. -I../modes -I../asn1 -I../evp -I../../include -fPIC -fno-common -DOPENSSL_PIC -DZLIB -DOPENSSL_THREADS -D_REENTRANT -DDSO_DLFCN -DHAVE_DLFCN_H -arch x86_64 -O3 -DL_ENDIAN -Wall -DOPENSSL_IA32_SSE2 -DOPENSSL_BN_ASM_MONT -DOPENSSL_BN_ASM_MONT5 -DOPENSSL_BN_ASM_GF2m -DSHA1_ASM -DSHA256_ASM -DSHA512_ASM -DMD5_ASM -DAES_ASM -DVPAES_ASM -DBSAES_ASM -DWHIRLPOOL_ASM -DGHASH_ASM -DECP_NISTZ256_ASM -c -o md5_one.o md5_one.c |
|---|
| 445 | :info:build /usr/bin/perl asm/md5-x86_64.pl macosx > md5-x86_64.s |
|---|
| 446 | :info:build /usr/bin/gcc-4.2 -I.. -I../.. -I../modes -I../asn1 -I../evp -I../../include -fPIC -fno-common -DOPENSSL_PIC -DZLIB -DOPENSSL_THREADS -D_REENTRANT -DDSO_DLFCN -DHAVE_DLFCN_H -arch x86_64 -O3 -DL_ENDIAN -Wall -DOPENSSL_IA32_SSE2 -DOPENSSL_BN_ASM_MONT -DOPENSSL_BN_ASM_MONT5 -DOPENSSL_BN_ASM_GF2m -DSHA1_ASM -DSHA256_ASM -DSHA512_ASM -DMD5_ASM -DAES_ASM -DVPAES_ASM -DBSAES_ASM -DWHIRLPOOL_ASM -DGHASH_ASM -DECP_NISTZ256_ASM -c -o md5-x86_64.o md5-x86_64.s |
|---|
| 447 | :info:build ar r ../../libcrypto.a md5_dgst.o md5_one.o md5-x86_64.o |
|---|
| 448 | :info:build /usr/bin/ranlib: file: ../../libcrypto.a(ebcdic.o) has no symbols |
|---|
| 449 | :info:build /usr/bin/ranlib: file: ../../libcrypto.a(fips_ers.o) has no symbols |
|---|
| 450 | :info:build /usr/bin/ranlib ../../libcrypto.a || echo Never mind. |
|---|
| 451 | :info:build /usr/bin/ranlib: file: ../../libcrypto.a(ebcdic.o) has no symbols |
|---|
| 452 | :info:build /usr/bin/ranlib: file: ../../libcrypto.a(fips_ers.o) has no symbols |
|---|
| 453 | :info:build make[2]: Leaving directory `/opt/local/var/macports/build/_opt_local_var_macports_sources_rsync.macports.org_release_tarballs_ports_devel_openssl/openssl/work/openssl-1.0.2g/crypto/md5' |
|---|
| 454 | :info:build making all in crypto/sha... |
|---|
| 455 | :info:build make[2]: Entering directory `/opt/local/var/macports/build/_opt_local_var_macports_sources_rsync.macports.org_release_tarballs_ports_devel_openssl/openssl/work/openssl-1.0.2g/crypto/sha' |
|---|
| 456 | :info:build /usr/bin/gcc-4.2 -I.. -I../.. -I../modes -I../asn1 -I../evp -I../../include -fPIC -fno-common -DOPENSSL_PIC -DZLIB -DOPENSSL_THREADS -D_REENTRANT -DDSO_DLFCN -DHAVE_DLFCN_H -arch x86_64 -O3 -DL_ENDIAN -Wall -DOPENSSL_IA32_SSE2 -DOPENSSL_BN_ASM_MONT -DOPENSSL_BN_ASM_MONT5 -DOPENSSL_BN_ASM_GF2m -DSHA1_ASM -DSHA256_ASM -DSHA512_ASM -DMD5_ASM -DAES_ASM -DVPAES_ASM -DBSAES_ASM -DWHIRLPOOL_ASM -DGHASH_ASM -DECP_NISTZ256_ASM -c -o sha_dgst.o sha_dgst.c |
|---|
| 457 | :info:build /usr/bin/gcc-4.2 -I.. -I../.. -I../modes -I../asn1 -I../evp -I../../include -fPIC -fno-common -DOPENSSL_PIC -DZLIB -DOPENSSL_THREADS -D_REENTRANT -DDSO_DLFCN -DHAVE_DLFCN_H -arch x86_64 -O3 -DL_ENDIAN -Wall -DOPENSSL_IA32_SSE2 -DOPENSSL_BN_ASM_MONT -DOPENSSL_BN_ASM_MONT5 -DOPENSSL_BN_ASM_GF2m -DSHA1_ASM -DSHA256_ASM -DSHA512_ASM -DMD5_ASM -DAES_ASM -DVPAES_ASM -DBSAES_ASM -DWHIRLPOOL_ASM -DGHASH_ASM -DECP_NISTZ256_ASM -c -o sha1dgst.o sha1dgst.c |
|---|
| 458 | :info:build /usr/bin/gcc-4.2 -I.. -I../.. -I../modes -I../asn1 -I../evp -I../../include -fPIC -fno-common -DOPENSSL_PIC -DZLIB -DOPENSSL_THREADS -D_REENTRANT -DDSO_DLFCN -DHAVE_DLFCN_H -arch x86_64 -O3 -DL_ENDIAN -Wall -DOPENSSL_IA32_SSE2 -DOPENSSL_BN_ASM_MONT -DOPENSSL_BN_ASM_MONT5 -DOPENSSL_BN_ASM_GF2m -DSHA1_ASM -DSHA256_ASM -DSHA512_ASM -DMD5_ASM -DAES_ASM -DVPAES_ASM -DBSAES_ASM -DWHIRLPOOL_ASM -DGHASH_ASM -DECP_NISTZ256_ASM -c -o sha_one.o sha_one.c |
|---|
| 459 | :info:build /usr/bin/gcc-4.2 -I.. -I../.. -I../modes -I../asn1 -I../evp -I../../include -fPIC -fno-common -DOPENSSL_PIC -DZLIB -DOPENSSL_THREADS -D_REENTRANT -DDSO_DLFCN -DHAVE_DLFCN_H -arch x86_64 -O3 -DL_ENDIAN -Wall -DOPENSSL_IA32_SSE2 -DOPENSSL_BN_ASM_MONT -DOPENSSL_BN_ASM_MONT5 -DOPENSSL_BN_ASM_GF2m -DSHA1_ASM -DSHA256_ASM -DSHA512_ASM -DMD5_ASM -DAES_ASM -DVPAES_ASM -DBSAES_ASM -DWHIRLPOOL_ASM -DGHASH_ASM -DECP_NISTZ256_ASM -c -o sha1_one.o sha1_one.c |
|---|
| 460 | :info:build /usr/bin/gcc-4.2 -I.. -I../.. -I../modes -I../asn1 -I../evp -I../../include -fPIC -fno-common -DOPENSSL_PIC -DZLIB -DOPENSSL_THREADS -D_REENTRANT -DDSO_DLFCN -DHAVE_DLFCN_H -arch x86_64 -O3 -DL_ENDIAN -Wall -DOPENSSL_IA32_SSE2 -DOPENSSL_BN_ASM_MONT -DOPENSSL_BN_ASM_MONT5 -DOPENSSL_BN_ASM_GF2m -DSHA1_ASM -DSHA256_ASM -DSHA512_ASM -DMD5_ASM -DAES_ASM -DVPAES_ASM -DBSAES_ASM -DWHIRLPOOL_ASM -DGHASH_ASM -DECP_NISTZ256_ASM -c -o sha256.o sha256.c |
|---|
| 461 | :info:build /usr/bin/gcc-4.2 -I.. -I../.. -I../modes -I../asn1 -I../evp -I../../include -fPIC -fno-common -DOPENSSL_PIC -DZLIB -DOPENSSL_THREADS -D_REENTRANT -DDSO_DLFCN -DHAVE_DLFCN_H -arch x86_64 -O3 -DL_ENDIAN -Wall -DOPENSSL_IA32_SSE2 -DOPENSSL_BN_ASM_MONT -DOPENSSL_BN_ASM_MONT5 -DOPENSSL_BN_ASM_GF2m -DSHA1_ASM -DSHA256_ASM -DSHA512_ASM -DMD5_ASM -DAES_ASM -DVPAES_ASM -DBSAES_ASM -DWHIRLPOOL_ASM -DGHASH_ASM -DECP_NISTZ256_ASM -c -o sha512.o sha512.c |
|---|
| 462 | :info:build /usr/bin/perl asm/sha1-x86_64.pl macosx > sha1-x86_64.s |
|---|
| 463 | :info:build /usr/bin/gcc-4.2 -I.. -I../.. -I../modes -I../asn1 -I../evp -I../../include -fPIC -fno-common -DOPENSSL_PIC -DZLIB -DOPENSSL_THREADS -D_REENTRANT -DDSO_DLFCN -DHAVE_DLFCN_H -arch x86_64 -O3 -DL_ENDIAN -Wall -DOPENSSL_IA32_SSE2 -DOPENSSL_BN_ASM_MONT -DOPENSSL_BN_ASM_MONT5 -DOPENSSL_BN_ASM_GF2m -DSHA1_ASM -DSHA256_ASM -DSHA512_ASM -DMD5_ASM -DAES_ASM -DVPAES_ASM -DBSAES_ASM -DWHIRLPOOL_ASM -DGHASH_ASM -DECP_NISTZ256_ASM -c -o sha1-x86_64.o sha1-x86_64.s |
|---|
| 464 | :info:build sha1-x86_64.s:1243:missing or invalid immediate expression `0b00011011' taken as 0 |
|---|
| 465 | :info:build sha1-x86_64.s:1243:suffix or operands invalid for `pshufd' |
|---|
| 466 | :info:build sha1-x86_64.s:1245:missing or invalid immediate expression `0b00011011' taken as 0 |
|---|
| 467 | :info:build sha1-x86_64.s:1245:suffix or operands invalid for `pshufd' |
|---|
| 468 | :info:build sha1-x86_64.s:1395:missing or invalid immediate expression `0b00011011' taken as 0 |
|---|
| 469 | :info:build sha1-x86_64.s:1395:suffix or operands invalid for `pshufd' |
|---|
| 470 | :info:build sha1-x86_64.s:1396:missing or invalid immediate expression `0b00011011' taken as 0 |
|---|
| 471 | :info:build sha1-x86_64.s:1396:suffix or operands invalid for `pshufd' |
|---|
| 472 | :info:build make[2]: *** [sha1-x86_64.o] Error 1 |
|---|
| 473 | :info:build make[2]: Leaving directory `/opt/local/var/macports/build/_opt_local_var_macports_sources_rsync.macports.org_release_tarballs_ports_devel_openssl/openssl/work/openssl-1.0.2g/crypto/sha' |
|---|
| 474 | :info:build make[1]: *** [subdirs] Error 1 |
|---|
| 475 | :info:build make[1]: Leaving directory `/opt/local/var/macports/build/_opt_local_var_macports_sources_rsync.macports.org_release_tarballs_ports_devel_openssl/openssl/work/openssl-1.0.2g/crypto' |
|---|
| 476 | :info:build make: *** [build_crypto] Error 1 |
|---|
| 477 | :info:build make: Leaving directory `/opt/local/var/macports/build/_opt_local_var_macports_sources_rsync.macports.org_release_tarballs_ports_devel_openssl/openssl/work/openssl-1.0.2g' |
|---|
| 478 | :info:build Command failed: cd "/opt/local/var/macports/build/_opt_local_var_macports_sources_rsync.macports.org_release_tarballs_ports_devel_openssl/openssl/work/openssl-1.0.2g" && /usr/bin/make -w all |
|---|
| 479 | :info:build Exit code: 2 |
|---|
| 480 | :error:build org.macports.build for port openssl returned: command execution failed |
|---|
| 481 | :debug:build Error code: CHILDSTATUS 11352 2 |
|---|
| 482 | :debug:build Backtrace: command execution failed |
|---|
| 483 | while executing |
|---|
| 484 | "system -nice 0 $fullcmdstring" |
|---|
| 485 | ("eval" body line 1) |
|---|
| 486 | invoked from within |
|---|
| 487 | "eval system $notty $nice \$fullcmdstring" |
|---|
| 488 | invoked from within |
|---|
| 489 | "command_exec build" |
|---|
| 490 | (procedure "portbuild::build_main" line 8) |
|---|
| 491 | invoked from within |
|---|
| 492 | "portbuild::build_main org.macports.build" |
|---|
| 493 | ("eval" body line 1) |
|---|
| 494 | invoked from within |
|---|
| 495 | "eval $procedure $targetname" |
|---|
| 496 | :info:build Warning: targets not executed for openssl: org.macports.install org.macports.build org.macports.destroot |
|---|
| 497 | :notice:build Please see the log file for port openssl for details: |
|---|
| 498 | /opt/local/var/macports/logs/_opt_local_var_macports_sources_rsync.macports.org_release_tarballs_ports_devel_openssl/openssl/main.log |
|---|