Ticket #51110: main.log

File main.log, 57.5 KB (added by bouttier__macports@…, 3 years ago)

full build log

Line 
1version:1
2:debug:main epoch: in tree: 0 installed: 0
3:debug:main pkgconfig 0.29.1_0 exists in the ports tree
4:debug:main pkgconfig 0.29.1_0  is the latest installed
5:debug:main pkgconfig 0.29.1_0  is active
6:debug:main Merging existing variants '' into variants
7:debug:main new fully merged portvariants:
8:debug:main Changing to port directory: /opt/local/var/macports/sources/rsync.macports.org/release/tarballs/ports/devel/pkgconfig
9:debug:main OS darwin/13.4.0 (Mac OS X 10.9) arch i386
10:debug:main adding the default universal variant
11:debug:main Reading variant descriptions from /opt/local/var/macports/sources/rsync.macports.org/release/tarballs/ports/_resources/port1.0/variant_descriptions.conf
12:debug:main Running callback portconfigure::add_automatic_compiler_dependencies
13:debug:main Finished running callback portconfigure::add_automatic_compiler_dependencies
14:debug:main Running callback portbuild::add_automatic_buildsystem_dependencies
15:debug:main Finished running callback portbuild::add_automatic_buildsystem_dependencies
16:debug:main No need to upgrade! pkgconfig 0.29.1_0 >= pkgconfig 0.29.1_0
17:debug:main epoch: in tree: 0 installed: 0
18:debug:main libiconv 1.14_0 exists in the ports tree
19:debug:main libiconv 1.14_0  is the latest installed
20:debug:main libiconv 1.14_0  is active
21:debug:main Merging existing variants '' into variants
22:debug:main new fully merged portvariants:
23:debug:main Changing to port directory: /opt/local/var/macports/sources/rsync.macports.org/release/tarballs/ports/textproc/libiconv
24:debug:main OS darwin/13.4.0 (Mac OS X 10.9) arch i386
25:debug:main Reading variant descriptions from /opt/local/var/macports/sources/rsync.macports.org/release/tarballs/ports/_resources/port1.0/variant_descriptions.conf
26:debug:main Sourcing PortGroup muniversal 1.0 from /opt/local/var/macports/sources/rsync.macports.org/release/tarballs/ports/_resources/port1.0/group/muniversal-1.0.tcl
27:debug:main universal variant already exists, so not adding the default one
28:debug:main Running callback portconfigure::add_automatic_compiler_dependencies
29:debug:main Finished running callback portconfigure::add_automatic_compiler_dependencies
30:debug:main Running callback portbuild::add_automatic_buildsystem_dependencies
31:debug:main Finished running callback portbuild::add_automatic_buildsystem_dependencies
32:debug:main No need to upgrade! libiconv 1.14_0 >= libiconv 1.14_0
33:debug:main epoch: in tree: 0 installed: 0
34:debug:main freetype 2.6.3_0 exists in the ports tree
35:debug:main freetype 2.6.3_0  is the latest installed
36:debug:main freetype 2.6.3_0  is active
37:debug:main Merging existing variants '' into variants
38:debug:main new fully merged portvariants:
39:debug:main Changing to port directory: /opt/local/var/macports/sources/rsync.macports.org/release/tarballs/ports/print/freetype
40:debug:main OS darwin/13.4.0 (Mac OS X 10.9) arch i386
41:debug:main Reading variant descriptions from /opt/local/var/macports/sources/rsync.macports.org/release/tarballs/ports/_resources/port1.0/variant_descriptions.conf
42:debug:main Sourcing PortGroup muniversal 1.0 from /opt/local/var/macports/sources/rsync.macports.org/release/tarballs/ports/_resources/port1.0/group/muniversal-1.0.tcl
43:debug:main universal variant already exists, so not adding the default one
44:debug:main Running callback portconfigure::add_automatic_compiler_dependencies
45:debug:main Finished running callback portconfigure::add_automatic_compiler_dependencies
46:debug:main Running callback portbuild::add_automatic_buildsystem_dependencies
47:debug:main Finished running callback portbuild::add_automatic_buildsystem_dependencies
48:debug:main No need to upgrade! freetype 2.6.3_0 >= freetype 2.6.3_0
49:debug:main epoch: in tree: 0 installed: 0
50:debug:main bzip2 1.0.6_0 exists in the ports tree
51:debug:main bzip2 1.0.6_0  is the latest installed
52:debug:main bzip2 1.0.6_0  is active
53:debug:main Merging existing variants '' into variants
54:debug:main new fully merged portvariants:
55:debug:main Changing to port directory: /opt/local/var/macports/sources/rsync.macports.org/release/tarballs/ports/archivers/bzip2
56:debug:main OS darwin/13.4.0 (Mac OS X 10.9) arch i386
57:debug:main Reading variant descriptions from /opt/local/var/macports/sources/rsync.macports.org/release/tarballs/ports/_resources/port1.0/variant_descriptions.conf
58:debug:main universal variant already exists, so not adding the default one
59:debug:main Running callback portconfigure::add_automatic_compiler_dependencies
60:debug:main Finished running callback portconfigure::add_automatic_compiler_dependencies
61:debug:main Running callback portbuild::add_automatic_buildsystem_dependencies
62:debug:main Finished running callback portbuild::add_automatic_buildsystem_dependencies
63:debug:main No need to upgrade! bzip2 1.0.6_0 >= bzip2 1.0.6_0
64:debug:main epoch: in tree: 0 installed: 0
65:debug:main libpng 1.6.21_0 exists in the ports tree
66:debug:main libpng 1.6.21_0  is the latest installed
67:debug:main libpng 1.6.21_0  is active
68:debug:main Merging existing variants '' into variants
69:debug:main new fully merged portvariants:
70:debug:main Changing to port directory: /opt/local/var/macports/sources/rsync.macports.org/release/tarballs/ports/graphics/libpng
71:debug:main OS darwin/13.4.0 (Mac OS X 10.9) arch i386
72:debug:main adding the default universal variant
73:debug:main Reading variant descriptions from /opt/local/var/macports/sources/rsync.macports.org/release/tarballs/ports/_resources/port1.0/variant_descriptions.conf
74:debug:main Running callback portconfigure::add_automatic_compiler_dependencies
75:debug:main Finished running callback portconfigure::add_automatic_compiler_dependencies
76:debug:main Running callback portbuild::add_automatic_buildsystem_dependencies
77:debug:main Finished running callback portbuild::add_automatic_buildsystem_dependencies
78:debug:main No need to upgrade! libpng 1.6.21_0 >= libpng 1.6.21_0
79:debug:main epoch: in tree: 0 installed: 0
80:debug:main zlib 1.2.8_0 exists in the ports tree
81:debug:main zlib 1.2.8_0  is the latest installed
82:debug:main zlib 1.2.8_0  is active
83:debug:main Merging existing variants '' into variants
84:debug:main new fully merged portvariants:
85:debug:main Changing to port directory: /opt/local/var/macports/sources/rsync.macports.org/release/tarballs/ports/archivers/zlib
86:debug:main OS darwin/13.4.0 (Mac OS X 10.9) arch i386
87:debug:main Sourcing PortGroup xcodeversion 1.0 from /opt/local/var/macports/sources/rsync.macports.org/release/tarballs/ports/_resources/port1.0/group/xcodeversion-1.0.tcl
88:debug:main adding the default universal variant
89:debug:main Reading variant descriptions from /opt/local/var/macports/sources/rsync.macports.org/release/tarballs/ports/_resources/port1.0/variant_descriptions.conf
90:debug:main Running callback portconfigure::add_automatic_compiler_dependencies
91:debug:main Finished running callback portconfigure::add_automatic_compiler_dependencies
92:debug:main Running callback portbuild::add_automatic_buildsystem_dependencies
93:debug:main Finished running callback portbuild::add_automatic_buildsystem_dependencies
94:debug:main No need to upgrade! zlib 1.2.8_0 >= zlib 1.2.8_0
95:msg:main --->  Computing dependencies for ipe:info:main .:debug:main ipe has no conflicts
96:debug:main Searching for dependency: pkgconfig
97:debug:main Found Dependency: receipt exists for pkgconfig
98:debug:main Searching for dependency: freetype
99:debug:main Found Dependency: receipt exists for freetype
100:debug:main Searching for dependency: cairo
101:debug:main Didn't find receipt, going to depspec regex for: cairo
102:debug:main Changing to port directory: /opt/local/var/macports/sources/rsync.macports.org/release/tarballs/ports/graphics/cairo
103:debug:main OS darwin/13.4.0 (Mac OS X 10.9) arch i386
104:debug:main Sourcing PortGroup compiler_blacklist_versions 1.0 from /opt/local/var/macports/sources/rsync.macports.org/release/tarballs/ports/_resources/port1.0/group/compiler_blacklist_versions-1.0.tcl
105:debug:main Reading variant descriptions from /opt/local/var/macports/sources/rsync.macports.org/release/tarballs/ports/_resources/port1.0/variant_descriptions.conf
106:debug:main Sourcing PortGroup muniversal 1.0 from /opt/local/var/macports/sources/rsync.macports.org/release/tarballs/ports/_resources/port1.0/group/muniversal-1.0.tcl
107:debug:main Sourcing PortGroup xcodeversion 1.0 from /opt/local/var/macports/sources/rsync.macports.org/release/tarballs/ports/_resources/port1.0/group/xcodeversion-1.0.tcl
108:debug:main compiler clang 600.0.57 not blacklisted because it doesn't match {clang < 318.0.61}
109:debug:main universal variant already exists, so not adding the default one
110:debug:main Executing variant quartz provides quartz
111:debug:main Executing variant x11 provides x11
112:debug:main Running callback portconfigure::add_automatic_compiler_dependencies
113:debug:main Finished running callback portconfigure::add_automatic_compiler_dependencies
114:debug:main Running callback portbuild::add_automatic_buildsystem_dependencies
115:debug:main Finished running callback portbuild::add_automatic_buildsystem_dependencies
116:debug:main Searching for dependency: lua
117:debug:main Didn't find receipt, going to depspec regex for: lua
118:debug:main Changing to port directory: /opt/local/var/macports/sources/rsync.macports.org/release/tarballs/ports/lang/lua
119:debug:main OS darwin/13.4.0 (Mac OS X 10.9) arch i386
120:debug:main adding the default universal variant
121:debug:main Reading variant descriptions from /opt/local/var/macports/sources/rsync.macports.org/release/tarballs/ports/_resources/port1.0/variant_descriptions.conf
122:debug:main Running callback portconfigure::add_automatic_compiler_dependencies
123:debug:main Finished running callback portconfigure::add_automatic_compiler_dependencies
124:debug:main Running callback portbuild::add_automatic_buildsystem_dependencies
125:debug:main Finished running callback portbuild::add_automatic_buildsystem_dependencies
126:debug:main Searching for dependency: libpng
127:debug:main Found Dependency: receipt exists for libpng
128:debug:main Searching for dependency: zlib
129:debug:main Found Dependency: receipt exists for zlib
130:debug:main Searching for dependency: qhull
131:debug:main Didn't find receipt, going to depspec regex for: qhull
132:debug:main Changing to port directory: /opt/local/var/macports/sources/rsync.macports.org/release/tarballs/ports/math/qhull
133:debug:main OS darwin/13.4.0 (Mac OS X 10.9) arch i386
134:debug:main Re-registering default for configure.dir
135:debug:main Re-registering default for build.dir
136:debug:main Sourcing PortGroup cmake 1.0 from /opt/local/var/macports/sources/rsync.macports.org/release/tarballs/ports/_resources/port1.0/group/cmake-1.0.tcl
137:debug:main adding the default universal variant
138:debug:main Reading variant descriptions from /opt/local/var/macports/sources/rsync.macports.org/release/tarballs/ports/_resources/port1.0/variant_descriptions.conf
139:debug:main Running callback portconfigure::add_automatic_compiler_dependencies
140:debug:main Finished running callback portconfigure::add_automatic_compiler_dependencies
141:debug:main Running callback portbuild::add_automatic_buildsystem_dependencies
142:debug:main Finished running callback portbuild::add_automatic_buildsystem_dependencies
143:info:main .:debug:main Checking for conflicts against cairo
144:debug:main Searching for dependency: cairo-devel
145:debug:main Didn't find receipt, going to depspec regex for: cairo-devel
146:debug:main Searching for dependency: libpixman
147:debug:main Didn't find receipt, going to depspec regex for: libpixman
148:debug:main Changing to port directory: /opt/local/var/macports/sources/rsync.macports.org/release/tarballs/ports/graphics/libpixman
149:debug:main OS darwin/13.4.0 (Mac OS X 10.9) arch i386
150:debug:main Sourcing PortGroup compiler_blacklist_versions 1.0 from /opt/local/var/macports/sources/rsync.macports.org/release/tarballs/ports/_resources/port1.0/group/compiler_blacklist_versions-1.0.tcl
151:debug:main Reading variant descriptions from /opt/local/var/macports/sources/rsync.macports.org/release/tarballs/ports/_resources/port1.0/variant_descriptions.conf
152:debug:main Sourcing PortGroup muniversal 1.0 from /opt/local/var/macports/sources/rsync.macports.org/release/tarballs/ports/_resources/port1.0/group/muniversal-1.0.tcl
153:debug:main compiler clang 600.0.57 not blacklisted because it doesn't match {clang < 211.10.1}
154:debug:main universal variant already exists, so not adding the default one
155:debug:main Running callback portconfigure::add_automatic_compiler_dependencies
156:debug:main Finished running callback portconfigure::add_automatic_compiler_dependencies
157:debug:main Running callback portbuild::add_automatic_buildsystem_dependencies
158:debug:main Finished running callback portbuild::add_automatic_buildsystem_dependencies
159:debug:main Searching for dependency: glib2
160:debug:main Found Dependency: receipt exists for glib2
161:debug:main Searching for dependency: fontconfig
162:debug:main Found Dependency: receipt exists for fontconfig
163:debug:main Searching for dependency: expat
164:debug:main Found Dependency: receipt exists for expat
165:debug:main Searching for dependency: xrender
166:debug:main Didn't find receipt, going to depspec regex for: xrender
167:debug:main Changing to port directory: /opt/local/var/macports/sources/rsync.macports.org/release/tarballs/ports/x11/xrender
168:debug:main OS darwin/13.4.0 (Mac OS X 10.9) arch i386
169:debug:main adding the default universal variant
170:debug:main Reading variant descriptions from /opt/local/var/macports/sources/rsync.macports.org/release/tarballs/ports/_resources/port1.0/variant_descriptions.conf
171:debug:main Running callback portconfigure::add_automatic_compiler_dependencies
172:debug:main Finished running callback portconfigure::add_automatic_compiler_dependencies
173:debug:main Running callback portbuild::add_automatic_buildsystem_dependencies
174:debug:main Finished running callback portbuild::add_automatic_buildsystem_dependencies
175:debug:main Searching for dependency: xorg-libXext
176:debug:main Found Dependency: receipt exists for xorg-libXext
177:debug:main Searching for dependency: xorg-xcb-util
178:debug:main Didn't find receipt, going to depspec regex for: xorg-xcb-util
179:debug:main Changing to port directory: /opt/local/var/macports/sources/rsync.macports.org/release/tarballs/ports/x11/xorg-xcb-util
180:debug:main OS darwin/13.4.0 (Mac OS X 10.9) arch i386
181:debug:main adding the default universal variant
182:debug:main Reading variant descriptions from /opt/local/var/macports/sources/rsync.macports.org/release/tarballs/ports/_resources/port1.0/variant_descriptions.conf
183:debug:main Running callback portconfigure::add_automatic_compiler_dependencies
184:debug:main Finished running callback portconfigure::add_automatic_compiler_dependencies
185:debug:main Running callback portbuild::add_automatic_buildsystem_dependencies
186:debug:main Finished running callback portbuild::add_automatic_buildsystem_dependencies
187:info:main .:debug:main Checking for conflicts against libpixman
188:debug:main Searching for dependency: libpixman-devel
189:debug:main Didn't find receipt, going to depspec regex for: libpixman-devel
190:info:main .:debug:main xrender has no conflicts
191:debug:main Searching for dependency: xorg-libX11
192:debug:main Found Dependency: receipt exists for xorg-libX11
193:debug:main Searching for dependency: xorg-renderproto
194:debug:main Didn't find receipt, going to depspec regex for: xorg-renderproto
195:debug:main Changing to port directory: /opt/local/var/macports/sources/rsync.macports.org/release/tarballs/ports/x11/xorg-renderproto
196:debug:main OS darwin/13.4.0 (Mac OS X 10.9) arch i386
197:debug:main only one arch supported, so not adding the default universal variant
198:debug:main Running callback portconfigure::add_automatic_compiler_dependencies
199:debug:main Finished running callback portconfigure::add_automatic_compiler_dependencies
200:debug:main Running callback portbuild::add_automatic_buildsystem_dependencies
201:debug:main Finished running callback portbuild::add_automatic_buildsystem_dependencies
202:info:main .:debug:main xorg-renderproto has no conflicts
203:info:main .:debug:main xorg-xcb-util has no conflicts
204:debug:main Searching for dependency: xorg-libxcb
205:debug:main Found Dependency: receipt exists for xorg-libxcb
206:debug:main Searching for dependency: xorg-xproto
207:debug:main Found Dependency: receipt exists for xorg-xproto
208:info:main .:debug:main Checking for conflicts against lua
209:debug:main Searching for dependency: lua50
210:debug:main Didn't find receipt, going to depspec regex for: lua50
211:debug:main Searching for dependency: readline
212:debug:main Found Dependency: receipt exists for readline
213:info:main .:debug:main qhull has no conflicts
214:msg:main
215:msg:main --->  Dependencies to be installed: cairo libpixman xorg-xcb-util xrender xorg-renderproto lua qhull
216:debug:main Starting logging for libpixman
217:debug:clean Starting logging for xorg-xcb-util
218:debug:clean Starting logging for xorg-renderproto
219:debug:clean Starting logging for xrender
220:debug:clean Starting logging for cairo
221:debug:clean Starting logging for lua
222:debug:clean Starting logging for qhull
223:debug:main Executing org.macports.main (ipe)
224:debug:main changing euid/egid - current euid: 0 - current egid: 0
225:debug:main egid changed to: 503
226:debug:main euid changed to: 506
227:debug:archivefetch archivefetch phase started at Sun Apr 10 11:37:04 CEST 2016
228:msg:archivefetch --->  Fetching archive for ipe
229:debug:archivefetch Executing org.macports.archivefetch (ipe)
230:debug:archivefetch euid/egid changed to: 0/0
231:debug:archivefetch chowned /opt/local/var/macports/incoming to macports
232:debug:archivefetch euid/egid changed to: 506/503
233:info:archivefetch --->  ipe-7.2.2_0+qvoronoi.darwin_13.x86_64.tbz2 doesn't seem to exist in /opt/local/var/macports/incoming/verified
234:msg:archivefetch --->  Attempting to fetch ipe-7.2.2_0+qvoronoi.darwin_13.x86_64.tbz2 from https://packages.macports.org/ipe
235:debug:archivefetch Fetching archive failed:: The requested URL returned error: 404 Not Found
236:msg:archivefetch --->  Attempting to fetch ipe-7.2.2_0+qvoronoi.darwin_13.x86_64.tbz2 from http://lil.fr.packages.macports.org/ipe
237:debug:archivefetch Fetching archive failed:: The requested URL returned error: 404 Not Found
238:msg:archivefetch --->  Attempting to fetch ipe-7.2.2_0+qvoronoi.darwin_13.x86_64.tbz2 from http://mse.uk.packages.macports.org/sites/packages.macports.org/ipe
239:debug:archivefetch Fetching archive failed:: The requested URL returned error: 404 Not Found
240:debug:archivefetch Privilege de-escalation not attempted as not running as root.
241:debug:fetch fetch phase started at Sun Apr 10 11:37:05 CEST 2016
242:notice:fetch --->  Fetching distfiles for ipe
243:debug:fetch Executing org.macports.fetch (ipe)
244:debug:fetch Privilege de-escalation not attempted as not running as root.
245:debug:checksum checksum phase started at Sun Apr 10 11:37:05 CEST 2016
246:notice:checksum --->  Verifying checksums for ipe
247:debug:checksum Executing org.macports.checksum (ipe)
248:info:checksum --->  Checksumming ipe-7.2.2-src.tar.gz
249:debug:checksum Calculated (sha1) is a0934e9c01487219ae4726ab1cac42cc6fd27e96
250:debug:checksum Correct (sha1) checksum for ipe-7.2.2-src.tar.gz
251:debug:checksum Calculated (rmd160) is 12fdc48bf37a477b5f6dddd2f18cbdafa1dd8ca0
252:debug:checksum Correct (rmd160) checksum for ipe-7.2.2-src.tar.gz
253:debug:checksum Privilege de-escalation not attempted as not running as root.
254:debug:extract extract phase started at Sun Apr 10 11:37:05 CEST 2016
255:notice:extract --->  Extracting ipe
256:debug:extract Executing org.macports.extract (ipe)
257:info:extract --->  Extracting ipe-7.2.2-src.tar.gz
258:debug:extract setting option extract.args to '/opt/local/var/macports/distfiles/ipe/ipe-7.2.2-src.tar.gz'
259:debug:extract Environment:
260CC_PRINT_OPTIONS='YES'
261CC_PRINT_OPTIONS_FILE='/opt/local/var/macports/build/_opt_local_var_macports_sources_rsync.macports.org_release_tarballs_ports_graphics_ipe/ipe/work/.CC_PRINT_OPTIONS'
262CPATH='/opt/local/include'
263LIBRARY_PATH='/opt/local/lib'
264MACOSX_DEPLOYMENT_TARGET='10.9'
265:debug:extract Assembled command: 'cd "/opt/local/var/macports/build/_opt_local_var_macports_sources_rsync.macports.org_release_tarballs_ports_graphics_ipe/ipe/work" && /usr/bin/gzip -dc '/opt/local/var/macports/distfiles/ipe/ipe-7.2.2-src.tar.gz' | /usr/bin/tar -xf -'
266:debug:extract Executing command line:  cd "/opt/local/var/macports/build/_opt_local_var_macports_sources_rsync.macports.org_release_tarballs_ports_graphics_ipe/ipe/work" && /usr/bin/gzip -dc '/opt/local/var/macports/distfiles/ipe/ipe-7.2.2-src.tar.gz' | /usr/bin/tar -xf -
267:debug:extract euid/egid changed to: 0/0
268:debug:extract chowned /opt/local/var/macports/build/_opt_local_var_macports_sources_rsync.macports.org_release_tarballs_ports_graphics_ipe/ipe/work to macports
269:debug:extract euid/egid changed to: 506/503
270:debug:extract Privilege de-escalation not attempted as not running as root.
271:debug:patch patch phase started at Sun Apr 10 11:37:06 CEST 2016
272:debug:patch Executing org.macports.patch (ipe)
273:notice:patch --->  Applying patches to ipe
274:info:patch --->  Applying patch-ipe-mainmenu.xib.diff
275:debug:patch Environment:
276CC_PRINT_OPTIONS='YES'
277CC_PRINT_OPTIONS_FILE='/opt/local/var/macports/build/_opt_local_var_macports_sources_rsync.macports.org_release_tarballs_ports_graphics_ipe/ipe/work/.CC_PRINT_OPTIONS'
278CPATH='/opt/local/include'
279LIBRARY_PATH='/opt/local/lib'
280MACOSX_DEPLOYMENT_TARGET='10.9'
281:debug:patch Assembled command: 'cd "/opt/local/var/macports/build/_opt_local_var_macports_sources_rsync.macports.org_release_tarballs_ports_graphics_ipe/ipe/work/ipe-7.2.2/src" && /usr/bin/patch -p0'
282:debug:patch Executing command line:  cd "/opt/local/var/macports/build/_opt_local_var_macports_sources_rsync.macports.org_release_tarballs_ports_graphics_ipe/ipe/work/ipe-7.2.2/src" && /usr/bin/patch -p0 < '/opt/local/var/macports/sources/rsync.macports.org/release/tarballs/ports/graphics/ipe/files/patch-ipe-mainmenu.xib.diff'
283:info:patch patching file ipe/mainmenu.xib
284:debug:patch Privilege de-escalation not attempted as not running as root.
285:debug:configure configure phase started at Sun Apr 10 11:37:06 CEST 2016
286:notice:configure --->  Configuring ipe
287:debug:configure Using compiler 'Xcode Clang'
288:debug:configure Executing proc-pre-org.macports.configure-configure-0
289:debug:configure Executing org.macports.configure (ipe)
290:debug:configure Privilege de-escalation not attempted as not running as root.
291:debug:build build phase started at Sun Apr 10 11:37:06 CEST 2016
292:notice:build --->  Building ipe
293:debug:build Executing proc-pre-org.macports.build-build-0
294:debug:build Executing org.macports.build (ipe)
295:debug:build port disallows a parallel build
296:debug:build Environment:
297CC_PRINT_OPTIONS='YES'
298CC_PRINT_OPTIONS_FILE='/opt/local/var/macports/build/_opt_local_var_macports_sources_rsync.macports.org_release_tarballs_ports_graphics_ipe/ipe/work/.CC_PRINT_OPTIONS'
299CPATH='/opt/local/include'
300CXXFLAGS='-arch x86_64'
301LDFLAGS='-arch x86_64'
302LIBRARY_PATH='/opt/local/lib'
303MACOSX_DEPLOYMENT_TARGET='10.9'
304:debug:build Assembled command: 'cd "/opt/local/var/macports/build/_opt_local_var_macports_sources_rsync.macports.org_release_tarballs_ports_graphics_ipe/ipe/work/ipe-7.2.2/src" && /usr/bin/make -w all IPEQVORONOI=1 QHULL_CFLAGS=-I/opt/local/include/qhull IPEPREFIX=/opt/local CXX=/usr/bin/clang++ LUA_PACKAGE="lua" JPEG_LIBS="-framework ApplicationServices" IPECONFIGMAK="config.mak" IPEBUNDLE=1'
305:debug:build Executing command line:  cd "/opt/local/var/macports/build/_opt_local_var_macports_sources_rsync.macports.org_release_tarballs_ports_graphics_ipe/ipe/work/ipe-7.2.2/src" && /usr/bin/make -w all IPEQVORONOI=1 QHULL_CFLAGS=-I/opt/local/include/qhull IPEPREFIX=/opt/local CXX=/usr/bin/clang++ LUA_PACKAGE="lua" JPEG_LIBS="-framework ApplicationServices" IPECONFIGMAK="config.mak" IPEBUNDLE=1
306:info:build make: Entering directory `/opt/local/var/macports/build/_opt_local_var_macports_sources_rsync.macports.org_release_tarballs_ports_graphics_ipe/ipe/work/ipe-7.2.2/src'
307:info:build /Applications/Xcode.app/Contents/Developer/usr/bin/make --directory=ipelib all
308:info:build make[1]: Entering directory `/opt/local/var/macports/build/_opt_local_var_macports_sources_rsync.macports.org_release_tarballs_ports_graphics_ipe/ipe/work/ipe-7.2.2/src/ipelib'
309:info:build mkdir -p ../../build/obj/ipelib; echo "" > ../../build/obj/ipelib/depend.mak; for f in ipebase.cpp ipeplatform.cpp ipegeo.cpp ipexml.cpp ipeattributes.cpp ipebitmap.cpp ipeshape.cpp ipegroup.cpp ipeimage.cpp ipetext.cpp ipepath.cpp ipereference.cpp ipeobject.cpp ipefactory.cpp ipestdstyles.cpp ipeiml.cpp ipepage.cpp ipepainter.cpp ipetoolbase.cpp ipepdfparser.cpp ipepdfwriter.cpp iperesources.cpp ipestyle.cpp ipesnap.cpp ipeutils.cpp ipelatex.cpp ipedoc.cpp ipebitmap_unix.cpp ; do /usr/bin/clang++ -MM -MT ../../build/obj/ipelib/${f%%.cpp}.o -DIPEUI_COCOA -std=c++11 -I../include   -DIPEBUNDLE   -I/opt/local/include/libpng16 $f >> ../../build/obj/ipelib/depend.mak; done
310:info:build make[1]: Leaving directory `/opt/local/var/macports/build/_opt_local_var_macports_sources_rsync.macports.org_release_tarballs_ports_graphics_ipe/ipe/work/ipe-7.2.2/src/ipelib'
311:info:build make[1]: Entering directory `/opt/local/var/macports/build/_opt_local_var_macports_sources_rsync.macports.org_release_tarballs_ports_graphics_ipe/ipe/work/ipe-7.2.2/src/ipelib'
312:info:build Compiling ipebase.cpp...
313:info:build /usr/bin/clang++ -arch x86_64 -mmacosx-version-min=10.8 -Wdeprecated-declarations -Wall -Wno-sign-conversion -g -Os -stdlib=libc++ -fPIC -DIPEUI_COCOA -std=c++11 -I../include   -DIPEBUNDLE   -I/opt/local/include/libpng16  -c -o ../../build/obj/ipelib/ipebase.o ipebase.cpp
314:info:build Compiling ipeplatform.cpp...
315:info:build /usr/bin/clang++ -arch x86_64 -mmacosx-version-min=10.8 -Wdeprecated-declarations -Wall -Wno-sign-conversion -g -Os -stdlib=libc++ -fPIC -DIPEUI_COCOA -std=c++11 -I../include   -DIPEBUNDLE   -I/opt/local/include/libpng16  -c -o ../../build/obj/ipelib/ipeplatform.o ipeplatform.cpp
316:info:build Compiling ipegeo.cpp...
317:info:build /usr/bin/clang++ -arch x86_64 -mmacosx-version-min=10.8 -Wdeprecated-declarations -Wall -Wno-sign-conversion -g -Os -stdlib=libc++ -fPIC -DIPEUI_COCOA -std=c++11 -I../include   -DIPEBUNDLE   -I/opt/local/include/libpng16  -c -o ../../build/obj/ipelib/ipegeo.o ipegeo.cpp
318:info:build Compiling ipexml.cpp...
319:info:build /usr/bin/clang++ -arch x86_64 -mmacosx-version-min=10.8 -Wdeprecated-declarations -Wall -Wno-sign-conversion -g -Os -stdlib=libc++ -fPIC -DIPEUI_COCOA -std=c++11 -I../include   -DIPEBUNDLE   -I/opt/local/include/libpng16  -c -o ../../build/obj/ipelib/ipexml.o ipexml.cpp
320:info:build Compiling ipeattributes.cpp...
321:info:build /usr/bin/clang++ -arch x86_64 -mmacosx-version-min=10.8 -Wdeprecated-declarations -Wall -Wno-sign-conversion -g -Os -stdlib=libc++ -fPIC -DIPEUI_COCOA -std=c++11 -I../include   -DIPEBUNDLE   -I/opt/local/include/libpng16  -c -o ../../build/obj/ipelib/ipeattributes.o ipeattributes.cpp
322:info:build Compiling ipebitmap.cpp...
323:info:build /usr/bin/clang++ -arch x86_64 -mmacosx-version-min=10.8 -Wdeprecated-declarations -Wall -Wno-sign-conversion -g -Os -stdlib=libc++ -fPIC -DIPEUI_COCOA -std=c++11 -I../include   -DIPEBUNDLE   -I/opt/local/include/libpng16  -c -o ../../build/obj/ipelib/ipebitmap.o ipebitmap.cpp
324:info:build Compiling ipeshape.cpp...
325:info:build /usr/bin/clang++ -arch x86_64 -mmacosx-version-min=10.8 -Wdeprecated-declarations -Wall -Wno-sign-conversion -g -Os -stdlib=libc++ -fPIC -DIPEUI_COCOA -std=c++11 -I../include   -DIPEBUNDLE   -I/opt/local/include/libpng16  -c -o ../../build/obj/ipelib/ipeshape.o ipeshape.cpp
326:info:build Compiling ipegroup.cpp...
327:info:build /usr/bin/clang++ -arch x86_64 -mmacosx-version-min=10.8 -Wdeprecated-declarations -Wall -Wno-sign-conversion -g -Os -stdlib=libc++ -fPIC -DIPEUI_COCOA -std=c++11 -I../include   -DIPEBUNDLE   -I/opt/local/include/libpng16  -c -o ../../build/obj/ipelib/ipegroup.o ipegroup.cpp
328:info:build Compiling ipeimage.cpp...
329:info:build /usr/bin/clang++ -arch x86_64 -mmacosx-version-min=10.8 -Wdeprecated-declarations -Wall -Wno-sign-conversion -g -Os -stdlib=libc++ -fPIC -DIPEUI_COCOA -std=c++11 -I../include   -DIPEBUNDLE   -I/opt/local/include/libpng16  -c -o ../../build/obj/ipelib/ipeimage.o ipeimage.cpp
330:info:build Compiling ipetext.cpp...
331:info:build /usr/bin/clang++ -arch x86_64 -mmacosx-version-min=10.8 -Wdeprecated-declarations -Wall -Wno-sign-conversion -g -Os -stdlib=libc++ -fPIC -DIPEUI_COCOA -std=c++11 -I../include   -DIPEBUNDLE   -I/opt/local/include/libpng16  -c -o ../../build/obj/ipelib/ipetext.o ipetext.cpp
332:info:build Compiling ipepath.cpp...
333:info:build /usr/bin/clang++ -arch x86_64 -mmacosx-version-min=10.8 -Wdeprecated-declarations -Wall -Wno-sign-conversion -g -Os -stdlib=libc++ -fPIC -DIPEUI_COCOA -std=c++11 -I../include   -DIPEBUNDLE   -I/opt/local/include/libpng16  -c -o ../../build/obj/ipelib/ipepath.o ipepath.cpp
334:info:build Compiling ipereference.cpp...
335:info:build /usr/bin/clang++ -arch x86_64 -mmacosx-version-min=10.8 -Wdeprecated-declarations -Wall -Wno-sign-conversion -g -Os -stdlib=libc++ -fPIC -DIPEUI_COCOA -std=c++11 -I../include   -DIPEBUNDLE   -I/opt/local/include/libpng16  -c -o ../../build/obj/ipelib/ipereference.o ipereference.cpp
336:info:build Compiling ipeobject.cpp...
337:info:build /usr/bin/clang++ -arch x86_64 -mmacosx-version-min=10.8 -Wdeprecated-declarations -Wall -Wno-sign-conversion -g -Os -stdlib=libc++ -fPIC -DIPEUI_COCOA -std=c++11 -I../include   -DIPEBUNDLE   -I/opt/local/include/libpng16  -c -o ../../build/obj/ipelib/ipeobject.o ipeobject.cpp
338:info:build Compiling ipefactory.cpp...
339:info:build /usr/bin/clang++ -arch x86_64 -mmacosx-version-min=10.8 -Wdeprecated-declarations -Wall -Wno-sign-conversion -g -Os -stdlib=libc++ -fPIC -DIPEUI_COCOA -std=c++11 -I../include   -DIPEBUNDLE   -I/opt/local/include/libpng16  -c -o ../../build/obj/ipelib/ipefactory.o ipefactory.cpp
340:info:build Compiling ipestdstyles.cpp...
341:info:build /usr/bin/clang++ -arch x86_64 -mmacosx-version-min=10.8 -Wdeprecated-declarations -Wall -Wno-sign-conversion -g -Os -stdlib=libc++ -fPIC -DIPEUI_COCOA -std=c++11 -I../include   -DIPEBUNDLE   -I/opt/local/include/libpng16  -c -o ../../build/obj/ipelib/ipestdstyles.o ipestdstyles.cpp
342:info:build Compiling ipeiml.cpp...
343:info:build /usr/bin/clang++ -arch x86_64 -mmacosx-version-min=10.8 -Wdeprecated-declarations -Wall -Wno-sign-conversion -g -Os -stdlib=libc++ -fPIC -DIPEUI_COCOA -std=c++11 -I../include   -DIPEBUNDLE   -I/opt/local/include/libpng16  -c -o ../../build/obj/ipelib/ipeiml.o ipeiml.cpp
344:info:build Compiling ipepage.cpp...
345:info:build /usr/bin/clang++ -arch x86_64 -mmacosx-version-min=10.8 -Wdeprecated-declarations -Wall -Wno-sign-conversion -g -Os -stdlib=libc++ -fPIC -DIPEUI_COCOA -std=c++11 -I../include   -DIPEBUNDLE   -I/opt/local/include/libpng16  -c -o ../../build/obj/ipelib/ipepage.o ipepage.cpp
346:info:build Compiling ipepainter.cpp...
347:info:build /usr/bin/clang++ -arch x86_64 -mmacosx-version-min=10.8 -Wdeprecated-declarations -Wall -Wno-sign-conversion -g -Os -stdlib=libc++ -fPIC -DIPEUI_COCOA -std=c++11 -I../include   -DIPEBUNDLE   -I/opt/local/include/libpng16  -c -o ../../build/obj/ipelib/ipepainter.o ipepainter.cpp
348:info:build Compiling ipetoolbase.cpp...
349:info:build /usr/bin/clang++ -arch x86_64 -mmacosx-version-min=10.8 -Wdeprecated-declarations -Wall -Wno-sign-conversion -g -Os -stdlib=libc++ -fPIC -DIPEUI_COCOA -std=c++11 -I../include   -DIPEBUNDLE   -I/opt/local/include/libpng16  -c -o ../../build/obj/ipelib/ipetoolbase.o ipetoolbase.cpp
350:info:build Compiling ipepdfparser.cpp...
351:info:build /usr/bin/clang++ -arch x86_64 -mmacosx-version-min=10.8 -Wdeprecated-declarations -Wall -Wno-sign-conversion -g -Os -stdlib=libc++ -fPIC -DIPEUI_COCOA -std=c++11 -I../include   -DIPEBUNDLE   -I/opt/local/include/libpng16  -c -o ../../build/obj/ipelib/ipepdfparser.o ipepdfparser.cpp
352:info:build Compiling ipepdfwriter.cpp...
353:info:build /usr/bin/clang++ -arch x86_64 -mmacosx-version-min=10.8 -Wdeprecated-declarations -Wall -Wno-sign-conversion -g -Os -stdlib=libc++ -fPIC -DIPEUI_COCOA -std=c++11 -I../include   -DIPEBUNDLE   -I/opt/local/include/libpng16  -c -o ../../build/obj/ipelib/ipepdfwriter.o ipepdfwriter.cpp
354:info:build Compiling iperesources.cpp...
355:info:build /usr/bin/clang++ -arch x86_64 -mmacosx-version-min=10.8 -Wdeprecated-declarations -Wall -Wno-sign-conversion -g -Os -stdlib=libc++ -fPIC -DIPEUI_COCOA -std=c++11 -I../include   -DIPEBUNDLE   -I/opt/local/include/libpng16  -c -o ../../build/obj/ipelib/iperesources.o iperesources.cpp
356:info:build Compiling ipestyle.cpp...
357:info:build /usr/bin/clang++ -arch x86_64 -mmacosx-version-min=10.8 -Wdeprecated-declarations -Wall -Wno-sign-conversion -g -Os -stdlib=libc++ -fPIC -DIPEUI_COCOA -std=c++11 -I../include   -DIPEBUNDLE   -I/opt/local/include/libpng16  -c -o ../../build/obj/ipelib/ipestyle.o ipestyle.cpp
358:info:build Compiling ipesnap.cpp...
359:info:build /usr/bin/clang++ -arch x86_64 -mmacosx-version-min=10.8 -Wdeprecated-declarations -Wall -Wno-sign-conversion -g -Os -stdlib=libc++ -fPIC -DIPEUI_COCOA -std=c++11 -I../include   -DIPEBUNDLE   -I/opt/local/include/libpng16  -c -o ../../build/obj/ipelib/ipesnap.o ipesnap.cpp
360:info:build Compiling ipeutils.cpp...
361:info:build /usr/bin/clang++ -arch x86_64 -mmacosx-version-min=10.8 -Wdeprecated-declarations -Wall -Wno-sign-conversion -g -Os -stdlib=libc++ -fPIC -DIPEUI_COCOA -std=c++11 -I../include   -DIPEBUNDLE   -I/opt/local/include/libpng16  -c -o ../../build/obj/ipelib/ipeutils.o ipeutils.cpp
362:info:build Compiling ipelatex.cpp...
363:info:build /usr/bin/clang++ -arch x86_64 -mmacosx-version-min=10.8 -Wdeprecated-declarations -Wall -Wno-sign-conversion -g -Os -stdlib=libc++ -fPIC -DIPEUI_COCOA -std=c++11 -I../include   -DIPEBUNDLE   -I/opt/local/include/libpng16  -c -o ../../build/obj/ipelib/ipelatex.o ipelatex.cpp
364:info:build Compiling ipedoc.cpp...
365:info:build /usr/bin/clang++ -arch x86_64 -mmacosx-version-min=10.8 -Wdeprecated-declarations -Wall -Wno-sign-conversion -g -Os -stdlib=libc++ -fPIC -DIPEUI_COCOA -std=c++11 -I../include   -DIPEBUNDLE   -I/opt/local/include/libpng16  -c -o ../../build/obj/ipelib/ipedoc.o ipedoc.cpp
366:info:build Compiling ipebitmap_unix.cpp...
367:info:build /usr/bin/clang++ -arch x86_64 -mmacosx-version-min=10.8 -Wdeprecated-declarations -Wall -Wno-sign-conversion -g -Os -stdlib=libc++ -fPIC -DIPEUI_COCOA -std=c++11 -I../include   -DIPEBUNDLE   -I/opt/local/include/libpng16  -c -o ../../build/obj/ipelib/ipebitmap_unix.o ipebitmap_unix.cpp
368:info:build mkdir -p ../../build/Ipe.app/Contents/Frameworks
369:info:build /usr/bin/clang++ -arch x86_64 -mmacosx-version-min=10.8 -stdlib=libc++ -dynamiclib  -Wl,-dylib_install_name,@executable_path/../Frameworks/libipe.7.2.2.dylib -o ../../build/Ipe.app/Contents/Frameworks/libipe.7.2.2.dylib ../../build/obj/ipelib/ipebase.o ../../build/obj/ipelib/ipeplatform.o ../../build/obj/ipelib/ipegeo.o ../../build/obj/ipelib/ipexml.o ../../build/obj/ipelib/ipeattributes.o ../../build/obj/ipelib/ipebitmap.o ../../build/obj/ipelib/ipeshape.o ../../build/obj/ipelib/ipegroup.o ../../build/obj/ipelib/ipeimage.o ../../build/obj/ipelib/ipetext.o ../../build/obj/ipelib/ipepath.o ../../build/obj/ipelib/ipereference.o ../../build/obj/ipelib/ipeobject.o ../../build/obj/ipelib/ipefactory.o ../../build/obj/ipelib/ipestdstyles.o ../../build/obj/ipelib/ipeiml.o ../../build/obj/ipelib/ipepage.o ../../build/obj/ipelib/ipepainter.o ../../build/obj/ipelib/ipetoolbase.o ../../build/obj/ipelib/ipepdfparser.o ../../build/obj/ipelib/ipepdfwriter.o ../../build/obj/ipelib/iperesources.o ../../build/obj/ipelib/ipestyle.o ../../build/obj/ipelib/ipesnap.o ../../build/obj/ipelib/ipeutils.o ../../build/obj/ipelib/ipelatex.o ../../build/obj/ipelib/ipedoc.o ../../build/obj/ipelib/ipebitmap_unix.o -framework ApplicationServices -lz -L/opt/local/lib -lpng16
370:info:build ln -sf libipe.7.2.2.dylib ../../build/Ipe.app/Contents/Frameworks/libipe.dylib
371:info:build make[1]: Leaving directory `/opt/local/var/macports/build/_opt_local_var_macports_sources_rsync.macports.org_release_tarballs_ports_graphics_ipe/ipe/work/ipe-7.2.2/src/ipelib'
372:info:build /Applications/Xcode.app/Contents/Developer/usr/bin/make --directory=ipelets/lua all
373:info:build make[1]: Entering directory `/opt/local/var/macports/build/_opt_local_var_macports_sources_rsync.macports.org_release_tarballs_ports_graphics_ipe/ipe/work/ipe-7.2.2/src/ipelets/lua'
374:info:build make[1]: Nothing to be done for `all'.
375:info:build make[1]: Leaving directory `/opt/local/var/macports/build/_opt_local_var_macports_sources_rsync.macports.org_release_tarballs_ports_graphics_ipe/ipe/work/ipe-7.2.2/src/ipelets/lua'
376:info:build /Applications/Xcode.app/Contents/Developer/usr/bin/make --directory=ipetoipe all
377:info:build make[1]: Entering directory `/opt/local/var/macports/build/_opt_local_var_macports_sources_rsync.macports.org_release_tarballs_ports_graphics_ipe/ipe/work/ipe-7.2.2/src/ipetoipe'
378:info:build mkdir -p ../../build/obj/ipetoipe; echo "" > ../../build/obj/ipetoipe/depend.mak; for f in ipetoipe.cpp ; do /usr/bin/clang++ -MM -MT ../../build/obj/ipetoipe/${f%%.cpp}.o -DIPEUI_COCOA -std=c++11 -I../include $f >> ../../build/obj/ipetoipe/depend.mak; done
379:info:build make[1]: Leaving directory `/opt/local/var/macports/build/_opt_local_var_macports_sources_rsync.macports.org_release_tarballs_ports_graphics_ipe/ipe/work/ipe-7.2.2/src/ipetoipe'
380:info:build make[1]: Entering directory `/opt/local/var/macports/build/_opt_local_var_macports_sources_rsync.macports.org_release_tarballs_ports_graphics_ipe/ipe/work/ipe-7.2.2/src/ipetoipe'
381:info:build Compiling ipetoipe.cpp...
382:info:build /usr/bin/clang++ -arch x86_64 -mmacosx-version-min=10.8 -Wdeprecated-declarations -Wall -Wno-sign-conversion -g -Os -stdlib=libc++ -DIPEUI_COCOA -std=c++11 -I../include  -c -o ../../build/obj/ipetoipe/ipetoipe.o ipetoipe.cpp
383:info:build mkdir -p ../../build/Ipe.app/Contents/MacOS
384:info:build /usr/bin/clang++ -arch x86_64 -mmacosx-version-min=10.8 -stdlib=libc++ -o ../../build/Ipe.app/Contents/MacOS/ipetoipe ../../build/obj/ipetoipe/ipetoipe.o -L../../build/Ipe.app/Contents/Frameworks -lipe
385:info:build make[1]: Leaving directory `/opt/local/var/macports/build/_opt_local_var_macports_sources_rsync.macports.org_release_tarballs_ports_graphics_ipe/ipe/work/ipe-7.2.2/src/ipetoipe'
386:info:build /Applications/Xcode.app/Contents/Developer/usr/bin/make --directory=ipe6upgrade all
387:info:build make[1]: Entering directory `/opt/local/var/macports/build/_opt_local_var_macports_sources_rsync.macports.org_release_tarballs_ports_graphics_ipe/ipe/work/ipe-7.2.2/src/ipe6upgrade'
388:info:build mkdir -p ../../build/obj/ipe6upgrade; echo "" > ../../build/obj/ipe6upgrade/depend.mak; for f in ipe6upgrade.cpp ; do /usr/bin/clang++ -MM -MT ../../build/obj/ipe6upgrade/${f%%.cpp}.o -DIPEUI_COCOA -std=c++11 -I../include $f >> ../../build/obj/ipe6upgrade/depend.mak; done
389:info:build make[1]: Leaving directory `/opt/local/var/macports/build/_opt_local_var_macports_sources_rsync.macports.org_release_tarballs_ports_graphics_ipe/ipe/work/ipe-7.2.2/src/ipe6upgrade'
390:info:build make[1]: Entering directory `/opt/local/var/macports/build/_opt_local_var_macports_sources_rsync.macports.org_release_tarballs_ports_graphics_ipe/ipe/work/ipe-7.2.2/src/ipe6upgrade'
391:info:build Compiling ipe6upgrade.cpp...
392:info:build /usr/bin/clang++ -arch x86_64 -mmacosx-version-min=10.8 -Wdeprecated-declarations -Wall -Wno-sign-conversion -g -Os -stdlib=libc++ -DIPEUI_COCOA -std=c++11 -I../include  -c -o ../../build/obj/ipe6upgrade/ipe6upgrade.o ipe6upgrade.cpp
393:info:build mkdir -p ../../build/Ipe.app/Contents/MacOS
394:info:build /usr/bin/clang++ -arch x86_64 -mmacosx-version-min=10.8 -stdlib=libc++ -o ../../build/Ipe.app/Contents/MacOS/ipe6upgrade ../../build/obj/ipe6upgrade/ipe6upgrade.o -L../../build/Ipe.app/Contents/Frameworks -lipe
395:info:build make[1]: Leaving directory `/opt/local/var/macports/build/_opt_local_var_macports_sources_rsync.macports.org_release_tarballs_ports_graphics_ipe/ipe/work/ipe-7.2.2/src/ipe6upgrade'
396:info:build /Applications/Xcode.app/Contents/Developer/usr/bin/make --directory=ipeextract all
397:info:build make[1]: Entering directory `/opt/local/var/macports/build/_opt_local_var_macports_sources_rsync.macports.org_release_tarballs_ports_graphics_ipe/ipe/work/ipe-7.2.2/src/ipeextract'
398:info:build mkdir -p ../../build/obj/ipeextract; echo "" > ../../build/obj/ipeextract/depend.mak; for f in ipeextract.cpp ; do /usr/bin/clang++ -MM -MT ../../build/obj/ipeextract/${f%%.cpp}.o -DIPEUI_COCOA -std=c++11 -I../include $f >> ../../build/obj/ipeextract/depend.mak; done
399:info:build make[1]: Leaving directory `/opt/local/var/macports/build/_opt_local_var_macports_sources_rsync.macports.org_release_tarballs_ports_graphics_ipe/ipe/work/ipe-7.2.2/src/ipeextract'
400:info:build make[1]: Entering directory `/opt/local/var/macports/build/_opt_local_var_macports_sources_rsync.macports.org_release_tarballs_ports_graphics_ipe/ipe/work/ipe-7.2.2/src/ipeextract'
401:info:build Compiling ipeextract.cpp...
402:info:build /usr/bin/clang++ -arch x86_64 -mmacosx-version-min=10.8 -Wdeprecated-declarations -Wall -Wno-sign-conversion -g -Os -stdlib=libc++ -DIPEUI_COCOA -std=c++11 -I../include  -c -o ../../build/obj/ipeextract/ipeextract.o ipeextract.cpp
403:info:build mkdir -p ../../build/Ipe.app/Contents/MacOS
404:info:build /usr/bin/clang++ -arch x86_64 -mmacosx-version-min=10.8 -stdlib=libc++ -o ../../build/Ipe.app/Contents/MacOS/ipeextract ../../build/obj/ipeextract/ipeextract.o -L../../build/Ipe.app/Contents/Frameworks -lipe
405:info:build make[1]: Leaving directory `/opt/local/var/macports/build/_opt_local_var_macports_sources_rsync.macports.org_release_tarballs_ports_graphics_ipe/ipe/work/ipe-7.2.2/src/ipeextract'
406:info:build /Applications/Xcode.app/Contents/Developer/usr/bin/make --directory=ipelua all
407:info:build make[1]: Entering directory `/opt/local/var/macports/build/_opt_local_var_macports_sources_rsync.macports.org_release_tarballs_ports_graphics_ipe/ipe/work/ipe-7.2.2/src/ipelua'
408:info:build mkdir -p ../../build/obj/ipelua; echo "" > ../../build/obj/ipelua/depend.mak; for f in ipelib.cpp ipeluageo.cpp ipeluaobj.cpp ipeluastyle.cpp ipeluapage.cpp ipeluaipelet.cpp ; do /usr/bin/clang++ -MM -MT ../../build/obj/ipelua/${f%%.cpp}.o -DIPEUI_COCOA -std=c++11 -I../include -I/opt/local/include $f >> ../../build/obj/ipelua/depend.mak; done
409:info:build make[1]: Leaving directory `/opt/local/var/macports/build/_opt_local_var_macports_sources_rsync.macports.org_release_tarballs_ports_graphics_ipe/ipe/work/ipe-7.2.2/src/ipelua'
410:info:build make[1]: Entering directory `/opt/local/var/macports/build/_opt_local_var_macports_sources_rsync.macports.org_release_tarballs_ports_graphics_ipe/ipe/work/ipe-7.2.2/src/ipelua'
411:info:build Compiling ipelib.cpp...
412:info:build /usr/bin/clang++ -arch x86_64 -mmacosx-version-min=10.8 -Wdeprecated-declarations -Wall -Wno-sign-conversion -g -Os -stdlib=libc++ -fPIC -DIPEUI_COCOA -std=c++11 -I../include -I/opt/local/include  -c -o ../../build/obj/ipelua/ipelib.o ipelib.cpp
413:info:build Compiling ipeluageo.cpp...
414:info:build /usr/bin/clang++ -arch x86_64 -mmacosx-version-min=10.8 -Wdeprecated-declarations -Wall -Wno-sign-conversion -g -Os -stdlib=libc++ -fPIC -DIPEUI_COCOA -std=c++11 -I../include -I/opt/local/include  -c -o ../../build/obj/ipelua/ipeluageo.o ipeluageo.cpp
415:info:build Compiling ipeluaobj.cpp...
416:info:build /usr/bin/clang++ -arch x86_64 -mmacosx-version-min=10.8 -Wdeprecated-declarations -Wall -Wno-sign-conversion -g -Os -stdlib=libc++ -fPIC -DIPEUI_COCOA -std=c++11 -I../include -I/opt/local/include  -c -o ../../build/obj/ipelua/ipeluaobj.o ipeluaobj.cpp
417:info:build Compiling ipeluastyle.cpp...
418:info:build /usr/bin/clang++ -arch x86_64 -mmacosx-version-min=10.8 -Wdeprecated-declarations -Wall -Wno-sign-conversion -g -Os -stdlib=libc++ -fPIC -DIPEUI_COCOA -std=c++11 -I../include -I/opt/local/include  -c -o ../../build/obj/ipelua/ipeluastyle.o ipeluastyle.cpp
419:info:build Compiling ipeluapage.cpp...
420:info:build /usr/bin/clang++ -arch x86_64 -mmacosx-version-min=10.8 -Wdeprecated-declarations -Wall -Wno-sign-conversion -g -Os -stdlib=libc++ -fPIC -DIPEUI_COCOA -std=c++11 -I../include -I/opt/local/include  -c -o ../../build/obj/ipelua/ipeluapage.o ipeluapage.cpp
421:info:build Compiling ipeluaipelet.cpp...
422:info:build /usr/bin/clang++ -arch x86_64 -mmacosx-version-min=10.8 -Wdeprecated-declarations -Wall -Wno-sign-conversion -g -Os -stdlib=libc++ -fPIC -DIPEUI_COCOA -std=c++11 -I../include -I/opt/local/include  -c -o ../../build/obj/ipelua/ipeluaipelet.o ipeluaipelet.cpp
423:info:build mkdir -p ../../build/Ipe.app/Contents/Frameworks
424:info:build /usr/bin/clang++ -arch x86_64 -mmacosx-version-min=10.8 -stdlib=libc++ -dynamiclib  -Wl,-dylib_install_name,@executable_path/../Frameworks/libipelua.7.2.2.dylib -o ../../build/Ipe.app/Contents/Frameworks/libipelua.7.2.2.dylib ../../build/obj/ipelua/ipelib.o ../../build/obj/ipelua/ipeluageo.o ../../build/obj/ipelua/ipeluaobj.o ../../build/obj/ipelua/ipeluastyle.o ../../build/obj/ipelua/ipeluapage.o ../../build/obj/ipelua/ipeluaipelet.o -L../../build/Ipe.app/Contents/Frameworks -lipe -L/opt/local/lib -llua -lm -ldl
425:info:build ln -sf libipelua.7.2.2.dylib ../../build/Ipe.app/Contents/Frameworks/libipelua.dylib
426:info:build make[1]: Leaving directory `/opt/local/var/macports/build/_opt_local_var_macports_sources_rsync.macports.org_release_tarballs_ports_graphics_ipe/ipe/work/ipe-7.2.2/src/ipelua'
427:info:build /Applications/Xcode.app/Contents/Developer/usr/bin/make --directory=ipescript all
428:info:build make[1]: Entering directory `/opt/local/var/macports/build/_opt_local_var_macports_sources_rsync.macports.org_release_tarballs_ports_graphics_ipe/ipe/work/ipe-7.2.2/src/ipescript'
429:info:build mkdir -p ../../build/obj/ipescript; echo "" > ../../build/obj/ipescript/depend.mak; for f in ipescript.cpp ; do /usr/bin/clang++ -MM -MT ../../build/obj/ipescript/${f%%.cpp}.o -DIPEUI_COCOA -std=c++11 -I../include -I../ipelua -I/opt/local/include -DIPEBUNDLE $f >> ../../build/obj/ipescript/depend.mak; done
430:info:build make[1]: Leaving directory `/opt/local/var/macports/build/_opt_local_var_macports_sources_rsync.macports.org_release_tarballs_ports_graphics_ipe/ipe/work/ipe-7.2.2/src/ipescript'
431:info:build make[1]: Entering directory `/opt/local/var/macports/build/_opt_local_var_macports_sources_rsync.macports.org_release_tarballs_ports_graphics_ipe/ipe/work/ipe-7.2.2/src/ipescript'
432:info:build Compiling ipescript.cpp...
433:info:build /usr/bin/clang++ -arch x86_64 -mmacosx-version-min=10.8 -Wdeprecated-declarations -Wall -Wno-sign-conversion -g -Os -stdlib=libc++ -DIPEUI_COCOA -std=c++11 -I../include -I../ipelua -I/opt/local/include -DIPEBUNDLE  -c -o ../../build/obj/ipescript/ipescript.o ipescript.cpp
434:info:build mkdir -p ../../build/Ipe.app/Contents/MacOS
435:info:build /usr/bin/clang++ -arch x86_64 -mmacosx-version-min=10.8 -stdlib=libc++ -o ../../build/Ipe.app/Contents/MacOS/ipescript ../../build/obj/ipescript/ipescript.o -L../../build/Ipe.app/Contents/Frameworks -lipelua -lipe -L/opt/local/lib -llua -lm -ldl
436:info:build make[1]: Leaving directory `/opt/local/var/macports/build/_opt_local_var_macports_sources_rsync.macports.org_release_tarballs_ports_graphics_ipe/ipe/work/ipe-7.2.2/src/ipescript'
437:info:build /Applications/Xcode.app/Contents/Developer/usr/bin/make --directory=ipecairo all
438:info:build make[1]: Entering directory `/opt/local/var/macports/build/_opt_local_var_macports_sources_rsync.macports.org_release_tarballs_ports_graphics_ipe/ipe/work/ipe-7.2.2/src/ipecairo'
439:info:build mkdir -p ../../build/obj/ipecairo; echo "" > ../../build/obj/ipecairo/depend.mak; for f in ipecairopainter.cpp ipefonts.cpp ipethumbs.cpp ; do /usr/bin/clang++ -MM -MT ../../build/obj/ipecairo/${f%%.cpp}.o -DIPEUI_COCOA -std=c++11 -I../include -I/opt/local/include/cairo -I/opt/local/include/glib-2.0 -I/opt/local/lib/glib-2.0/include -I/opt/local/include -I/opt/local/include/pixman-1 -I/opt/local/include -I/opt/local/include/freetype2 -I/opt/local/include -I/opt/local/include/freetype2 -I/opt/local/include/libpng16 -I/opt/local/include -I/opt/local/include/freetype2 $f >> ../../build/obj/ipecairo/depend.mak; done
440:info:build make[1]: Leaving directory `/opt/local/var/macports/build/_opt_local_var_macports_sources_rsync.macports.org_release_tarballs_ports_graphics_ipe/ipe/work/ipe-7.2.2/src/ipecairo'
441:info:build make[1]: Entering directory `/opt/local/var/macports/build/_opt_local_var_macports_sources_rsync.macports.org_release_tarballs_ports_graphics_ipe/ipe/work/ipe-7.2.2/src/ipecairo'
442:info:build Compiling ipecairopainter.cpp...
443:info:build /usr/bin/clang++ -arch x86_64 -mmacosx-version-min=10.8 -Wdeprecated-declarations -Wall -Wno-sign-conversion -g -Os -stdlib=libc++ -fPIC -DIPEUI_COCOA -std=c++11 -I../include -I/opt/local/include/cairo -I/opt/local/include/glib-2.0 -I/opt/local/lib/glib-2.0/include -I/opt/local/include -I/opt/local/include/pixman-1 -I/opt/local/include -I/opt/local/include/freetype2 -I/opt/local/include -I/opt/local/include/freetype2 -I/opt/local/include/libpng16 -I/opt/local/include -I/opt/local/include/freetype2  -c -o ../../build/obj/ipecairo/ipecairopainter.o ipecairopainter.cpp
444:info:build Compiling ipefonts.cpp...
445:info:build /usr/bin/clang++ -arch x86_64 -mmacosx-version-min=10.8 -Wdeprecated-declarations -Wall -Wno-sign-conversion -g -Os -stdlib=libc++ -fPIC -DIPEUI_COCOA -std=c++11 -I../include -I/opt/local/include/cairo -I/opt/local/include/glib-2.0 -I/opt/local/lib/glib-2.0/include -I/opt/local/include -I/opt/local/include/pixman-1 -I/opt/local/include -I/opt/local/include/freetype2 -I/opt/local/include -I/opt/local/include/freetype2 -I/opt/local/include/libpng16 -I/opt/local/include -I/opt/local/include/freetype2  -c -o ../../build/obj/ipecairo/ipefonts.o ipefonts.cpp
446:info:build Compiling ipethumbs.cpp...
447:info:build /usr/bin/clang++ -arch x86_64 -mmacosx-version-min=10.8 -Wdeprecated-declarations -Wall -Wno-sign-conversion -g -Os -stdlib=libc++ -fPIC -DIPEUI_COCOA -std=c++11 -I../include -I/opt/local/include/cairo -I/opt/local/include/glib-2.0 -I/opt/local/lib/glib-2.0/include -I/opt/local/include -I/opt/local/include/pixman-1 -I/opt/local/include -I/opt/local/include/freetype2 -I/opt/local/include -I/opt/local/include/freetype2 -I/opt/local/include/libpng16 -I/opt/local/include -I/opt/local/include/freetype2  -c -o ../../build/obj/ipecairo/ipethumbs.o ipethumbs.cpp
448:info:build mkdir -p ../../build/Ipe.app/Contents/Frameworks
449:info:build /usr/bin/clang++ -arch x86_64 -mmacosx-version-min=10.8 -stdlib=libc++ -dynamiclib  -Wl,-dylib_install_name,@executable_path/../Frameworks/libipecairo.7.2.2.dylib -o ../../build/Ipe.app/Contents/Frameworks/libipecairo.7.2.2.dylib ../../build/obj/ipecairo/ipecairopainter.o ../../build/obj/ipecairo/ipefonts.o ../../build/obj/ipecairo/ipethumbs.o -L../../build/Ipe.app/Contents/Frameworks -lipe -L/opt/local/lib -lcairo -L/opt/local/lib -lfreetype
450:info:build ln -sf libipecairo.7.2.2.dylib ../../build/Ipe.app/Contents/Frameworks/libipecairo.dylib
451:info:build make[1]: Leaving directory `/opt/local/var/macports/build/_opt_local_var_macports_sources_rsync.macports.org_release_tarballs_ports_graphics_ipe/ipe/work/ipe-7.2.2/src/ipecairo'
452:info:build /Applications/Xcode.app/Contents/Developer/usr/bin/make --directory=iperender all
453:info:build make[1]: Entering directory `/opt/local/var/macports/build/_opt_local_var_macports_sources_rsync.macports.org_release_tarballs_ports_graphics_ipe/ipe/work/ipe-7.2.2/src/iperender'
454:info:build mkdir -p ../../build/obj/iperender; echo "" > ../../build/obj/iperender/depend.mak; for f in iperender.cpp ; do /usr/bin/clang++ -MM -MT ../../build/obj/iperender/${f%%.cpp}.o -DIPEUI_COCOA -std=c++11 -I../include -I/opt/local/include/cairo -I/opt/local/include/glib-2.0 -I/opt/local/lib/glib-2.0/include -I/opt/local/include -I/opt/local/include/pixman-1 -I/opt/local/include -I/opt/local/include/freetype2 -I/opt/local/include -I/opt/local/include/freetype2 -I/opt/local/include/libpng16 -I/opt/local/include -I../ipecairo $f >> ../../build/obj/iperender/depend.mak; done
455:info:build make[1]: Leaving directory `/opt/local/var/macports/build/_opt_local_var_macports_sources_rsync.macports.org_release_tarballs_ports_graphics_ipe/ipe/work/ipe-7.2.2/src/iperender'
456:info:build make[1]: Entering directory `/opt/local/var/macports/build/_opt_local_var_macports_sources_rsync.macports.org_release_tarballs_ports_graphics_ipe/ipe/work/ipe-7.2.2/src/iperender'
457:info:build Compiling iperender.cpp...
458:info:build /usr/bin/clang++ -arch x86_64 -mmacosx-version-min=10.8 -Wdeprecated-declarations -Wall -Wno-sign-conversion -g -Os -stdlib=libc++ -DIPEUI_COCOA -std=c++11 -I../include -I/opt/local/include/cairo -I/opt/local/include/glib-2.0 -I/opt/local/lib/glib-2.0/include -I/opt/local/include -I/opt/local/include/pixman-1 -I/opt/local/include -I/opt/local/include/freetype2 -I/opt/local/include -I/opt/local/include/freetype2 -I/opt/local/include/libpng16 -I/opt/local/include -I../ipecairo  -c -o ../../build/obj/iperender/iperender.o iperender.cpp
459:info:build mkdir -p ../../build/Ipe.app/Contents/MacOS
460:info:build /usr/bin/clang++ -arch x86_64 -mmacosx-version-min=10.8 -stdlib=libc++ -o ../../build/Ipe.app/Contents/MacOS/iperender ../../build/obj/iperender/iperender.o -L../../build/Ipe.app/Contents/Frameworks -lipecairo -lipe -L/opt/local/lib -lcairo
461:info:build make[1]: Leaving directory `/opt/local/var/macports/build/_opt_local_var_macports_sources_rsync.macports.org_release_tarballs_ports_graphics_ipe/ipe/work/ipe-7.2.2/src/iperender'
462:info:build /Applications/Xcode.app/Contents/Developer/usr/bin/make --directory=ipecanvas all
463:info:build make[1]: Entering directory `/opt/local/var/macports/build/_opt_local_var_macports_sources_rsync.macports.org_release_tarballs_ports_graphics_ipe/ipe/work/ipe-7.2.2/src/ipecanvas'
464:info:build mkdir -p ../../build/obj/ipecanvas; echo "" > ../../build/obj/ipecanvas/depend.mak; for f in ipetool.cpp ipecanvas.cpp ipecanvas_cocoa.cpp ipeselector_cocoa.cpp; do /usr/bin/clang++ -MM -MT ../../build/obj/ipecanvas/${f%%.cpp}.o -DIPEUI_COCOA -std=c++11 -I../include -I../ipecairo -I/opt/local/include/cairo -I/opt/local/include/glib-2.0 -I/opt/local/lib/glib-2.0/include -I/opt/local/include -I/opt/local/include/pixman-1 -I/opt/local/include -I/opt/local/include/freetype2 -I/opt/local/include -I/opt/local/include/freetype2 -I/opt/local/include/libpng16 -I/opt/local/include -x objective-c++ -fobjc-arc  $f >> ../../build/obj/ipecanvas/depend.mak; done
465:info:build make[1]: Leaving directory `/opt/local/var/macports/build/_opt_local_var_macports_sources_rsync.macports.org_release_tarballs_ports_graphics_ipe/ipe/work/ipe-7.2.2/src/ipecanvas'
466:info:build make[1]: Entering directory `/opt/local/var/macports/build/_opt_local_var_macports_sources_rsync.macports.org_release_tarballs_ports_graphics_ipe/ipe/work/ipe-7.2.2/src/ipecanvas'
467:info:build Compiling ipetool.cpp...
468:info:build /usr/bin/clang++ -arch x86_64 -mmacosx-version-min=10.8 -Wdeprecated-declarations -Wall -Wno-sign-conversion -g -Os -stdlib=libc++ -fPIC -DIPEUI_COCOA -std=c++11 -I../include -I../ipecairo -I/opt/local/include/cairo -I/opt/local/include/glib-2.0 -I/opt/local/lib/glib-2.0/include -I/opt/local/include -I/opt/local/include/pixman-1 -I/opt/local/include -I/opt/local/include/freetype2 -I/opt/local/include -I/opt/local/include/freetype2 -I/opt/local/include/libpng16 -I/opt/local/include -x objective-c++ -fobjc-arc   -c -o ../../build/obj/ipecanvas/ipetool.o ipetool.cpp
469:info:build Compiling ipecanvas.cpp...
470:info:build /usr/bin/clang++ -arch x86_64 -mmacosx-version-min=10.8 -Wdeprecated-declarations -Wall -Wno-sign-conversion -g -Os -stdlib=libc++ -fPIC -DIPEUI_COCOA -std=c++11 -I../include -I../ipecairo -I/opt/local/include/cairo -I/opt/local/include/glib-2.0 -I/opt/local/lib/glib-2.0/include -I/opt/local/include -I/opt/local/include/pixman-1 -I/opt/local/include -I/opt/local/include/freetype2 -I/opt/local/include -I/opt/local/include/freetype2 -I/opt/local/include/libpng16 -I/opt/local/include -x objective-c++ -fobjc-arc   -c -o ../../build/obj/ipecanvas/ipecanvas.o ipecanvas.cpp
471:info:build Compiling ipecanvas_cocoa.cpp...
472:info:build /usr/bin/clang++ -arch x86_64 -mmacosx-version-min=10.8 -Wdeprecated-declarations -Wall -Wno-sign-conversion -g -Os -stdlib=libc++ -fPIC -DIPEUI_COCOA -std=c++11 -I../include -I../ipecairo -I/opt/local/include/cairo -I/opt/local/include/glib-2.0 -I/opt/local/lib/glib-2.0/include -I/opt/local/include -I/opt/local/include/pixman-1 -I/opt/local/include -I/opt/local/include/freetype2 -I/opt/local/include -I/opt/local/include/freetype2 -I/opt/local/include/libpng16 -I/opt/local/include -x objective-c++ -fobjc-arc   -c -o ../../build/obj/ipecanvas/ipecanvas_cocoa.o ipecanvas_cocoa.cpp
473:info:build ipecanvas_cocoa.cpp:48:46: error: no visible @interface for 'NSGraphicsContext' declares the selector 'CGContext'
474:info:build   return [[NSGraphicsContext currentContext] CGContext];
475:info:build           ~~~~~~~~~~~~~~~~~~~~~~~~~~~~~~~~~~ ^~~~~~~~~
476:info:build 1 error generated.
477:info:build make[1]: *** [../../build/obj/ipecanvas/ipecanvas_cocoa.o] Error 1
478:info:build make[1]: Leaving directory `/opt/local/var/macports/build/_opt_local_var_macports_sources_rsync.macports.org_release_tarballs_ports_graphics_ipe/ipe/work/ipe-7.2.2/src/ipecanvas'
479:info:build make: *** [ipecanvas] Error 2
480:info:build make: Leaving directory `/opt/local/var/macports/build/_opt_local_var_macports_sources_rsync.macports.org_release_tarballs_ports_graphics_ipe/ipe/work/ipe-7.2.2/src'
481:info:build Command failed:  cd "/opt/local/var/macports/build/_opt_local_var_macports_sources_rsync.macports.org_release_tarballs_ports_graphics_ipe/ipe/work/ipe-7.2.2/src" && /usr/bin/make -w all IPEQVORONOI=1 QHULL_CFLAGS=-I/opt/local/include/qhull IPEPREFIX=/opt/local CXX=/usr/bin/clang++ LUA_PACKAGE="lua" JPEG_LIBS="-framework ApplicationServices" IPECONFIGMAK="config.mak" IPEBUNDLE=1
482:info:build Exit code: 2
483:error:build org.macports.build for port ipe returned: command execution failed
484:debug:build Error code: CHILDSTATUS 68447 2
485:debug:build Backtrace: command execution failed
486    while executing
487"system -nice 0 $fullcmdstring"
488    ("eval" body line 1)
489    invoked from within
490"eval system $notty $nice \$fullcmdstring"
491    invoked from within
492"command_exec build"
493    (procedure "portbuild::build_main" line 8)
494    invoked from within
495"portbuild::build_main org.macports.build"
496    ("eval" body line 1)
497    invoked from within
498"eval $procedure $targetname"
499:info:build Warning: targets not executed for ipe: org.macports.activate org.macports.build org.macports.destroot org.macports.install
500:notice:build Please see the log file for port ipe for details:
501    /opt/local/var/macports/logs/_opt_local_var_macports_sources_rsync.macports.org_release_tarballs_ports_graphics_ipe/ipe/main.log