Ticket #51566: avrdude_build.log

File avrdude_build.log, 71.6 KB (added by feilipu (Phillip Stevens), 17 months ago)

avrdude build log

Line 
1version:1
2:debug:main epoch: in tree: 0 installed: 0
3:debug:main apple-gcc42 5666.3_15 exists in the ports tree
4:debug:main apple-gcc42 5666.3_15  is the latest installed
5:debug:main apple-gcc42 5666.3_15  is active
6:debug:main Merging existing variants '' into variants
7:debug:main new fully merged portvariants:
8:debug:main Changing to port directory: /opt/local/var/macports/sources/rsync.macports.org/release/tarballs/ports/lang/apple-gcc42
9:debug:main OS darwin/8.11.0 (Mac OS X 10.4) arch powerpc
10:debug:main Sourcing PortGroup select 1.0 from /opt/local/var/macports/sources/rsync.macports.org/release/tarballs/ports/_resources/port1.0/group/select-1.0.tcl
11:debug:main Reading variant descriptions from /opt/local/var/macports/sources/rsync.macports.org/release/tarballs/ports/_resources/port1.0/variant_descriptions.conf
12:debug:main universal variant already exists, so not adding the default one
13:debug:main Running callback portconfigure::add_automatic_compiler_dependencies
14:debug:main Chosen compiler apple-gcc-4.2 is provided by a port, adding dependency
15:debug:main Adding depends_build port:apple-gcc42
16:debug:main Adding depends_skip_archcheck apple-gcc42
17:debug:main Finished running callback portconfigure::add_automatic_compiler_dependencies
18:debug:main Running callback portbuild::add_automatic_buildsystem_dependencies
19:debug:main Finished running callback portbuild::add_automatic_buildsystem_dependencies
20:debug:main No need to upgrade! apple-gcc42 5666.3_15 >= apple-gcc42 5666.3_15
21:debug:main epoch: in tree: 2 installed: 2
22:debug:main ld64 2_0 exists in the ports tree
23:debug:main ld64 2_0 +ld64_97 is the latest installed
24:debug:main ld64 2_0 +ld64_97 is active
25:debug:main Merging existing variants '+ld64_97' into variants
26:debug:main new fully merged portvariants: ld64_97 +
27:debug:main Changing to port directory: /opt/local/var/macports/sources/rsync.macports.org/release/tarballs/ports/devel/ld64
28:debug:main OS darwin/8.11.0 (Mac OS X 10.4) arch powerpc
29:debug:main Sourcing PortGroup compiler_blacklist_versions 1.0 from /opt/local/var/macports/sources/rsync.macports.org/release/tarballs/ports/_resources/port1.0/group/compiler_blacklist_versions-1.0.tcl
30:debug:main Reading variant descriptions from /opt/local/var/macports/sources/rsync.macports.org/release/tarballs/ports/_resources/port1.0/variant_descriptions.conf
31:debug:main universal variant already exists, so not adding the default one
32:debug:main Executing variant ld64_97 provides ld64_97
33:debug:main Running callback portconfigure::add_automatic_compiler_dependencies
34:debug:main Chosen compiler apple-gcc-4.2 is provided by a port, adding dependency
35:debug:main Adding depends_build port:apple-gcc42
36:debug:main Adding depends_skip_archcheck apple-gcc42
37:debug:main Finished running callback portconfigure::add_automatic_compiler_dependencies
38:debug:main Running callback portbuild::add_automatic_buildsystem_dependencies
39:debug:main Finished running callback portbuild::add_automatic_buildsystem_dependencies
40:debug:main No need to upgrade! ld64 2_0 >= ld64 2_0
41:debug:main epoch: in tree: 2 installed: 2
42:debug:main ld64-97 97.17_2 exists in the ports tree
43:debug:main ld64-97 97.17_2  is the latest installed
44:debug:main ld64-97 97.17_2  is active
45:debug:main Merging existing variants '' into variants
46:debug:main new fully merged portvariants:
47:debug:main Changing to port directory: /opt/local/var/macports/sources/rsync.macports.org/release/tarballs/ports/devel/ld64
48:debug:main OS darwin/8.11.0 (Mac OS X 10.4) arch powerpc
49:debug:main Sourcing PortGroup compiler_blacklist_versions 1.0 from /opt/local/var/macports/sources/rsync.macports.org/release/tarballs/ports/_resources/port1.0/group/compiler_blacklist_versions-1.0.tcl
50:debug:main Reading variant descriptions from /opt/local/var/macports/sources/rsync.macports.org/release/tarballs/ports/_resources/port1.0/variant_descriptions.conf
51:debug:main universal variant already exists, so not adding the default one
52:debug:main Running callback portconfigure::add_automatic_compiler_dependencies
53:debug:main Chosen compiler apple-gcc-4.2 is provided by a port, adding dependency
54:debug:main Adding depends_build port:apple-gcc42
55:debug:main Adding depends_skip_archcheck apple-gcc42
56:debug:main Finished running callback portconfigure::add_automatic_compiler_dependencies
57:debug:main Running callback portbuild::add_automatic_buildsystem_dependencies
58:debug:main Finished running callback portbuild::add_automatic_buildsystem_dependencies
59:debug:main No need to upgrade! ld64-97 97.17_2 >= ld64-97 97.17_2
60:debug:main epoch: in tree: 0 installed: 0
61:debug:main cctools 877.8_0 exists in the ports tree
62:debug:main cctools 877.8_0  is the latest installed
63:debug:main cctools 877.8_0  is active
64:debug:main Merging existing variants '' into variants
65:debug:main new fully merged portvariants:
66:debug:main Changing to port directory: /opt/local/var/macports/sources/rsync.macports.org/release/tarballs/ports/devel/cctools
67:debug:main OS darwin/8.11.0 (Mac OS X 10.4) arch powerpc
68:debug:main Reading variant descriptions from /opt/local/var/macports/sources/rsync.macports.org/release/tarballs/ports/_resources/port1.0/variant_descriptions.conf
69:debug:main universal variant already exists, so not adding the default one
70:debug:main Running callback portconfigure::add_automatic_compiler_dependencies
71:debug:main Chosen compiler apple-gcc-4.2 is provided by a port, adding dependency
72:debug:main Adding depends_build port:apple-gcc42
73:debug:main Adding depends_skip_archcheck apple-gcc42
74:debug:main Finished running callback portconfigure::add_automatic_compiler_dependencies
75:debug:main Running callback portbuild::add_automatic_buildsystem_dependencies
76:debug:main Finished running callback portbuild::add_automatic_buildsystem_dependencies
77:debug:main No need to upgrade! cctools 877.8_0 >= cctools 877.8_0
78:debug:main epoch: in tree: 0 installed: 0
79:debug:main gcc_select 0.1_8 exists in the ports tree
80:debug:main gcc_select 0.1_8  is the latest installed
81:debug:main gcc_select 0.1_8  is active
82:debug:main Merging existing variants '' into variants
83:debug:main new fully merged portvariants:
84:debug:main Changing to port directory: /opt/local/var/macports/sources/rsync.macports.org/release/tarballs/ports/sysutils/gcc_select
85:debug:main OS darwin/8.11.0 (Mac OS X 10.4) arch powerpc
86:debug:main Sourcing PortGroup select 1.0 from /opt/local/var/macports/sources/rsync.macports.org/release/tarballs/ports/_resources/port1.0/group/select-1.0.tcl
87:debug:main universal_variant is false, so not adding the default universal variant
88:debug:main Running callback portconfigure::add_automatic_compiler_dependencies
89:debug:main Finished running callback portconfigure::add_automatic_compiler_dependencies
90:debug:main Running callback portbuild::add_automatic_buildsystem_dependencies
91:debug:main Finished running callback portbuild::add_automatic_buildsystem_dependencies
92:debug:main No need to upgrade! gcc_select 0.1_8 >= gcc_select 0.1_8
93:debug:main epoch: in tree: 0 installed: 0
94:debug:main libusb 1.0.20_0 exists in the ports tree
95:debug:main libusb 1.0.20_0  is the latest installed
96:debug:main libusb 1.0.20_0  is active
97:debug:main Merging existing variants '' into variants
98:debug:main new fully merged portvariants:
99:debug:main Changing to port directory: /opt/local/var/macports/sources/rsync.macports.org/release/tarballs/ports/devel/libusb
100:debug:main OS darwin/8.11.0 (Mac OS X 10.4) arch powerpc
101:debug:main Sourcing PortGroup github 1.0 from /opt/local/var/macports/sources/rsync.macports.org/release/tarballs/ports/_resources/port1.0/group/github-1.0.tcl
102:debug:main adding the default universal variant
103:debug:main Reading variant descriptions from /opt/local/var/macports/sources/rsync.macports.org/release/tarballs/ports/_resources/port1.0/variant_descriptions.conf
104:debug:main Running callback portconfigure::add_automatic_compiler_dependencies
105:debug:main Chosen compiler apple-gcc-4.2 is provided by a port, adding dependency
106:debug:main Adding depends_build port:apple-gcc42
107:debug:main Adding depends_skip_archcheck apple-gcc42
108:debug:main Finished running callback portconfigure::add_automatic_compiler_dependencies
109:debug:main Running callback portbuild::add_automatic_buildsystem_dependencies
110:debug:main Finished running callback portbuild::add_automatic_buildsystem_dependencies
111:debug:main No need to upgrade! libusb 1.0.20_0 >= libusb 1.0.20_0
112:debug:main epoch: in tree: 0 installed: 0
113:debug:main ncurses 6.0_0 exists in the ports tree
114:debug:main ncurses 6.0_0  is the latest installed
115:debug:main ncurses 6.0_0  is active
116:debug:main Merging existing variants '' into variants
117:debug:main new fully merged portvariants:
118:debug:main Changing to port directory: /opt/local/var/macports/sources/rsync.macports.org/release/tarballs/ports/devel/ncurses
119:debug:main OS darwin/8.11.0 (Mac OS X 10.4) arch powerpc
120:debug:main adding the default universal variant
121:debug:main Reading variant descriptions from /opt/local/var/macports/sources/rsync.macports.org/release/tarballs/ports/_resources/port1.0/variant_descriptions.conf
122:debug:main Running callback portconfigure::add_automatic_compiler_dependencies
123:debug:main Chosen compiler apple-gcc-4.2 is provided by a port, adding dependency
124:debug:main Adding depends_build port:apple-gcc42
125:debug:main Adding depends_skip_archcheck apple-gcc42
126:debug:main Finished running callback portconfigure::add_automatic_compiler_dependencies
127:debug:main Running callback portbuild::add_automatic_buildsystem_dependencies
128:debug:main Finished running callback portbuild::add_automatic_buildsystem_dependencies
129:debug:main No need to upgrade! ncurses 6.0_0 >= ncurses 6.0_0
130:debug:main epoch: in tree: 0 installed: 0
131:debug:main libftdi1 1.3_0 exists in the ports tree
132:debug:main libftdi1 1.3_0  is the latest installed
133:debug:main libftdi1 1.3_0  is active
134:debug:main Merging existing variants '' into variants
135:debug:main new fully merged portvariants:
136:debug:main Changing to port directory: /opt/local/var/macports/sources/rsync.macports.org/release/tarballs/ports/devel/libftdi
137:debug:main OS darwin/8.11.0 (Mac OS X 10.4) arch powerpc
138:debug:main Re-registering default for configure.dir
139:debug:main Re-registering default for build.dir
140:debug:main Sourcing PortGroup cmake 1.0 from /opt/local/var/macports/sources/rsync.macports.org/release/tarballs/ports/_resources/port1.0/group/cmake-1.0.tcl
141:debug:main adding the default universal variant
142:debug:main Reading variant descriptions from /opt/local/var/macports/sources/rsync.macports.org/release/tarballs/ports/_resources/port1.0/variant_descriptions.conf
143:debug:main Running callback portconfigure::add_automatic_compiler_dependencies
144:debug:main Chosen compiler apple-gcc-4.2 is provided by a port, adding dependency
145:debug:main Adding depends_build port:apple-gcc42
146:debug:main Adding depends_skip_archcheck apple-gcc42
147:debug:main Finished running callback portconfigure::add_automatic_compiler_dependencies
148:debug:main Running callback portbuild::add_automatic_buildsystem_dependencies
149:debug:main Finished running callback portbuild::add_automatic_buildsystem_dependencies
150:debug:main No need to upgrade! libftdi1 1.3_0 >= libftdi1 1.3_0
151:debug:main epoch: in tree: 0 installed: 0
152:debug:main libusb-compat 0.1.5_0 exists in the ports tree
153:debug:main libusb-compat 0.1.5_0  is the latest installed
154:debug:main libusb-compat 0.1.5_0  is active
155:debug:main Merging existing variants '' into variants
156:debug:main new fully merged portvariants:
157:debug:main Changing to port directory: /opt/local/var/macports/sources/rsync.macports.org/release/tarballs/ports/devel/libusb-compat
158:debug:main OS darwin/8.11.0 (Mac OS X 10.4) arch powerpc
159:debug:main adding the default universal variant
160:debug:main Reading variant descriptions from /opt/local/var/macports/sources/rsync.macports.org/release/tarballs/ports/_resources/port1.0/variant_descriptions.conf
161:debug:main Running callback portconfigure::add_automatic_compiler_dependencies
162:debug:main Chosen compiler apple-gcc-4.2 is provided by a port, adding dependency
163:debug:main Adding depends_build port:apple-gcc42
164:debug:main Adding depends_skip_archcheck apple-gcc42
165:debug:main Finished running callback portconfigure::add_automatic_compiler_dependencies
166:debug:main Running callback portbuild::add_automatic_buildsystem_dependencies
167:debug:main Finished running callback portbuild::add_automatic_buildsystem_dependencies
168:debug:main No need to upgrade! libusb-compat 0.1.5_0 >= libusb-compat 0.1.5_0
169:debug:main epoch: in tree: 0 installed: 0
170:debug:main boost 1.59.0_2 exists in the ports tree
171:debug:main boost 1.59.0_2 +no_single+no_static+python27 is the latest installed
172:debug:main boost 1.59.0_2 +no_single+no_static+python27 is active
173:debug:main Merging existing variants '+no_single+no_static+python27' into variants
174:debug:main new fully merged portvariants: no_static + no_single + python27 +
175:debug:main Changing to port directory: /opt/local/var/macports/sources/rsync.macports.org/release/tarballs/ports/devel/boost
176:debug:main OS darwin/8.11.0 (Mac OS X 10.4) arch powerpc
177:debug:main Sourcing PortGroup compiler_blacklist_versions 1.0 from /opt/local/var/macports/sources/rsync.macports.org/release/tarballs/ports/_resources/port1.0/group/compiler_blacklist_versions-1.0.tcl
178:debug:main Sourcing PortGroup active_variants 1.1 from /opt/local/var/macports/sources/rsync.macports.org/release/tarballs/ports/_resources/port1.0/group/active_variants-1.1.tcl
179:debug:main Sourcing PortGroup compilers 1.0 from /opt/local/var/macports/sources/rsync.macports.org/release/tarballs/ports/_resources/port1.0/group/compilers-1.0.tcl
180:debug:main Sourcing PortGroup mpi 1.0 from /opt/local/var/macports/sources/rsync.macports.org/release/tarballs/ports/_resources/port1.0/group/mpi-1.0.tcl
181:debug:main compiler clang blacklisted because it's not installed or it doesn't work
182:debug:main Unmatched blacklisted compiler: *gcc-4.0
183:debug:main Unmatched blacklisted compiler: gcc-3.3
184:debug:main Unmatched blacklisted compiler: clang
185:debug:main Reading variant descriptions from /opt/local/var/macports/sources/rsync.macports.org/release/tarballs/ports/_resources/port1.0/variant_descriptions.conf
186:debug:main universal variant already exists, so not adding the default one
187:debug:main Executing variant python27 provides python27
188:debug:main Executing variant no_static provides no_static
189:debug:main Executing variant no_single provides no_single
190:debug:main Running callback portconfigure::add_automatic_compiler_dependencies
191:debug:main Chosen compiler apple-gcc-4.2 is provided by a port, adding dependency
192:debug:main Adding depends_build port:apple-gcc42
193:debug:main Adding depends_skip_archcheck apple-gcc42
194:debug:main Finished running callback portconfigure::add_automatic_compiler_dependencies
195:debug:main Running callback portbuild::add_automatic_buildsystem_dependencies
196:debug:main Finished running callback portbuild::add_automatic_buildsystem_dependencies
197:debug:main No need to upgrade! boost 1.59.0_2 >= boost 1.59.0_2
198:debug:main epoch: in tree: 0 installed: 0
199:debug:main zlib 1.2.8_0 exists in the ports tree
200:debug:main zlib 1.2.8_0  is the latest installed
201:debug:main zlib 1.2.8_0  is active
202:debug:main Merging existing variants '' into variants
203:debug:main new fully merged portvariants:
204:debug:main Changing to port directory: /opt/local/var/macports/sources/rsync.macports.org/release/tarballs/ports/archivers/zlib
205:debug:main OS darwin/8.11.0 (Mac OS X 10.4) arch powerpc
206:debug:main Sourcing PortGroup xcodeversion 1.0 from /opt/local/var/macports/sources/rsync.macports.org/release/tarballs/ports/_resources/port1.0/group/xcodeversion-1.0.tcl
207:debug:main adding the default universal variant
208:debug:main Reading variant descriptions from /opt/local/var/macports/sources/rsync.macports.org/release/tarballs/ports/_resources/port1.0/variant_descriptions.conf
209:debug:main Running callback portconfigure::add_automatic_compiler_dependencies
210:debug:main Chosen compiler apple-gcc-4.2 is provided by a port, adding dependency
211:debug:main Adding depends_build port:apple-gcc42
212:debug:main Adding depends_skip_archcheck apple-gcc42
213:debug:main Finished running callback portconfigure::add_automatic_compiler_dependencies
214:debug:main Running callback portbuild::add_automatic_buildsystem_dependencies
215:debug:main Finished running callback portbuild::add_automatic_buildsystem_dependencies
216:debug:main No need to upgrade! zlib 1.2.8_0 >= zlib 1.2.8_0
217:debug:main epoch: in tree: 0 installed: 0
218:debug:main expat 2.1.1_0 exists in the ports tree
219:debug:main expat 2.1.1_0  is the latest installed
220:debug:main expat 2.1.1_0  is active
221:debug:main Merging existing variants '' into variants
222:debug:main new fully merged portvariants:
223:debug:main Changing to port directory: /opt/local/var/macports/sources/rsync.macports.org/release/tarballs/ports/textproc/expat
224:debug:main OS darwin/8.11.0 (Mac OS X 10.4) arch powerpc
225:debug:main adding the default universal variant
226:debug:main Reading variant descriptions from /opt/local/var/macports/sources/rsync.macports.org/release/tarballs/ports/_resources/port1.0/variant_descriptions.conf
227:debug:main Running callback portconfigure::add_automatic_compiler_dependencies
228:debug:main Chosen compiler apple-gcc-4.2 is provided by a port, adding dependency
229:debug:main Adding depends_build port:apple-gcc42
230:debug:main Adding depends_skip_archcheck apple-gcc42
231:debug:main Finished running callback portconfigure::add_automatic_compiler_dependencies
232:debug:main Running callback portbuild::add_automatic_buildsystem_dependencies
233:debug:main Finished running callback portbuild::add_automatic_buildsystem_dependencies
234:debug:main No need to upgrade! expat 2.1.1_0 >= expat 2.1.1_0
235:debug:main epoch: in tree: 0 installed: 0
236:debug:main bzip2 1.0.6_0 exists in the ports tree
237:debug:main bzip2 1.0.6_0  is the latest installed
238:debug:main bzip2 1.0.6_0  is active
239:debug:main Merging existing variants '' into variants
240:debug:main new fully merged portvariants:
241:debug:main Changing to port directory: /opt/local/var/macports/sources/rsync.macports.org/release/tarballs/ports/archivers/bzip2
242:debug:main OS darwin/8.11.0 (Mac OS X 10.4) arch powerpc
243:debug:main Reading variant descriptions from /opt/local/var/macports/sources/rsync.macports.org/release/tarballs/ports/_resources/port1.0/variant_descriptions.conf
244:debug:main universal variant already exists, so not adding the default one
245:debug:main Running callback portconfigure::add_automatic_compiler_dependencies
246:debug:main Chosen compiler apple-gcc-4.2 is provided by a port, adding dependency
247:debug:main Adding depends_build port:apple-gcc42
248:debug:main Adding depends_skip_archcheck apple-gcc42
249:debug:main Finished running callback portconfigure::add_automatic_compiler_dependencies
250:debug:main Running callback portbuild::add_automatic_buildsystem_dependencies
251:debug:main Finished running callback portbuild::add_automatic_buildsystem_dependencies
252:debug:main No need to upgrade! bzip2 1.0.6_0 >= bzip2 1.0.6_0
253:debug:main epoch: in tree: 0 installed: 0
254:debug:main libiconv 1.14_0 exists in the ports tree
255:debug:main libiconv 1.14_0  is the latest installed
256:debug:main libiconv 1.14_0  is active
257:debug:main Merging existing variants '' into variants
258:debug:main new fully merged portvariants:
259:debug:main Changing to port directory: /opt/local/var/macports/sources/rsync.macports.org/release/tarballs/ports/textproc/libiconv
260:debug:main OS darwin/8.11.0 (Mac OS X 10.4) arch powerpc
261:debug:main Reading variant descriptions from /opt/local/var/macports/sources/rsync.macports.org/release/tarballs/ports/_resources/port1.0/variant_descriptions.conf
262:debug:main Sourcing PortGroup muniversal 1.0 from /opt/local/var/macports/sources/rsync.macports.org/release/tarballs/ports/_resources/port1.0/group/muniversal-1.0.tcl
263:debug:main universal variant already exists, so not adding the default one
264:debug:main Running callback portconfigure::add_automatic_compiler_dependencies
265:debug:main Chosen compiler apple-gcc-4.2 is provided by a port, adding dependency
266:debug:main Adding depends_build port:apple-gcc42
267:debug:main Adding depends_skip_archcheck apple-gcc42
268:debug:main Finished running callback portconfigure::add_automatic_compiler_dependencies
269:debug:main Running callback portbuild::add_automatic_buildsystem_dependencies
270:debug:main Finished running callback portbuild::add_automatic_buildsystem_dependencies
271:debug:main No need to upgrade! libiconv 1.14_0 >= libiconv 1.14_0
272:debug:main epoch: in tree: 0 installed: 0
273:debug:main icu 55.1_0 exists in the ports tree
274:debug:main icu 55.1_0  is the latest installed
275:debug:main icu 55.1_0  is active
276:debug:main Merging existing variants '' into variants
277:debug:main new fully merged portvariants:
278:debug:main Changing to port directory: /opt/local/var/macports/sources/rsync.macports.org/release/tarballs/ports/devel/icu
279:debug:main OS darwin/8.11.0 (Mac OS X 10.4) arch powerpc
280:debug:main Reading variant descriptions from /opt/local/var/macports/sources/rsync.macports.org/release/tarballs/ports/_resources/port1.0/variant_descriptions.conf
281:debug:main Sourcing PortGroup muniversal 1.0 from /opt/local/var/macports/sources/rsync.macports.org/release/tarballs/ports/_resources/port1.0/group/muniversal-1.0.tcl
282:debug:main universal variant already exists, so not adding the default one
283:debug:main Running callback portconfigure::add_automatic_compiler_dependencies
284:debug:main Chosen compiler apple-gcc-4.2 is provided by a port, adding dependency
285:debug:main Adding depends_build port:apple-gcc42
286:debug:main Adding depends_skip_archcheck apple-gcc42
287:debug:main Finished running callback portconfigure::add_automatic_compiler_dependencies
288:debug:main Running callback portbuild::add_automatic_buildsystem_dependencies
289:debug:main Finished running callback portbuild::add_automatic_buildsystem_dependencies
290:debug:main No need to upgrade! icu 55.1_0 >= icu 55.1_0
291:debug:main epoch: in tree: 2 installed: 2
292:debug:main python27 2.7.11_2 exists in the ports tree
293:debug:main python27 2.7.11_2  is the latest installed
294:debug:main python27 2.7.11_2  is active
295:debug:main Merging existing variants '' into variants
296:debug:main new fully merged portvariants:
297:debug:main Changing to port directory: /opt/local/var/macports/sources/rsync.macports.org/release/tarballs/ports/lang/python27
298:debug:main OS darwin/8.11.0 (Mac OS X 10.4) arch powerpc
299:debug:main Sourcing PortGroup select 1.0 from /opt/local/var/macports/sources/rsync.macports.org/release/tarballs/ports/_resources/port1.0/group/select-1.0.tcl
300:debug:main Reading variant descriptions from /opt/local/var/macports/sources/rsync.macports.org/release/tarballs/ports/_resources/port1.0/variant_descriptions.conf
301:debug:main universal variant already exists, so not adding the default one
302:debug:main Running callback portconfigure::add_automatic_compiler_dependencies
303:debug:main Chosen compiler apple-gcc-4.2 is provided by a port, adding dependency
304:debug:main Adding depends_build port:apple-gcc42
305:debug:main Adding depends_skip_archcheck apple-gcc42
306:debug:main Finished running callback portconfigure::add_automatic_compiler_dependencies
307:debug:main Running callback portbuild::add_automatic_buildsystem_dependencies
308:debug:main Finished running callback portbuild::add_automatic_buildsystem_dependencies
309:debug:main No need to upgrade! python27 2.7.11_2 >= python27 2.7.11_2
310:debug:main epoch: in tree: 2 installed: 2
311:debug:main gettext 0.19.7_0 exists in the ports tree
312:debug:main gettext 0.19.7_0  is the latest installed
313:debug:main gettext 0.19.7_0  is active
314:debug:main Merging existing variants '' into variants
315:debug:main new fully merged portvariants:
316:debug:main Changing to port directory: /opt/local/var/macports/sources/rsync.macports.org/release/tarballs/ports/devel/gettext
317:debug:main OS darwin/8.11.0 (Mac OS X 10.4) arch powerpc
318:debug:main Sourcing PortGroup compiler_blacklist_versions 1.0 from /opt/local/var/macports/sources/rsync.macports.org/release/tarballs/ports/_resources/port1.0/group/compiler_blacklist_versions-1.0.tcl
319:debug:main Reading variant descriptions from /opt/local/var/macports/sources/rsync.macports.org/release/tarballs/ports/_resources/port1.0/variant_descriptions.conf
320:debug:main Sourcing PortGroup muniversal 1.0 from /opt/local/var/macports/sources/rsync.macports.org/release/tarballs/ports/_resources/port1.0/group/muniversal-1.0.tcl
321:debug:main compiler clang blacklisted because it's not installed or it doesn't work
322:debug:main universal variant already exists, so not adding the default one
323:debug:main Running callback portconfigure::add_automatic_compiler_dependencies
324:debug:main Chosen compiler apple-gcc-4.2 is provided by a port, adding dependency
325:debug:main Adding depends_build port:apple-gcc42
326:debug:main Adding depends_skip_archcheck apple-gcc42
327:debug:main Finished running callback portconfigure::add_automatic_compiler_dependencies
328:debug:main Running callback portbuild::add_automatic_buildsystem_dependencies
329:debug:main Finished running callback portbuild::add_automatic_buildsystem_dependencies
330:debug:main No need to upgrade! gettext 0.19.7_0 >= gettext 0.19.7_0
331:debug:main epoch: in tree: 1 installed: 1
332:debug:main openssl 1.0.2h_1 exists in the ports tree
333:debug:main openssl 1.0.2h_1  is the latest installed
334:debug:main openssl 1.0.2h_1  is active
335:debug:main Merging existing variants '' into variants
336:debug:main new fully merged portvariants:
337:debug:main Changing to port directory: /opt/local/var/macports/sources/rsync.macports.org/release/tarballs/ports/devel/openssl
338:debug:main OS darwin/8.11.0 (Mac OS X 10.4) arch powerpc
339:debug:main Reading variant descriptions from /opt/local/var/macports/sources/rsync.macports.org/release/tarballs/ports/_resources/port1.0/variant_descriptions.conf
340:debug:main Sourcing PortGroup muniversal 1.0 from /opt/local/var/macports/sources/rsync.macports.org/release/tarballs/ports/_resources/port1.0/group/muniversal-1.0.tcl
341:debug:main universal variant already exists, so not adding the default one
342:debug:main Running callback portconfigure::add_automatic_compiler_dependencies
343:debug:main Chosen compiler apple-gcc-4.2 is provided by a port, adding dependency
344:debug:main Adding depends_build port:apple-gcc42
345:debug:main Adding depends_skip_archcheck apple-gcc42
346:debug:main Finished running callback portconfigure::add_automatic_compiler_dependencies
347:debug:main Running callback portbuild::add_automatic_buildsystem_dependencies
348:debug:main Finished running callback portbuild::add_automatic_buildsystem_dependencies
349:debug:main No need to upgrade! openssl 1.0.2h_1 >= openssl 1.0.2h_1
350:debug:main epoch: in tree: 0 installed: 0
351:debug:main sqlite3 3.13.0_0 exists in the ports tree
352:debug:main sqlite3 3.13.0_0  is the latest installed
353:debug:main sqlite3 3.13.0_0  is active
354:debug:main Merging existing variants '' into variants
355:debug:main new fully merged portvariants:
356:debug:main Changing to port directory: /opt/local/var/macports/sources/rsync.macports.org/release/tarballs/ports/databases/sqlite3
357:debug:main OS darwin/8.11.0 (Mac OS X 10.4) arch powerpc
358:debug:main adding the default universal variant
359:debug:main Reading variant descriptions from /opt/local/var/macports/sources/rsync.macports.org/release/tarballs/ports/_resources/port1.0/variant_descriptions.conf
360:debug:main Running callback portconfigure::add_automatic_compiler_dependencies
361:debug:main Chosen compiler apple-gcc-4.2 is provided by a port, adding dependency
362:debug:main Adding depends_build port:apple-gcc42
363:debug:main Adding depends_skip_archcheck apple-gcc42
364:debug:main Finished running callback portconfigure::add_automatic_compiler_dependencies
365:debug:main Running callback portbuild::add_automatic_buildsystem_dependencies
366:debug:main Finished running callback portbuild::add_automatic_buildsystem_dependencies
367:debug:main No need to upgrade! sqlite3 3.13.0_0 >= sqlite3 3.13.0_0
368:debug:main epoch: in tree: 20090923 installed: 20090923
369:debug:main libedit 20150325-3.1_0 exists in the ports tree
370:debug:main libedit 20150325-3.1_0  is the latest installed
371:debug:main libedit 20150325-3.1_0  is active
372:debug:main Merging existing variants '' into variants
373:debug:main new fully merged portvariants:
374:debug:main Changing to port directory: /opt/local/var/macports/sources/rsync.macports.org/release/tarballs/ports/devel/libedit
375:debug:main OS darwin/8.11.0 (Mac OS X 10.4) arch powerpc
376:debug:main Reading variant descriptions from /opt/local/var/macports/sources/rsync.macports.org/release/tarballs/ports/_resources/port1.0/variant_descriptions.conf
377:debug:main Sourcing PortGroup muniversal 1.0 from /opt/local/var/macports/sources/rsync.macports.org/release/tarballs/ports/_resources/port1.0/group/muniversal-1.0.tcl
378:debug:main universal variant already exists, so not adding the default one
379:debug:main Running callback portconfigure::add_automatic_compiler_dependencies
380:debug:main Chosen compiler apple-gcc-4.2 is provided by a port, adding dependency
381:debug:main Adding depends_build port:apple-gcc42
382:debug:main Adding depends_skip_archcheck apple-gcc42
383:debug:main Finished running callback portconfigure::add_automatic_compiler_dependencies
384:debug:main Running callback portbuild::add_automatic_buildsystem_dependencies
385:debug:main Finished running callback portbuild::add_automatic_buildsystem_dependencies
386:debug:main No need to upgrade! libedit 20150325-3.1_0 >= libedit 20150325-3.1_0
387:debug:main epoch: in tree: 0 installed: 0
388:debug:main db48 4.8.30_4 exists in the ports tree
389:debug:main db48 4.8.30_4 +java is the latest installed
390:debug:main db48 4.8.30_4 +java is active
391:debug:main Merging existing variants '+java' into variants
392:debug:main new fully merged portvariants: java +
393:debug:main Changing to port directory: /opt/local/var/macports/sources/rsync.macports.org/release/tarballs/ports/databases/db48
394:debug:main OS darwin/8.11.0 (Mac OS X 10.4) arch powerpc
395:debug:main Reading variant descriptions from /opt/local/var/macports/sources/rsync.macports.org/release/tarballs/ports/_resources/port1.0/variant_descriptions.conf
396:debug:main Sourcing PortGroup muniversal 1.0 from /opt/local/var/macports/sources/rsync.macports.org/release/tarballs/ports/_resources/port1.0/group/muniversal-1.0.tcl
397:debug:main universal variant already exists, so not adding the default one
398:debug:main Executing variant java provides java
399:debug:main Running callback portconfigure::add_automatic_compiler_dependencies
400:debug:main Chosen compiler apple-gcc-4.2 is provided by a port, adding dependency
401:debug:main Adding depends_build port:apple-gcc42
402:debug:main Adding depends_skip_archcheck apple-gcc42
403:debug:main Finished running callback portconfigure::add_automatic_compiler_dependencies
404:debug:main Running callback portbuild::add_automatic_buildsystem_dependencies
405:debug:main Finished running callback portbuild::add_automatic_buildsystem_dependencies
406:debug:main No need to upgrade! db48 4.8.30_4 >= db48 4.8.30_4
407:debug:main epoch: in tree: 0 installed: 0
408:debug:main readline 6.3.003_1 exists in the ports tree
409:debug:main readline 6.3.003_1  is the latest installed
410:debug:main readline 6.3.003_1  is active
411:debug:main Merging existing variants '' into variants
412:debug:main new fully merged portvariants:
413:debug:main Changing to port directory: /opt/local/var/macports/sources/rsync.macports.org/release/tarballs/ports/devel/readline
414:debug:main OS darwin/8.11.0 (Mac OS X 10.4) arch powerpc
415:debug:main Reading variant descriptions from /opt/local/var/macports/sources/rsync.macports.org/release/tarballs/ports/_resources/port1.0/variant_descriptions.conf
416:debug:main Sourcing PortGroup muniversal 1.0 from /opt/local/var/macports/sources/rsync.macports.org/release/tarballs/ports/_resources/port1.0/group/muniversal-1.0.tcl
417:debug:main universal variant already exists, so not adding the default one
418:debug:main Running callback portconfigure::add_automatic_compiler_dependencies
419:debug:main Chosen compiler apple-gcc-4.2 is provided by a port, adding dependency
420:debug:main Adding depends_build port:apple-gcc42
421:debug:main Adding depends_skip_archcheck apple-gcc42
422:debug:main Finished running callback portconfigure::add_automatic_compiler_dependencies
423:debug:main Running callback portbuild::add_automatic_buildsystem_dependencies
424:debug:main Finished running callback portbuild::add_automatic_buildsystem_dependencies
425:debug:main No need to upgrade! readline 6.3.003_1 >= readline 6.3.003_1
426:debug:main epoch: in tree: 0 installed: 0
427:debug:main python_select 0.3_6 exists in the ports tree
428:debug:main python_select 0.3_6  is the latest installed
429:debug:main python_select 0.3_6  is active
430:debug:main Merging existing variants '' into variants
431:debug:main new fully merged portvariants:
432:debug:main Changing to port directory: /opt/local/var/macports/sources/rsync.macports.org/release/tarballs/ports/sysutils/python_select
433:debug:main OS darwin/8.11.0 (Mac OS X 10.4) arch powerpc
434:debug:main Sourcing PortGroup select 1.0 from /opt/local/var/macports/sources/rsync.macports.org/release/tarballs/ports/_resources/port1.0/group/select-1.0.tcl
435:debug:main universal_variant is false, so not adding the default universal variant
436:debug:main Running callback portconfigure::add_automatic_compiler_dependencies
437:debug:main Chosen compiler apple-gcc-4.2 is provided by a port, adding dependency
438:debug:main Adding depends_build port:apple-gcc42
439:debug:main Adding depends_skip_archcheck apple-gcc42
440:debug:main Finished running callback portconfigure::add_automatic_compiler_dependencies
441:debug:main Running callback portbuild::add_automatic_buildsystem_dependencies
442:debug:main Finished running callback portbuild::add_automatic_buildsystem_dependencies
443:debug:main No need to upgrade! python_select 0.3_6 >= python_select 0.3_6
444:debug:main epoch: in tree: 0 installed: 0
445:debug:main python2_select 0.0_1 exists in the ports tree
446:debug:main python2_select 0.0_1  is the latest installed
447:debug:main python2_select 0.0_1  is active
448:debug:main Merging existing variants '' into variants
449:debug:main new fully merged portvariants:
450:debug:main Changing to port directory: /opt/local/var/macports/sources/rsync.macports.org/release/tarballs/ports/sysutils/python2_select
451:debug:main OS darwin/8.11.0 (Mac OS X 10.4) arch powerpc
452:debug:main Sourcing PortGroup select 1.0 from /opt/local/var/macports/sources/rsync.macports.org/release/tarballs/ports/_resources/port1.0/group/select-1.0.tcl
453:debug:main universal_variant is false, so not adding the default universal variant
454:debug:main Running callback portconfigure::add_automatic_compiler_dependencies
455:debug:main Chosen compiler apple-gcc-4.2 is provided by a port, adding dependency
456:debug:main Adding depends_build port:apple-gcc42
457:debug:main Adding depends_skip_archcheck apple-gcc42
458:debug:main Finished running callback portconfigure::add_automatic_compiler_dependencies
459:debug:main Running callback portbuild::add_automatic_buildsystem_dependencies
460:debug:main Finished running callback portbuild::add_automatic_buildsystem_dependencies
461:debug:main No need to upgrade! python2_select 0.0_1 >= python2_select 0.0_1
462:debug:main epoch: in tree: 0 installed: 0
463:debug:main libconfuse 2.7_0 exists in the ports tree
464:debug:main libconfuse 2.7_0  is the latest installed
465:debug:main libconfuse 2.7_0  is active
466:debug:main Merging existing variants '' into variants
467:debug:main new fully merged portvariants:
468:debug:main Changing to port directory: /opt/local/var/macports/sources/rsync.macports.org/release/tarballs/ports/devel/libconfuse
469:debug:main OS darwin/8.11.0 (Mac OS X 10.4) arch powerpc
470:debug:main adding the default universal variant
471:debug:main Reading variant descriptions from /opt/local/var/macports/sources/rsync.macports.org/release/tarballs/ports/_resources/port1.0/variant_descriptions.conf
472:debug:main Running callback portconfigure::add_automatic_compiler_dependencies
473:debug:main Chosen compiler apple-gcc-4.2 is provided by a port, adding dependency
474:debug:main Adding depends_build port:apple-gcc42
475:debug:main Adding depends_skip_archcheck apple-gcc42
476:debug:main Finished running callback portconfigure::add_automatic_compiler_dependencies
477:debug:main Running callback portbuild::add_automatic_buildsystem_dependencies
478:debug:main Finished running callback portbuild::add_automatic_buildsystem_dependencies
479:debug:main No need to upgrade! libconfuse 2.7_0 >= libconfuse 2.7_0
480:debug:main epoch: in tree: 0 installed: 0
481:debug:main swig-python 3.0.9_0 exists in the ports tree
482:debug:main swig-python 3.0.9_0  is the latest installed
483:debug:main swig-python 3.0.9_0  is active
484:debug:main Merging existing variants '' into variants
485:debug:main new fully merged portvariants:
486:debug:main Changing to port directory: /opt/local/var/macports/sources/rsync.macports.org/release/tarballs/ports/devel/swig
487:debug:main OS darwin/8.11.0 (Mac OS X 10.4) arch powerpc
488:debug:main adding the default universal variant
489:debug:main Reading variant descriptions from /opt/local/var/macports/sources/rsync.macports.org/release/tarballs/ports/_resources/port1.0/variant_descriptions.conf
490:debug:main Running callback portconfigure::add_automatic_compiler_dependencies
491:debug:main Chosen compiler apple-gcc-4.2 is provided by a port, adding dependency
492:debug:main Adding depends_build port:apple-gcc42
493:debug:main Adding depends_skip_archcheck apple-gcc42
494:debug:main Finished running callback portconfigure::add_automatic_compiler_dependencies
495:debug:main Running callback portbuild::add_automatic_buildsystem_dependencies
496:debug:main Finished running callback portbuild::add_automatic_buildsystem_dependencies
497:debug:main No need to upgrade! swig-python 3.0.9_0 >= swig-python 3.0.9_0
498:debug:main epoch: in tree: 0 installed: 0
499:debug:main swig 3.0.9_0 exists in the ports tree
500:debug:main swig 3.0.9_0  is the latest installed
501:debug:main swig 3.0.9_0  is active
502:debug:main Merging existing variants '' into variants
503:debug:main new fully merged portvariants:
504:debug:main Changing to port directory: /opt/local/var/macports/sources/rsync.macports.org/release/tarballs/ports/devel/swig
505:debug:main OS darwin/8.11.0 (Mac OS X 10.4) arch powerpc
506:debug:main adding the default universal variant
507:debug:main Reading variant descriptions from /opt/local/var/macports/sources/rsync.macports.org/release/tarballs/ports/_resources/port1.0/variant_descriptions.conf
508:debug:main Running callback portconfigure::add_automatic_compiler_dependencies
509:debug:main Chosen compiler apple-gcc-4.2 is provided by a port, adding dependency
510:debug:main Adding depends_build port:apple-gcc42
511:debug:main Adding depends_skip_archcheck apple-gcc42
512:debug:main Finished running callback portconfigure::add_automatic_compiler_dependencies
513:debug:main Running callback portbuild::add_automatic_buildsystem_dependencies
514:debug:main Finished running callback portbuild::add_automatic_buildsystem_dependencies
515:debug:main No need to upgrade! swig 3.0.9_0 >= swig 3.0.9_0
516:debug:main epoch: in tree: 0 installed: 0
517:debug:main pcre 8.38_0 exists in the ports tree
518:debug:main pcre 8.38_0  is the latest installed
519:debug:main pcre 8.38_0  is active
520:debug:main Merging existing variants '' into variants
521:debug:main new fully merged portvariants:
522:debug:main Changing to port directory: /opt/local/var/macports/sources/rsync.macports.org/release/tarballs/ports/devel/pcre
523:debug:main OS darwin/8.11.0 (Mac OS X 10.4) arch powerpc
524:debug:main adding the default universal variant
525:debug:main Reading variant descriptions from /opt/local/var/macports/sources/rsync.macports.org/release/tarballs/ports/_resources/port1.0/variant_descriptions.conf
526:debug:main Running callback portconfigure::add_automatic_compiler_dependencies
527:debug:main Chosen compiler apple-gcc-4.2 is provided by a port, adding dependency
528:debug:main Adding depends_build port:apple-gcc42
529:debug:main Adding depends_skip_archcheck apple-gcc42
530:debug:main Finished running callback portconfigure::add_automatic_compiler_dependencies
531:debug:main Running callback portbuild::add_automatic_buildsystem_dependencies
532:debug:main Finished running callback portbuild::add_automatic_buildsystem_dependencies
533:debug:main No need to upgrade! pcre 8.38_0 >= pcre 8.38_0
534:debug:main epoch: in tree: 0 installed: 0
535:debug:main libelf 0.8.13_2 exists in the ports tree
536:debug:main libelf 0.8.13_2  is the latest installed
537:debug:main libelf 0.8.13_2  is active
538:debug:main Merging existing variants '' into variants
539:debug:main new fully merged portvariants:
540:debug:main Changing to port directory: /opt/local/var/macports/sources/rsync.macports.org/release/tarballs/ports/devel/libelf
541:debug:main OS darwin/8.11.0 (Mac OS X 10.4) arch powerpc
542:debug:main adding the default universal variant
543:debug:main Reading variant descriptions from /opt/local/var/macports/sources/rsync.macports.org/release/tarballs/ports/_resources/port1.0/variant_descriptions.conf
544:debug:main Running callback portconfigure::add_automatic_compiler_dependencies
545:debug:main Chosen compiler apple-gcc-4.2 is provided by a port, adding dependency
546:debug:main Adding depends_build port:apple-gcc42
547:debug:main Adding depends_skip_archcheck apple-gcc42
548:debug:main Finished running callback portconfigure::add_automatic_compiler_dependencies
549:debug:main Running callback portbuild::add_automatic_buildsystem_dependencies
550:debug:main Finished running callback portbuild::add_automatic_buildsystem_dependencies
551:debug:main No need to upgrade! libelf 0.8.13_2 >= libelf 0.8.13_2
552:msg:main --->  Computing dependencies for avrdude:info:main .:debug:main avrdude has no conflicts
553:debug:main Searching for dependency: apple-gcc42
554:debug:main Found Dependency: receipt exists for apple-gcc42
555:debug:main Searching for dependency: libusb
556:debug:main Found Dependency: receipt exists for libusb
557:debug:main Searching for dependency: ncurses
558:debug:main Found Dependency: receipt exists for ncurses
559:debug:main Searching for dependency: libftdi1
560:debug:main Found Dependency: receipt exists for libftdi1
561:debug:main Searching for dependency: libelf
562:debug:main Found Dependency: receipt exists for libelf
563:debug:main Searching for dependency: readline
564:debug:main Found Dependency: receipt exists for readline
565:msg:main
566:debug:main Executing org.macports.main (avrdude)
567:debug:main changing euid/egid - current euid: 0 - current egid: 0
568:debug:main egid changed to: 500
569:debug:main euid changed to: 502
570:debug:archivefetch archivefetch phase started at Sun Jun  5 16:17:02 EST 2016
571:msg:archivefetch --->  Fetching archive for avrdude
572:debug:archivefetch Executing org.macports.archivefetch (avrdude)
573:debug:archivefetch euid/egid changed to: 0/0
574:debug:archivefetch chowned /opt/local/var/macports/incoming to macports
575:debug:archivefetch euid/egid changed to: 502/500
576:info:archivefetch --->  avrdude-6.3_0.darwin_8.ppc.tbz2 doesn't seem to exist in /opt/local/var/macports/incoming/verified
577:msg:archivefetch --->  Attempting to fetch avrdude-6.3_0.darwin_8.ppc.tbz2 from http://nou.nc.packages.macports.org/pub/macports/packages.macports.org/avrdude
578:debug:archivefetch Fetching archive failed:: The requested URL returned error: 404
579:msg:archivefetch --->  Attempting to fetch avrdude-6.3_0.darwin_8.ppc.tbz2 from https://packages.macports.org/avrdude
580:debug:archivefetch Fetching archive failed:: SSL certificate problem, verify that the CA cert is OK. Details:
581error:14090086:SSL routines:SSL3_GET_SERVER_CERTIFICATE:certificate verify failed
582:msg:archivefetch --->  Attempting to fetch avrdude-6.3_0.darwin_8.ppc.tbz2 from http://sea.us.packages.macports.org/macports/packages/avrdude
583:debug:archivefetch Fetching archive failed:: The requested URL returned error: 404
584:debug:archivefetch Privilege de-escalation not attempted as not running as root.
585:debug:fetch fetch phase started at Sun Jun  5 16:17:04 EST 2016
586:notice:fetch --->  Fetching distfiles for avrdude
587:debug:fetch Executing org.macports.fetch (avrdude)
588:debug:fetch Privilege de-escalation not attempted as not running as root.
589:debug:checksum checksum phase started at Sun Jun  5 16:17:04 EST 2016
590:notice:checksum --->  Verifying checksums for avrdude
591:debug:checksum Executing org.macports.checksum (avrdude)
592:info:checksum --->  Checksumming avrdude-6.3.tar.gz
593:debug:checksum Calculated (rmd160) is 245c20fa6f6be274093f43fa4932295ea47dafaa
594:debug:checksum Correct (rmd160) checksum for avrdude-6.3.tar.gz
595:debug:checksum Calculated (sha256) is 0f9f731b6394ca7795b88359689a7fa1fba818c6e1d962513eb28da670e0a196
596:debug:checksum Correct (sha256) checksum for avrdude-6.3.tar.gz
597:debug:checksum Privilege de-escalation not attempted as not running as root.
598:debug:extract extract phase started at Sun Jun  5 16:17:04 EST 2016
599:notice:extract --->  Extracting avrdude
600:debug:extract Executing org.macports.extract (avrdude)
601:info:extract --->  Extracting avrdude-6.3.tar.gz
602:debug:extract setting option extract.args to '/opt/local/var/macports/distfiles/avrdude/avrdude-6.3.tar.gz'
603:debug:extract Environment:
604CC_PRINT_OPTIONS='YES'
605CC_PRINT_OPTIONS_FILE='/opt/local/var/macports/build/_opt_local_var_macports_sources_rsync.macports.org_release_tarballs_ports_cross_avrdude/avrdude/work/.CC_PRINT_OPTIONS'
606CPATH='/opt/local/include'
607LIBRARY_PATH='/opt/local/lib'
608MACOSX_DEPLOYMENT_TARGET='10.4'
609:debug:extract Assembled command: 'cd "/opt/local/var/macports/build/_opt_local_var_macports_sources_rsync.macports.org_release_tarballs_ports_cross_avrdude/avrdude/work" && /usr/bin/gzip -dc '/opt/local/var/macports/distfiles/avrdude/avrdude-6.3.tar.gz' | /usr/bin/gnutar --no-same-owner -xf -'
610:debug:extract Executing command line:  cd "/opt/local/var/macports/build/_opt_local_var_macports_sources_rsync.macports.org_release_tarballs_ports_cross_avrdude/avrdude/work" && /usr/bin/gzip -dc '/opt/local/var/macports/distfiles/avrdude/avrdude-6.3.tar.gz' | /usr/bin/gnutar --no-same-owner -xf -
611:debug:extract euid/egid changed to: 0/0
612:debug:extract chowned /opt/local/var/macports/build/_opt_local_var_macports_sources_rsync.macports.org_release_tarballs_ports_cross_avrdude/avrdude/work to macports
613:debug:extract euid/egid changed to: 502/500
614:debug:extract Privilege de-escalation not attempted as not running as root.
615:debug:patch patch phase started at Sun Jun  5 16:17:04 EST 2016
616:debug:patch Executing org.macports.patch (avrdude)
617:notice:patch --->  Applying patches to avrdude
618:info:patch --->  Applying patch-stk500v2.diff
619:debug:patch Environment:
620CC_PRINT_OPTIONS='YES'
621CC_PRINT_OPTIONS_FILE='/opt/local/var/macports/build/_opt_local_var_macports_sources_rsync.macports.org_release_tarballs_ports_cross_avrdude/avrdude/work/.CC_PRINT_OPTIONS'
622CPATH='/opt/local/include'
623LIBRARY_PATH='/opt/local/lib'
624MACOSX_DEPLOYMENT_TARGET='10.4'
625:debug:patch Assembled command: 'cd "/opt/local/var/macports/build/_opt_local_var_macports_sources_rsync.macports.org_release_tarballs_ports_cross_avrdude/avrdude/work/avrdude-6.3" && /usr/bin/patch -p0'
626:debug:patch Executing command line:  cd "/opt/local/var/macports/build/_opt_local_var_macports_sources_rsync.macports.org_release_tarballs_ports_cross_avrdude/avrdude/work/avrdude-6.3" && /usr/bin/patch -p0 < '/opt/local/var/macports/sources/rsync.macports.org/release/tarballs/ports/cross/avrdude/files/patch-stk500v2.diff'
627:info:patch patching file stk500v2.c
628:info:patch Hunk #1 succeeded at 745 (offset -3 lines).
629:debug:patch Privilege de-escalation not attempted as not running as root.
630:debug:configure configure phase started at Sun Jun  5 16:17:05 EST 2016
631:notice:configure --->  Configuring avrdude
632:debug:configure Using compiler 'MacPorts Apple GCC 4.2'
633:debug:configure Executing org.macports.configure (avrdude)
634:debug:configure Environment:
635CC='/opt/local/bin/gcc-apple-4.2'
636CC_PRINT_OPTIONS='YES'
637CC_PRINT_OPTIONS_FILE='/opt/local/var/macports/build/_opt_local_var_macports_sources_rsync.macports.org_release_tarballs_ports_cross_avrdude/avrdude/work/.CC_PRINT_OPTIONS'
638CFLAGS='-pipe -Os -arch ppc'
639CPATH='/opt/local/include'
640CPPFLAGS='-I/opt/local/include'
641CXX='/opt/local/bin/g++-apple-4.2'
642CXXFLAGS='-pipe -Os -arch ppc'
643F77FLAGS='-m32'
644F90FLAGS='-pipe -Os -m32'
645FCFLAGS='-pipe -Os -m32'
646FFLAGS='-pipe -Os'
647INSTALL='/usr/bin/install -c'
648LDFLAGS='-L/opt/local/lib -Wl,-headerpad_max_install_names -arch ppc'
649LIBRARY_PATH='/opt/local/lib'
650MACOSX_DEPLOYMENT_TARGET='10.4'
651OBJC='/opt/local/bin/gcc-apple-4.2'
652OBJCFLAGS='-pipe -Os -arch ppc'
653OBJCXX='/opt/local/bin/g++-apple-4.2'
654OBJCXXFLAGS='-pipe -Os -arch ppc'
655:debug:configure Assembled command: 'cd "/opt/local/var/macports/build/_opt_local_var_macports_sources_rsync.macports.org_release_tarballs_ports_cross_avrdude/avrdude/work/avrdude-6.3" && ./configure --prefix=/opt/local --mandir=/opt/local/share/man --disable-parport'
656:debug:configure Executing command line:  cd "/opt/local/var/macports/build/_opt_local_var_macports_sources_rsync.macports.org_release_tarballs_ports_cross_avrdude/avrdude/work/avrdude-6.3" && ./configure --prefix=/opt/local --mandir=/opt/local/share/man --disable-parport
657:info:configure checking build system type... powerpc-apple-darwin8.11.0
658:info:configure checking host system type... powerpc-apple-darwin8.11.0
659:info:configure checking target system type... powerpc-apple-darwin8.11.0
660:info:configure checking for a BSD-compatible install... /usr/bin/install -c
661:info:configure checking whether build environment is sane... yes
662:info:configure /opt/local/var/macports/build/_opt_local_var_macports_sources_rsync.macports.org_release_tarballs_ports_cross_avrdude/avrdude/work/avrdude-6.3/missing: Unknown `--is-lightweight' option
663:info:configure Try `/opt/local/var/macports/build/_opt_local_var_macports_sources_rsync.macports.org_release_tarballs_ports_cross_avrdude/avrdude/work/avrdude-6.3/missing --help' for more information
664:info:configure configure: WARNING: 'missing' script is too old or missing
665:info:configure checking for a thread-safe mkdir -p... ./install-sh -c -d
666:info:configure checking for gawk... gawk
667:info:configure checking whether make sets $(MAKE)... yes
668:info:configure checking whether make supports nested variables... yes
669:info:configure checking how to print strings... printf
670:info:configure checking for style of include used by make... GNU
671:info:configure checking for gcc... /opt/local/bin/gcc-apple-4.2
672:info:configure checking whether the C compiler works... yes
673:info:configure checking for C compiler default output file name... a.out
674:info:configure checking for suffix of executables...
675:info:configure checking whether we are cross compiling... no
676:info:configure checking for suffix of object files... o
677:info:configure checking whether we are using the GNU C compiler... yes
678:info:configure checking whether /opt/local/bin/gcc-apple-4.2 accepts -g... yes
679:info:configure checking for /opt/local/bin/gcc-apple-4.2 option to accept ISO C89... none needed
680:info:configure checking whether /opt/local/bin/gcc-apple-4.2 understands -c and -o together... yes
681:info:configure checking dependency style of /opt/local/bin/gcc-apple-4.2... gcc3
682:info:configure checking for a sed that does not truncate output... /opt/local/bin/gsed
683:info:configure checking for grep that handles long lines and -e... /usr/bin/grep
684:info:configure checking for egrep... /usr/bin/grep -E
685:info:configure checking for fgrep... /usr/bin/grep -F
686:info:configure checking for ld used by /opt/local/bin/gcc-apple-4.2... /opt/local/libexec/apple-gcc42/gcc/powerpc-apple-darwin8/4.2.1/ld
687:info:configure checking if the linker (/opt/local/libexec/apple-gcc42/gcc/powerpc-apple-darwin8/4.2.1/ld) is GNU ld... no
688:info:configure checking for BSD- or MS-compatible name lister (nm)... /usr/bin/nm -p
689:info:configure checking the name lister (/usr/bin/nm -p) interface... BSD nm
690:info:configure checking whether ln -s works... yes
691:info:configure checking the maximum length of command line arguments... 196608
692:info:configure checking whether the shell understands some XSI constructs... yes
693:info:configure checking whether the shell understands "+="... no
694:info:configure checking how to convert powerpc-apple-darwin8.11.0 file names to powerpc-apple-darwin8.11.0 format... func_convert_file_noop
695:info:configure checking how to convert powerpc-apple-darwin8.11.0 file names to toolchain format... func_convert_file_noop
696:info:configure checking for /opt/local/libexec/apple-gcc42/gcc/powerpc-apple-darwin8/4.2.1/ld option to reload object files... -r
697:info:configure checking for objdump... no
698:info:configure checking how to recognize dependent libraries... pass_all
699:info:configure checking for dlltool... no
700:info:configure checking how to associate runtime and link libraries... printf %s\n
701:info:configure checking for ar... ar
702:info:configure checking for archiver @FILE support... no
703:info:configure checking for strip... strip
704:info:configure checking for ranlib... ranlib
705:info:configure checking command to parse /usr/bin/nm -p output from /opt/local/bin/gcc-apple-4.2 object... ok
706:info:configure checking for sysroot... no
707:info:configure checking for mt... no
708:info:configure checking if : is a manifest tool... no
709:info:configure checking for dsymutil... dsymutil
710:info:configure checking for nmedit... nmedit
711:info:configure checking for lipo... lipo
712:info:configure checking for otool... otool
713:info:configure checking for otool64... otool64
714:info:configure checking for -single_module linker flag... yes
715:info:configure checking for -exported_symbols_list linker flag... yes
716:info:configure checking for -force_load linker flag... yes
717:info:configure checking how to run the C preprocessor... /opt/local/bin/gcc-apple-4.2 -E
718:info:configure checking for ANSI C header files... yes
719:info:configure checking for sys/types.h... yes
720:info:configure checking for sys/stat.h... yes
721:info:configure checking for stdlib.h... yes
722:info:configure checking for string.h... yes
723:info:configure checking for memory.h... yes
724:info:configure checking for strings.h... yes
725:info:configure checking for inttypes.h... yes
726:info:configure checking for stdint.h... yes
727:info:configure checking for unistd.h... yes
728:info:configure checking for dlfcn.h... yes
729:info:configure checking for objdir... .libs
730:info:configure checking if /opt/local/bin/gcc-apple-4.2 supports -fno-rtti -fno-exceptions... no
731:info:configure checking for /opt/local/bin/gcc-apple-4.2 option to produce PIC... -fno-common -DPIC
732:info:configure checking if /opt/local/bin/gcc-apple-4.2 PIC flag -fno-common -DPIC works... yes
733:info:configure checking if /opt/local/bin/gcc-apple-4.2 static flag -static works... no
734:info:configure checking if /opt/local/bin/gcc-apple-4.2 supports -c -o file.o... yes
735:info:configure checking if /opt/local/bin/gcc-apple-4.2 supports -c -o file.o... (cached) yes
736:info:configure checking whether the /opt/local/bin/gcc-apple-4.2 linker (/opt/local/libexec/apple-gcc42/gcc/powerpc-apple-darwin8/4.2.1/ld) supports shared libraries... yes
737:info:configure checking dynamic linker characteristics... darwin8.11.0 dyld
738:info:configure checking how to hardcode library paths into programs... immediate
739:info:configure checking whether stripping libraries is possible... yes
740:info:configure checking if libtool supports shared libraries... yes
741:info:configure checking whether to build shared libraries... yes
742:info:configure checking whether to build static libraries... yes
743:info:configure checking for gcc... (cached) /opt/local/bin/gcc-apple-4.2
744:info:configure checking whether we are using the GNU C compiler... (cached) yes
745:info:configure checking whether /opt/local/bin/gcc-apple-4.2 accepts -g... (cached) yes
746:info:configure checking for /opt/local/bin/gcc-apple-4.2 option to accept ISO C89... (cached) none needed
747:info:configure checking whether /opt/local/bin/gcc-apple-4.2 understands -c and -o together... (cached) yes
748:info:configure checking dependency style of /opt/local/bin/gcc-apple-4.2... (cached) gcc3
749:info:configure checking for a sed that does not truncate output... (cached) /opt/local/bin/gsed
750:info:configure checking for bison... bison -y
751:info:configure checking for flex... flex
752:info:configure checking lex output file root... lex.yy
753:info:configure checking lex library... -lfl
754:info:configure checking whether yytext is a pointer... yes
755:info:configure checking for -ar... ar
756:info:configure checking whether yylex_destroy is generated by flex... version 2.6.0 => yes
757:info:configure checking for tputs in -ltermcap... yes
758:info:configure checking for tputs in -lncurses... yes
759:info:configure checking for readline in -lreadline... yes
760:info:configure checking for elf_getshdrstrndx in -lelf... yes
761:info:configure checking libelf.h usability... no
762:info:configure checking libelf.h presence... no
763:info:configure checking for libelf.h... no
764:info:configure checking libelf/libelf.h usability... yes
765:info:configure checking libelf/libelf.h presence... yes
766:info:configure checking for libelf/libelf.h... yes
767:info:configure checking for library containing gethostent... none required
768:info:configure checking for library containing setsockopt... none required
769:info:configure checking for usb_get_string_simple in -lusb... yes
770:info:configure checking usb.h usability... yes
771:info:configure checking usb.h presence... yes
772:info:configure checking for usb.h... yes
773:info:configure checking lusb0_usb.h usability... no
774:info:configure checking lusb0_usb.h presence... no
775:info:configure checking for lusb0_usb.h... no
776:info:configure checking for libusb_init in -lusb-1.0... yes
777:info:configure checking libusb-1.0/libusb.h usability... yes
778:info:configure checking libusb-1.0/libusb.h presence... yes
779:info:configure checking for libusb-1.0/libusb.h... yes
780:info:configure checking libusb.h usability... no
781:info:configure checking libusb.h presence... no
782:info:configure checking for libusb.h... no
783:info:configure checking for libusb_init in -lusb... no
784:info:configure checking for libusb.h... (cached) no
785:info:configure checking for ftdi_new in -lftdi1... yes
786:info:configure checking for ftdi_usb_get_strings in -lftdi... yes
787:info:configure checking pthread.h usability... yes
788:info:configure checking pthread.h presence... yes
789:info:configure checking for pthread.h... yes
790:info:configure checking for pthread_create in -lpthread... yes
791:info:configure checking limits.h usability... yes
792:info:configure checking limits.h presence... yes
793:info:configure checking for limits.h... yes
794:info:configure checking for stdlib.h... (cached) yes
795:info:configure checking for string.h... (cached) yes
796:info:configure checking fcntl.h usability... yes
797:info:configure checking fcntl.h presence... yes
798:info:configure checking for fcntl.h... yes
799:info:configure checking sys/ioctl.h usability... yes
800:info:configure checking sys/ioctl.h presence... yes
801:info:configure checking for sys/ioctl.h... yes
802:info:configure checking sys/time.h usability... yes
803:info:configure checking sys/time.h presence... yes
804:info:configure checking for sys/time.h... yes
805:info:configure checking termios.h usability... yes
806:info:configure checking termios.h presence... yes
807:info:configure checking for termios.h... yes
808:info:configure checking for unistd.h... (cached) yes
809:info:configure checking for ddk/hidsdi.h... no
810:info:configure checking for an ANSI C-conforming const... yes
811:info:configure checking whether time.h and sys/time.h may both be included... yes
812:info:configure checking for puts in -lws2_32... no
813:info:configure checking for memset... yes
814:info:configure checking for select... yes
815:info:configure checking for strcasecmp... yes
816:info:configure checking for strdup... yes
817:info:configure checking for strerror... yes
818:info:configure checking for strncasecmp... yes
819:info:configure checking for strtol... yes
820:info:configure checking for strtoul... yes
821:info:configure checking for gettimeofday... yes
822:info:configure checking for usleep... yes
823:info:configure checking for a Win32 HID libray... no
824:info:configure checking for uint_t... no
825:info:configure checking for ulong_t... no
826:info:configure checking for serial device... unknown
827:info:configure checking if gcc accepts -Wno-pointer-sign ... no
828:info:configure checking that generated files are newer than configure... done
829:info:configure configure: creating ./config.status
830:info:configure config.status: creating doc/Makefile
831:info:configure config.status: creating windows/Makefile
832:info:configure config.status: creating avrdude.spec
833:info:configure config.status: creating Makefile
834:info:configure config.status: creating avrdude.conf.tmp
835:info:configure config.status: creating ac_cfg.h
836:info:configure config.status: executing depfiles commands
837:info:configure config.status: executing libtool commands
838:info:configure
839:info:configure
840:info:configure Configuration summary:
841:info:configure ----------------------
842:info:configure DO HAVE    libelf
843:info:configure DO HAVE    libusb
844:info:configure DO HAVE    libusb_1_0
845:info:configure DO HAVE    libftdi1
846:info:configure DO HAVE    libftdi (but prefer to use libftdi1)
847:info:configure DON'T HAVE libhid
848:info:configure DO HAVE    pthread
849:info:configure DISABLED   doc
850:info:configure DISABLED   parport
851:info:configure DISABLED   linuxgpio
852:debug:configure Privilege de-escalation not attempted as not running as root.
853:debug:build build phase started at Sun Jun  5 16:17:39 EST 2016
854:notice:build --->  Building avrdude
855:debug:build Executing org.macports.build (avrdude)
856:debug:build Environment:
857CC_PRINT_OPTIONS='YES'
858CC_PRINT_OPTIONS_FILE='/opt/local/var/macports/build/_opt_local_var_macports_sources_rsync.macports.org_release_tarballs_ports_cross_avrdude/avrdude/work/.CC_PRINT_OPTIONS'
859CPATH='/opt/local/include'
860LIBRARY_PATH='/opt/local/lib'
861MACOSX_DEPLOYMENT_TARGET='10.4'
862:debug:build Assembled command: 'cd "/opt/local/var/macports/build/_opt_local_var_macports_sources_rsync.macports.org_release_tarballs_ports_cross_avrdude/avrdude/work/avrdude-6.3" && /usr/bin/make -w all'
863:debug:build Executing command line:  cd "/opt/local/var/macports/build/_opt_local_var_macports_sources_rsync.macports.org_release_tarballs_ports_cross_avrdude/avrdude/work/avrdude-6.3" && /usr/bin/make -w all
864:info:build make: Entering directory `/opt/local/var/macports/build/_opt_local_var_macports_sources_rsync.macports.org_release_tarballs_ports_cross_avrdude/avrdude/work/avrdude-6.3'
865:info:build /bin/sh ./ylwrap config_gram.y y.tab.c config_gram.c y.tab.h `echo config_gram.c | sed -e s/cc$/hh/ -e s/cpp$/hpp/ -e s/cxx$/hxx/ -e s/c++$/h++/ -e s/c$/h/` y.output config_gram.output -- bison -y -d
866:info:build updating config_gram.h
867:info:build /bin/sh ./ylwrap lexer.l lex.yy.c lexer.c -- flex 
868:info:build /usr/bin/make  all-recursive
869:info:build make[1]: Entering directory `/opt/local/var/macports/build/_opt_local_var_macports_sources_rsync.macports.org_release_tarballs_ports_cross_avrdude/avrdude/work/avrdude-6.3'
870:info:build Making all in .
871:info:build make[2]: Entering directory `/opt/local/var/macports/build/_opt_local_var_macports_sources_rsync.macports.org_release_tarballs_ports_cross_avrdude/avrdude/work/avrdude-6.3'
872:info:build /opt/local/bin/gcc-apple-4.2 -DHAVE_CONFIG_H -I.  -DCONFIG_DIR=\"/opt/local/etc\" -I/opt/local/include -Wall -pipe -Os -arch ppc -MT libavrdude_a-config_gram.o -MD -MP -MF .deps/libavrdude_a-config_gram.Tpo -c -o libavrdude_a-config_gram.o `test -f 'config_gram.c' || echo './'`config_gram.c
873:info:build mv -f .deps/libavrdude_a-config_gram.Tpo .deps/libavrdude_a-config_gram.Po
874:info:build /opt/local/bin/gcc-apple-4.2 -DHAVE_CONFIG_H -I.  -DCONFIG_DIR=\"/opt/local/etc\" -I/opt/local/include -Wall -pipe -Os -arch ppc -MT libavrdude_a-lexer.o -MD -MP -MF .deps/libavrdude_a-lexer.Tpo -c -o libavrdude_a-lexer.o `test -f 'lexer.c' || echo './'`lexer.c
875:info:build mv -f .deps/libavrdude_a-lexer.Tpo .deps/libavrdude_a-lexer.Po
876:info:build /opt/local/bin/gcc-apple-4.2 -DHAVE_CONFIG_H -I.  -DCONFIG_DIR=\"/opt/local/etc\" -I/opt/local/include -Wall -pipe -Os -arch ppc -MT libavrdude_a-arduino.o -MD -MP -MF .deps/libavrdude_a-arduino.Tpo -c -o libavrdude_a-arduino.o `test -f 'arduino.c' || echo './'`arduino.c
877:info:build mv -f .deps/libavrdude_a-arduino.Tpo .deps/libavrdude_a-arduino.Po
878:info:build /opt/local/bin/gcc-apple-4.2 -DHAVE_CONFIG_H -I.  -DCONFIG_DIR=\"/opt/local/etc\" -I/opt/local/include -Wall -pipe -Os -arch ppc -MT libavrdude_a-avr.o -MD -MP -MF .deps/libavrdude_a-avr.Tpo -c -o libavrdude_a-avr.o `test -f 'avr.c' || echo './'`avr.c
879:info:build mv -f .deps/libavrdude_a-avr.Tpo .deps/libavrdude_a-avr.Po
880:info:build /opt/local/bin/gcc-apple-4.2 -DHAVE_CONFIG_H -I.  -DCONFIG_DIR=\"/opt/local/etc\" -I/opt/local/include -Wall -pipe -Os -arch ppc -MT libavrdude_a-avr910.o -MD -MP -MF .deps/libavrdude_a-avr910.Tpo -c -o libavrdude_a-avr910.o `test -f 'avr910.c' || echo './'`avr910.c
881:info:build mv -f .deps/libavrdude_a-avr910.Tpo .deps/libavrdude_a-avr910.Po
882:info:build /opt/local/bin/gcc-apple-4.2 -DHAVE_CONFIG_H -I.  -DCONFIG_DIR=\"/opt/local/etc\" -I/opt/local/include -Wall -pipe -Os -arch ppc -MT libavrdude_a-avrftdi.o -MD -MP -MF .deps/libavrdude_a-avrftdi.Tpo -c -o libavrdude_a-avrftdi.o `test -f 'avrftdi.c' || echo './'`avrftdi.c
883:info:build mv -f .deps/libavrdude_a-avrftdi.Tpo .deps/libavrdude_a-avrftdi.Po
884:info:build /opt/local/bin/gcc-apple-4.2 -DHAVE_CONFIG_H -I.  -DCONFIG_DIR=\"/opt/local/etc\" -I/opt/local/include -Wall -pipe -Os -arch ppc -MT libavrdude_a-avrftdi_tpi.o -MD -MP -MF .deps/libavrdude_a-avrftdi_tpi.Tpo -c -o libavrdude_a-avrftdi_tpi.o `test -f 'avrftdi_tpi.c' || echo './'`avrftdi_tpi.c
885:info:build mv -f .deps/libavrdude_a-avrftdi_tpi.Tpo .deps/libavrdude_a-avrftdi_tpi.Po
886:info:build /opt/local/bin/gcc-apple-4.2 -DHAVE_CONFIG_H -I.  -DCONFIG_DIR=\"/opt/local/etc\" -I/opt/local/include -Wall -pipe -Os -arch ppc -MT libavrdude_a-avrpart.o -MD -MP -MF .deps/libavrdude_a-avrpart.Tpo -c -o libavrdude_a-avrpart.o `test -f 'avrpart.c' || echo './'`avrpart.c
887:info:build mv -f .deps/libavrdude_a-avrpart.Tpo .deps/libavrdude_a-avrpart.Po
888:info:build /opt/local/bin/gcc-apple-4.2 -DHAVE_CONFIG_H -I.  -DCONFIG_DIR=\"/opt/local/etc\" -I/opt/local/include -Wall -pipe -Os -arch ppc -MT libavrdude_a-bitbang.o -MD -MP -MF .deps/libavrdude_a-bitbang.Tpo -c -o libavrdude_a-bitbang.o `test -f 'bitbang.c' || echo './'`bitbang.c
889:info:build mv -f .deps/libavrdude_a-bitbang.Tpo .deps/libavrdude_a-bitbang.Po
890:info:build /opt/local/bin/gcc-apple-4.2 -DHAVE_CONFIG_H -I.  -DCONFIG_DIR=\"/opt/local/etc\" -I/opt/local/include -Wall -pipe -Os -arch ppc -MT libavrdude_a-buspirate.o -MD -MP -MF .deps/libavrdude_a-buspirate.Tpo -c -o libavrdude_a-buspirate.o `test -f 'buspirate.c' || echo './'`buspirate.c
891:info:build mv -f .deps/libavrdude_a-buspirate.Tpo .deps/libavrdude_a-buspirate.Po
892:info:build /opt/local/bin/gcc-apple-4.2 -DHAVE_CONFIG_H -I.  -DCONFIG_DIR=\"/opt/local/etc\" -I/opt/local/include -Wall -pipe -Os -arch ppc -MT libavrdude_a-butterfly.o -MD -MP -MF .deps/libavrdude_a-butterfly.Tpo -c -o libavrdude_a-butterfly.o `test -f 'butterfly.c' || echo './'`butterfly.c
893:info:build mv -f .deps/libavrdude_a-butterfly.Tpo .deps/libavrdude_a-butterfly.Po
894:info:build /opt/local/bin/gcc-apple-4.2 -DHAVE_CONFIG_H -I.  -DCONFIG_DIR=\"/opt/local/etc\" -I/opt/local/include -Wall -pipe -Os -arch ppc -MT libavrdude_a-config.o -MD -MP -MF .deps/libavrdude_a-config.Tpo -c -o libavrdude_a-config.o `test -f 'config.c' || echo './'`config.c
895:info:build mv -f .deps/libavrdude_a-config.Tpo .deps/libavrdude_a-config.Po
896:info:build /opt/local/bin/gcc-apple-4.2 -DHAVE_CONFIG_H -I.  -DCONFIG_DIR=\"/opt/local/etc\" -I/opt/local/include -Wall -pipe -Os -arch ppc -MT libavrdude_a-confwin.o -MD -MP -MF .deps/libavrdude_a-confwin.Tpo -c -o libavrdude_a-confwin.o `test -f 'confwin.c' || echo './'`confwin.c
897:info:build mv -f .deps/libavrdude_a-confwin.Tpo .deps/libavrdude_a-confwin.Po
898:info:build /opt/local/bin/gcc-apple-4.2 -DHAVE_CONFIG_H -I.  -DCONFIG_DIR=\"/opt/local/etc\" -I/opt/local/include -Wall -pipe -Os -arch ppc -MT libavrdude_a-crc16.o -MD -MP -MF .deps/libavrdude_a-crc16.Tpo -c -o libavrdude_a-crc16.o `test -f 'crc16.c' || echo './'`crc16.c
899:info:build mv -f .deps/libavrdude_a-crc16.Tpo .deps/libavrdude_a-crc16.Po
900:info:build /opt/local/bin/gcc-apple-4.2 -DHAVE_CONFIG_H -I.  -DCONFIG_DIR=\"/opt/local/etc\" -I/opt/local/include -Wall -pipe -Os -arch ppc -MT libavrdude_a-dfu.o -MD -MP -MF .deps/libavrdude_a-dfu.Tpo -c -o libavrdude_a-dfu.o `test -f 'dfu.c' || echo './'`dfu.c
901:info:build mv -f .deps/libavrdude_a-dfu.Tpo .deps/libavrdude_a-dfu.Po
902:info:build /opt/local/bin/gcc-apple-4.2 -DHAVE_CONFIG_H -I.  -DCONFIG_DIR=\"/opt/local/etc\" -I/opt/local/include -Wall -pipe -Os -arch ppc -MT libavrdude_a-fileio.o -MD -MP -MF .deps/libavrdude_a-fileio.Tpo -c -o libavrdude_a-fileio.o `test -f 'fileio.c' || echo './'`fileio.c
903:info:build mv -f .deps/libavrdude_a-fileio.Tpo .deps/libavrdude_a-fileio.Po
904:info:build /opt/local/bin/gcc-apple-4.2 -DHAVE_CONFIG_H -I.  -DCONFIG_DIR=\"/opt/local/etc\" -I/opt/local/include -Wall -pipe -Os -arch ppc -MT libavrdude_a-flip1.o -MD -MP -MF .deps/libavrdude_a-flip1.Tpo -c -o libavrdude_a-flip1.o `test -f 'flip1.c' || echo './'`flip1.c
905:info:build mv -f .deps/libavrdude_a-flip1.Tpo .deps/libavrdude_a-flip1.Po
906:info:build /opt/local/bin/gcc-apple-4.2 -DHAVE_CONFIG_H -I.  -DCONFIG_DIR=\"/opt/local/etc\" -I/opt/local/include -Wall -pipe -Os -arch ppc -MT libavrdude_a-flip2.o -MD -MP -MF .deps/libavrdude_a-flip2.Tpo -c -o libavrdude_a-flip2.o `test -f 'flip2.c' || echo './'`flip2.c
907:info:build mv -f .deps/libavrdude_a-flip2.Tpo .deps/libavrdude_a-flip2.Po
908:info:build /opt/local/bin/gcc-apple-4.2 -DHAVE_CONFIG_H -I.  -DCONFIG_DIR=\"/opt/local/etc\" -I/opt/local/include -Wall -pipe -Os -arch ppc -MT libavrdude_a-ft245r.o -MD -MP -MF .deps/libavrdude_a-ft245r.Tpo -c -o libavrdude_a-ft245r.o `test -f 'ft245r.c' || echo './'`ft245r.c
909:info:build ft245r.c:127:31: error: dispatch/dispatch.h: No such file or directory
910:info:build ft245r.c:129: error: expected '=', ',', ';', 'asm' or '__attribute__' before 'sem_t'
911:info:build ft245r.c:156: error: expected '=', ',', ';', 'asm' or '__attribute__' before 'buf_data'
912:info:build ft245r.c: In function 'add_to_buf':
913:info:build ft245r.c:163: warning: implicit declaration of function 'dispatch_semaphore_wait'
914:info:build ft245r.c:163: error: 'buf_space' undeclared (first use in this function)
915:info:build ft245r.c:163: error: (Each undeclared identifier is reported only once
916:info:build ft245r.c:163: error: for each function it appears in.)
917:info:build ft245r.c:163: error: 'DISPATCH_TIME_FOREVER' undeclared (first use in this function)
918:info:build ft245r.c:172: warning: implicit declaration of function 'dispatch_semaphore_signal'
919:info:build ft245r.c:172: error: 'buf_data' undeclared (first use in this function)
920:info:build ft245r.c: In function 'ft245r_recv':
921:info:build ft245r.c:205: error: 'buf_data' undeclared (first use in this function)
922:info:build ft245r.c:205: error: 'DISPATCH_TIME_FOREVER' undeclared (first use in this function)
923:info:build ft245r.c:209: error: 'buf_space' undeclared (first use in this function)
924:info:build ft245r.c: In function 'ft245r_open':
925:info:build ft245r.c:631: error: 'buf_data' undeclared (first use in this function)
926:info:build ft245r.c:631: warning: implicit declaration of function 'dispatch_semaphore_create'
927:info:build ft245r.c:632: error: 'buf_space' undeclared (first use in this function)
928:info:build make[2]: *** [libavrdude_a-ft245r.o] Error 1
929:info:build make[2]: Leaving directory `/opt/local/var/macports/build/_opt_local_var_macports_sources_rsync.macports.org_release_tarballs_ports_cross_avrdude/avrdude/work/avrdude-6.3'
930:info:build make[1]: *** [all-recursive] Error 1
931:info:build make[1]: Leaving directory `/opt/local/var/macports/build/_opt_local_var_macports_sources_rsync.macports.org_release_tarballs_ports_cross_avrdude/avrdude/work/avrdude-6.3'
932:info:build make: *** [all] Error 2
933:info:build make: Leaving directory `/opt/local/var/macports/build/_opt_local_var_macports_sources_rsync.macports.org_release_tarballs_ports_cross_avrdude/avrdude/work/avrdude-6.3'
934:info:build Command failed:  cd "/opt/local/var/macports/build/_opt_local_var_macports_sources_rsync.macports.org_release_tarballs_ports_cross_avrdude/avrdude/work/avrdude-6.3" && /usr/bin/make -w all
935:info:build Exit code: 2
936:error:build org.macports.build for port avrdude returned: command execution failed
937:debug:build Error code: CHILDSTATUS 3740 2
938:debug:build Backtrace: command execution failed
939    while executing
940"system -nice 0 $fullcmdstring"
941    ("eval" body line 1)
942    invoked from within
943"eval system $notty $nice \$fullcmdstring"
944    invoked from within
945"command_exec build"
946    (procedure "portbuild::build_main" line 8)
947    invoked from within
948"portbuild::build_main org.macports.build"
949    ("eval" body line 1)
950    invoked from within
951"eval $procedure $targetname"
952:info:build Warning: targets not executed for avrdude: org.macports.activate org.macports.build org.macports.destroot org.macports.install
953:notice:build Please see the log file for port avrdude for details:
954    /opt/local/var/macports/logs/_opt_local_var_macports_sources_rsync.macports.org_release_tarballs_ports_cross_avrdude/avrdude/main.log