Ticket #52018: dibbler fail 8-13-2016.txt

File dibbler fail 8-13-2016.txt, 72.6 KB (added by baalbamoth@…, 5 years ago)

Macports build log showing dibbler build fail 8-13-2016

Line 
1
2sh-3.2# cat /opt/local/var/macports/logs/_opt_local_var_macports_sources_sea.us.rsync.macports.org_release_tarballs_ports_net_dibbler/dibbler/main.log
3version:1
4:debug:main dibbler has no conflicts
5:debug:main Executing org.macports.main (dibbler)
6:debug:main changing euid/egid - current euid: 0 - current egid: 0
7:debug:main egid changed to: 501
8:debug:main euid changed to: 502
9:debug:archivefetch archivefetch phase started at Mon Aug 15 00:24:51 EDT 2016
10:msg:archivefetch --->  Fetching archive for dibbler
11:debug:archivefetch Executing org.macports.archivefetch (dibbler)
12:debug:archivefetch euid/egid changed to: 0/0
13:debug:archivefetch chowned /opt/local/var/macports/incoming to macports
14:debug:archivefetch euid/egid changed to: 502/501
15:info:archivefetch --->  dibbler-1.0.0RC1_0.darwin_15.x86_64.tbz2 doesn't seem to exist in /opt/local/var/macports/incoming/verified
16:msg:archivefetch --->  Attempting to fetch dibbler-1.0.0RC1_0.darwin_15.x86_64.tbz2 from https://packages.macports.org/dibbler
17:debug:archivefetch Fetching archive failed:: The requested URL returned error: 404 Not Found
18:msg:archivefetch --->  Attempting to fetch dibbler-1.0.0RC1_0.darwin_15.x86_64.tbz2 from http://mse.uk.packages.macports.org/sites/packages.macports.org/dibbler
19:debug:archivefetch Fetching archive failed:: The requested URL returned error: 404 Not Found
20:msg:archivefetch --->  Attempting to fetch dibbler-1.0.0RC1_0.darwin_15.x86_64.tbz2 from http://sea.us.packages.macports.org/macports/packages/dibbler
21:debug:archivefetch Fetching archive failed:: The requested URL returned error: 404 Not Found
22:debug:archivefetch Privilege de-escalation not attempted as not running as root.
23:debug:fetch fetch phase started at Mon Aug 15 00:24:54 EDT 2016
24:notice:fetch --->  Fetching distfiles for dibbler
25:debug:fetch Executing org.macports.fetch (dibbler)
26:debug:fetch Privilege de-escalation not attempted as not running as root.
27:debug:checksum checksum phase started at Mon Aug 15 00:24:54 EDT 2016
28:notice:checksum --->  Verifying checksums for dibbler
29:debug:checksum Executing org.macports.checksum (dibbler)
30:info:checksum --->  Checksumming dibbler-1.0.0RC1.tar.gz
31:debug:checksum Calculated (rmd160) is 5f8a70f46e9497b9cceab6cf04a2e05259ab075e
32:debug:checksum Correct (rmd160) checksum for dibbler-1.0.0RC1.tar.gz
33:debug:checksum Calculated (sha256) is 4d29b5436cd97e5e5c7afb2278ec608bf5adb9c451e9628066f2e943164d3f74
34:debug:checksum Correct (sha256) checksum for dibbler-1.0.0RC1.tar.gz
35:debug:checksum Privilege de-escalation not attempted as not running as root.
36:debug:extract extract phase started at Mon Aug 15 00:24:54 EDT 2016
37:notice:extract --->  Extracting dibbler
38:debug:extract Executing org.macports.extract (dibbler)
39:info:extract --->  Extracting dibbler-1.0.0RC1.tar.gz
40:debug:extract setting option extract.args to '/opt/local/var/macports/distfiles/dibbler/dibbler-1.0.0RC1.tar.gz'
41:debug:extract Environment:
42CC_PRINT_OPTIONS='YES'
43CC_PRINT_OPTIONS_FILE='/opt/local/var/macports/build/_opt_local_var_macports_sources_sea.us.rsync.macports.org_release_tarballs_ports_net_dibbler/dibbler/work/.CC_PRINT_OPTIONS'
44CPATH='/opt/local/include'
45LIBRARY_PATH='/opt/local/lib'
46MACOSX_DEPLOYMENT_TARGET='10.11'
47:debug:extract Assembled command: 'cd "/opt/local/var/macports/build/_opt_local_var_macports_sources_sea.us.rsync.macports.org_release_tarballs_ports_net_dibbler/dibbler/work" && /usr/bin/gzip -dc '/opt/local/var/macports/distfiles/dibbler/dibbler-1.0.0RC1.tar.gz' | /usr/bin/tar -xf -'
48:debug:extract Executing command line:  cd "/opt/local/var/macports/build/_opt_local_var_macports_sources_sea.us.rsync.macports.org_release_tarballs_ports_net_dibbler/dibbler/work" && /usr/bin/gzip -dc '/opt/local/var/macports/distfiles/dibbler/dibbler-1.0.0RC1.tar.gz' | /usr/bin/tar -xf -
49:debug:extract euid/egid changed to: 0/0
50:debug:extract chowned /opt/local/var/macports/build/_opt_local_var_macports_sources_sea.us.rsync.macports.org_release_tarballs_ports_net_dibbler/dibbler/work to macports
51:debug:extract euid/egid changed to: 502/501
52:debug:extract Privilege de-escalation not attempted as not running as root.
53:debug:patch patch phase started at Mon Aug 15 00:24:54 EDT 2016
54:debug:patch Executing org.macports.patch (dibbler)
55:notice:patch --->  Applying patches to dibbler
56:info:patch --->  Applying 0-enable-prefix.patch
57:debug:patch Environment:
58CC_PRINT_OPTIONS='YES'
59CC_PRINT_OPTIONS_FILE='/opt/local/var/macports/build/_opt_local_var_macports_sources_sea.us.rsync.macports.org_release_tarballs_ports_net_dibbler/dibbler/work/.CC_PRINT_OPTIONS'
60CPATH='/opt/local/include'
61LIBRARY_PATH='/opt/local/lib'
62MACOSX_DEPLOYMENT_TARGET='10.11'
63:debug:patch Assembled command: 'cd "/opt/local/var/macports/build/_opt_local_var_macports_sources_sea.us.rsync.macports.org_release_tarballs_ports_net_dibbler/dibbler/work/dibbler-1.0.0RC1" && /usr/bin/patch -p1'
64:debug:patch Executing command line:  cd "/opt/local/var/macports/build/_opt_local_var_macports_sources_sea.us.rsync.macports.org_release_tarballs_ports_net_dibbler/dibbler/work/dibbler-1.0.0RC1" && /usr/bin/patch -p1 < '/opt/local/var/macports/sources/sea.us.rsync.macports.org/release/tarballs/ports/net/dibbler/files/0-enable-prefix.patch'
65:info:patch patching file Misc/Portable.h
66:info:patch patching file Port-bsd/lowlevel-bsd.c
67:info:patch patching file doc/examples/client.conf
68:info:patch patching file doc/examples/server.conf
69:info:patch patching file doc/man/dibbler-client.8
70:info:patch patching file doc/man/dibbler-relay.8
71:info:patch patching file doc/man/dibbler-server.8
72:info:patch patching file scripts/notify-scripts/server-notify.sh
73:info:patch --->  Applying 1-correct-man-pages.patch
74:debug:patch Environment:
75CC_PRINT_OPTIONS='YES'
76CC_PRINT_OPTIONS_FILE='/opt/local/var/macports/build/_opt_local_var_macports_sources_sea.us.rsync.macports.org_release_tarballs_ports_net_dibbler/dibbler/work/.CC_PRINT_OPTIONS'
77CPATH='/opt/local/include'
78LIBRARY_PATH='/opt/local/lib'
79MACOSX_DEPLOYMENT_TARGET='10.11'
80:debug:patch Assembled command: 'cd "/opt/local/var/macports/build/_opt_local_var_macports_sources_sea.us.rsync.macports.org_release_tarballs_ports_net_dibbler/dibbler/work/dibbler-1.0.0RC1" && /usr/bin/patch -p1'
81:debug:patch Executing command line:  cd "/opt/local/var/macports/build/_opt_local_var_macports_sources_sea.us.rsync.macports.org_release_tarballs_ports_net_dibbler/dibbler/work/dibbler-1.0.0RC1" && /usr/bin/patch -p1 < '/opt/local/var/macports/sources/sea.us.rsync.macports.org/release/tarballs/ports/net/dibbler/files/1-correct-man-pages.patch'
82:info:patch patching file doc/man/dibbler-client.8
83:info:patch patching file doc/man/dibbler-server.8
84:debug:patch Executing proc-post-org.macports.patch-patch-0
85:info:patch --->  Patching Portable.h: s|__PREFIX__|/opt/local|g
86:debug:patch Executing reinplace: /usr/bin/sed s|__PREFIX__|/opt/local|g < /opt/local/var/macports/build/_opt_local_var_macports_sources_sea.us.rsync.macports.org_release_tarballs_ports_net_dibbler/dibbler/work/dibbler-1.0.0RC1/Misc/Portable.h >@ file10 2>@stderr
87:debug:patch euid/egid changed to: 0/0
88:debug:patch chowned /opt/local/var/macports/build/_opt_local_var_macports_sources_sea.us.rsync.macports.org_release_tarballs_ports_net_dibbler/dibbler/work/dibbler-1.0.0RC1/Misc/Portable.h to macports
89:debug:patch euid/egid changed to: 502/501
90:debug:patch euid/egid changed to: 0/0
91:debug:patch setting attributes on /opt/local/var/macports/build/_opt_local_var_macports_sources_sea.us.rsync.macports.org_release_tarballs_ports_net_dibbler/dibbler/work/dibbler-1.0.0RC1/Misc/Portable.h
92:debug:patch euid/egid changed to: 502/501
93:info:patch --->  Patching lowlevel-bsd.c: s|__PREFIX__|/opt/local|g
94:debug:patch Executing reinplace: /usr/bin/sed s|__PREFIX__|/opt/local|g < /opt/local/var/macports/build/_opt_local_var_macports_sources_sea.us.rsync.macports.org_release_tarballs_ports_net_dibbler/dibbler/work/dibbler-1.0.0RC1/Port-bsd/lowlevel-bsd.c >@ file10 2>@stderr
95:debug:patch euid/egid changed to: 0/0
96:debug:patch chowned /opt/local/var/macports/build/_opt_local_var_macports_sources_sea.us.rsync.macports.org_release_tarballs_ports_net_dibbler/dibbler/work/dibbler-1.0.0RC1/Port-bsd/lowlevel-bsd.c to macports
97:debug:patch euid/egid changed to: 502/501
98:debug:patch euid/egid changed to: 0/0
99:debug:patch setting attributes on /opt/local/var/macports/build/_opt_local_var_macports_sources_sea.us.rsync.macports.org_release_tarballs_ports_net_dibbler/dibbler/work/dibbler-1.0.0RC1/Port-bsd/lowlevel-bsd.c
100:debug:patch euid/egid changed to: 502/501
101:info:patch --->  Patching client.conf: s|__PREFIX__|/opt/local|g
102:debug:patch Executing reinplace: /usr/bin/sed s|__PREFIX__|/opt/local|g < /opt/local/var/macports/build/_opt_local_var_macports_sources_sea.us.rsync.macports.org_release_tarballs_ports_net_dibbler/dibbler/work/dibbler-1.0.0RC1/doc/examples/client.conf >@ file10 2>@stderr
103:debug:patch euid/egid changed to: 0/0
104:debug:patch chowned /opt/local/var/macports/build/_opt_local_var_macports_sources_sea.us.rsync.macports.org_release_tarballs_ports_net_dibbler/dibbler/work/dibbler-1.0.0RC1/doc/examples/client.conf to macports
105:debug:patch euid/egid changed to: 502/501
106:debug:patch euid/egid changed to: 0/0
107:debug:patch setting attributes on /opt/local/var/macports/build/_opt_local_var_macports_sources_sea.us.rsync.macports.org_release_tarballs_ports_net_dibbler/dibbler/work/dibbler-1.0.0RC1/doc/examples/client.conf
108:debug:patch euid/egid changed to: 502/501
109:info:patch --->  Patching server.conf: s|__PREFIX__|/opt/local|g
110:debug:patch Executing reinplace: /usr/bin/sed s|__PREFIX__|/opt/local|g < /opt/local/var/macports/build/_opt_local_var_macports_sources_sea.us.rsync.macports.org_release_tarballs_ports_net_dibbler/dibbler/work/dibbler-1.0.0RC1/doc/examples/server.conf >@ file10 2>@stderr
111:debug:patch euid/egid changed to: 0/0
112:debug:patch chowned /opt/local/var/macports/build/_opt_local_var_macports_sources_sea.us.rsync.macports.org_release_tarballs_ports_net_dibbler/dibbler/work/dibbler-1.0.0RC1/doc/examples/server.conf to macports
113:debug:patch euid/egid changed to: 502/501
114:debug:patch euid/egid changed to: 0/0
115:debug:patch setting attributes on /opt/local/var/macports/build/_opt_local_var_macports_sources_sea.us.rsync.macports.org_release_tarballs_ports_net_dibbler/dibbler/work/dibbler-1.0.0RC1/doc/examples/server.conf
116:debug:patch euid/egid changed to: 502/501
117:info:patch --->  Patching dibbler-client.8: s|__PREFIX__|/opt/local|g
118:debug:patch Executing reinplace: /usr/bin/sed s|__PREFIX__|/opt/local|g < /opt/local/var/macports/build/_opt_local_var_macports_sources_sea.us.rsync.macports.org_release_tarballs_ports_net_dibbler/dibbler/work/dibbler-1.0.0RC1/doc/man/dibbler-client.8 >@ file10 2>@stderr
119:debug:patch euid/egid changed to: 0/0
120:debug:patch chowned /opt/local/var/macports/build/_opt_local_var_macports_sources_sea.us.rsync.macports.org_release_tarballs_ports_net_dibbler/dibbler/work/dibbler-1.0.0RC1/doc/man/dibbler-client.8 to macports
121:debug:patch euid/egid changed to: 502/501
122:debug:patch euid/egid changed to: 0/0
123:debug:patch setting attributes on /opt/local/var/macports/build/_opt_local_var_macports_sources_sea.us.rsync.macports.org_release_tarballs_ports_net_dibbler/dibbler/work/dibbler-1.0.0RC1/doc/man/dibbler-client.8
124:debug:patch euid/egid changed to: 502/501
125:info:patch --->  Patching dibbler-relay.8: s|__PREFIX__|/opt/local|g
126:debug:patch Executing reinplace: /usr/bin/sed s|__PREFIX__|/opt/local|g < /opt/local/var/macports/build/_opt_local_var_macports_sources_sea.us.rsync.macports.org_release_tarballs_ports_net_dibbler/dibbler/work/dibbler-1.0.0RC1/doc/man/dibbler-relay.8 >@ file10 2>@stderr
127:debug:patch euid/egid changed to: 0/0
128:debug:patch chowned /opt/local/var/macports/build/_opt_local_var_macports_sources_sea.us.rsync.macports.org_release_tarballs_ports_net_dibbler/dibbler/work/dibbler-1.0.0RC1/doc/man/dibbler-relay.8 to macports
129:debug:patch euid/egid changed to: 502/501
130:debug:patch euid/egid changed to: 0/0
131:debug:patch setting attributes on /opt/local/var/macports/build/_opt_local_var_macports_sources_sea.us.rsync.macports.org_release_tarballs_ports_net_dibbler/dibbler/work/dibbler-1.0.0RC1/doc/man/dibbler-relay.8
132:debug:patch euid/egid changed to: 502/501
133:info:patch --->  Patching dibbler-server.8: s|__PREFIX__|/opt/local|g
134:debug:patch Executing reinplace: /usr/bin/sed s|__PREFIX__|/opt/local|g < /opt/local/var/macports/build/_opt_local_var_macports_sources_sea.us.rsync.macports.org_release_tarballs_ports_net_dibbler/dibbler/work/dibbler-1.0.0RC1/doc/man/dibbler-server.8 >@ file10 2>@stderr
135:debug:patch euid/egid changed to: 0/0
136:debug:patch chowned /opt/local/var/macports/build/_opt_local_var_macports_sources_sea.us.rsync.macports.org_release_tarballs_ports_net_dibbler/dibbler/work/dibbler-1.0.0RC1/doc/man/dibbler-server.8 to macports
137:debug:patch euid/egid changed to: 502/501
138:debug:patch euid/egid changed to: 0/0
139:debug:patch setting attributes on /opt/local/var/macports/build/_opt_local_var_macports_sources_sea.us.rsync.macports.org_release_tarballs_ports_net_dibbler/dibbler/work/dibbler-1.0.0RC1/doc/man/dibbler-server.8
140:debug:patch euid/egid changed to: 502/501
141:info:patch --->  Patching server-notify.sh: s|__PREFIX__|/opt/local|g
142:debug:patch Executing reinplace: /usr/bin/sed s|__PREFIX__|/opt/local|g < /opt/local/var/macports/build/_opt_local_var_macports_sources_sea.us.rsync.macports.org_release_tarballs_ports_net_dibbler/dibbler/work/dibbler-1.0.0RC1/scripts/notify-scripts/server-notify.sh >@ file10 2>@stderr
143:debug:patch euid/egid changed to: 0/0
144:debug:patch chowned /opt/local/var/macports/build/_opt_local_var_macports_sources_sea.us.rsync.macports.org_release_tarballs_ports_net_dibbler/dibbler/work/dibbler-1.0.0RC1/scripts/notify-scripts/server-notify.sh to macports
145:debug:patch euid/egid changed to: 502/501
146:debug:patch euid/egid changed to: 0/0
147:debug:patch setting attributes on /opt/local/var/macports/build/_opt_local_var_macports_sources_sea.us.rsync.macports.org_release_tarballs_ports_net_dibbler/dibbler/work/dibbler-1.0.0RC1/scripts/notify-scripts/server-notify.sh
148:debug:patch euid/egid changed to: 502/501
149:debug:patch Privilege de-escalation not attempted as not running as root.
150:debug:configure configure phase started at Mon Aug 15 00:24:54 EDT 2016
151:notice:configure --->  Configuring dibbler
152:debug:configure Using compiler 'Xcode Clang'
153:debug:configure Can't run configure ccache on this port without elevated privileges. Escalating privileges back to root.
154:debug:configure euid changed to: 0. egid changed to: 0.
155:debug:configure changing euid/egid - current euid: 0 - current egid: 0
156:debug:configure egid changed to: 501
157:debug:configure euid changed to: 502
158:debug:configure Executing org.macports.configure (dibbler)
159:debug:configure Environment:
160CC='ccache /usr/bin/clang'
161CC_PRINT_OPTIONS='YES'
162CC_PRINT_OPTIONS_FILE='/opt/local/var/macports/build/_opt_local_var_macports_sources_sea.us.rsync.macports.org_release_tarballs_ports_net_dibbler/dibbler/work/.CC_PRINT_OPTIONS'
163CFLAGS='-pipe -Os -arch x86_64'
164CPATH='/opt/local/include'
165CPPFLAGS='-I/opt/local/include'
166CXX='ccache /usr/bin/clang++'
167CXXFLAGS='-pipe -Os -arch x86_64 -stdlib=libstdc++'
168F77FLAGS='-m64'
169F90FLAGS='-pipe -Os -m64'
170FCFLAGS='-pipe -Os -m64'
171FFLAGS='-pipe -Os'
172INSTALL='/usr/bin/install -c'
173LDFLAGS='-L/opt/local/lib -Wl,-headerpad_max_install_names -arch x86_64'
174LIBRARY_PATH='/opt/local/lib'
175MACOSX_DEPLOYMENT_TARGET='10.11'
176OBJC='ccache /usr/bin/clang'
177OBJCFLAGS='-pipe -Os -arch x86_64'
178OBJCXX='ccache /usr/bin/clang++'
179OBJCXXFLAGS='-pipe -Os -arch x86_64 -stdlib=libstdc++'
180:debug:configure Assembled command: 'cd "/opt/local/var/macports/build/_opt_local_var_macports_sources_sea.us.rsync.macports.org_release_tarballs_ports_net_dibbler/dibbler/work/dibbler-1.0.0RC1" && ./configure --prefix=/opt/local'
181:debug:configure Executing command line:  cd "/opt/local/var/macports/build/_opt_local_var_macports_sources_sea.us.rsync.macports.org_release_tarballs_ports_net_dibbler/dibbler/work/dibbler-1.0.0RC1" && ./configure --prefix=/opt/local
182:info:configure checking for a BSD-compatible install... /usr/bin/install -c
183:info:configure checking whether build environment is sane... yes
184:info:configure checking for a thread-safe mkdir -p... /opt/local/bin/gmkdir -p
185:info:configure checking for gawk... gawk
186:info:configure checking whether make sets $(MAKE)... yes
187:info:configure checking whether make supports nested variables... yes
188:info:configure checking whether to enable maintainer-specific portions of Makefiles... no
189:info:configure checking whether make supports nested variables... (cached) yes
190:info:configure checking whether the C++ compiler works... yes
191:info:configure checking for C++ compiler default output file name... a.out
192:info:configure checking for suffix of executables...
193:info:configure checking whether we are cross compiling... no
194:info:configure checking for suffix of object files... o
195:info:configure checking whether we are using the GNU C++ compiler... yes
196:info:configure checking whether ccache /usr/bin/clang++ accepts -g... yes
197:info:configure checking for style of include used by make... GNU
198:info:configure checking dependency style of ccache /usr/bin/clang++... gcc3
199:info:configure checking for gcc... ccache /usr/bin/clang
200:info:configure checking whether we are using the GNU C compiler... yes
201:info:configure checking whether ccache /usr/bin/clang accepts -g... yes
202:info:configure checking for ccache /usr/bin/clang option to accept ISO C89... none needed
203:info:configure checking dependency style of ccache /usr/bin/clang... gcc3
204:info:configure checking build system type... x86_64-apple-darwin15.6.0
205:info:configure checking host system type... x86_64-apple-darwin15.6.0
206:info:configure checking how to print strings... printf
207:info:configure checking for a sed that does not truncate output... /opt/local/bin/gsed
208:info:configure checking for grep that handles long lines and -e... /opt/local/bin/grep
209:info:configure checking for egrep... /opt/local/bin/grep -E
210:info:configure checking for fgrep... /opt/local/bin/grep -F
211:info:configure checking for ld used by ccache /usr/bin/clang... /Applications/Xcode.app/Contents/Developer/Toolchains/XcodeDefault.xctoolchain/usr/bin/ld
212:info:configure checking if the linker (/Applications/Xcode.app/Contents/Developer/Toolchains/XcodeDefault.xctoolchain/usr/bin/ld) is GNU ld... no
213:info:configure checking for BSD- or MS-compatible name lister (nm)... /usr/bin/nm -B
214:info:configure checking the name lister (/usr/bin/nm -B) interface... BSD nm
215:info:configure checking whether ln -s works... yes
216:info:configure checking the maximum length of command line arguments... 196608
217:info:configure checking whether the shell understands some XSI constructs... yes
218:info:configure checking whether the shell understands "+="... yes
219:info:configure checking how to convert x86_64-apple-darwin15.6.0 file names to x86_64-apple-darwin15.6.0 format... func_convert_file_noop
220:info:configure checking how to convert x86_64-apple-darwin15.6.0 file names to toolchain format... func_convert_file_noop
221:info:configure checking for /Applications/Xcode.app/Contents/Developer/Toolchains/XcodeDefault.xctoolchain/usr/bin/ld option to reload object files... -r
222:info:configure checking for objdump... no
223:info:configure checking how to recognize dependent libraries... pass_all
224:info:configure checking for dlltool... no
225:info:configure checking how to associate runtime and link libraries... printf %s\n
226:info:configure checking for ar... ar
227:info:configure checking for archiver @FILE support... no
228:info:configure checking for strip... strip
229:info:configure checking for ranlib... ranlib
230:info:configure checking command to parse /usr/bin/nm -B output from ccache /usr/bin/clang object... ok
231:info:configure checking for sysroot... no
232:info:configure checking for mt... no
233:info:configure checking if : is a manifest tool... no
234:info:configure checking for dsymutil... dsymutil
235:info:configure checking for nmedit... nmedit
236:info:configure checking for lipo... lipo
237:info:configure checking for otool... otool
238:info:configure checking for otool64... no
239:info:configure checking for -single_module linker flag... yes
240:info:configure checking for -exported_symbols_list linker flag... yes
241:info:configure checking for -force_load linker flag... yes
242:info:configure checking how to run the C preprocessor... ccache /usr/bin/clang -E
243:info:configure checking for ANSI C header files... yes
244:info:configure checking for sys/types.h... yes
245:info:configure checking for sys/stat.h... yes
246:info:configure checking for stdlib.h... yes
247:info:configure checking for string.h... yes
248:info:configure checking for memory.h... yes
249:info:configure checking for strings.h... yes
250:info:configure checking for inttypes.h... yes
251:info:configure checking for stdint.h... yes
252:info:configure checking for unistd.h... yes
253:info:configure checking for dlfcn.h... yes
254:info:configure checking for objdir... .libs
255:info:configure checking if ccache /usr/bin/clang supports -fno-rtti -fno-exceptions... yes
256:info:configure checking for ccache /usr/bin/clang option to produce PIC... -fno-common -DPIC
257:info:configure checking if ccache /usr/bin/clang PIC flag -fno-common -DPIC works... yes
258:info:configure checking if ccache /usr/bin/clang static flag -static works... no
259:info:configure checking if ccache /usr/bin/clang supports -c -o file.o... yes
260:info:configure checking if ccache /usr/bin/clang supports -c -o file.o... (cached) yes
261:info:configure checking whether the ccache /usr/bin/clang linker (/Applications/Xcode.app/Contents/Developer/Toolchains/XcodeDefault.xctoolchain/usr/bin/ld) supports shared libraries... yes
262:info:configure checking dynamic linker characteristics... darwin15.6.0 dyld
263:info:configure checking how to hardcode library paths into programs... immediate
264:info:configure checking whether stripping libraries is possible... yes
265:info:configure checking if libtool supports shared libraries... yes
266:info:configure checking whether to build shared libraries... no
267:info:configure checking whether to build static libraries... yes
268:info:configure checking how to run the C++ preprocessor... ccache /usr/bin/clang++ -E
269:info:configure checking for ld used by ccache /usr/bin/clang++... /Applications/Xcode.app/Contents/Developer/Toolchains/XcodeDefault.xctoolchain/usr/bin/ld
270:info:configure checking if the linker (/Applications/Xcode.app/Contents/Developer/Toolchains/XcodeDefault.xctoolchain/usr/bin/ld) is GNU ld... no
271:info:configure checking whether the ccache /usr/bin/clang++ linker (/Applications/Xcode.app/Contents/Developer/Toolchains/XcodeDefault.xctoolchain/usr/bin/ld) supports shared libraries... yes
272:info:configure checking for ccache /usr/bin/clang++ option to produce PIC... -fno-common -DPIC
273:info:configure checking if ccache /usr/bin/clang++ PIC flag -fno-common -DPIC works... yes
274:info:configure checking if ccache /usr/bin/clang++ static flag -static works... no
275:info:configure checking if ccache /usr/bin/clang++ supports -c -o file.o... yes
276:info:configure checking if ccache /usr/bin/clang++ supports -c -o file.o... (cached) yes
277:info:configure checking whether the ccache /usr/bin/clang++ linker (/Applications/Xcode.app/Contents/Developer/Toolchains/XcodeDefault.xctoolchain/usr/bin/ld) supports shared libraries... yes
278:info:configure checking dynamic linker characteristics... darwin15.6.0 dyld
279:info:configure checking how to hardcode library paths into programs... immediate
280:info:configure checking for strip... (cached) strip
281:info:configure checking for ANSI C header files... (cached) yes
282:info:configure checking for size_t... yes
283:info:configure checking for working alloca.h... yes
284:info:configure checking for alloca... yes
285:info:configure checking arpa/inet.h usability... yes
286:info:configure checking arpa/inet.h presence... yes
287:info:configure checking for arpa/inet.h... yes
288:info:configure checking fcntl.h usability... yes
289:info:configure checking fcntl.h presence... yes
290:info:configure checking for fcntl.h... yes
291:info:configure checking for inttypes.h... (cached) yes
292:info:configure checking limits.h usability... yes
293:info:configure checking limits.h presence... yes
294:info:configure checking for limits.h... yes
295:info:configure checking malloc.h usability... no
296:info:configure checking malloc.h presence... no
297:info:configure checking for malloc.h... no
298:info:configure checking netdb.h usability... yes
299:info:configure checking netdb.h presence... yes
300:info:configure checking for netdb.h... yes
301:info:configure checking netinet/in.h usability... yes
302:info:configure checking netinet/in.h presence... yes
303:info:configure checking for netinet/in.h... yes
304:info:configure checking stddef.h usability... yes
305:info:configure checking stddef.h presence... yes
306:info:configure checking for stddef.h... yes
307:info:configure checking for stdint.h... (cached) yes
308:info:configure checking for stdlib.h... (cached) yes
309:info:configure checking for string.h... (cached) yes
310:info:configure checking sys/ioctl.h usability... yes
311:info:configure checking sys/ioctl.h presence... yes
312:info:configure checking for sys/ioctl.h... yes
313:info:configure checking sys/socket.h usability... yes
314:info:configure checking sys/socket.h presence... yes
315:info:configure checking for sys/socket.h... yes
316:info:configure checking sys/time.h usability... yes
317:info:configure checking sys/time.h presence... yes
318:info:configure checking for sys/time.h... yes
319:info:configure checking syslog.h usability... yes
320:info:configure checking syslog.h presence... yes
321:info:configure checking for syslog.h... yes
322:info:configure checking for unistd.h... (cached) yes
323:info:configure checking wchar.h usability... yes
324:info:configure checking wchar.h presence... yes
325:info:configure checking for wchar.h... yes
326:info:configure checking poll.h usability... yes
327:info:configure checking poll.h presence... yes
328:info:configure checking for poll.h... yes
329:info:configure checking sys/poll.h usability... yes
330:info:configure checking sys/poll.h presence... yes
331:info:configure checking for sys/poll.h... yes
332:info:configure checking winsock2.h usability... no
333:info:configure checking winsock2.h presence... no
334:info:configure checking for winsock2.h... no
335:info:configure checking sys/select.h usability... yes
336:info:configure checking sys/select.h presence... yes
337:info:configure checking for sys/select.h... yes
338:info:configure checking slist usability... no
339:info:configure checking slist presence... no
340:info:configure checking for slist... no
341:info:configure checking ext/slist usability... yes
342:info:configure checking ext/slist presence... no
343:info:configure configure: WARNING: ext/slist: accepted by the compiler, rejected by the preprocessor!
344:info:configure configure: WARNING: ext/slist: proceeding with the compiler's result
345:info:configure checking for ext/slist... yes
346:info:configure checking whether IPV6_PKTINFO is declared... no
347:info:configure checking whether IPV6_RECVPKTINFO is declared... no
348:info:configure checking for stdbool.h that conforms to C99... yes
349:info:configure checking for _Bool... no
350:info:configure checking for inline... inline
351:info:configure checking for int16_t... yes
352:info:configure checking for int32_t... yes
353:info:configure checking for int8_t... yes
354:info:configure checking for pid_t... yes
355:info:configure checking for C/C++ restrict keyword... __restrict
356:info:configure checking for size_t... (cached) yes
357:info:configure checking for ssize_t... yes
358:info:configure checking for uint16_t... yes
359:info:configure checking for uint32_t... yes
360:info:configure checking for uint64_t... yes
361:info:configure checking for uint8_t... yes
362:info:configure checking vfork.h usability... no
363:info:configure checking vfork.h presence... no
364:info:configure checking for vfork.h... no
365:info:configure checking for fork... yes
366:info:configure checking for vfork... yes
367:info:configure checking for working fork... yes
368:info:configure checking for working vfork... (cached) yes
369:info:configure checking for bzero... yes
370:info:configure checking for gethostbyaddr... yes
371:info:configure checking for gethostname... yes
372:info:configure checking for gethostbyname... yes
373:info:configure checking for gettimeofday... yes
374:info:configure checking for inet_ntoa... yes
375:info:configure checking for inet_aton... yes
376:info:configure checking for memchr... yes
377:info:configure checking for memmove... yes
378:info:configure checking for memset... yes
379:info:configure checking for select... yes
380:info:configure checking for socket... yes
381:info:configure checking for strcasecmp... yes
382:info:configure checking for strchr... yes
383:info:configure checking for strdup... yes
384:info:configure checking for strerror... yes
385:info:configure checking for strncasecmp... yes
386:info:configure checking for strstr... yes
387:info:configure checking for strtol... yes
388:info:configure checking for strtoul... yes
389:info:configure checking for vsnprintf... yes
390:info:configure checking for struct sockaddr_in6... yes
391:info:configure checking whether struct sockaddr_in6 has a sin6_len field... yes
392:info:configure checking whether struct sockaddr_storage has a __ss_family field... no
393:info:configure checking for struct sockaddr_storage... yes
394:info:configure checking whether struct sockaddr_in has a sin_len field... yes
395:info:configure checking for socklen_t... yes
396:info:configure checking which port is appropriate for this system... Port-bsd
397:info:configure Link state detection disabled or this is not Linux, NOT adding -lpthreads
398:info:configure checking that generated files are newer than configure... done
399:info:configure configure: creating ./config.status
400:info:configure config.status: creating Makefile
401:info:configure config.status: creating AddrMgr/Makefile
402:info:configure config.status: creating CfgMgr/Makefile
403:info:configure config.status: creating ClntAddrMgr/Makefile
404:info:configure config.status: creating ClntCfgMgr/Makefile
405:info:configure config.status: creating ClntIfaceMgr/Makefile
406:info:configure config.status: creating ClntMessages/Makefile
407:info:configure config.status: creating ClntOptions/Makefile
408:info:configure config.status: creating ClntTransMgr/Makefile
409:info:configure config.status: creating IfaceMgr/Makefile
410:info:configure config.status: creating Messages/Makefile
411:info:configure config.status: creating Misc/Makefile
412:info:configure config.status: creating Options/Makefile
413:info:configure config.status: creating RelCfgMgr/Makefile
414:info:configure config.status: creating RelIfaceMgr/Makefile
415:info:configure config.status: creating RelMessages/Makefile
416:info:configure config.status: creating RelOptions/Makefile
417:info:configure config.status: creating RelTransMgr/Makefile
418:info:configure config.status: creating Requestor/Makefile
419:info:configure config.status: creating SrvAddrMgr/Makefile
420:info:configure config.status: creating SrvCfgMgr/Makefile
421:info:configure config.status: creating SrvIfaceMgr/Makefile
422:info:configure config.status: creating SrvMessages/Makefile
423:info:configure config.status: creating SrvOptions/Makefile
424:info:configure config.status: creating SrvTransMgr/Makefile
425:info:configure config.status: creating poslib/Makefile
426:info:configure config.status: creating nettle/Makefile
427:info:configure config.status: creating Port-bsd/Makefile
428:info:configure config.status: creating Port-linux/Makefile
429:info:configure config.status: creating Port-bsd/Makefile
430:info:configure config.status: creating Port-sun/Makefile
431:info:configure config.status: creating Port-win32/Makefile
432:info:configure config.status: creating Port-winnt2k/Makefile
433:info:configure config.status: creating doc/Makefile
434:info:configure config.status: creating Misc/Portable.h
435:info:configure config.status: creating doc/doxygen.cfg
436:info:configure config.status: creating doc/version.tex
437:info:configure config.status: creating AddrMgr/tests/Makefile
438:info:configure config.status: creating IfaceMgr/tests/Makefile
439:info:configure config.status: creating Options/tests/Makefile
440:info:configure config.status: creating SrvCfgMgr/tests/Makefile
441:info:configure config.status: creating CfgMgr/tests/Makefile
442:info:configure config.status: creating poslib/tests/Makefile
443:info:configure config.status: creating Misc/tests/Makefile
444:info:configure config.status: creating tests/Makefile
445:info:configure config.status: creating tests/Srv/Makefile
446:info:configure config.status: creating tests/utils/Makefile
447:info:configure config.status: creating include/dibbler-config.h
448:info:configure config.status: executing depfiles commands
449:info:configure config.status: executing libtool commands
450:info:configure === configuring in bison++ (/opt/local/var/macports/build/_opt_local_var_macports_sources_sea.us.rsync.macports.org_release_tarballs_ports_net_dibbler/dibbler/work/dibbler-1.0.0RC1/bison++)
451:info:configure configure: running /bin/sh ./configure --disable-option-checking '--prefix=/opt/local'  'CXX=ccache /usr/bin/clang++' 'CXXFLAGS=-pipe -Os -arch x86_64 -stdlib=libstdc++' 'LDFLAGS=-L/opt/local/lib -Wl,-headerpad_max_install_names -arch x86_64' 'CPPFLAGS=-I/opt/local/include' 'CC=ccache /usr/bin/clang' 'CFLAGS=-pipe -Os -arch x86_64' --cache-file=/dev/null --srcdir=.
452:info:configure checking for a BSD-compatible install... /usr/bin/install -c
453:info:configure checking whether build environment is sane... yes
454:info:configure checking for a thread-safe mkdir -p... /opt/local/bin/gmkdir -p
455:info:configure checking for gawk... gawk
456:info:configure checking whether make sets $(MAKE)... yes
457:info:configure checking whether make supports nested variables... yes
458:info:configure checking whether to enable maintainer-specific portions of Makefiles... no
459:info:configure checking for gawk... (cached) gawk
460:info:configure checking whether the C++ compiler works... yes
461:info:configure checking for C++ compiler default output file name... a.out
462:info:configure checking for suffix of executables...
463:info:configure checking whether we are cross compiling... no
464:info:configure checking for suffix of object files... o
465:info:configure checking whether we are using the GNU C++ compiler... yes
466:info:configure checking whether ccache /usr/bin/clang++ accepts -g... yes
467:info:configure checking for style of include used by make... GNU
468:info:configure checking dependency style of ccache /usr/bin/clang++... gcc3
469:info:configure checking for gcc... ccache /usr/bin/clang
470:info:configure checking whether we are using the GNU C compiler... yes
471:info:configure checking whether ccache /usr/bin/clang accepts -g... yes
472:info:configure checking for ccache /usr/bin/clang option to accept ISO C89... none needed
473:info:configure checking dependency style of ccache /usr/bin/clang... gcc3
474:info:configure checking whether ln -s works... yes
475:info:configure checking how to run the C preprocessor... ccache /usr/bin/clang -E
476:info:configure checking for grep that handles long lines and -e... /opt/local/bin/grep
477:info:configure checking for egrep... /opt/local/bin/grep -E
478:info:configure checking for ANSI C header files... yes
479:info:configure checking for sys/types.h... yes
480:info:configure checking for sys/stat.h... yes
481:info:configure checking for stdlib.h... yes
482:info:configure checking for string.h... yes
483:info:configure checking for memory.h... yes
484:info:configure checking for strings.h... yes
485:info:configure checking for inttypes.h... yes
486:info:configure checking for stdint.h... yes
487:info:configure checking for unistd.h... yes
488:info:configure checking alloca.h usability... yes
489:info:configure checking alloca.h presence... yes
490:info:configure checking for alloca.h... yes
491:info:configure checking malloc.h usability... no
492:info:configure checking malloc.h presence... no
493:info:configure checking for malloc.h... no
494:info:configure checking for memory.h... (cached) yes
495:info:configure checking stddef.h usability... yes
496:info:configure checking stddef.h presence... yes
497:info:configure checking for stddef.h... yes
498:info:configure checking for stdlib.h... (cached) yes
499:info:configure checking for string.h... (cached) yes
500:info:configure checking for strings.h... (cached) yes
501:info:configure checking for an ANSI C-conforming const... yes
502:info:configure checking for size_t... yes
503:info:configure checking for working alloca.h... yes
504:info:configure checking for alloca... yes
505:info:configure checking for stdlib.h... (cached) yes
506:info:configure checking for GNU libc compatible malloc... yes
507:info:configure checking that generated files are newer than configure... done
508:info:configure configure: creating ./config.status
509:info:configure config.status: creating Makefile
510:info:configure config.status: executing depfiles commands
511:info:configure
512:info:configure Dibbler version               : 1.0.0RC1
513:info:configure Selected OS port              : Port-bsd
514:info:configure Actual OS                     : Darwin 15.6.0
515:info:configure Debug                         : no
516:info:configure Electric fence                : no
517:info:configure Socket bind reuse             : yes
518:info:configure DNS Update (clnt/srv) disabled: no/no
519:info:configure Authentication disabled       : no
520:info:configure Link-state change detection   : yes
521:info:configure /sbin/resolvconf support      : no
522:info:configure
523:info:configure Experimental features:
524:info:configure Remote autoconfigution        : no
525:info:configure
526:info:configure CFLAGS         : -pipe -Os -arch x86_64
527:info:configure CPPFLAGS       : -O2 -I/opt/local/include -DBSD -Wall -pedantic -funsigned-char -DMOD_CLNT_BIND_REUSE -DMOD_CLNT_CONFIRM
528:info:configure CXXFLAGS       : -pipe -Os -arch x86_64 -stdlib=libstdc++
529:info:configure LDFLAGS        : -L/opt/local/lib -Wl,-headerpad_max_install_names -arch x86_64
530:info:configure
531:info:configure Google test    : no
532:info:configure Type make to compile dibbler.
533:info:configure
534:debug:configure Privilege de-escalation not attempted as not running as root.
535:debug:build build phase started at Mon Aug 15 00:25:12 EDT 2016
536:notice:build --->  Building dibbler
537:debug:build Executing org.macports.build (dibbler)
538:debug:build Environment:
539CC_PRINT_OPTIONS='YES'
540CC_PRINT_OPTIONS_FILE='/opt/local/var/macports/build/_opt_local_var_macports_sources_sea.us.rsync.macports.org_release_tarballs_ports_net_dibbler/dibbler/work/.CC_PRINT_OPTIONS'
541CPATH='/opt/local/include'
542LIBRARY_PATH='/opt/local/lib'
543MACOSX_DEPLOYMENT_TARGET='10.11'
544:debug:build Assembled command: 'cd "/opt/local/var/macports/build/_opt_local_var_macports_sources_sea.us.rsync.macports.org_release_tarballs_ports_net_dibbler/dibbler/work/dibbler-1.0.0RC1" && /usr/bin/make -j8 -w all'
545:debug:build Executing command line:  cd "/opt/local/var/macports/build/_opt_local_var_macports_sources_sea.us.rsync.macports.org_release_tarballs_ports_net_dibbler/dibbler/work/dibbler-1.0.0RC1" && /usr/bin/make -j8 -w all
546:info:build make: Entering directory `/opt/local/var/macports/build/_opt_local_var_macports_sources_sea.us.rsync.macports.org_release_tarballs_ports_net_dibbler/dibbler/work/dibbler-1.0.0RC1'
547:info:build Making all in Port-bsd
548:info:build make[1]: Entering directory `/opt/local/var/macports/build/_opt_local_var_macports_sources_sea.us.rsync.macports.org_release_tarballs_ports_net_dibbler/dibbler/work/dibbler-1.0.0RC1/Port-bsd'
549:info:build ccache /usr/bin/clang++ -DHAVE_CONFIG_H -I. -I../include  -I../Misc -O2 -I/opt/local/include -DBSD -Wall -pedantic -funsigned-char -DMOD_CLNT_BIND_REUSE -DMOD_CLNT_CONFIRM  -pipe -Os -arch x86_64 -stdlib=libstdc++ -MT libLowLevel_a-daemon.o -MD -MP -MF .deps/libLowLevel_a-daemon.Tpo -c -o libLowLevel_a-daemon.o `test -f 'daemon.cpp' || echo './'`daemon.cpp
550:info:build ccache /usr/bin/clang -DHAVE_CONFIG_H -I. -I../include  -I../Misc -O2 -I/opt/local/include -DBSD -Wall -pedantic -funsigned-char -DMOD_CLNT_BIND_REUSE -DMOD_CLNT_CONFIRM -std=c99 -pipe -Os -arch x86_64  -MT libLowLevel_a-lowlevel-bsd.o -MD -MP -MF .deps/libLowLevel_a-lowlevel-bsd.Tpo -c -o libLowLevel_a-lowlevel-bsd.o `test -f 'lowlevel-bsd.c' || echo './'`lowlevel-bsd.c
551:info:build ccache /usr/bin/clang -DHAVE_CONFIG_H -I. -I../include  -I../Misc -O2 -I/opt/local/include -DBSD -Wall -pedantic -funsigned-char -DMOD_CLNT_BIND_REUSE -DMOD_CLNT_CONFIRM -std=c99 -pipe -Os -arch x86_64  -MT libLowLevel_a-lowlevel-options-bsd.o -MD -MP -MF .deps/libLowLevel_a-lowlevel-options-bsd.Tpo -c -o libLowLevel_a-lowlevel-options-bsd.o `test -f 'lowlevel-options-bsd.c' || echo './'`lowlevel-options-bsd.c
552:info:build ccache /usr/bin/clang++ -DHAVE_CONFIG_H -I. -I../include  -I../Misc -O2 -I/opt/local/include -DBSD -Wall -pedantic -funsigned-char -DMOD_CLNT_BIND_REUSE -DMOD_CLNT_CONFIRM  -pipe -Os -arch x86_64 -stdlib=libstdc++ -MT libLowLevel_a-dibbler-client.o -MD -MP -MF .deps/libLowLevel_a-dibbler-client.Tpo -c -o libLowLevel_a-dibbler-client.o `test -f 'dibbler-client.cpp' || echo './'`dibbler-client.cpp
553:info:build ccache /usr/bin/clang++ -DHAVE_CONFIG_H -I. -I../include  -I../Misc -O2 -I/opt/local/include -DBSD -Wall -pedantic -funsigned-char -DMOD_CLNT_BIND_REUSE -DMOD_CLNT_CONFIRM  -pipe -Os -arch x86_64 -stdlib=libstdc++ -MT libLowLevel_a-dibbler-server.o -MD -MP -MF .deps/libLowLevel_a-dibbler-server.Tpo -c -o libLowLevel_a-dibbler-server.o `test -f 'dibbler-server.cpp' || echo './'`dibbler-server.cpp
554:info:build ccache /usr/bin/clang++ -DHAVE_CONFIG_H -I. -I../include  -I../Misc -O2 -I/opt/local/include -DBSD -Wall -pedantic -funsigned-char -DMOD_CLNT_BIND_REUSE -DMOD_CLNT_CONFIRM  -pipe -Os -arch x86_64 -stdlib=libstdc++ -MT libLowLevel_a-dibbler-relay.o -MD -MP -MF .deps/libLowLevel_a-dibbler-relay.Tpo -c -o libLowLevel_a-dibbler-relay.o `test -f 'dibbler-relay.cpp' || echo './'`dibbler-relay.cpp
555:info:build In file included from lowlevel-options-bsd.c:15:
556:info:build ../Misc/Portable.h:323:48: error: expected ')'
557:info:build     uint64_t (__builtin_constant_p(uint64_t n) ? ((__uint64_t)((((__uint64_t)(uint64_t n) & 0xff00000000000000ULL) >> 56) | (((__uint64_t)(uint64_t n) & 0x00ff000000000000ULL) >> 40) | (((__uint64_t)(uint64_t n) & 0x0000ff0000000000ULL) >> 24) | (((__uint64_t)(uint64_t n) & 0x000000ff00000000ULL) >> 8) | (((__uint64_t)(uint64_t n) & 0x00000000ff000000ULL) << 8) | (((__uint64_t)(uint64_t n) & 0x0000000000ff0000ULL) << 24) | (((__uint64_t)(uint64_t n) & 0x000000000000ff00ULL) << 40) | (((__uint64_t)(uint64_t n) & 0x00000000000000ffULL) << 56))) : _OSSwapInt64(uint64_t n));
558:info:build                                                ^
559:info:build ../Misc/Portable.h:323:14: note: to match this '('
560:info:build     uint64_t (__builtin_constant_p(uint64_t n) ? ((__uint64_t)((((__uint64_t)(uint64_t n) & 0xff00000000000000ULL) >> 56) | (((__uint64_t)(uint64_t n) & 0x00ff000000000000ULL) >> 40) | (((__uint64_t)(uint64_t n) & 0x0000ff0000000000ULL) >> 24) | (((__uint64_t)(uint64_t n) & 0x000000ff00000000ULL) >> 8) | (((__uint64_t)(uint64_t n) & 0x00000000ff000000ULL) << 8) | (((__uint64_t)(uint64_t n) & 0x0000000000ff0000ULL) << 24) | (((__uint64_t)(uint64_t n) & 0x000000000000ff00ULL) << 40) | (((__uint64_t)(uint64_t n) & 0x00000000000000ffULL) << 56))) : _OSSwapInt64(uint64_t n));
561:info:build              ^
562:info:build ../Misc/Portable.h:323:15: error: conflicting types for '__builtin_constant_p'
563:info:build     uint64_t (__builtin_constant_p(uint64_t n) ? ((__uint64_t)((((__uint64_t)(uint64_t n) & 0xff00000000000000ULL) >> 56) | (((__uint64_t)(uint64_t n) & 0x00ff000000000000ULL) >> 40) | (((__uint64_t)(uint64_t n) & 0x0000ff0000000000ULL) >> 24) | (((__uint64_t)(uint64_t n) & 0x000000ff00000000ULL) >> 8) | (((__uint64_t)(uint64_t n) & 0x00000000ff000000ULL) << 8) | (((__uint64_t)(uint64_t n) & 0x0000000000ff0000ULL) << 24) | (((__uint64_t)(uint64_t n) & 0x000000000000ff00ULL) << 40) | (((__uint64_t)(uint64_t n) & 0x00000000000000ffULL) << 56))) : _OSSwapInt64(uint64_t n));
564:info:build               ^
565:info:build ../Misc/Portable.h:323:15: note: '__builtin_constant_p' is a builtin with type 'int ()'
566:info:build ../Misc/Portable.h:324:48: error: expected ')'
567:info:build     uint64_t (__builtin_constant_p(uint64_t n) ? ((__uint64_t)((((__uint64_t)(uint64_t n) & 0xff00000000000000ULL) >> 56) | (((__uint64_t)(uint64_t n) & 0x00ff000000000000ULL) >> 40) | (((__uint64_t)(uint64_t n) & 0x0000ff0000000000ULL) >> 24) | (((__uint64_t)(uint64_t n) & 0x000000ff00000000ULL) >> 8) | (((__uint64_t)(uint64_t n) & 0x00000000ff000000ULL) << 8) | (((__uint64_t)(uint64_t n) & 0x0000000000ff0000ULL) << 24) | (((__uint64_t)(uint64_t n) & 0x000000000000ff00ULL) << 40) | (((__uint64_t)(uint64_t n) & 0x00000000000000ffULL) << 56))) : _OSSwapInt64(uint64_t n));
568:info:build                                                ^
569:info:build ../Misc/Portable.h:324:14: note: to match this '('
570:info:build     uint64_t (__builtin_constant_p(uint64_t n) ? ((__uint64_t)((((__uint64_t)(uint64_t n) & 0xff00000000000000ULL) >> 56) | (((__uint64_t)(uint64_t n) & 0x00ff000000000000ULL) >> 40) | (((__uint64_t)(uint64_t n) & 0x0000ff0000000000ULL) >> 24) | (((__uint64_t)(uint64_t n) & 0x000000ff00000000ULL) >> 8) | (((__uint64_t)(uint64_t n) & 0x00000000ff000000ULL) << 8) | (((__uint64_t)(uint64_t n) & 0x0000000000ff0000ULL) << 24) | (((__uint64_t)(uint64_t n) & 0x000000000000ff00ULL) << 40) | (((__uint64_t)(uint64_t n) & 0x00000000000000ffULL) << 56))) : _OSSwapInt64(uint64_t n));
571:info:build              ^
572:info:build ../Misc/Portable.h:324:15: error: conflicting types for '__builtin_constant_p'
573:info:build     uint64_t (__builtin_constant_p(uint64_t n) ? ((__uint64_t)((((__uint64_t)(uint64_t n) & 0xff00000000000000ULL) >> 56) | (((__uint64_t)(uint64_t n) & 0x00ff000000000000ULL) >> 40) | (((__uint64_t)(uint64_t n) & 0x0000ff0000000000ULL) >> 24) | (((__uint64_t)(uint64_t n) & 0x000000ff00000000ULL) >> 8) | (((__uint64_t)(uint64_t n) & 0x00000000ff000000ULL) << 8) | (((__uint64_t)(uint64_t n) & 0x0000000000ff0000ULL) << 24) | (((__uint64_t)(uint64_t n) & 0x000000000000ff00ULL) << 40) | (((__uint64_t)(uint64_t n) & 0x00000000000000ffULL) << 56))) : _OSSwapInt64(uint64_t n));
574:info:build               ^
575:info:build ../Misc/Portable.h:323:15: note: '__builtin_constant_p' is a builtin with type 'int ()'
576:info:build     uint64_t (__builtin_constant_p(uint64_t n) ? ((__uint64_t)((((__uint64_t)(uint64_t n) & 0xff00000000000000ULL) >> 56) | (((__uint64_t)(uint64_t n) & 0x00ff000000000000ULL) >> 40) | (((__uint64_t)(uint64_t n) & 0x0000ff0000000000ULL) >> 24) | (((__uint64_t)(uint64_t n) & 0x000000ff00000000ULL) >> 8) | (((__uint64_t)(uint64_t n) & 0x00000000ff000000ULL) << 8) | (((__uint64_t)(uint64_t n) & 0x0000000000ff0000ULL) << 24) | (((__uint64_t)(uint64_t n) & 0x000000000000ff00ULL) << 40) | (((__uint64_t)(uint64_t n) & 0x00000000000000ffULL) << 56))) : _OSSwapInt64(uint64_t n));
577:info:build               ^
578:info:build 4 errors generated.
579:info:build make[1]: *** [libLowLevel_a-lowlevel-options-bsd.o] Error 1
580:info:build make[1]: *** Waiting for unfinished jobs....
581:info:build In file included from lowlevel-bsd.c:31:
582:info:build ../Misc/Portable.h:323:14: error: expected ')'
583:info:build     uint64_t htonll(uint64_t n);
584:info:build              ^
585:info:build /usr/include/sys/_endian.h:141:25: note: expanded from macro 'htonll'
586:info:build #define htonll(x)       __DARWIN_OSSwapInt64(x)
587:info:build                         ^
588:info:build /usr/include/libkern/_OSByteOrder.h:78:30: note: expanded from macro '__DARWIN_OSSwapInt64'
589:info:build     (__builtin_constant_p(x) ? __DARWIN_OSSwapConstInt64(x) : _OSSwapInt64(x))
590:info:build                              ^
591:info:build ../Misc/Portable.h:323:14: note: to match this '('
592:info:build /usr/include/sys/_endian.h:141:25: note: expanded from macro 'htonll'
593:info:build #define htonll(x)       __DARWIN_OSSwapInt64(x)
594:info:build                         ^
595:info:build /usr/include/libkern/_OSByteOrder.h:78:5: note: expanded from macro '__DARWIN_OSSwapInt64'
596:info:build     (__builtin_constant_p(x) ? __DARWIN_OSSwapConstInt64(x) : _OSSwapInt64(x))
597:info:build     ^
598:info:build In file included from lowlevel-bsd.c:31:
599:info:build ../Misc/Portable.h:323:14: error: conflicting types for '__builtin_constant_p'
600:info:build     uint64_t htonll(uint64_t n);
601:info:build              ^
602:info:build /usr/include/sys/_endian.h:141:25: note: expanded from macro 'htonll'
603:info:build #define htonll(x)       __DARWIN_OSSwapInt64(x)
604:info:build                         ^
605:info:build /usr/include/libkern/_OSByteOrder.h:78:6: note: expanded from macro '__DARWIN_OSSwapInt64'
606:info:build     (__builtin_constant_p(x) ? __DARWIN_OSSwapConstInt64(x) : _OSSwapInt64(x))
607:info:build      ^
608:info:build ../Misc/Portable.h:323:14: note: '__builtin_constant_p' is a builtin with type 'int ()'
609:info:build /usr/include/sys/_endian.h:141:25: note: expanded from macro 'htonll'
610:info:build #define htonll(x)       __DARWIN_OSSwapInt64(x)
611:info:build                         ^
612:info:build /usr/include/libkern/_OSByteOrder.h:78:6: note: expanded from macro '__DARWIN_OSSwapInt64'
613:info:build     (__builtin_constant_p(x) ? __DARWIN_OSSwapConstInt64(x) : _OSSwapInt64(x))
614:info:build      ^
615:info:build In file included from lowlevel-bsd.c:31:
616:info:build ../Misc/Portable.h:324:14: error: expected ')'
617:info:build     uint64_t ntohll(uint64_t n);
618:info:build              ^
619:info:build /usr/include/sys/_endian.h:140:25: note: expanded from macro 'ntohll'
620:info:build #define ntohll(x)       __DARWIN_OSSwapInt64(x)
621:info:build                         ^
622:info:build /usr/include/libkern/_OSByteOrder.h:78:30: note: expanded from macro '__DARWIN_OSSwapInt64'
623:info:build     (__builtin_constant_p(x) ? __DARWIN_OSSwapConstInt64(x) : _OSSwapInt64(x))
624:info:build                              ^
625:info:build ../Misc/Portable.h:324:14: note: to match this '('
626:info:build /usr/include/sys/_endian.h:140:25: note: expanded from macro 'ntohll'
627:info:build #define ntohll(x)       __DARWIN_OSSwapInt64(x)
628:info:build                         ^
629:info:build /usr/include/libkern/_OSByteOrder.h:78:5: note: expanded from macro '__DARWIN_OSSwapInt64'
630:info:build     (__builtin_constant_p(x) ? __DARWIN_OSSwapConstInt64(x) : _OSSwapInt64(x))
631:info:build     ^
632:info:build In file included from lowlevel-bsd.c:31:
633:info:build ../Misc/Portable.h:324:14: error: conflicting types for '__builtin_constant_p'
634:info:build     uint64_t ntohll(uint64_t n);
635:info:build              ^
636:info:build /usr/include/sys/_endian.h:140:25: note: expanded from macro 'ntohll'
637:info:build #define ntohll(x)       __DARWIN_OSSwapInt64(x)
638:info:build                         ^
639:info:build /usr/include/libkern/_OSByteOrder.h:78:6: note: expanded from macro '__DARWIN_OSSwapInt64'
640:info:build     (__builtin_constant_p(x) ? __DARWIN_OSSwapConstInt64(x) : _OSSwapInt64(x))
641:info:build      ^
642:info:build ../Misc/Portable.h:323:14: note: '__builtin_constant_p' is a builtin with type 'int ()'
643:info:build     uint64_t htonll(uint64_t n);
644:info:build              ^
645:info:build /usr/include/sys/_endian.h:141:25: note: expanded from macro 'htonll'
646:info:build #define htonll(x)       __DARWIN_OSSwapInt64(x)
647:info:build                         ^
648:info:build /usr/include/libkern/_OSByteOrder.h:78:6: note: expanded from macro '__DARWIN_OSSwapInt64'
649:info:build     (__builtin_constant_p(x) ? __DARWIN_OSSwapConstInt64(x) : _OSSwapInt64(x))
650:info:build      ^
651:info:build lowlevel-bsd.c:333:2: error: "Both IPV6_RECVPKTINFO and IPV6_PKTINFO not defined. Need at least one of them"
652:info:build #error "Both IPV6_RECVPKTINFO and IPV6_PKTINFO not defined. Need at least one of them"
653:info:build  ^
654:info:build lowlevel-bsd.c:464:64: error: use of undeclared identifier 'IPV6_PKTINFO'
655:info:build         if (cm->cmsg_level != IPPROTO_IPV6 || cm->cmsg_type != IPV6_PKTINFO)
656:info:build                                                                ^
657:info:build 6 errors generated.
658:info:build make[1]: *** [libLowLevel_a-lowlevel-bsd.o] Error 1
659:info:build In file included from dibbler-client.cpp:11:
660:info:build In file included from ../Misc/DHCPClient.h:19:
661:info:build ../Misc/Portable.h:323:48: error: expected ')'
662:info:build     uint64_t (__builtin_constant_p(uint64_t n) ? ((__uint64_t)((((__uint64_t)(uint64_t n) & 0xff00000000000000ULL) >> 56) | (((__uint64_t)(uint64_t n) & 0x00ff000000000000ULL) >> 40) | (((__uint64_t)(uint64_t n) & 0x0000ff0000000000ULL) >> 24) | (((__uint64_t)(uint64_t n) & 0x000000ff00000000ULL) >> 8) | (((__uint64_t)(uint64_t n) & 0x00000000ff000000ULL) << 8) | (((__uint64_t)(uint64_t n) & 0x0000000000ff0000ULL) << 24) | (((__uint64_t)(uint64_t n) & 0x000000000000ff00ULL) << 40) | (((__uint64_t)(uint64_t n) & 0x00000000000000ffULL) << 56))) : _OSSwapInt64(uint64_t n));
663:info:build                                                ^
664:info:build ../Misc/Portable.h:323:14: note: to match this '('
665:info:build     uint64_t (__builtin_constant_p(uint64_t n) ? ((__uint64_t)((((__uint64_t)(uint64_t n) & 0xff00000000000000ULL) >> 56) | (((__uint64_t)(uint64_t n) & 0x00ff000000000000ULL) >> 40) | (((__uint64_t)(uint64_t n) & 0x0000ff0000000000ULL) >> 24) | (((__uint64_t)(uint64_t n) & 0x000000ff00000000ULL) >> 8) | (((__uint64_t)(uint64_t n) & 0x00000000ff000000ULL) << 8) | (((__uint64_t)(uint64_t n) & 0x0000000000ff0000ULL) << 24) | (((__uint64_t)(uint64_t n) & 0x000000000000ff00ULL) << 40) | (((__uint64_t)(uint64_t n) & 0x00000000000000ffULL) << 56))) : _OSSwapInt64(uint64_t n));
666:info:build              ^
667:info:build ../Misc/Portable.h:323:15: error: functions that differ only in their return type cannot be overloaded
668:info:build     uint64_t (__builtin_constant_p(uint64_t n) ? ((__uint64_t)((((__uint64_t)(uint64_t n) & 0xff00000000000000ULL) >> 56) | (((__uint64_t)(uint64_t n) & 0x00ff000000000000ULL) >> 40) | (((__uint64_t)(uint64_t n) & 0x0000ff0000000000ULL) >> 24) | (((__uint64_t)(uint64_t n) & 0x000000ff00000000ULL) >> 8) | (((__uint64_t)(uint64_t n) & 0x00000000ff000000ULL) << 8) | (((__uint64_t)(uint64_t n) & 0x0000000000ff0000ULL) << 24) | (((__uint64_t)(uint64_t n) & 0x000000000000ff00ULL) << 40) | (((__uint64_t)(uint64_t n) & 0x00000000000000ffULL) << 56))) : _OSSwapInt64(uint64_t n));
669:info:build               ^
670:info:build ../Misc/Portable.h:323:15: note: previous implicit declaration is here
671:info:build ../Misc/Portable.h:324:48: error: expected ')'
672:info:build     uint64_t (__builtin_constant_p(uint64_t n) ? ((__uint64_t)((((__uint64_t)(uint64_t n) & 0xff00000000000000ULL) >> 56) | (((__uint64_t)(uint64_t n) & 0x00ff000000000000ULL) >> 40) | (((__uint64_t)(uint64_t n) & 0x0000ff0000000000ULL) >> 24) | (((__uint64_t)(uint64_t n) & 0x000000ff00000000ULL) >> 8) | (((__uint64_t)(uint64_t n) & 0x00000000ff000000ULL) << 8) | (((__uint64_t)(uint64_t n) & 0x0000000000ff0000ULL) << 24) | (((__uint64_t)(uint64_t n) & 0x000000000000ff00ULL) << 40) | (((__uint64_t)(uint64_t n) & 0x00000000000000ffULL) << 56))) : _OSSwapInt64(uint64_t n));
673:info:build                                                ^
674:info:build ../Misc/Portable.h:324:14: note: to match this '('
675:info:build     uint64_t (__builtin_constant_p(uint64_t n) ? ((__uint64_t)((((__uint64_t)(uint64_t n) & 0xff00000000000000ULL) >> 56) | (((__uint64_t)(uint64_t n) & 0x00ff000000000000ULL) >> 40) | (((__uint64_t)(uint64_t n) & 0x0000ff0000000000ULL) >> 24) | (((__uint64_t)(uint64_t n) & 0x000000ff00000000ULL) >> 8) | (((__uint64_t)(uint64_t n) & 0x00000000ff000000ULL) << 8) | (((__uint64_t)(uint64_t n) & 0x0000000000ff0000ULL) << 24) | (((__uint64_t)(uint64_t n) & 0x000000000000ff00ULL) << 40) | (((__uint64_t)(uint64_t n) & 0x00000000000000ffULL) << 56))) : _OSSwapInt64(uint64_t n));
676:info:build              ^
677:info:build ../Misc/Portable.h:324:15: error: functions that differ only in their return type cannot be overloaded
678:info:build     uint64_t (__builtin_constant_p(uint64_t n) ? ((__uint64_t)((((__uint64_t)(uint64_t n) & 0xff00000000000000ULL) >> 56) | (((__uint64_t)(uint64_t n) & 0x00ff000000000000ULL) >> 40) | (((__uint64_t)(uint64_t n) & 0x0000ff0000000000ULL) >> 24) | (((__uint64_t)(uint64_t n) & 0x000000ff00000000ULL) >> 8) | (((__uint64_t)(uint64_t n) & 0x00000000ff000000ULL) << 8) | (((__uint64_t)(uint64_t n) & 0x0000000000ff0000ULL) << 24) | (((__uint64_t)(uint64_t n) & 0x000000000000ff00ULL) << 40) | (((__uint64_t)(uint64_t n) & 0x00000000000000ffULL) << 56))) : _OSSwapInt64(uint64_t n));
679:info:build               ^
680:info:build ../Misc/Portable.h:323:15: note: previous implicit declaration is here
681:info:build     uint64_t (__builtin_constant_p(uint64_t n) ? ((__uint64_t)((((__uint64_t)(uint64_t n) & 0xff00000000000000ULL) >> 56) | (((__uint64_t)(uint64_t n) & 0x00ff000000000000ULL) >> 40) | (((__uint64_t)(uint64_t n) & 0x0000ff0000000000ULL) >> 24) | (((__uint64_t)(uint64_t n) & 0x000000ff00000000ULL) >> 8) | (((__uint64_t)(uint64_t n) & 0x00000000ff000000ULL) << 8) | (((__uint64_t)(uint64_t n) & 0x0000000000ff0000ULL) << 24) | (((__uint64_t)(uint64_t n) & 0x000000000000ff00ULL) << 40) | (((__uint64_t)(uint64_t n) & 0x00000000000000ffULL) << 56))) : _OSSwapInt64(uint64_t n));
682:info:build               ^
683:info:build 4 errors generated.
684:info:build In file included from dibbler-server.cpp:15:
685:info:build ../Misc/Portable.h:323:48: error: expected ')'
686:info:build     uint64_t (__builtin_constant_p(uint64_t n) ? ((__uint64_t)((((__uint64_t)(uint64_t n) & 0xff00000000000000ULL) >> 56) | (((__uint64_t)(uint64_t n) & 0x00ff000000000000ULL) >> 40) | (((__uint64_t)(uint64_t n) & 0x0000ff0000000000ULL) >> 24) | (((__uint64_t)(uint64_t n) & 0x000000ff00000000ULL) >> 8) | (((__uint64_t)(uint64_t n) & 0x00000000ff000000ULL) << 8) | (((__uint64_t)(uint64_t n) & 0x0000000000ff0000ULL) << 24) | (((__uint64_t)(uint64_t n) & 0x000000000000ff00ULL) << 40) | (((__uint64_t)(uint64_t n) & 0x00000000000000ffULL) << 56))) : _OSSwapInt64(uint64_t n));
687:info:build                                                ^
688:info:build ../Misc/Portable.h:323:14: note: to match this '('
689:info:build     uint64_t (__builtin_constant_p(uint64_t n) ? ((__uint64_t)((((__uint64_t)(uint64_t n) & 0xff00000000000000ULL) >> 56) | (((__uint64_t)(uint64_t n) & 0x00ff000000000000ULL) >> 40) | (((__uint64_t)(uint64_t n) & 0x0000ff0000000000ULL) >> 24) | (((__uint64_t)(uint64_t n) & 0x000000ff00000000ULL) >> 8) | (((__uint64_t)(uint64_t n) & 0x00000000ff000000ULL) << 8) | (((__uint64_t)(uint64_t n) & 0x0000000000ff0000ULL) << 24) | (((__uint64_t)(uint64_t n) & 0x000000000000ff00ULL) << 40) | (((__uint64_t)(uint64_t n) & 0x00000000000000ffULL) << 56))) : _OSSwapInt64(uint64_t n));
690:info:build              ^
691:info:build ../Misc/Portable.h:323:15: error: functions that differ only in their return type cannot be overloaded
692:info:build     uint64_t (__builtin_constant_p(uint64_t n) ? ((__uint64_t)((((__uint64_t)(uint64_t n) & 0xff00000000000000ULL) >> 56) | (((__uint64_t)(uint64_t n) & 0x00ff000000000000ULL) >> 40) | (((__uint64_t)(uint64_t n) & 0x0000ff0000000000ULL) >> 24) | (((__uint64_t)(uint64_t n) & 0x000000ff00000000ULL) >> 8) | (((__uint64_t)(uint64_t n) & 0x00000000ff000000ULL) << 8) | (((__uint64_t)(uint64_t n) & 0x0000000000ff0000ULL) << 24) | (((__uint64_t)(uint64_t n) & 0x000000000000ff00ULL) << 40) | (((__uint64_t)(uint64_t n) & 0x00000000000000ffULL) << 56))) : _OSSwapInt64(uint64_t n));
693:info:build               ^
694:info:build ../Misc/Portable.h:323:15: note: previous implicit declaration is here
695:info:build ../Misc/Portable.h:324:48: error: expected ')'
696:info:build     uint64_t (__builtin_constant_p(uint64_t n) ? ((__uint64_t)((((__uint64_t)(uint64_t n) & 0xff00000000000000ULL) >> 56) | (((__uint64_t)(uint64_t n) & 0x00ff000000000000ULL) >> 40) | (((__uint64_t)(uint64_t n) & 0x0000ff0000000000ULL) >> 24) | (((__uint64_t)(uint64_t n) & 0x000000ff00000000ULL) >> 8) | (((__uint64_t)(uint64_t n) & 0x00000000ff000000ULL) << 8) | (((__uint64_t)(uint64_t n) & 0x0000000000ff0000ULL) << 24) | (((__uint64_t)(uint64_t n) & 0x000000000000ff00ULL) << 40) | (((__uint64_t)(uint64_t n) & 0x00000000000000ffULL) << 56))) : _OSSwapInt64(uint64_t n));
697:info:build                                                ^
698:info:build ../Misc/Portable.h:324:14: note: to match this '('
699:info:build     uint64_t (__builtin_constant_p(uint64_t n) ? ((__uint64_t)((((__uint64_t)(uint64_t n) & 0xff00000000000000ULL) >> 56) | (((__uint64_t)(uint64_t n) & 0x00ff000000000000ULL) >> 40) | (((__uint64_t)(uint64_t n) & 0x0000ff0000000000ULL) >> 24) | (((__uint64_t)(uint64_t n) & 0x000000ff00000000ULL) >> 8) | (((__uint64_t)(uint64_t n) & 0x00000000ff000000ULL) << 8) | (((__uint64_t)(uint64_t n) & 0x0000000000ff0000ULL) << 24) | (((__uint64_t)(uint64_t n) & 0x000000000000ff00ULL) << 40) | (((__uint64_t)(uint64_t n) & 0x00000000000000ffULL) << 56))) : _OSSwapInt64(uint64_t n));
700:info:build              ^
701:info:build ../Misc/Portable.h:324:15: error: functions that differ only in their return type cannot be overloaded
702:info:build     uint64_t (__builtin_constant_p(uint64_t n) ? ((__uint64_t)((((__uint64_t)(uint64_t n) & 0xff00000000000000ULL) >> 56) | (((__uint64_t)(uint64_t n) & 0x00ff000000000000ULL) >> 40) | (((__uint64_t)(uint64_t n) & 0x0000ff0000000000ULL) >> 24) | (((__uint64_t)(uint64_t n) & 0x000000ff00000000ULL) >> 8) | (((__uint64_t)(uint64_t n) & 0x00000000ff000000ULL) << 8) | (((__uint64_t)(uint64_t n) & 0x0000000000ff0000ULL) << 24) | (((__uint64_t)(uint64_t n) & 0x000000000000ff00ULL) << 40) | (((__uint64_t)(uint64_t n) & 0x00000000000000ffULL) << 56))) : _OSSwapInt64(uint64_t n));
703:info:build               ^
704:info:build ../Misc/Portable.h:323:15: note: previous implicit declaration is here
705:info:build     uint64_t (__builtin_constant_p(uint64_t n) ? ((__uint64_t)((((__uint64_t)(uint64_t n) & 0xff00000000000000ULL) >> 56) | (((__uint64_t)(uint64_t n) & 0x00ff000000000000ULL) >> 40) | (((__uint64_t)(uint64_t n) & 0x0000ff0000000000ULL) >> 24) | (((__uint64_t)(uint64_t n) & 0x000000ff00000000ULL) >> 8) | (((__uint64_t)(uint64_t n) & 0x00000000ff000000ULL) << 8) | (((__uint64_t)(uint64_t n) & 0x0000000000ff0000ULL) << 24) | (((__uint64_t)(uint64_t n) & 0x000000000000ff00ULL) << 40) | (((__uint64_t)(uint64_t n) & 0x00000000000000ffULL) << 56))) : _OSSwapInt64(uint64_t n));
706:info:build               ^
707:info:build 4 errors generated.
708:info:build In file included from dibbler-relay.cpp:14:
709:info:build ../Misc/Portable.h:323:48: error: expected ')'
710:info:build     uint64_t (__builtin_constant_p(uint64_t n) ? ((__uint64_t)((((__uint64_t)(uint64_t n) & 0xff00000000000000ULL) >> 56) | (((__uint64_t)(uint64_t n) & 0x00ff000000000000ULL) >> 40) | (((__uint64_t)(uint64_t n) & 0x0000ff0000000000ULL) >> 24) | (((__uint64_t)(uint64_t n) & 0x000000ff00000000ULL) >> 8) | (((__uint64_t)(uint64_t n) & 0x00000000ff000000ULL) << 8) | (((__uint64_t)(uint64_t n) & 0x0000000000ff0000ULL) << 24) | (((__uint64_t)(uint64_t n) & 0x000000000000ff00ULL) << 40) | (((__uint64_t)(uint64_t n) & 0x00000000000000ffULL) << 56))) : _OSSwapInt64(uint64_t n));
711:info:build                                                ^
712:info:build ../Misc/Portable.h:323:14: note: to match this '('
713:info:build     uint64_t (__builtin_constant_p(uint64_t n) ? ((__uint64_t)((((__uint64_t)(uint64_t n) & 0xff00000000000000ULL) >> 56) | (((__uint64_t)(uint64_t n) & 0x00ff000000000000ULL) >> 40) | (((__uint64_t)(uint64_t n) & 0x0000ff0000000000ULL) >> 24) | (((__uint64_t)(uint64_t n) & 0x000000ff00000000ULL) >> 8) | (((__uint64_t)(uint64_t n) & 0x00000000ff000000ULL) << 8) | (((__uint64_t)(uint64_t n) & 0x0000000000ff0000ULL) << 24) | (((__uint64_t)(uint64_t n) & 0x000000000000ff00ULL) << 40) | (((__uint64_t)(uint64_t n) & 0x00000000000000ffULL) << 56))) : _OSSwapInt64(uint64_t n));
714:info:build              ^
715:info:build ../Misc/Portable.h:323:15: error: functions that differ only in their return type cannot be overloaded
716:info:build     uint64_t (__builtin_constant_p(uint64_t n) ? ((__uint64_t)((((__uint64_t)(uint64_t n) & 0xff00000000000000ULL) >> 56) | (((__uint64_t)(uint64_t n) & 0x00ff000000000000ULL) >> 40) | (((__uint64_t)(uint64_t n) & 0x0000ff0000000000ULL) >> 24) | (((__uint64_t)(uint64_t n) & 0x000000ff00000000ULL) >> 8) | (((__uint64_t)(uint64_t n) & 0x00000000ff000000ULL) << 8) | (((__uint64_t)(uint64_t n) & 0x0000000000ff0000ULL) << 24) | (((__uint64_t)(uint64_t n) & 0x000000000000ff00ULL) << 40) | (((__uint64_t)(uint64_t n) & 0x00000000000000ffULL) << 56))) : _OSSwapInt64(uint64_t n));
717:info:build               ^
718:info:build ../Misc/Portable.h:323:15: note: previous implicit declaration is here
719:info:build ../Misc/Portable.h:324:48: error: expected ')'
720:info:build     uint64_t (__builtin_constant_p(uint64_t n) ? ((__uint64_t)((((__uint64_t)(uint64_t n) & 0xff00000000000000ULL) >> 56) | (((__uint64_t)(uint64_t n) & 0x00ff000000000000ULL) >> 40) | (((__uint64_t)(uint64_t n) & 0x0000ff0000000000ULL) >> 24) | (((__uint64_t)(uint64_t n) & 0x000000ff00000000ULL) >> 8) | (((__uint64_t)(uint64_t n) & 0x00000000ff000000ULL) << 8) | (((__uint64_t)(uint64_t n) & 0x0000000000ff0000ULL) << 24) | (((__uint64_t)(uint64_t n) & 0x000000000000ff00ULL) << 40) | (((__uint64_t)(uint64_t n) & 0x00000000000000ffULL) << 56))) : _OSSwapInt64(uint64_t n));
721:info:build                                                ^
722:info:build ../Misc/Portable.h:324:14: note: to match this '('
723:info:build     uint64_t (__builtin_constant_p(uint64_t n) ? ((__uint64_t)((((__uint64_t)(uint64_t n) & 0xff00000000000000ULL) >> 56) | (((__uint64_t)(uint64_t n) & 0x00ff000000000000ULL) >> 40) | (((__uint64_t)(uint64_t n) & 0x0000ff0000000000ULL) >> 24) | (((__uint64_t)(uint64_t n) & 0x000000ff00000000ULL) >> 8) | (((__uint64_t)(uint64_t n) & 0x00000000ff000000ULL) << 8) | (((__uint64_t)(uint64_t n) & 0x0000000000ff0000ULL) << 24) | (((__uint64_t)(uint64_t n) & 0x000000000000ff00ULL) << 40) | (((__uint64_t)(uint64_t n) & 0x00000000000000ffULL) << 56))) : _OSSwapInt64(uint64_t n));
724:info:build              ^
725:info:build ../Misc/Portable.h:324:15: error: functions that differ only in their return type cannot be overloaded
726:info:build     uint64_t (__builtin_constant_p(uint64_t n) ? ((__uint64_t)((((__uint64_t)(uint64_t n) & 0xff00000000000000ULL) >> 56) | (((__uint64_t)(uint64_t n) & 0x00ff000000000000ULL) >> 40) | (((__uint64_t)(uint64_t n) & 0x0000ff0000000000ULL) >> 24) | (((__uint64_t)(uint64_t n) & 0x000000ff00000000ULL) >> 8) | (((__uint64_t)(uint64_t n) & 0x00000000ff000000ULL) << 8) | (((__uint64_t)(uint64_t n) & 0x0000000000ff0000ULL) << 24) | (((__uint64_t)(uint64_t n) & 0x000000000000ff00ULL) << 40) | (((__uint64_t)(uint64_t n) & 0x00000000000000ffULL) << 56))) : _OSSwapInt64(uint64_t n));
727:info:build               ^
728:info:build ../Misc/Portable.h:323:15: note: previous implicit declaration is here
729:info:build     uint64_t (__builtin_constant_p(uint64_t n) ? ((__uint64_t)((((__uint64_t)(uint64_t n) & 0xff00000000000000ULL) >> 56) | (((__uint64_t)(uint64_t n) & 0x00ff000000000000ULL) >> 40) | (((__uint64_t)(uint64_t n) & 0x0000ff0000000000ULL) >> 24) | (((__uint64_t)(uint64_t n) & 0x000000ff00000000ULL) >> 8) | (((__uint64_t)(uint64_t n) & 0x00000000ff000000ULL) << 8) | (((__uint64_t)(uint64_t n) & 0x0000000000ff0000ULL) << 24) | (((__uint64_t)(uint64_t n) & 0x000000000000ff00ULL) << 40) | (((__uint64_t)(uint64_t n) & 0x00000000000000ffULL) << 56))) : _OSSwapInt64(uint64_t n));
730:info:build               ^
731:info:build 4 errors generated.
732:info:build make[1]: *** [libLowLevel_a-dibbler-client.o] Error 1
733:info:build make[1]: *** [libLowLevel_a-dibbler-relay.o] Error 1
734:info:build make[1]: *** [libLowLevel_a-dibbler-server.o] Error 1
735:info:build In file included from daemon.cpp:18:
736:info:build ../Misc/Portable.h:323:48: error: expected ')'
737:info:build     uint64_t (__builtin_constant_p(uint64_t n) ? ((__uint64_t)((((__uint64_t)(uint64_t n) & 0xff00000000000000ULL) >> 56) | (((__uint64_t)(uint64_t n) & 0x00ff000000000000ULL) >> 40) | (((__uint64_t)(uint64_t n) & 0x0000ff0000000000ULL) >> 24) | (((__uint64_t)(uint64_t n) & 0x000000ff00000000ULL) >> 8) | (((__uint64_t)(uint64_t n) & 0x00000000ff000000ULL) << 8) | (((__uint64_t)(uint64_t n) & 0x0000000000ff0000ULL) << 24) | (((__uint64_t)(uint64_t n) & 0x000000000000ff00ULL) << 40) | (((__uint64_t)(uint64_t n) & 0x00000000000000ffULL) << 56))) : _OSSwapInt64(uint64_t n));
738:info:build                                                ^
739:info:build ../Misc/Portable.h:323:14: note: to match this '('
740:info:build     uint64_t (__builtin_constant_p(uint64_t n) ? ((__uint64_t)((((__uint64_t)(uint64_t n) & 0xff00000000000000ULL) >> 56) | (((__uint64_t)(uint64_t n) & 0x00ff000000000000ULL) >> 40) | (((__uint64_t)(uint64_t n) & 0x0000ff0000000000ULL) >> 24) | (((__uint64_t)(uint64_t n) & 0x000000ff00000000ULL) >> 8) | (((__uint64_t)(uint64_t n) & 0x00000000ff000000ULL) << 8) | (((__uint64_t)(uint64_t n) & 0x0000000000ff0000ULL) << 24) | (((__uint64_t)(uint64_t n) & 0x000000000000ff00ULL) << 40) | (((__uint64_t)(uint64_t n) & 0x00000000000000ffULL) << 56))) : _OSSwapInt64(uint64_t n));
741:info:build              ^
742:info:build ../Misc/Portable.h:323:15: error: functions that differ only in their return type cannot be overloaded
743:info:build     uint64_t (__builtin_constant_p(uint64_t n) ? ((__uint64_t)((((__uint64_t)(uint64_t n) & 0xff00000000000000ULL) >> 56) | (((__uint64_t)(uint64_t n) & 0x00ff000000000000ULL) >> 40) | (((__uint64_t)(uint64_t n) & 0x0000ff0000000000ULL) >> 24) | (((__uint64_t)(uint64_t n) & 0x000000ff00000000ULL) >> 8) | (((__uint64_t)(uint64_t n) & 0x00000000ff000000ULL) << 8) | (((__uint64_t)(uint64_t n) & 0x0000000000ff0000ULL) << 24) | (((__uint64_t)(uint64_t n) & 0x000000000000ff00ULL) << 40) | (((__uint64_t)(uint64_t n) & 0x00000000000000ffULL) << 56))) : _OSSwapInt64(uint64_t n));
744:info:build               ^
745:info:build ../Misc/Portable.h:323:15: note: previous implicit declaration is here
746:info:build ../Misc/Portable.h:324:48: error: expected ')'
747:info:build     uint64_t (__builtin_constant_p(uint64_t n) ? ((__uint64_t)((((__uint64_t)(uint64_t n) & 0xff00000000000000ULL) >> 56) | (((__uint64_t)(uint64_t n) & 0x00ff000000000000ULL) >> 40) | (((__uint64_t)(uint64_t n) & 0x0000ff0000000000ULL) >> 24) | (((__uint64_t)(uint64_t n) & 0x000000ff00000000ULL) >> 8) | (((__uint64_t)(uint64_t n) & 0x00000000ff000000ULL) << 8) | (((__uint64_t)(uint64_t n) & 0x0000000000ff0000ULL) << 24) | (((__uint64_t)(uint64_t n) & 0x000000000000ff00ULL) << 40) | (((__uint64_t)(uint64_t n) & 0x00000000000000ffULL) << 56))) : _OSSwapInt64(uint64_t n));
748:info:build                                                ^
749:info:build ../Misc/Portable.h:324:14: note: to match this '('
750:info:build     uint64_t (__builtin_constant_p(uint64_t n) ? ((__uint64_t)((((__uint64_t)(uint64_t n) & 0xff00000000000000ULL) >> 56) | (((__uint64_t)(uint64_t n) & 0x00ff000000000000ULL) >> 40) | (((__uint64_t)(uint64_t n) & 0x0000ff0000000000ULL) >> 24) | (((__uint64_t)(uint64_t n) & 0x000000ff00000000ULL) >> 8) | (((__uint64_t)(uint64_t n) & 0x00000000ff000000ULL) << 8) | (((__uint64_t)(uint64_t n) & 0x0000000000ff0000ULL) << 24) | (((__uint64_t)(uint64_t n) & 0x000000000000ff00ULL) << 40) | (((__uint64_t)(uint64_t n) & 0x00000000000000ffULL) << 56))) : _OSSwapInt64(uint64_t n));
751:info:build              ^
752:info:build ../Misc/Portable.h:324:15: error: functions that differ only in their return type cannot be overloaded
753:info:build     uint64_t (__builtin_constant_p(uint64_t n) ? ((__uint64_t)((((__uint64_t)(uint64_t n) & 0xff00000000000000ULL) >> 56) | (((__uint64_t)(uint64_t n) & 0x00ff000000000000ULL) >> 40) | (((__uint64_t)(uint64_t n) & 0x0000ff0000000000ULL) >> 24) | (((__uint64_t)(uint64_t n) & 0x000000ff00000000ULL) >> 8) | (((__uint64_t)(uint64_t n) & 0x00000000ff000000ULL) << 8) | (((__uint64_t)(uint64_t n) & 0x0000000000ff0000ULL) << 24) | (((__uint64_t)(uint64_t n) & 0x000000000000ff00ULL) << 40) | (((__uint64_t)(uint64_t n) & 0x00000000000000ffULL) << 56))) : _OSSwapInt64(uint64_t n));
754:info:build               ^
755:info:build ../Misc/Portable.h:323:15: note: previous implicit declaration is here
756:info:build     uint64_t (__builtin_constant_p(uint64_t n) ? ((__uint64_t)((((__uint64_t)(uint64_t n) & 0xff00000000000000ULL) >> 56) | (((__uint64_t)(uint64_t n) & 0x00ff000000000000ULL) >> 40) | (((__uint64_t)(uint64_t n) & 0x0000ff0000000000ULL) >> 24) | (((__uint64_t)(uint64_t n) & 0x000000ff00000000ULL) >> 8) | (((__uint64_t)(uint64_t n) & 0x00000000ff000000ULL) << 8) | (((__uint64_t)(uint64_t n) & 0x0000000000ff0000ULL) << 24) | (((__uint64_t)(uint64_t n) & 0x000000000000ff00ULL) << 40) | (((__uint64_t)(uint64_t n) & 0x00000000000000ffULL) << 56))) : _OSSwapInt64(uint64_t n));
757:info:build               ^
758:info:build 4 errors generated.
759:info:build make[1]: *** [libLowLevel_a-daemon.o] Error 1
760:info:build make[1]: Leaving directory `/opt/local/var/macports/build/_opt_local_var_macports_sources_sea.us.rsync.macports.org_release_tarballs_ports_net_dibbler/dibbler/work/dibbler-1.0.0RC1/Port-bsd'
761:info:build make: *** [all-recursive] Error 1
762:info:build make: Leaving directory `/opt/local/var/macports/build/_opt_local_var_macports_sources_sea.us.rsync.macports.org_release_tarballs_ports_net_dibbler/dibbler/work/dibbler-1.0.0RC1'
763:info:build Command failed:  cd "/opt/local/var/macports/build/_opt_local_var_macports_sources_sea.us.rsync.macports.org_release_tarballs_ports_net_dibbler/dibbler/work/dibbler-1.0.0RC1" && /usr/bin/make -j8 -w all
764:info:build Exit code: 2
765:error:build org.macports.build for port dibbler returned: command execution failed
766:debug:build Error code: CHILDSTATUS 74017 2
767:debug:build Backtrace: command execution failed
768    while executing
769"system -nice 0 $fullcmdstring"
770    ("eval" body line 1)
771    invoked from within
772"eval system $notty $nice \$fullcmdstring"
773    invoked from within
774"command_exec build"
775    (procedure "portbuild::build_main" line 8)
776    invoked from within
777"portbuild::build_main org.macports.build"
778    ("eval" body line 1)
779    invoked from within
780"eval $procedure $targetname"
781:info:build Warning: targets not executed for dibbler: org.macports.activate org.macports.build org.macports.destroot org.macports.install
782:notice:build Please see the log file for port dibbler for details:
783    /opt/local/var/macports/logs/_opt_local_var_macports_sources_sea.us.rsync.macports.org_release_tarballs_ports_net_dibbler/dibbler/main.log
784sh-3.2#