Ticket #52119: main.log

File main.log, 30.1 KB (added by macports@…, 4 years ago)
Line 
1version:1
2:msg:main --->  Computing dependencies for gr-osmosdr:info:main .:debug:main gr-osmosdr has no conflicts
3:debug:main Searching for dependency: cmake
4:debug:main Found Dependency: receipt exists for cmake
5:debug:main Searching for dependency: doxygen
6:debug:main Found Dependency: receipt exists for doxygen
7:debug:main Searching for dependency: graphviz
8:debug:main Found Dependency: receipt exists for graphviz
9:debug:main Searching for dependency: gnuradio
10:debug:main Found Dependency: receipt exists for gnuradio
11:debug:main Searching for dependency: python27
12:debug:main Found Dependency: receipt exists for python27
13:debug:main Searching for dependency: uhd
14:debug:main Found Dependency: receipt exists for uhd
15:debug:main Searching for dependency: swig-python
16:debug:main Found Dependency: receipt exists for swig-python
17:debug:main Searching for dependency: hackrf
18:debug:main Found Dependency: receipt exists for hackrf
19:debug:main Searching for dependency: gr-fcdproplus
20:debug:main Found Dependency: receipt exists for gr-fcdproplus
21:debug:main Searching for dependency: rtl-sdr
22:debug:main Found Dependency: receipt exists for rtl-sdr
23:debug:main Searching for dependency: bladeRF
24:debug:main Found Dependency: receipt exists for bladeRF
25:debug:main Searching for dependency: airspy
26:debug:main Found Dependency: receipt exists for airspy
27:debug:main Searching for dependency: soapysdr
28:debug:main Found Dependency: receipt exists for soapysdr
29:debug:main Searching for dependency: sdrplay
30:debug:main Found Dependency: receipt exists for sdrplay
31:msg:main
32:debug:main Executing org.macports.main (gr-osmosdr)
33:debug:main changing euid/egid - current euid: 0 - current egid: 0
34:debug:main egid changed to: 501
35:debug:main euid changed to: 503
36:debug:main Skipping completed org.macports.archivefetch (gr-osmosdr)
37:debug:main Privilege de-escalation not attempted as not running as root.
38:debug:main Skipping completed org.macports.fetch (gr-osmosdr)
39:debug:main Privilege de-escalation not attempted as not running as root.
40:debug:main Skipping completed org.macports.checksum (gr-osmosdr)
41:debug:main Privilege de-escalation not attempted as not running as root.
42:debug:main Skipping completed org.macports.extract (gr-osmosdr)
43:debug:main Privilege de-escalation not attempted as not running as root.
44:debug:main Skipping completed org.macports.patch (gr-osmosdr)
45:debug:main Privilege de-escalation not attempted as not running as root.
46:debug:main Skipping completed org.macports.configure (gr-osmosdr)
47:debug:main Privilege de-escalation not attempted as not running as root.
48:debug:build build phase started at Sat Aug 27 16:18:03 CDT 2016
49:notice:build --->  Building gr-osmosdr
50:debug:build Executing org.macports.build (gr-osmosdr)
51:debug:build Environment:
52CC_PRINT_OPTIONS='YES'
53CC_PRINT_OPTIONS_FILE='/opt/local/var/macports/build/_opt_local_var_macports_sources_rsync.macports.org_release_tarballs_ports_science_gr-osmosdr/gr-osmosdr/work/.CC_PRINT_OPTIONS'
54CPATH='/opt/local/include'
55LIBRARY_PATH='/opt/local/lib'
56MACOSX_DEPLOYMENT_TARGET='10.11'
57:debug:build Assembled command: 'cd "/opt/local/var/macports/build/_opt_local_var_macports_sources_rsync.macports.org_release_tarballs_ports_science_gr-osmosdr/gr-osmosdr/work/build" && /usr/bin/make -j4 -w all VERBOSE=ON'
58:debug:build Executing command line:  cd "/opt/local/var/macports/build/_opt_local_var_macports_sources_rsync.macports.org_release_tarballs_ports_science_gr-osmosdr/gr-osmosdr/work/build" && /usr/bin/make -j4 -w all VERBOSE=ON
59:info:build make: Entering directory `/opt/local/var/macports/build/_opt_local_var_macports_sources_rsync.macports.org_release_tarballs_ports_science_gr-osmosdr/gr-osmosdr/work/build'
60:info:build /opt/local/bin/cmake -H/opt/local/var/macports/build/_opt_local_var_macports_sources_rsync.macports.org_release_tarballs_ports_science_gr-osmosdr/gr-osmosdr/work/gr-osmosdr-164a09fc11cec2d8b15b38e8b512fa542d6cecc7 -B/opt/local/var/macports/build/_opt_local_var_macports_sources_rsync.macports.org_release_tarballs_ports_science_gr-osmosdr/gr-osmosdr/work/build --check-build-system CMakeFiles/Makefile.cmake 0
61:info:build /opt/local/bin/cmake -E cmake_progress_start /opt/local/var/macports/build/_opt_local_var_macports_sources_rsync.macports.org_release_tarballs_ports_science_gr-osmosdr/gr-osmosdr/work/build/CMakeFiles /opt/local/var/macports/build/_opt_local_var_macports_sources_rsync.macports.org_release_tarballs_ports_science_gr-osmosdr/gr-osmosdr/work/build/CMakeFiles/progress.marks
62:info:build /Applications/Xcode.app/Contents/Developer/usr/bin/make -f CMakeFiles/Makefile2 all
63:info:build make[1]: Entering directory `/opt/local/var/macports/build/_opt_local_var_macports_sources_rsync.macports.org_release_tarballs_ports_science_gr-osmosdr/gr-osmosdr/work/build'
64:info:build /Applications/Xcode.app/Contents/Developer/usr/bin/make -f lib/CMakeFiles/gnuradio-osmosdr.dir/build.make lib/CMakeFiles/gnuradio-osmosdr.dir/depend
65:info:build /Applications/Xcode.app/Contents/Developer/usr/bin/make -f swig/CMakeFiles/osmosdr_swig_swig_doc.dir/build.make swig/CMakeFiles/osmosdr_swig_swig_doc.dir/depend
66:info:build /Applications/Xcode.app/Contents/Developer/usr/bin/make -f python/CMakeFiles/pygen_python_48b12.dir/build.make python/CMakeFiles/pygen_python_48b12.dir/depend
67:info:build /Applications/Xcode.app/Contents/Developer/usr/bin/make -f grc/CMakeFiles/osmosdr_grc_xml_blocks.dir/build.make grc/CMakeFiles/osmosdr_grc_xml_blocks.dir/depend
68:info:build make[2]: Entering directory `/opt/local/var/macports/build/_opt_local_var_macports_sources_rsync.macports.org_release_tarballs_ports_science_gr-osmosdr/gr-osmosdr/work/build'
69:info:build cd /opt/local/var/macports/build/_opt_local_var_macports_sources_rsync.macports.org_release_tarballs_ports_science_gr-osmosdr/gr-osmosdr/work/build && /opt/local/bin/cmake -E cmake_depends "Unix Makefiles" /opt/local/var/macports/build/_opt_local_var_macports_sources_rsync.macports.org_release_tarballs_ports_science_gr-osmosdr/gr-osmosdr/work/gr-osmosdr-164a09fc11cec2d8b15b38e8b512fa542d6cecc7 /opt/local/var/macports/build/_opt_local_var_macports_sources_rsync.macports.org_release_tarballs_ports_science_gr-osmosdr/gr-osmosdr/work/gr-osmosdr-164a09fc11cec2d8b15b38e8b512fa542d6cecc7/swig /opt/local/var/macports/build/_opt_local_var_macports_sources_rsync.macports.org_release_tarballs_ports_science_gr-osmosdr/gr-osmosdr/work/build /opt/local/var/macports/build/_opt_local_var_macports_sources_rsync.macports.org_release_tarballs_ports_science_gr-osmosdr/gr-osmosdr/work/build/swig /opt/local/var/macports/build/_opt_local_var_macports_sources_rsync.macports.org_release_tarballs_ports_science_gr-osmosdr/gr-osmosdr/work/build/swig/CMakeFiles/osmosdr_swig_swig_doc.dir/DependInfo.cmake --color=
70:info:build make[2]: Entering directory `/opt/local/var/macports/build/_opt_local_var_macports_sources_rsync.macports.org_release_tarballs_ports_science_gr-osmosdr/gr-osmosdr/work/build'
71:info:build cd /opt/local/var/macports/build/_opt_local_var_macports_sources_rsync.macports.org_release_tarballs_ports_science_gr-osmosdr/gr-osmosdr/work/build && /opt/local/bin/cmake -E cmake_depends "Unix Makefiles" /opt/local/var/macports/build/_opt_local_var_macports_sources_rsync.macports.org_release_tarballs_ports_science_gr-osmosdr/gr-osmosdr/work/gr-osmosdr-164a09fc11cec2d8b15b38e8b512fa542d6cecc7 /opt/local/var/macports/build/_opt_local_var_macports_sources_rsync.macports.org_release_tarballs_ports_science_gr-osmosdr/gr-osmosdr/work/gr-osmosdr-164a09fc11cec2d8b15b38e8b512fa542d6cecc7/python /opt/local/var/macports/build/_opt_local_var_macports_sources_rsync.macports.org_release_tarballs_ports_science_gr-osmosdr/gr-osmosdr/work/build /opt/local/var/macports/build/_opt_local_var_macports_sources_rsync.macports.org_release_tarballs_ports_science_gr-osmosdr/gr-osmosdr/work/build/python /opt/local/var/macports/build/_opt_local_var_macports_sources_rsync.macports.org_release_tarballs_ports_science_gr-osmosdr/gr-osmosdr/work/build/python/CMakeFiles/pygen_python_48b12.dir/DependInfo.cmake --color=
72:info:build make[2]: Entering directory `/opt/local/var/macports/build/_opt_local_var_macports_sources_rsync.macports.org_release_tarballs_ports_science_gr-osmosdr/gr-osmosdr/work/build'
73:info:build cd /opt/local/var/macports/build/_opt_local_var_macports_sources_rsync.macports.org_release_tarballs_ports_science_gr-osmosdr/gr-osmosdr/work/build && /opt/local/bin/cmake -E cmake_depends "Unix Makefiles" /opt/local/var/macports/build/_opt_local_var_macports_sources_rsync.macports.org_release_tarballs_ports_science_gr-osmosdr/gr-osmosdr/work/gr-osmosdr-164a09fc11cec2d8b15b38e8b512fa542d6cecc7 /opt/local/var/macports/build/_opt_local_var_macports_sources_rsync.macports.org_release_tarballs_ports_science_gr-osmosdr/gr-osmosdr/work/gr-osmosdr-164a09fc11cec2d8b15b38e8b512fa542d6cecc7/grc /opt/local/var/macports/build/_opt_local_var_macports_sources_rsync.macports.org_release_tarballs_ports_science_gr-osmosdr/gr-osmosdr/work/build /opt/local/var/macports/build/_opt_local_var_macports_sources_rsync.macports.org_release_tarballs_ports_science_gr-osmosdr/gr-osmosdr/work/build/grc /opt/local/var/macports/build/_opt_local_var_macports_sources_rsync.macports.org_release_tarballs_ports_science_gr-osmosdr/gr-osmosdr/work/build/grc/CMakeFiles/osmosdr_grc_xml_blocks.dir/DependInfo.cmake --color=
74:info:build make[2]: Leaving directory `/opt/local/var/macports/build/_opt_local_var_macports_sources_rsync.macports.org_release_tarballs_ports_science_gr-osmosdr/gr-osmosdr/work/build'
75:info:build /Applications/Xcode.app/Contents/Developer/usr/bin/make -f swig/CMakeFiles/osmosdr_swig_swig_doc.dir/build.make swig/CMakeFiles/osmosdr_swig_swig_doc.dir/build
76:info:build make[2]: Leaving directory `/opt/local/var/macports/build/_opt_local_var_macports_sources_rsync.macports.org_release_tarballs_ports_science_gr-osmosdr/gr-osmosdr/work/build'
77:info:build /Applications/Xcode.app/Contents/Developer/usr/bin/make -f python/CMakeFiles/pygen_python_48b12.dir/build.make python/CMakeFiles/pygen_python_48b12.dir/build
78:info:build make[2]: Leaving directory `/opt/local/var/macports/build/_opt_local_var_macports_sources_rsync.macports.org_release_tarballs_ports_science_gr-osmosdr/gr-osmosdr/work/build'
79:info:build /Applications/Xcode.app/Contents/Developer/usr/bin/make -f grc/CMakeFiles/osmosdr_grc_xml_blocks.dir/build.make grc/CMakeFiles/osmosdr_grc_xml_blocks.dir/build
80:info:build make[2]: Entering directory `/opt/local/var/macports/build/_opt_local_var_macports_sources_rsync.macports.org_release_tarballs_ports_science_gr-osmosdr/gr-osmosdr/work/build'
81:info:build make[2]: Nothing to be done for `swig/CMakeFiles/osmosdr_swig_swig_doc.dir/build'.
82:info:build make[2]: Leaving directory `/opt/local/var/macports/build/_opt_local_var_macports_sources_rsync.macports.org_release_tarballs_ports_science_gr-osmosdr/gr-osmosdr/work/build'
83:info:build make[2]: Entering directory `/opt/local/var/macports/build/_opt_local_var_macports_sources_rsync.macports.org_release_tarballs_ports_science_gr-osmosdr/gr-osmosdr/work/build'
84:info:build make[2]: Nothing to be done for `python/CMakeFiles/pygen_python_48b12.dir/build'.
85:info:build make[2]: Leaving directory `/opt/local/var/macports/build/_opt_local_var_macports_sources_rsync.macports.org_release_tarballs_ports_science_gr-osmosdr/gr-osmosdr/work/build'
86:info:build make[2]: Entering directory `/opt/local/var/macports/build/_opt_local_var_macports_sources_rsync.macports.org_release_tarballs_ports_science_gr-osmosdr/gr-osmosdr/work/build'
87:info:build make[2]: Nothing to be done for `grc/CMakeFiles/osmosdr_grc_xml_blocks.dir/build'.
88:info:build make[2]: Leaving directory `/opt/local/var/macports/build/_opt_local_var_macports_sources_rsync.macports.org_release_tarballs_ports_science_gr-osmosdr/gr-osmosdr/work/build'
89:info:build [  0%] Built target osmosdr_swig_swig_doc
90:info:build /Applications/Xcode.app/Contents/Developer/usr/bin/make -f apps/CMakeFiles/pygen_apps_c7833.dir/build.make apps/CMakeFiles/pygen_apps_c7833.dir/depend
91:info:build [  4%] Built target pygen_python_48b12
92:info:build /Applications/Xcode.app/Contents/Developer/usr/bin/make -f apps/CMakeFiles/pygen_apps_f9b37.dir/build.make apps/CMakeFiles/pygen_apps_f9b37.dir/depend
93:info:build [ 10%] Built target osmosdr_grc_xml_blocks
94:info:build /Applications/Xcode.app/Contents/Developer/usr/bin/make -f swig/CMakeFiles/_osmosdr_swig_swig_tag.dir/build.make swig/CMakeFiles/_osmosdr_swig_swig_tag.dir/depend
95:info:build make[2]: Entering directory `/opt/local/var/macports/build/_opt_local_var_macports_sources_rsync.macports.org_release_tarballs_ports_science_gr-osmosdr/gr-osmosdr/work/build'
96:info:build cd /opt/local/var/macports/build/_opt_local_var_macports_sources_rsync.macports.org_release_tarballs_ports_science_gr-osmosdr/gr-osmosdr/work/build && /opt/local/bin/cmake -E cmake_depends "Unix Makefiles" /opt/local/var/macports/build/_opt_local_var_macports_sources_rsync.macports.org_release_tarballs_ports_science_gr-osmosdr/gr-osmosdr/work/gr-osmosdr-164a09fc11cec2d8b15b38e8b512fa542d6cecc7 /opt/local/var/macports/build/_opt_local_var_macports_sources_rsync.macports.org_release_tarballs_ports_science_gr-osmosdr/gr-osmosdr/work/gr-osmosdr-164a09fc11cec2d8b15b38e8b512fa542d6cecc7/apps /opt/local/var/macports/build/_opt_local_var_macports_sources_rsync.macports.org_release_tarballs_ports_science_gr-osmosdr/gr-osmosdr/work/build /opt/local/var/macports/build/_opt_local_var_macports_sources_rsync.macports.org_release_tarballs_ports_science_gr-osmosdr/gr-osmosdr/work/build/apps /opt/local/var/macports/build/_opt_local_var_macports_sources_rsync.macports.org_release_tarballs_ports_science_gr-osmosdr/gr-osmosdr/work/build/apps/CMakeFiles/pygen_apps_c7833.dir/DependInfo.cmake --color=
97:info:build make[2]: Entering directory `/opt/local/var/macports/build/_opt_local_var_macports_sources_rsync.macports.org_release_tarballs_ports_science_gr-osmosdr/gr-osmosdr/work/build'
98:info:build cd /opt/local/var/macports/build/_opt_local_var_macports_sources_rsync.macports.org_release_tarballs_ports_science_gr-osmosdr/gr-osmosdr/work/build && /opt/local/bin/cmake -E cmake_depends "Unix Makefiles" /opt/local/var/macports/build/_opt_local_var_macports_sources_rsync.macports.org_release_tarballs_ports_science_gr-osmosdr/gr-osmosdr/work/gr-osmosdr-164a09fc11cec2d8b15b38e8b512fa542d6cecc7 /opt/local/var/macports/build/_opt_local_var_macports_sources_rsync.macports.org_release_tarballs_ports_science_gr-osmosdr/gr-osmosdr/work/gr-osmosdr-164a09fc11cec2d8b15b38e8b512fa542d6cecc7/apps /opt/local/var/macports/build/_opt_local_var_macports_sources_rsync.macports.org_release_tarballs_ports_science_gr-osmosdr/gr-osmosdr/work/build /opt/local/var/macports/build/_opt_local_var_macports_sources_rsync.macports.org_release_tarballs_ports_science_gr-osmosdr/gr-osmosdr/work/build/apps /opt/local/var/macports/build/_opt_local_var_macports_sources_rsync.macports.org_release_tarballs_ports_science_gr-osmosdr/gr-osmosdr/work/build/apps/CMakeFiles/pygen_apps_f9b37.dir/DependInfo.cmake --color=
99:info:build make[2]: Entering directory `/opt/local/var/macports/build/_opt_local_var_macports_sources_rsync.macports.org_release_tarballs_ports_science_gr-osmosdr/gr-osmosdr/work/build'
100:info:build cd /opt/local/var/macports/build/_opt_local_var_macports_sources_rsync.macports.org_release_tarballs_ports_science_gr-osmosdr/gr-osmosdr/work/build && /opt/local/bin/cmake -E cmake_depends "Unix Makefiles" /opt/local/var/macports/build/_opt_local_var_macports_sources_rsync.macports.org_release_tarballs_ports_science_gr-osmosdr/gr-osmosdr/work/gr-osmosdr-164a09fc11cec2d8b15b38e8b512fa542d6cecc7 /opt/local/var/macports/build/_opt_local_var_macports_sources_rsync.macports.org_release_tarballs_ports_science_gr-osmosdr/gr-osmosdr/work/gr-osmosdr-164a09fc11cec2d8b15b38e8b512fa542d6cecc7/swig /opt/local/var/macports/build/_opt_local_var_macports_sources_rsync.macports.org_release_tarballs_ports_science_gr-osmosdr/gr-osmosdr/work/build /opt/local/var/macports/build/_opt_local_var_macports_sources_rsync.macports.org_release_tarballs_ports_science_gr-osmosdr/gr-osmosdr/work/build/swig /opt/local/var/macports/build/_opt_local_var_macports_sources_rsync.macports.org_release_tarballs_ports_science_gr-osmosdr/gr-osmosdr/work/build/swig/CMakeFiles/_osmosdr_swig_swig_tag.dir/DependInfo.cmake --color=
101:info:build make[2]: Leaving directory `/opt/local/var/macports/build/_opt_local_var_macports_sources_rsync.macports.org_release_tarballs_ports_science_gr-osmosdr/gr-osmosdr/work/build'
102:info:build /Applications/Xcode.app/Contents/Developer/usr/bin/make -f apps/CMakeFiles/pygen_apps_c7833.dir/build.make apps/CMakeFiles/pygen_apps_c7833.dir/build
103:info:build make[2]: Leaving directory `/opt/local/var/macports/build/_opt_local_var_macports_sources_rsync.macports.org_release_tarballs_ports_science_gr-osmosdr/gr-osmosdr/work/build'
104:info:build make[2]: Leaving directory `/opt/local/var/macports/build/_opt_local_var_macports_sources_rsync.macports.org_release_tarballs_ports_science_gr-osmosdr/gr-osmosdr/work/build'
105:info:build /Applications/Xcode.app/Contents/Developer/usr/bin/make -f swig/CMakeFiles/_osmosdr_swig_swig_tag.dir/build.make swig/CMakeFiles/_osmosdr_swig_swig_tag.dir/build
106:info:build /Applications/Xcode.app/Contents/Developer/usr/bin/make -f apps/CMakeFiles/pygen_apps_f9b37.dir/build.make apps/CMakeFiles/pygen_apps_f9b37.dir/build
107:info:build make[2]: Entering directory `/opt/local/var/macports/build/_opt_local_var_macports_sources_rsync.macports.org_release_tarballs_ports_science_gr-osmosdr/gr-osmosdr/work/build'
108:info:build make[2]: Nothing to be done for `apps/CMakeFiles/pygen_apps_c7833.dir/build'.
109:info:build make[2]: Leaving directory `/opt/local/var/macports/build/_opt_local_var_macports_sources_rsync.macports.org_release_tarballs_ports_science_gr-osmosdr/gr-osmosdr/work/build'
110:info:build make[2]: Entering directory `/opt/local/var/macports/build/_opt_local_var_macports_sources_rsync.macports.org_release_tarballs_ports_science_gr-osmosdr/gr-osmosdr/work/build'
111:info:build make[2]: Nothing to be done for `swig/CMakeFiles/_osmosdr_swig_swig_tag.dir/build'.
112:info:build make[2]: Leaving directory `/opt/local/var/macports/build/_opt_local_var_macports_sources_rsync.macports.org_release_tarballs_ports_science_gr-osmosdr/gr-osmosdr/work/build'
113:info:build make[2]: Entering directory `/opt/local/var/macports/build/_opt_local_var_macports_sources_rsync.macports.org_release_tarballs_ports_science_gr-osmosdr/gr-osmosdr/work/build'
114:info:build make[2]: Nothing to be done for `apps/CMakeFiles/pygen_apps_f9b37.dir/build'.
115:info:build make[2]: Leaving directory `/opt/local/var/macports/build/_opt_local_var_macports_sources_rsync.macports.org_release_tarballs_ports_science_gr-osmosdr/gr-osmosdr/work/build'
116:info:build [ 25%] Built target _osmosdr_swig_swig_tag
117:info:build [ 25%] Built target pygen_apps_f9b37
118:info:build [ 27%] Built target pygen_apps_c7833
119:info:build /Applications/Xcode.app/Contents/Developer/usr/bin/make -f swig/CMakeFiles/osmosdr_swig_swig_2d0df.dir/build.make swig/CMakeFiles/osmosdr_swig_swig_2d0df.dir/depend
120:info:build make[2]: Entering directory `/opt/local/var/macports/build/_opt_local_var_macports_sources_rsync.macports.org_release_tarballs_ports_science_gr-osmosdr/gr-osmosdr/work/build'
121:info:build cd /opt/local/var/macports/build/_opt_local_var_macports_sources_rsync.macports.org_release_tarballs_ports_science_gr-osmosdr/gr-osmosdr/work/build && /opt/local/bin/cmake -E cmake_depends "Unix Makefiles" /opt/local/var/macports/build/_opt_local_var_macports_sources_rsync.macports.org_release_tarballs_ports_science_gr-osmosdr/gr-osmosdr/work/gr-osmosdr-164a09fc11cec2d8b15b38e8b512fa542d6cecc7 /opt/local/var/macports/build/_opt_local_var_macports_sources_rsync.macports.org_release_tarballs_ports_science_gr-osmosdr/gr-osmosdr/work/gr-osmosdr-164a09fc11cec2d8b15b38e8b512fa542d6cecc7/swig /opt/local/var/macports/build/_opt_local_var_macports_sources_rsync.macports.org_release_tarballs_ports_science_gr-osmosdr/gr-osmosdr/work/build /opt/local/var/macports/build/_opt_local_var_macports_sources_rsync.macports.org_release_tarballs_ports_science_gr-osmosdr/gr-osmosdr/work/build/swig /opt/local/var/macports/build/_opt_local_var_macports_sources_rsync.macports.org_release_tarballs_ports_science_gr-osmosdr/gr-osmosdr/work/build/swig/CMakeFiles/osmosdr_swig_swig_2d0df.dir/DependInfo.cmake --color=
122:info:build make[2]: Leaving directory `/opt/local/var/macports/build/_opt_local_var_macports_sources_rsync.macports.org_release_tarballs_ports_science_gr-osmosdr/gr-osmosdr/work/build'
123:info:build /Applications/Xcode.app/Contents/Developer/usr/bin/make -f swig/CMakeFiles/osmosdr_swig_swig_2d0df.dir/build.make swig/CMakeFiles/osmosdr_swig_swig_2d0df.dir/build
124:info:build make[2]: Entering directory `/opt/local/var/macports/build/_opt_local_var_macports_sources_rsync.macports.org_release_tarballs_ports_science_gr-osmosdr/gr-osmosdr/work/build'
125:info:build make[2]: Nothing to be done for `swig/CMakeFiles/osmosdr_swig_swig_2d0df.dir/build'.
126:info:build make[2]: Leaving directory `/opt/local/var/macports/build/_opt_local_var_macports_sources_rsync.macports.org_release_tarballs_ports_science_gr-osmosdr/gr-osmosdr/work/build'
127:info:build [ 34%] Built target osmosdr_swig_swig_2d0df
128:info:build /Applications/Xcode.app/Contents/Developer/usr/bin/make -f swig/CMakeFiles/pygen_swig_d21bb.dir/build.make swig/CMakeFiles/pygen_swig_d21bb.dir/depend
129:info:build make[2]: Entering directory `/opt/local/var/macports/build/_opt_local_var_macports_sources_rsync.macports.org_release_tarballs_ports_science_gr-osmosdr/gr-osmosdr/work/build'
130:info:build cd /opt/local/var/macports/build/_opt_local_var_macports_sources_rsync.macports.org_release_tarballs_ports_science_gr-osmosdr/gr-osmosdr/work/build && /opt/local/bin/cmake -E cmake_depends "Unix Makefiles" /opt/local/var/macports/build/_opt_local_var_macports_sources_rsync.macports.org_release_tarballs_ports_science_gr-osmosdr/gr-osmosdr/work/gr-osmosdr-164a09fc11cec2d8b15b38e8b512fa542d6cecc7 /opt/local/var/macports/build/_opt_local_var_macports_sources_rsync.macports.org_release_tarballs_ports_science_gr-osmosdr/gr-osmosdr/work/gr-osmosdr-164a09fc11cec2d8b15b38e8b512fa542d6cecc7/swig /opt/local/var/macports/build/_opt_local_var_macports_sources_rsync.macports.org_release_tarballs_ports_science_gr-osmosdr/gr-osmosdr/work/build /opt/local/var/macports/build/_opt_local_var_macports_sources_rsync.macports.org_release_tarballs_ports_science_gr-osmosdr/gr-osmosdr/work/build/swig /opt/local/var/macports/build/_opt_local_var_macports_sources_rsync.macports.org_release_tarballs_ports_science_gr-osmosdr/gr-osmosdr/work/build/swig/CMakeFiles/pygen_swig_d21bb.dir/DependInfo.cmake --color=
131:info:build make[2]: Leaving directory `/opt/local/var/macports/build/_opt_local_var_macports_sources_rsync.macports.org_release_tarballs_ports_science_gr-osmosdr/gr-osmosdr/work/build'
132:info:build /Applications/Xcode.app/Contents/Developer/usr/bin/make -f swig/CMakeFiles/pygen_swig_d21bb.dir/build.make swig/CMakeFiles/pygen_swig_d21bb.dir/build
133:info:build make[2]: Entering directory `/opt/local/var/macports/build/_opt_local_var_macports_sources_rsync.macports.org_release_tarballs_ports_science_gr-osmosdr/gr-osmosdr/work/build'
134:info:build make[2]: Nothing to be done for `swig/CMakeFiles/pygen_swig_d21bb.dir/build'.
135:info:build make[2]: Leaving directory `/opt/local/var/macports/build/_opt_local_var_macports_sources_rsync.macports.org_release_tarballs_ports_science_gr-osmosdr/gr-osmosdr/work/build'
136:info:build [ 40%] Built target pygen_swig_d21bb
137:info:build make[2]: Entering directory `/opt/local/var/macports/build/_opt_local_var_macports_sources_rsync.macports.org_release_tarballs_ports_science_gr-osmosdr/gr-osmosdr/work/build'
138:info:build cd /opt/local/var/macports/build/_opt_local_var_macports_sources_rsync.macports.org_release_tarballs_ports_science_gr-osmosdr/gr-osmosdr/work/build && /opt/local/bin/cmake -E cmake_depends "Unix Makefiles" /opt/local/var/macports/build/_opt_local_var_macports_sources_rsync.macports.org_release_tarballs_ports_science_gr-osmosdr/gr-osmosdr/work/gr-osmosdr-164a09fc11cec2d8b15b38e8b512fa542d6cecc7 /opt/local/var/macports/build/_opt_local_var_macports_sources_rsync.macports.org_release_tarballs_ports_science_gr-osmosdr/gr-osmosdr/work/gr-osmosdr-164a09fc11cec2d8b15b38e8b512fa542d6cecc7/lib /opt/local/var/macports/build/_opt_local_var_macports_sources_rsync.macports.org_release_tarballs_ports_science_gr-osmosdr/gr-osmosdr/work/build /opt/local/var/macports/build/_opt_local_var_macports_sources_rsync.macports.org_release_tarballs_ports_science_gr-osmosdr/gr-osmosdr/work/build/lib /opt/local/var/macports/build/_opt_local_var_macports_sources_rsync.macports.org_release_tarballs_ports_science_gr-osmosdr/gr-osmosdr/work/build/lib/CMakeFiles/gnuradio-osmosdr.dir/DependInfo.cmake --color=
139:info:build make[2]: Leaving directory `/opt/local/var/macports/build/_opt_local_var_macports_sources_rsync.macports.org_release_tarballs_ports_science_gr-osmosdr/gr-osmosdr/work/build'
140:info:build /Applications/Xcode.app/Contents/Developer/usr/bin/make -f lib/CMakeFiles/gnuradio-osmosdr.dir/build.make lib/CMakeFiles/gnuradio-osmosdr.dir/build
141:info:build make[2]: Entering directory `/opt/local/var/macports/build/_opt_local_var_macports_sources_rsync.macports.org_release_tarballs_ports_science_gr-osmosdr/gr-osmosdr/work/build'
142:info:build [ 42%] Linking CXX shared library libgnuradio-osmosdr.dylib
143:info:build cd /opt/local/var/macports/build/_opt_local_var_macports_sources_rsync.macports.org_release_tarballs_ports_science_gr-osmosdr/gr-osmosdr/work/build/lib && /opt/local/bin/cmake -E cmake_link_script CMakeFiles/gnuradio-osmosdr.dir/link.txt --verbose=ON
144:info:build /Applications/Xcode.app/Contents/Developer/Toolchains/XcodeDefault.xctoolchain/usr/bin/clang++  -pipe -Os -stdlib=libc++  -DNDEBUG -arch x86_64 -mmacosx-version-min=10.11 -dynamiclib -Wl,-headerpad_max_install_names  -Wl,-headerpad_max_install_names -flat_namespace -compatibility_version 0.1.5 -o libgnuradio-osmosdr.0.1.5git.dylib -install_name /opt/local/lib/libgnuradio-osmosdr.0.1.5git.dylib CMakeFiles/gnuradio-osmosdr.dir/source_impl.cc.o CMakeFiles/gnuradio-osmosdr.dir/sink_impl.cc.o CMakeFiles/gnuradio-osmosdr.dir/ranges.cc.o CMakeFiles/gnuradio-osmosdr.dir/device.cc.o CMakeFiles/gnuradio-osmosdr.dir/time_spec.cc.o CMakeFiles/gnuradio-osmosdr.dir/fcd/fcd_source_c.cc.o CMakeFiles/gnuradio-osmosdr.dir/file/file_source_c.cc.o CMakeFiles/gnuradio-osmosdr.dir/file/file_sink_c.cc.o CMakeFiles/gnuradio-osmosdr.dir/rtl/rtl_source_c.cc.o CMakeFiles/gnuradio-osmosdr.dir/rtl_tcp/rtl_tcp_source_f.cc.o CMakeFiles/gnuradio-osmosdr.dir/rtl_tcp/rtl_tcp_source_c.cc.o CMakeFiles/gnuradio-osmosdr.dir/uhd/uhd_sink_c.cc.o CMakeFiles/gnuradio-osmosdr.dir/uhd/uhd_source_c.cc.o CMakeFiles/gnuradio-osmosdr.dir/sdrplay/sdrplay_source_c.cc.o CMakeFiles/gnuradio-osmosdr.dir/hackrf/hackrf_source_c.cc.o CMakeFiles/gnuradio-osmosdr.dir/hackrf/hackrf_sink_c.cc.o CMakeFiles/gnuradio-osmosdr.dir/bladerf/bladerf_source_c.cc.o CMakeFiles/gnuradio-osmosdr.dir/bladerf/bladerf_sink_c.cc.o CMakeFiles/gnuradio-osmosdr.dir/bladerf/bladerf_common.cc.o CMakeFiles/gnuradio-osmosdr.dir/rfspace/rfspace_source_c.cc.o CMakeFiles/gnuradio-osmosdr.dir/airspy/airspy_source_c.cc.o CMakeFiles/gnuradio-osmosdr.dir/soapy/soapy_source_c.cc.o CMakeFiles/gnuradio-osmosdr.dir/soapy/soapy_sink_c.cc.o /opt/local/lib/libboost_thread-mt.dylib /opt/local/lib/libboost_system-mt.dylib /opt/local/lib/libboost_chrono-mt.dylib /opt/local/lib/libboost_date_time-mt.dylib /opt/local/lib/libboost_atomic-mt.dylib /opt/local/lib/libgnuradio-runtime.dylib /opt/local/lib/libgnuradio-pmt.dylib /opt/local/lib/libgnuradio-blocks.dylib /opt/local/lib/libgnuradio-fcd.dylib /opt/local/lib/libgnuradio-fcdproplus.dylib /opt/local/lib/librtlsdr.dylib /opt/local/lib/libgnuradio-uhd.dylib /opt/local/lib/libuhd.dylib /opt/local/lib/libmirsdrapi-rsp.dylib /opt/local/lib/libhackrf.dylib /opt/local/lib/libbladeRF.dylib /opt/local/lib/libairspy.dylib /opt/local/lib/libgnuradio-blocks.dylib /opt/local/lib/libgnuradio-runtime.dylib /opt/local/lib/libgnuradio-pmt.dylib /opt/local/lib/libSoapySDR.dylib /opt/local/lib/libgnuradio-fcd.dylib /opt/local/lib/libgnuradio-fcdproplus.dylib /opt/local/lib/librtlsdr.dylib /opt/local/lib/libgnuradio-uhd.dylib /opt/local/lib/libuhd.dylib /opt/local/lib/libmirsdrapi-rsp.dylib /opt/local/lib/libhackrf.dylib /opt/local/lib/libbladeRF.dylib /opt/local/lib/libairspy.dylib /opt/local/lib/libSoapySDR.dylib -Wl,-rpath,/opt/local/lib
145:info:build ld: file not found: /opt/local/lib/libgnuradio-runtime.3.7.10.dylib for architecture x86_64
146:info:build clang: error: linker command failed with exit code 1 (use -v to see invocation)
147:info:build make[2]: *** [lib/libgnuradio-osmosdr.0.1.5git.dylib] Error 1
148:info:build make[2]: Leaving directory `/opt/local/var/macports/build/_opt_local_var_macports_sources_rsync.macports.org_release_tarballs_ports_science_gr-osmosdr/gr-osmosdr/work/build'
149:info:build make[1]: *** [lib/CMakeFiles/gnuradio-osmosdr.dir/all] Error 2
150:info:build make[1]: Leaving directory `/opt/local/var/macports/build/_opt_local_var_macports_sources_rsync.macports.org_release_tarballs_ports_science_gr-osmosdr/gr-osmosdr/work/build'
151:info:build make: *** [all] Error 2
152:info:build make: Leaving directory `/opt/local/var/macports/build/_opt_local_var_macports_sources_rsync.macports.org_release_tarballs_ports_science_gr-osmosdr/gr-osmosdr/work/build'
153:info:build Command failed:  cd "/opt/local/var/macports/build/_opt_local_var_macports_sources_rsync.macports.org_release_tarballs_ports_science_gr-osmosdr/gr-osmosdr/work/build" && /usr/bin/make -j4 -w all VERBOSE=ON
154:info:build Exit code: 2
155:error:build org.macports.build for port gr-osmosdr returned: command execution failed
156:debug:build Error code: CHILDSTATUS 18251 2
157:debug:build Backtrace: command execution failed
158    while executing
159"system -nice 0 $fullcmdstring"
160    ("eval" body line 1)
161    invoked from within
162"eval system $notty $nice \$fullcmdstring"
163    invoked from within
164"command_exec build"
165    (procedure "portbuild::build_main" line 8)
166    invoked from within
167"portbuild::build_main org.macports.build"
168    ("eval" body line 1)
169    invoked from within
170"eval $procedure $targetname"
171:info:build Warning: targets not executed for gr-osmosdr: org.macports.install org.macports.build org.macports.destroot
172:notice:build Please see the log file for port gr-osmosdr for details:
173    /opt/local/var/macports/logs/_opt_local_var_macports_sources_rsync.macports.org_release_tarballs_ports_science_gr-osmosdr/gr-osmosdr/main.log