Ticket #52323: aquaterm_sierra_fail.log

File aquaterm_sierra_fail.log, 100.7 KB (added by michaelld (Michael Dickens), 5 years ago)
Line 
1version:1
2:debug:main aquaterm has no conflicts
3:debug:main Executing org.macports.main (aquaterm)
4:debug:main dropping privileges: euid changed to 503, egid changed to 501.
5:debug:archivefetch archivefetch phase started at Thu Sep 22 10:54:48 EDT 2016
6:debug:archivefetch Executing org.macports.archivefetch (aquaterm)
7:debug:archivefetch Privilege de-escalation not attempted as not running as root.
8:debug:fetch fetch phase started at Thu Sep 22 10:54:48 EDT 2016
9:notice:fetch --->  Fetching distfiles for aquaterm
10:debug:fetch Executing org.macports.fetch (aquaterm)
11:debug:fetch Privilege de-escalation not attempted as not running as root.
12:debug:checksum checksum phase started at Thu Sep 22 10:54:48 EDT 2016
13:notice:checksum --->  Verifying checksums for aquaterm
14:debug:checksum Executing org.macports.checksum (aquaterm)
15:info:checksum --->  Checksumming AquaTerm-1.1.1.tar.gz
16:debug:checksum Calculated (rmd160) is 007db0806a2b1b1263043647035fa428b15560e3
17:debug:checksum Correct (rmd160) checksum for AquaTerm-1.1.1.tar.gz
18:debug:checksum Calculated (sha256) is 8e35cb81f5f024382ba4b2c96569631b34cf798966aa2870258f272e551c0e34
19:debug:checksum Correct (sha256) checksum for AquaTerm-1.1.1.tar.gz
20:debug:checksum Privilege de-escalation not attempted as not running as root.
21:debug:extract extract phase started at Thu Sep 22 10:54:48 EDT 2016
22:notice:extract --->  Extracting aquaterm
23:debug:extract Executing org.macports.extract (aquaterm)
24:info:extract --->  Extracting AquaTerm-1.1.1.tar.gz
25:debug:extract setting option extract.args to '/Development/sources/MacPorts/distfiles/aquaterm/AquaTerm-1.1.1.tar.gz'
26:debug:extract Environment:
27:debug:extract CC_PRINT_OPTIONS='YES'
28:debug:extract CC_PRINT_OPTIONS_FILE='/Development/local/10_12/var/macports/build/_Development_sources_MacPorts_trunk_dports_aqua_aquaterm/aquaterm/work/.CC_PRINT_OPTIONS'
29:debug:extract CPATH='/opt/local/include'
30:debug:extract LIBRARY_PATH='/opt/local/lib'
31:debug:extract MACOSX_DEPLOYMENT_TARGET='10.12'
32:info:extract Executing:  cd "/Development/local/10_12/var/macports/build/_Development_sources_MacPorts_trunk_dports_aqua_aquaterm/aquaterm/work" && /usr/bin/gzip -dc '/Development/sources/MacPorts/distfiles/aquaterm/AquaTerm-1.1.1.tar.gz' | /usr/bin/tar -xf -
33:debug:extract system:  cd "/Development/local/10_12/var/macports/build/_Development_sources_MacPorts_trunk_dports_aqua_aquaterm/aquaterm/work" && /usr/bin/gzip -dc '/Development/sources/MacPorts/distfiles/aquaterm/AquaTerm-1.1.1.tar.gz' | /usr/bin/tar -xf -
34:debug:extract euid/egid changed to: 0/0
35:debug:extract chowned /Development/local/10_12/var/macports/build/_Development_sources_MacPorts_trunk_dports_aqua_aquaterm/aquaterm/work to macports
36:debug:extract euid/egid changed to: 503/501
37:debug:extract Executing proc-post-org.macports.extract-extract-0
38:debug:extract Privilege de-escalation not attempted as not running as root.
39:debug:patch patch phase started at Thu Sep 22 10:54:48 EDT 2016
40:debug:patch Executing org.macports.patch (aquaterm)
41:notice:patch --->  Applying patches to aquaterm
42:info:patch --->  Applying no-NSMailDelivery.patch
43:debug:patch Environment:
44:debug:patch CC_PRINT_OPTIONS='YES'
45:debug:patch CC_PRINT_OPTIONS_FILE='/Development/local/10_12/var/macports/build/_Development_sources_MacPorts_trunk_dports_aqua_aquaterm/aquaterm/work/.CC_PRINT_OPTIONS'
46:debug:patch CPATH='/opt/local/include'
47:debug:patch LIBRARY_PATH='/opt/local/lib'
48:debug:patch MACOSX_DEPLOYMENT_TARGET='10.12'
49:info:patch Executing:  cd "/Development/local/10_12/var/macports/build/_Development_sources_MacPorts_trunk_dports_aqua_aquaterm/aquaterm/work/AquaTerm-1.1.1" && /usr/bin/patch -p0 < '/Development/sources/MacPorts/trunk/dports/aqua/aquaterm/files/no-NSMailDelivery.patch'
50:debug:patch system:  cd "/Development/local/10_12/var/macports/build/_Development_sources_MacPorts_trunk_dports_aqua_aquaterm/aquaterm/work/AquaTerm-1.1.1" && /usr/bin/patch -p0 < '/Development/sources/MacPorts/trunk/dports/aqua/aquaterm/files/no-NSMailDelivery.patch'
51:info:patch patching file aquaterm/AQTController.m
52:info:patch patching file aquaterm/AquaTerm.xcodeproj/project.pbxproj
53:debug:patch Executing proc-post-org.macports.patch-patch-0
54:info:patch --->  Patching AQTClientManager.m: s|/Applications/AquaTerm.app|/opt/local/Applications/AquaTerm.app|
55:debug:patch Executing reinplace: /usr/bin/sed s|/Applications/AquaTerm.app|/opt/local/Applications/AquaTerm.app| </Development/local/10_12/var/macports/build/_Development_sources_MacPorts_trunk_dports_aqua_aquaterm/aquaterm/work/AquaTerm-1.1.1/aquaterm/AQTClientManager.m >@file9
56:debug:patch euid/egid changed to: 0/0
57:debug:patch chowned /Development/local/10_12/var/macports/build/_Development_sources_MacPorts_trunk_dports_aqua_aquaterm/aquaterm/work/AquaTerm-1.1.1/aquaterm/AQTClientManager.m to macports
58:debug:patch euid/egid changed to: 503/501
59:debug:patch euid/egid changed to: 0/0
60:debug:patch setting attributes on /Development/local/10_12/var/macports/build/_Development_sources_MacPorts_trunk_dports_aqua_aquaterm/aquaterm/work/AquaTerm-1.1.1/aquaterm/AQTClientManager.m
61:debug:patch euid/egid changed to: 503/501
62:info:patch --->  Patching Makefile: s|# FRAMEWORKS_DIR.*|FRAMEWORKS_DIR = /opt/local/Library/Frameworks|
63:debug:patch Executing reinplace: /usr/bin/sed {s|# FRAMEWORKS_DIR.*|FRAMEWORKS_DIR = /opt/local/Library/Frameworks|} </Development/local/10_12/var/macports/build/_Development_sources_MacPorts_trunk_dports_aqua_aquaterm/aquaterm/work/AquaTerm-1.1.1/adapters/c/Makefile >@file9
64:debug:patch euid/egid changed to: 0/0
65:debug:patch chowned /Development/local/10_12/var/macports/build/_Development_sources_MacPorts_trunk_dports_aqua_aquaterm/aquaterm/work/AquaTerm-1.1.1/adapters/c/Makefile to macports
66:debug:patch euid/egid changed to: 503/501
67:debug:patch euid/egid changed to: 0/0
68:debug:patch setting attributes on /Development/local/10_12/var/macports/build/_Development_sources_MacPorts_trunk_dports_aqua_aquaterm/aquaterm/work/AquaTerm-1.1.1/adapters/c/Makefile
69:debug:patch euid/egid changed to: 503/501
70:info:patch --->  Patching Makefile: s|# FRAMEWORKS_DIR.*|FRAMEWORKS_DIR = /opt/local/Library/Frameworks|
71:debug:patch Executing reinplace: /usr/bin/sed {s|# FRAMEWORKS_DIR.*|FRAMEWORKS_DIR = /opt/local/Library/Frameworks|} </Development/local/10_12/var/macports/build/_Development_sources_MacPorts_trunk_dports_aqua_aquaterm/aquaterm/work/AquaTerm-1.1.1/adapters/fortran/Makefile >@file9
72:debug:patch euid/egid changed to: 0/0
73:debug:patch chowned /Development/local/10_12/var/macports/build/_Development_sources_MacPorts_trunk_dports_aqua_aquaterm/aquaterm/work/AquaTerm-1.1.1/adapters/fortran/Makefile to macports
74:debug:patch euid/egid changed to: 503/501
75:debug:patch euid/egid changed to: 0/0
76:debug:patch setting attributes on /Development/local/10_12/var/macports/build/_Development_sources_MacPorts_trunk_dports_aqua_aquaterm/aquaterm/work/AquaTerm-1.1.1/adapters/fortran/Makefile
77:debug:patch euid/egid changed to: 503/501
78:info:patch --->  Patching ChangeLog: s|/usr/local|/opt/local|g
79:debug:patch Executing reinplace: /usr/bin/sed s|/usr/local|/opt/local|g </Development/local/10_12/var/macports/build/_Development_sources_MacPorts_trunk_dports_aqua_aquaterm/aquaterm/work/AquaTerm-1.1.1/adapters/pgplot/ChangeLog >@file9
80:debug:patch euid/egid changed to: 0/0
81:debug:patch chowned /Development/local/10_12/var/macports/build/_Development_sources_MacPorts_trunk_dports_aqua_aquaterm/aquaterm/work/AquaTerm-1.1.1/adapters/pgplot/ChangeLog to macports
82:debug:patch euid/egid changed to: 503/501
83:debug:patch euid/egid changed to: 0/0
84:debug:patch setting attributes on /Development/local/10_12/var/macports/build/_Development_sources_MacPorts_trunk_dports_aqua_aquaterm/aquaterm/work/AquaTerm-1.1.1/adapters/pgplot/ChangeLog
85:debug:patch euid/egid changed to: 503/501
86:info:patch --->  Patching g77_gcc_AQT.conf: s|/usr/local|/opt/local|g
87:debug:patch Executing reinplace: /usr/bin/sed s|/usr/local|/opt/local|g </Development/local/10_12/var/macports/build/_Development_sources_MacPorts_trunk_dports_aqua_aquaterm/aquaterm/work/AquaTerm-1.1.1/adapters/pgplot/g77_gcc_AQT.conf >@file9
88:debug:patch euid/egid changed to: 0/0
89:debug:patch chowned /Development/local/10_12/var/macports/build/_Development_sources_MacPorts_trunk_dports_aqua_aquaterm/aquaterm/work/AquaTerm-1.1.1/adapters/pgplot/g77_gcc_AQT.conf to macports
90:debug:patch euid/egid changed to: 503/501
91:debug:patch euid/egid changed to: 0/0
92:debug:patch setting attributes on /Development/local/10_12/var/macports/build/_Development_sources_MacPorts_trunk_dports_aqua_aquaterm/aquaterm/work/AquaTerm-1.1.1/adapters/pgplot/g77_gcc_AQT.conf
93:debug:patch euid/egid changed to: 503/501
94:info:patch --->  Patching xlf_gcc_AQT.conf: s|/usr/local|/opt/local|g
95:debug:patch Executing reinplace: /usr/bin/sed s|/usr/local|/opt/local|g </Development/local/10_12/var/macports/build/_Development_sources_MacPorts_trunk_dports_aqua_aquaterm/aquaterm/work/AquaTerm-1.1.1/adapters/pgplot/xlf_gcc_AQT.conf >@file9
96:debug:patch euid/egid changed to: 0/0
97:debug:patch chowned /Development/local/10_12/var/macports/build/_Development_sources_MacPorts_trunk_dports_aqua_aquaterm/aquaterm/work/AquaTerm-1.1.1/adapters/pgplot/xlf_gcc_AQT.conf to macports
98:debug:patch euid/egid changed to: 503/501
99:debug:patch euid/egid changed to: 0/0
100:debug:patch setting attributes on /Development/local/10_12/var/macports/build/_Development_sources_MacPorts_trunk_dports_aqua_aquaterm/aquaterm/work/AquaTerm-1.1.1/adapters/pgplot/xlf_gcc_AQT.conf
101:debug:patch euid/egid changed to: 503/501
102:info:patch --->  Patching g77_cc_AQT.conf: s|/*<PREFIX>|/opt/local|g
103:debug:patch Executing reinplace: /usr/bin/sed s|/*<PREFIX>|/opt/local|g </Development/local/10_12/var/macports/build/_Development_sources_MacPorts_trunk_dports_aqua_aquaterm/aquaterm/work/AquaTerm-1.1.1/adapters/pgplot/g77_cc_AQT.conf >@file9
104:debug:patch euid/egid changed to: 0/0
105:debug:patch chowned /Development/local/10_12/var/macports/build/_Development_sources_MacPorts_trunk_dports_aqua_aquaterm/aquaterm/work/AquaTerm-1.1.1/adapters/pgplot/g77_cc_AQT.conf to macports
106:debug:patch euid/egid changed to: 503/501
107:debug:patch euid/egid changed to: 0/0
108:debug:patch setting attributes on /Development/local/10_12/var/macports/build/_Development_sources_MacPorts_trunk_dports_aqua_aquaterm/aquaterm/work/AquaTerm-1.1.1/adapters/pgplot/g77_cc_AQT.conf
109:debug:patch euid/egid changed to: 503/501
110:info:patch --->  Patching g77_gcc_AQT.conf: s|/*<PREFIX>|/opt/local|g
111:debug:patch Executing reinplace: /usr/bin/sed s|/*<PREFIX>|/opt/local|g </Development/local/10_12/var/macports/build/_Development_sources_MacPorts_trunk_dports_aqua_aquaterm/aquaterm/work/AquaTerm-1.1.1/adapters/pgplot/g77_gcc_AQT.conf >@file9
112:debug:patch euid/egid changed to: 0/0
113:debug:patch chowned /Development/local/10_12/var/macports/build/_Development_sources_MacPorts_trunk_dports_aqua_aquaterm/aquaterm/work/AquaTerm-1.1.1/adapters/pgplot/g77_gcc_AQT.conf to macports
114:debug:patch euid/egid changed to: 503/501
115:debug:patch euid/egid changed to: 0/0
116:debug:patch setting attributes on /Development/local/10_12/var/macports/build/_Development_sources_MacPorts_trunk_dports_aqua_aquaterm/aquaterm/work/AquaTerm-1.1.1/adapters/pgplot/g77_gcc_AQT.conf
117:debug:patch euid/egid changed to: 503/501
118:info:patch --->  Patching xlf_gcc_AQT.conf: s|/*<PREFIX>|/opt/local|g
119:debug:patch Executing reinplace: /usr/bin/sed s|/*<PREFIX>|/opt/local|g </Development/local/10_12/var/macports/build/_Development_sources_MacPorts_trunk_dports_aqua_aquaterm/aquaterm/work/AquaTerm-1.1.1/adapters/pgplot/xlf_gcc_AQT.conf >@file9
120:debug:patch euid/egid changed to: 0/0
121:debug:patch chowned /Development/local/10_12/var/macports/build/_Development_sources_MacPorts_trunk_dports_aqua_aquaterm/aquaterm/work/AquaTerm-1.1.1/adapters/pgplot/xlf_gcc_AQT.conf to macports
122:debug:patch euid/egid changed to: 503/501
123:debug:patch euid/egid changed to: 0/0
124:debug:patch setting attributes on /Development/local/10_12/var/macports/build/_Development_sources_MacPorts_trunk_dports_aqua_aquaterm/aquaterm/work/AquaTerm-1.1.1/adapters/pgplot/xlf_gcc_AQT.conf
125:debug:patch euid/egid changed to: 503/501
126:info:patch --->  Patching ReadMe: s|/sw|/opt/local|g
127:debug:patch Executing reinplace: /usr/bin/sed s|/sw|/opt/local|g </Development/local/10_12/var/macports/build/_Development_sources_MacPorts_trunk_dports_aqua_aquaterm/aquaterm/work/AquaTerm-1.1.1/adapters/pgplot/ReadMe >@file9
128:debug:patch euid/egid changed to: 0/0
129:debug:patch chowned /Development/local/10_12/var/macports/build/_Development_sources_MacPorts_trunk_dports_aqua_aquaterm/aquaterm/work/AquaTerm-1.1.1/adapters/pgplot/ReadMe to macports
130:debug:patch euid/egid changed to: 503/501
131:debug:patch euid/egid changed to: 0/0
132:debug:patch setting attributes on /Development/local/10_12/var/macports/build/_Development_sources_MacPorts_trunk_dports_aqua_aquaterm/aquaterm/work/AquaTerm-1.1.1/adapters/pgplot/ReadMe
133:debug:patch euid/egid changed to: 503/501
134:debug:patch Privilege de-escalation not attempted as not running as root.
135:debug:configure configure phase started at Thu Sep 22 10:54:48 EDT 2016
136:notice:configure --->  Configuring aquaterm
137:debug:configure Preferred compilers: clang macports-clang-3.8 macports-clang-3.7
138:debug:configure Using compiler 'Xcode Clang'
139:debug:configure Executing org.macports.configure (aquaterm)
140:debug:configure Privilege de-escalation not attempted as not running as root.
141:debug:build build phase started at Thu Sep 22 10:54:48 EDT 2016
142:notice:build --->  Building aquaterm
143:debug:build Executing org.macports.build (aquaterm)
144:debug:build Assembled command: 'cd "/Development/local/10_12/var/macports/build/_Development_sources_MacPorts_trunk_dports_aqua_aquaterm/aquaterm/work/AquaTerm-1.1.1/aquaterm" && /usr/bin/xcodebuild  -target "AquaTerm" -configuration Default build OBJROOT=build/ SYMROOT=build/ MACOSX_DEPLOYMENT_TARGET=10.12 ARCHS=x86_64 SDKROOT="" GCC_VERSION=com.apple.compilers.llvm.clang.1_0 CLANG_CXX_LIBRARY="libc++" LOCAL_APPS_DIR=/opt/local/Applications LOCAL_FRAMEWORKS_DIR=/opt/local/Library/Frameworks'
145:debug:build system: cd "/Development/local/10_12/var/macports/build/_Development_sources_MacPorts_trunk_dports_aqua_aquaterm/aquaterm/work/AquaTerm-1.1.1/aquaterm" && /usr/bin/xcodebuild  -target "AquaTerm" -configuration Default build OBJROOT=build/ SYMROOT=build/ MACOSX_DEPLOYMENT_TARGET=10.12 ARCHS=x86_64 SDKROOT="" GCC_VERSION=com.apple.compilers.llvm.clang.1_0 CLANG_CXX_LIBRARY="libc++" LOCAL_APPS_DIR=/opt/local/Applications LOCAL_FRAMEWORKS_DIR=/opt/local/Library/Frameworks
146:info:build Build settings from command line:
147:info:build     ARCHS = x86_64
148:info:build     CLANG_CXX_LIBRARY = libc++
149:info:build     GCC_VERSION = com.apple.compilers.llvm.clang.1_0
150:info:build     LOCAL_APPS_DIR = /opt/local/Applications
151:info:build     LOCAL_FRAMEWORKS_DIR = /opt/local/Library/Frameworks
152:info:build     MACOSX_DEPLOYMENT_TARGET = 10.12
153:info:build     OBJROOT = build/
154:info:build     SDKROOT =
155:info:build     SYMROOT = build/
156:info:build === BUILD TARGET AQTFwk OF PROJECT AquaTerm WITH CONFIGURATION Default ===
157:info:build Check dependencies
158:info:build Write auxiliary files
159:info:build write-file /Development/local/10_12/var/macports/build/_Development_sources_MacPorts_trunk_dports_aqua_aquaterm/aquaterm/work/AquaTerm-1.1.1/aquaterm/build/AquaTerm.build/Default/AQTFwk.build/AquaTerm-generated-files.hmap
160:info:build write-file /Development/local/10_12/var/macports/build/_Development_sources_MacPorts_trunk_dports_aqua_aquaterm/aquaterm/work/AquaTerm-1.1.1/aquaterm/build/AquaTerm.build/Default/AQTFwk.build/AquaTerm.hmap
161:info:build /bin/mkdir -p /Development/local/10_12/var/macports/build/_Development_sources_MacPorts_trunk_dports_aqua_aquaterm/aquaterm/work/AquaTerm-1.1.1/aquaterm/build/AquaTerm.build/Default/AQTFwk.build/Objects-normal/x86_64
162:info:build write-file /Development/local/10_12/var/macports/build/_Development_sources_MacPorts_trunk_dports_aqua_aquaterm/aquaterm/work/AquaTerm-1.1.1/aquaterm/build/AquaTerm.build/Default/AQTFwk.build/Objects-normal/x86_64/AquaTerm.LinkFileList
163:info:build write-file /Development/local/10_12/var/macports/build/_Development_sources_MacPorts_trunk_dports_aqua_aquaterm/aquaterm/work/AquaTerm-1.1.1/aquaterm/build/AquaTerm.build/Default/AQTFwk.build/AquaTerm-own-target-headers.hmap
164:info:build write-file /Development/local/10_12/var/macports/build/_Development_sources_MacPorts_trunk_dports_aqua_aquaterm/aquaterm/work/AquaTerm-1.1.1/aquaterm/build/AquaTerm.build/Default/AQTFwk.build/AquaTerm-all-target-headers.hmap
165:info:build write-file /Development/local/10_12/var/macports/build/_Development_sources_MacPorts_trunk_dports_aqua_aquaterm/aquaterm/work/AquaTerm-1.1.1/aquaterm/build/AquaTerm.build/Default/AQTFwk.build/AquaTerm-project-headers.hmap
166:info:build /bin/mkdir -p /Development/local/10_12/var/macports/build/_Development_sources_MacPorts_trunk_dports_aqua_aquaterm/aquaterm/work/AquaTerm-1.1.1/aquaterm/build/SharedPrecompiledHeaders/AppKit-gdnhrywcmpbgcxbovxkmxwrsbjmc
167:info:build write-file /Development/local/10_12/var/macports/build/_Development_sources_MacPorts_trunk_dports_aqua_aquaterm/aquaterm/work/AquaTerm-1.1.1/aquaterm/build/SharedPrecompiledHeaders/AppKit-gdnhrywcmpbgcxbovxkmxwrsbjmc/AppKit.h.pch.hash-criteria
168:info:build write-file /Development/local/10_12/var/macports/build/_Development_sources_MacPorts_trunk_dports_aqua_aquaterm/aquaterm/work/AquaTerm-1.1.1/aquaterm/build/AquaTerm.build/Default/AQTFwk.build/AquaTerm-all-non-framework-target-headers.hmap
169:info:build Create product structure
170:info:build /bin/mkdir -p /Development/local/10_12/var/macports/build/_Development_sources_MacPorts_trunk_dports_aqua_aquaterm/aquaterm/work/AquaTerm-1.1.1/aquaterm/build/Default/AquaTerm.framework/Versions/A
171:info:build /bin/mkdir -p /Development/local/10_12/var/macports/build/_Development_sources_MacPorts_trunk_dports_aqua_aquaterm/aquaterm/work/AquaTerm-1.1.1/aquaterm/build/Default/AquaTerm.framework/Versions/A/Headers
172:info:build /bin/mkdir -p /Development/local/10_12/var/macports/build/_Development_sources_MacPorts_trunk_dports_aqua_aquaterm/aquaterm/work/AquaTerm-1.1.1/aquaterm/build/Default/AquaTerm.framework/Versions/A/Resources
173:info:build /bin/ln -sfh A /Development/local/10_12/var/macports/build/_Development_sources_MacPorts_trunk_dports_aqua_aquaterm/aquaterm/work/AquaTerm-1.1.1/aquaterm/build/Default/AquaTerm.framework/Versions/Current
174:info:build /bin/ln -sfh Versions/Current/Resources /Development/local/10_12/var/macports/build/_Development_sources_MacPorts_trunk_dports_aqua_aquaterm/aquaterm/work/AquaTerm-1.1.1/aquaterm/build/Default/AquaTerm.framework/Resources
175:info:build /bin/ln -sfh Versions/Current/Headers /Development/local/10_12/var/macports/build/_Development_sources_MacPorts_trunk_dports_aqua_aquaterm/aquaterm/work/AquaTerm-1.1.1/aquaterm/build/Default/AquaTerm.framework/Headers
176:info:build /bin/ln -sfh Versions/Current/AquaTerm /Development/local/10_12/var/macports/build/_Development_sources_MacPorts_trunk_dports_aqua_aquaterm/aquaterm/work/AquaTerm-1.1.1/aquaterm/build/Default/AquaTerm.framework/AquaTerm
177:info:build ProcessInfoPlistFile build/Default/AquaTerm.framework/Versions/A/Resources/Info.plist AquaTerm.framework-Info.plist
178:info:build     cd /Development/local/10_12/var/macports/build/_Development_sources_MacPorts_trunk_dports_aqua_aquaterm/aquaterm/work/AquaTerm-1.1.1/aquaterm
179:info:build     builtin-infoPlistUtility /Development/local/10_12/var/macports/build/_Development_sources_MacPorts_trunk_dports_aqua_aquaterm/aquaterm/work/AquaTerm-1.1.1/aquaterm/AquaTerm.framework-Info.plist -expandbuildsettings -platform macosx -o /Development/local/10_12/var/macports/build/_Development_sources_MacPorts_trunk_dports_aqua_aquaterm/aquaterm/work/AquaTerm-1.1.1/aquaterm/build/Default/AquaTerm.framework/Versions/A/Resources/Info.plist
180:info:build CpHeader AQTAdapter.h build/Default/AquaTerm.framework/Versions/A/Headers/AQTAdapter.h
181:info:build     cd /Development/local/10_12/var/macports/build/_Development_sources_MacPorts_trunk_dports_aqua_aquaterm/aquaterm/work/AquaTerm-1.1.1/aquaterm
182:info:build     builtin-copy -exclude .DS_Store -exclude CVS -exclude .svn -exclude .git -exclude .hg -resolve-src-symlinks /Development/local/10_12/var/macports/build/_Development_sources_MacPorts_trunk_dports_aqua_aquaterm/aquaterm/work/AquaTerm-1.1.1/aquaterm/AQTAdapter.h /Development/local/10_12/var/macports/build/_Development_sources_MacPorts_trunk_dports_aqua_aquaterm/aquaterm/work/AquaTerm-1.1.1/aquaterm/build/Default/AquaTerm.framework/Versions/A/Headers
183:info:build CpHeader aquaterm.h build/Default/AquaTerm.framework/Versions/A/Headers/aquaterm.h
184:info:build     cd /Development/local/10_12/var/macports/build/_Development_sources_MacPorts_trunk_dports_aqua_aquaterm/aquaterm/work/AquaTerm-1.1.1/aquaterm
185:info:build     builtin-copy -exclude .DS_Store -exclude CVS -exclude .svn -exclude .git -exclude .hg -resolve-src-symlinks /Development/local/10_12/var/macports/build/_Development_sources_MacPorts_trunk_dports_aqua_aquaterm/aquaterm/work/AquaTerm-1.1.1/aquaterm/aquaterm.h /Development/local/10_12/var/macports/build/_Development_sources_MacPorts_trunk_dports_aqua_aquaterm/aquaterm/work/AquaTerm-1.1.1/aquaterm/build/Default/AquaTerm.framework/Versions/A/Headers
186:info:build CpResource AquaTerm.bridgesupport build/Default/AquaTerm.framework/Versions/A/Resources/AquaTerm.bridgesupport
187:info:build     cd /Development/local/10_12/var/macports/build/_Development_sources_MacPorts_trunk_dports_aqua_aquaterm/aquaterm/work/AquaTerm-1.1.1/aquaterm
188:info:build     builtin-copy -exclude .DS_Store -exclude CVS -exclude .svn -exclude .git -exclude .hg -resolve-src-symlinks /Development/local/10_12/var/macports/build/_Development_sources_MacPorts_trunk_dports_aqua_aquaterm/aquaterm/work/AquaTerm-1.1.1/aquaterm/AquaTerm.bridgesupport /Development/local/10_12/var/macports/build/_Development_sources_MacPorts_trunk_dports_aqua_aquaterm/aquaterm/work/AquaTerm-1.1.1/aquaterm/build/Default/AquaTerm.framework/Versions/A/Resources
189:info:build ProcessPCH build/SharedPrecompiledHeaders/AppKit-gdnhrywcmpbgcxbovxkmxwrsbjmc/AppKit.h.pch /Applications/Xcode.app/Contents/Developer/Platforms/MacOSX.platform/Developer/SDKs/MacOSX10.12.sdk/System/Library/Frameworks/AppKit.framework/Headers/AppKit.h normal x86_64 objective-c com.apple.compilers.llvm.clang.1_0.compiler
190:info:build     cd /Development/local/10_12/var/macports/build/_Development_sources_MacPorts_trunk_dports_aqua_aquaterm/aquaterm/work/AquaTerm-1.1.1/aquaterm
191:info:build     export LANG=en_US.US-ASCII
192:info:build     /Applications/Xcode.app/Contents/Developer/Toolchains/XcodeDefault.xctoolchain/usr/bin/clang -x objective-c-header -arch x86_64 -fmessage-length=0 -fdiagnostics-show-note-include-stack -fmacro-backtrace-limit=0 -gmodules -Wno-trigraphs -fpascal-strings -Os -Wno-missing-field-initializers -Wno-missing-prototypes -Wno-return-type -Wno-implicit-atomic-properties -Wno-arc-repeated-use-of-weak -Wno-missing-braces -Wparentheses -Wswitch -Wno-unused-function -Wno-unused-label -Wno-unused-parameter -Wno-unused-variable -Wunused-value -Wno-empty-body -Wno-uninitialized -Wno-unknown-pragmas -Wno-shadow -Wno-four-char-constants -Wno-conversion -Wno-constant-conversion -Wno-int-conversion -Wno-bool-conversion -Wno-enum-conversion -Wno-shorten-64-to-32 -Wpointer-sign -Wno-newline-eof -Wno-selector -Wno-strict-selector-match -Wno-undeclared-selector -Wno-deprecated-implementations -isysroot /Applications/Xcode.app/Contents/Developer/Platforms/MacOSX.platform/Developer/SDKs/MacOSX10.12.sdk -fasm-blocks -fstrict-aliasing -Wprotocol -Wdeprecated-declarations -mmacosx-version-min=10.12 -g -Wno-sign-conversion -Wno-infinite-recursion -I/Development/local/10_12/var/macports/build/_Development_sources_MacPorts_trunk_dports_aqua_aquaterm/aquaterm/work/AquaTerm-1.1.1/aquaterm/build/AquaTerm.build/Default/AQTFwk.build/AquaTerm.hmap -I/Development/local/10_12/var/macports/build/_Development_sources_MacPorts_trunk_dports_aqua_aquaterm/aquaterm/work/AquaTerm-1.1.1/aquaterm/build/Default/include -I/Development/local/10_12/var/macports/build/_Development_sources_MacPorts_trunk_dports_aqua_aquaterm/aquaterm/work/AquaTerm-1.1.1/aquaterm/build/AquaTerm.build/Default/AQTFwk.build/DerivedSources/x86_64 -I/Development/local/10_12/var/macports/build/_Development_sources_MacPorts_trunk_dports_aqua_aquaterm/aquaterm/work/AquaTerm-1.1.1/aquaterm/build/AquaTerm.build/Default/AQTFwk.build/DerivedSources -Wmost -Wno-four-char-constants -Wno-unknown-pragmas -F/Development/local/10_12/var/macports/build/_Development_sources_MacPorts_trunk_dports_aqua_aquaterm/aquaterm/work/AquaTerm-1.1.1/aquaterm/build/Default -MD -MT dependencies -MF /Development/local/10_12/var/macports/build/_Development_sources_MacPorts_trunk_dports_aqua_aquaterm/aquaterm/work/AquaTerm-1.1.1/aquaterm/build/SharedPrecompiledHeaders/AppKit-gdnhrywcmpbgcxbovxkmxwrsbjmc/AppKit.h.d -c /Applications/Xcode.app/Contents/Developer/Platforms/MacOSX.platform/Developer/SDKs/MacOSX10.12.sdk/System/Library/Frameworks/AppKit.framework/Headers/AppKit.h -o /Development/local/10_12/var/macports/build/_Development_sources_MacPorts_trunk_dports_aqua_aquaterm/aquaterm/work/AquaTerm-1.1.1/aquaterm/build/SharedPrecompiledHeaders/AppKit-gdnhrywcmpbgcxbovxkmxwrsbjmc/AppKit.h.pch --serialize-diagnostics /Development/local/10_12/var/macports/build/_Development_sources_MacPorts_trunk_dports_aqua_aquaterm/aquaterm/work/AquaTerm-1.1.1/aquaterm/build/SharedPrecompiledHeaders/AppKit-gdnhrywcmpbgcxbovxkmxwrsbjmc/AppKit.h.dia
193:info:build 2016-09-22 10:54:52.781 xcodebuild[28972:6101750] couldn't write: Error Domain=NSCocoaErrorDomain Code=513 "You don’t have permission to save the file “AppKit.h.data” in the folder “AppKit-gdnhrywcmpbgcxbovxkmxwrsbjmc”." UserInfo={NSURL=file:///Development/local/10_12/var/macports/build/_Development_sources_MacPorts_trunk_dports_aqua_aquaterm/aquaterm/work/AquaTerm-1.1.1/aquaterm/build/SharedPrecompiledHeaders/AppKit-gdnhrywcmpbgcxbovxkmxwrsbjmc/AppKit.h.data, NSUserStringVariant=Folder, NSUnderlyingError=0x7fe208ae6b40 {Error Domain=NSPOSIXErrorDomain Code=1 "Operation not permitted"}}
194:info:build CompileC build/AquaTerm.build/Default/AQTFwk.build/Objects-normal/x86_64/AQTPlotBuilder.o AQTPlotBuilder.m normal x86_64 objective-c com.apple.compilers.llvm.clang.1_0.compiler
195:info:build     cd /Development/local/10_12/var/macports/build/_Development_sources_MacPorts_trunk_dports_aqua_aquaterm/aquaterm/work/AquaTerm-1.1.1/aquaterm
196:info:build     export LANG=en_US.US-ASCII
197:info:build     /Applications/Xcode.app/Contents/Developer/Toolchains/XcodeDefault.xctoolchain/usr/bin/clang -x objective-c -arch x86_64 -fmessage-length=0 -fdiagnostics-show-note-include-stack -fmacro-backtrace-limit=0 -gmodules -Wno-trigraphs -fpascal-strings -Os -Wno-missing-field-initializers -Wno-missing-prototypes -Wno-return-type -Wno-implicit-atomic-properties -Wno-arc-repeated-use-of-weak -Wno-missing-braces -Wparentheses -Wswitch -Wno-unused-function -Wno-unused-label -Wno-unused-parameter -Wno-unused-variable -Wunused-value -Wno-empty-body -Wno-uninitialized -Wno-unknown-pragmas -Wno-shadow -Wno-four-char-constants -Wno-conversion -Wno-constant-conversion -Wno-int-conversion -Wno-bool-conversion -Wno-enum-conversion -Wno-shorten-64-to-32 -Wpointer-sign -Wno-newline-eof -Wno-selector -Wno-strict-selector-match -Wno-undeclared-selector -Wno-deprecated-implementations -isysroot /Applications/Xcode.app/Contents/Developer/Platforms/MacOSX.platform/Developer/SDKs/MacOSX10.12.sdk -fasm-blocks -fstrict-aliasing -Wprotocol -Wdeprecated-declarations -mmacosx-version-min=10.12 -g -Wno-sign-conversion -Wno-infinite-recursion -I/Development/local/10_12/var/macports/build/_Development_sources_MacPorts_trunk_dports_aqua_aquaterm/aquaterm/work/AquaTerm-1.1.1/aquaterm/build/AquaTerm.build/Default/AQTFwk.build/AquaTerm.hmap -I/Development/local/10_12/var/macports/build/_Development_sources_MacPorts_trunk_dports_aqua_aquaterm/aquaterm/work/AquaTerm-1.1.1/aquaterm/build/Default/include -I/Development/local/10_12/var/macports/build/_Development_sources_MacPorts_trunk_dports_aqua_aquaterm/aquaterm/work/AquaTerm-1.1.1/aquaterm/build/AquaTerm.build/Default/AQTFwk.build/DerivedSources/x86_64 -I/Development/local/10_12/var/macports/build/_Development_sources_MacPorts_trunk_dports_aqua_aquaterm/aquaterm/work/AquaTerm-1.1.1/aquaterm/build/AquaTerm.build/Default/AQTFwk.build/DerivedSources -Wmost -Wno-four-char-constants -Wno-unknown-pragmas -F/Development/local/10_12/var/macports/build/_Development_sources_MacPorts_trunk_dports_aqua_aquaterm/aquaterm/work/AquaTerm-1.1.1/aquaterm/build/Default -include /Development/local/10_12/var/macports/build/_Development_sources_MacPorts_trunk_dports_aqua_aquaterm/aquaterm/work/AquaTerm-1.1.1/aquaterm/build/SharedPrecompiledHeaders/AppKit-gdnhrywcmpbgcxbovxkmxwrsbjmc/AppKit.h -MMD -MT dependencies -MF /Development/local/10_12/var/macports/build/_Development_sources_MacPorts_trunk_dports_aqua_aquaterm/aquaterm/work/AquaTerm-1.1.1/aquaterm/build/AquaTerm.build/Default/AQTFwk.build/Objects-normal/x86_64/AQTPlotBuilder.d --serialize-diagnostics /Development/local/10_12/var/macports/build/_Development_sources_MacPorts_trunk_dports_aqua_aquaterm/aquaterm/work/AquaTerm-1.1.1/aquaterm/build/AquaTerm.build/Default/AQTFwk.build/Objects-normal/x86_64/AQTPlotBuilder.dia -c /Development/local/10_12/var/macports/build/_Development_sources_MacPorts_trunk_dports_aqua_aquaterm/aquaterm/work/AquaTerm-1.1.1/aquaterm/AQTPlotBuilder.m -o /Development/local/10_12/var/macports/build/_Development_sources_MacPorts_trunk_dports_aqua_aquaterm/aquaterm/work/AquaTerm-1.1.1/aquaterm/build/AquaTerm.build/Default/AQTFwk.build/Objects-normal/x86_64/AQTPlotBuilder.o
198:info:build CompileC build/AquaTerm.build/Default/AQTFwk.build/Objects-normal/x86_64/aquaterm.o aquaterm.m normal x86_64 objective-c com.apple.compilers.llvm.clang.1_0.compiler
199:info:build     cd /Development/local/10_12/var/macports/build/_Development_sources_MacPorts_trunk_dports_aqua_aquaterm/aquaterm/work/AquaTerm-1.1.1/aquaterm
200:info:build     export LANG=en_US.US-ASCII
201:info:build     /Applications/Xcode.app/Contents/Developer/Toolchains/XcodeDefault.xctoolchain/usr/bin/clang -x objective-c -arch x86_64 -fmessage-length=0 -fdiagnostics-show-note-include-stack -fmacro-backtrace-limit=0 -gmodules -Wno-trigraphs -fpascal-strings -Os -Wno-missing-field-initializers -Wno-missing-prototypes -Wno-return-type -Wno-implicit-atomic-properties -Wno-arc-repeated-use-of-weak -Wno-missing-braces -Wparentheses -Wswitch -Wno-unused-function -Wno-unused-label -Wno-unused-parameter -Wno-unused-variable -Wunused-value -Wno-empty-body -Wno-uninitialized -Wno-unknown-pragmas -Wno-shadow -Wno-four-char-constants -Wno-conversion -Wno-constant-conversion -Wno-int-conversion -Wno-bool-conversion -Wno-enum-conversion -Wno-shorten-64-to-32 -Wpointer-sign -Wno-newline-eof -Wno-selector -Wno-strict-selector-match -Wno-undeclared-selector -Wno-deprecated-implementations -isysroot /Applications/Xcode.app/Contents/Developer/Platforms/MacOSX.platform/Developer/SDKs/MacOSX10.12.sdk -fasm-blocks -fstrict-aliasing -Wprotocol -Wdeprecated-declarations -mmacosx-version-min=10.12 -g -Wno-sign-conversion -Wno-infinite-recursion -I/Development/local/10_12/var/macports/build/_Development_sources_MacPorts_trunk_dports_aqua_aquaterm/aquaterm/work/AquaTerm-1.1.1/aquaterm/build/AquaTerm.build/Default/AQTFwk.build/AquaTerm.hmap -I/Development/local/10_12/var/macports/build/_Development_sources_MacPorts_trunk_dports_aqua_aquaterm/aquaterm/work/AquaTerm-1.1.1/aquaterm/build/Default/include -I/Development/local/10_12/var/macports/build/_Development_sources_MacPorts_trunk_dports_aqua_aquaterm/aquaterm/work/AquaTerm-1.1.1/aquaterm/build/AquaTerm.build/Default/AQTFwk.build/DerivedSources/x86_64 -I/Development/local/10_12/var/macports/build/_Development_sources_MacPorts_trunk_dports_aqua_aquaterm/aquaterm/work/AquaTerm-1.1.1/aquaterm/build/AquaTerm.build/Default/AQTFwk.build/DerivedSources -Wmost -Wno-four-char-constants -Wno-unknown-pragmas -F/Development/local/10_12/var/macports/build/_Development_sources_MacPorts_trunk_dports_aqua_aquaterm/aquaterm/work/AquaTerm-1.1.1/aquaterm/build/Default -include /Development/local/10_12/var/macports/build/_Development_sources_MacPorts_trunk_dports_aqua_aquaterm/aquaterm/work/AquaTerm-1.1.1/aquaterm/build/SharedPrecompiledHeaders/AppKit-gdnhrywcmpbgcxbovxkmxwrsbjmc/AppKit.h -MMD -MT dependencies -MF /Development/local/10_12/var/macports/build/_Development_sources_MacPorts_trunk_dports_aqua_aquaterm/aquaterm/work/AquaTerm-1.1.1/aquaterm/build/AquaTerm.build/Default/AQTFwk.build/Objects-normal/x86_64/aquaterm.d --serialize-diagnostics /Development/local/10_12/var/macports/build/_Development_sources_MacPorts_trunk_dports_aqua_aquaterm/aquaterm/work/AquaTerm-1.1.1/aquaterm/build/AquaTerm.build/Default/AQTFwk.build/Objects-normal/x86_64/aquaterm.dia -c /Development/local/10_12/var/macports/build/_Development_sources_MacPorts_trunk_dports_aqua_aquaterm/aquaterm/work/AquaTerm-1.1.1/aquaterm/aquaterm.m -o /Development/local/10_12/var/macports/build/_Development_sources_MacPorts_trunk_dports_aqua_aquaterm/aquaterm/work/AquaTerm-1.1.1/aquaterm/build/AquaTerm.build/Default/AQTFwk.build/Objects-normal/x86_64/aquaterm.o
202:info:build CompileC build/AquaTerm.build/Default/AQTFwk.build/Objects-normal/x86_64/AQTClientManager.o AQTClientManager.m normal x86_64 objective-c com.apple.compilers.llvm.clang.1_0.compiler
203:info:build     cd /Development/local/10_12/var/macports/build/_Development_sources_MacPorts_trunk_dports_aqua_aquaterm/aquaterm/work/AquaTerm-1.1.1/aquaterm
204:info:build     export LANG=en_US.US-ASCII
205:info:build     /Applications/Xcode.app/Contents/Developer/Toolchains/XcodeDefault.xctoolchain/usr/bin/clang -x objective-c -arch x86_64 -fmessage-length=0 -fdiagnostics-show-note-include-stack -fmacro-backtrace-limit=0 -gmodules -Wno-trigraphs -fpascal-strings -Os -Wno-missing-field-initializers -Wno-missing-prototypes -Wno-return-type -Wno-implicit-atomic-properties -Wno-arc-repeated-use-of-weak -Wno-missing-braces -Wparentheses -Wswitch -Wno-unused-function -Wno-unused-label -Wno-unused-parameter -Wno-unused-variable -Wunused-value -Wno-empty-body -Wno-uninitialized -Wno-unknown-pragmas -Wno-shadow -Wno-four-char-constants -Wno-conversion -Wno-constant-conversion -Wno-int-conversion -Wno-bool-conversion -Wno-enum-conversion -Wno-shorten-64-to-32 -Wpointer-sign -Wno-newline-eof -Wno-selector -Wno-strict-selector-match -Wno-undeclared-selector -Wno-deprecated-implementations -isysroot /Applications/Xcode.app/Contents/Developer/Platforms/MacOSX.platform/Developer/SDKs/MacOSX10.12.sdk -fasm-blocks -fstrict-aliasing -Wprotocol -Wdeprecated-declarations -mmacosx-version-min=10.12 -g -Wno-sign-conversion -Wno-infinite-recursion -I/Development/local/10_12/var/macports/build/_Development_sources_MacPorts_trunk_dports_aqua_aquaterm/aquaterm/work/AquaTerm-1.1.1/aquaterm/build/AquaTerm.build/Default/AQTFwk.build/AquaTerm.hmap -I/Development/local/10_12/var/macports/build/_Development_sources_MacPorts_trunk_dports_aqua_aquaterm/aquaterm/work/AquaTerm-1.1.1/aquaterm/build/Default/include -I/Development/local/10_12/var/macports/build/_Development_sources_MacPorts_trunk_dports_aqua_aquaterm/aquaterm/work/AquaTerm-1.1.1/aquaterm/build/AquaTerm.build/Default/AQTFwk.build/DerivedSources/x86_64 -I/Development/local/10_12/var/macports/build/_Development_sources_MacPorts_trunk_dports_aqua_aquaterm/aquaterm/work/AquaTerm-1.1.1/aquaterm/build/AquaTerm.build/Default/AQTFwk.build/DerivedSources -Wmost -Wno-four-char-constants -Wno-unknown-pragmas -F/Development/local/10_12/var/macports/build/_Development_sources_MacPorts_trunk_dports_aqua_aquaterm/aquaterm/work/AquaTerm-1.1.1/aquaterm/build/Default -include /Development/local/10_12/var/macports/build/_Development_sources_MacPorts_trunk_dports_aqua_aquaterm/aquaterm/work/AquaTerm-1.1.1/aquaterm/build/SharedPrecompiledHeaders/AppKit-gdnhrywcmpbgcxbovxkmxwrsbjmc/AppKit.h -MMD -MT dependencies -MF /Development/local/10_12/var/macports/build/_Development_sources_MacPorts_trunk_dports_aqua_aquaterm/aquaterm/work/AquaTerm-1.1.1/aquaterm/build/AquaTerm.build/Default/AQTFwk.build/Objects-normal/x86_64/AQTClientManager.d --serialize-diagnostics /Development/local/10_12/var/macports/build/_Development_sources_MacPorts_trunk_dports_aqua_aquaterm/aquaterm/work/AquaTerm-1.1.1/aquaterm/build/AquaTerm.build/Default/AQTFwk.build/Objects-normal/x86_64/AQTClientManager.dia -c /Development/local/10_12/var/macports/build/_Development_sources_MacPorts_trunk_dports_aqua_aquaterm/aquaterm/work/AquaTerm-1.1.1/aquaterm/AQTClientManager.m -o /Development/local/10_12/var/macports/build/_Development_sources_MacPorts_trunk_dports_aqua_aquaterm/aquaterm/work/AquaTerm-1.1.1/aquaterm/build/AquaTerm.build/Default/AQTFwk.build/Objects-normal/x86_64/AQTClientManager.o
206:info:build /Development/local/10_12/var/macports/build/_Development_sources_MacPorts_trunk_dports_aqua_aquaterm/aquaterm/work/AquaTerm-1.1.1/aquaterm/AQTClientManager.m:156:19: warning: 'LSFindApplicationForInfo' is deprecated: first deprecated in macOS 10.10 - Use LSCopyApplicationURLsForBundleIdentifier instead. [-Wdeprecated-declarations]
207:info:build          status = LSFindApplicationForInfo('AqTS', NULL, NULL, NULL, (CFURLRef *)&tmpURL);
208:info:build                   ^
209:info:build In file included from /Development/local/10_12/var/macports/build/_Development_sources_MacPorts_trunk_dports_aqua_aquaterm/aquaterm/work/AquaTerm-1.1.1/aquaterm/AQTClientManager.m:1:
210:info:build In file included from /Applications/Xcode.app/Contents/Developer/Platforms/MacOSX.platform/Developer/SDKs/MacOSX10.12.sdk/System/Library/Frameworks/AppKit.framework/Headers/AppKit.h:10:
211:info:build In file included from /Applications/Xcode.app/Contents/Developer/Platforms/MacOSX.platform/Developer/SDKs/MacOSX10.12.sdk/System/Library/Frameworks/Foundation.framework/Headers/Foundation.h:87:
212:info:build In file included from /Applications/Xcode.app/Contents/Developer/Platforms/MacOSX.platform/Developer/SDKs/MacOSX10.12.sdk/System/Library/Frameworks/Foundation.framework/Headers/NSURLError.h:14:
213:info:build In file included from /Applications/Xcode.app/Contents/Developer/Platforms/MacOSX.platform/Developer/SDKs/MacOSX10.12.sdk/System/Library/Frameworks/CoreServices.framework/Headers/CoreServices.h:39:
214:info:build In file included from /Applications/Xcode.app/Contents/Developer/Platforms/MacOSX.platform/Developer/SDKs/MacOSX10.12.sdk/System/Library/Frameworks/CoreServices.framework/Frameworks/LaunchServices.framework/Headers/LaunchServices.h:27:
215:info:build In file included from /Applications/Xcode.app/Contents/Developer/Platforms/MacOSX.platform/Developer/SDKs/MacOSX10.12.sdk/System/Library/Frameworks/CoreServices.framework/Frameworks/LaunchServices.framework/Headers/LSInfo.h:530:
216:info:build /Applications/Xcode.app/Contents/Developer/Platforms/MacOSX.platform/Developer/SDKs/MacOSX10.12.sdk/System/Library/Frameworks/CoreServices.framework/Frameworks/LaunchServices.framework/Headers/LSInfoDeprecated.h:785:1: note: 'LSFindApplicationForInfo' has been explicitly marked deprecated here
217:info:build LSFindApplicationForInfo(
218:info:build ^
219:info:build /Development/local/10_12/var/macports/build/_Development_sources_MacPorts_trunk_dports_aqua_aquaterm/aquaterm/work/AquaTerm-1.1.1/aquaterm/AQTClientManager.m:190:83: warning: values of type 'NSInteger' should not be used as format arguments; add an explicit cast to 'long' instead [-Wformat]
220:info:build    [self logMessage:_activePlotKey?[NSString stringWithFormat:@"Active plot: %d", [_activePlotKey integerValue]]:@"**** plot invalid ****"
221:info:build                                                                              ~~   ^~~~~~~~~~~~~~~~~~~~~~~~~~~~~
222:info:build                                                                              %ld  (long)
223:info:build /Development/local/10_12/var/macports/build/_Development_sources_MacPorts_trunk_dports_aqua_aquaterm/aquaterm/work/AquaTerm-1.1.1/aquaterm/AQTClientManager.m:407:1: warning: conflicting distributed object modifiers on return type in implementation of 'processEvent:sender:' [-Wdistributed-object-modifiers]
224:info:build - (void)processEvent:(NSString *)event sender:(id)sender
225:info:build ^  ~~~~
226:info:build In file included from /Development/local/10_12/var/macports/build/_Development_sources_MacPorts_trunk_dports_aqua_aquaterm/aquaterm/work/AquaTerm-1.1.1/aquaterm/AQTClientManager.m:9:
227:info:build In file included from /Development/local/10_12/var/macports/build/_Development_sources_MacPorts_trunk_dports_aqua_aquaterm/aquaterm/work/AquaTerm-1.1.1/aquaterm/AQTClientManager.h:11:
228:info:build /Development/local/10_12/var/macports/build/_Development_sources_MacPorts_trunk_dports_aqua_aquaterm/aquaterm/work/AquaTerm-1.1.1/aquaterm/AQTEventProtocol.h:2:1: note: previous declaration is here
229:info:build - (oneway void)processEvent:(bycopy NSString *)event sender:(id)sender;
230:info:build ^         ~~~~
231:info:build /Development/local/10_12/var/macports/build/_Development_sources_MacPorts_trunk_dports_aqua_aquaterm/aquaterm/work/AquaTerm-1.1.1/aquaterm/AQTClientManager.m:407:34: warning: conflicting distributed object modifiers on parameter type in implementation of 'processEvent:sender:' [-Wdistributed-object-modifiers]
232:info:build - (void)processEvent:(NSString *)event sender:(id)sender
233:info:build                       ~~~~~~~~~~ ^
234:info:build In file included from /Development/local/10_12/var/macports/build/_Development_sources_MacPorts_trunk_dports_aqua_aquaterm/aquaterm/work/AquaTerm-1.1.1/aquaterm/AQTClientManager.m:9:
235:info:build In file included from /Development/local/10_12/var/macports/build/_Development_sources_MacPorts_trunk_dports_aqua_aquaterm/aquaterm/work/AquaTerm-1.1.1/aquaterm/AQTClientManager.h:11:
236:info:build /Development/local/10_12/var/macports/build/_Development_sources_MacPorts_trunk_dports_aqua_aquaterm/aquaterm/work/AquaTerm-1.1.1/aquaterm/AQTEventProtocol.h:2:48: note: previous declaration is here
237:info:build - (oneway void)processEvent:(bycopy NSString *)event sender:(id)sender;
238:info:build                                     ~~~~~~~~~~ ^
239:info:build /Development/local/10_12/var/macports/build/_Development_sources_MacPorts_trunk_dports_aqua_aquaterm/aquaterm/work/AquaTerm-1.1.1/aquaterm/AQTClientManager.m:402:1: warning: conflicting distributed object modifiers on return type in implementation of 'ping' [-Wdistributed-object-modifiers]
240:info:build - (void)ping
241:info:build ^  ~~~~
242:info:build In file included from /Development/local/10_12/var/macports/build/_Development_sources_MacPorts_trunk_dports_aqua_aquaterm/aquaterm/work/AquaTerm-1.1.1/aquaterm/AQTClientManager.m:9:
243:info:build In file included from /Development/local/10_12/var/macports/build/_Development_sources_MacPorts_trunk_dports_aqua_aquaterm/aquaterm/work/AquaTerm-1.1.1/aquaterm/AQTClientManager.h:11:
244:info:build /Development/local/10_12/var/macports/build/_Development_sources_MacPorts_trunk_dports_aqua_aquaterm/aquaterm/work/AquaTerm-1.1.1/aquaterm/AQTEventProtocol.h:3:1: note: previous declaration is here
245:info:build - (oneway void)ping;
246:info:build ^         ~~~~
247:info:build 5 warnings generated.
248:info:build CompileC build/AquaTerm.build/Default/AQTFwk.build/Objects-normal/x86_64/AQTColorMap.o AQTColorMap.m normal x86_64 objective-c com.apple.compilers.llvm.clang.1_0.compiler
249:info:build     cd /Development/local/10_12/var/macports/build/_Development_sources_MacPorts_trunk_dports_aqua_aquaterm/aquaterm/work/AquaTerm-1.1.1/aquaterm
250:info:build     export LANG=en_US.US-ASCII
251:info:build     /Applications/Xcode.app/Contents/Developer/Toolchains/XcodeDefault.xctoolchain/usr/bin/clang -x objective-c -arch x86_64 -fmessage-length=0 -fdiagnostics-show-note-include-stack -fmacro-backtrace-limit=0 -gmodules -Wno-trigraphs -fpascal-strings -Os -Wno-missing-field-initializers -Wno-missing-prototypes -Wno-return-type -Wno-implicit-atomic-properties -Wno-arc-repeated-use-of-weak -Wno-missing-braces -Wparentheses -Wswitch -Wno-unused-function -Wno-unused-label -Wno-unused-parameter -Wno-unused-variable -Wunused-value -Wno-empty-body -Wno-uninitialized -Wno-unknown-pragmas -Wno-shadow -Wno-four-char-constants -Wno-conversion -Wno-constant-conversion -Wno-int-conversion -Wno-bool-conversion -Wno-enum-conversion -Wno-shorten-64-to-32 -Wpointer-sign -Wno-newline-eof -Wno-selector -Wno-strict-selector-match -Wno-undeclared-selector -Wno-deprecated-implementations -isysroot /Applications/Xcode.app/Contents/Developer/Platforms/MacOSX.platform/Developer/SDKs/MacOSX10.12.sdk -fasm-blocks -fstrict-aliasing -Wprotocol -Wdeprecated-declarations -mmacosx-version-min=10.12 -g -Wno-sign-conversion -Wno-infinite-recursion -I/Development/local/10_12/var/macports/build/_Development_sources_MacPorts_trunk_dports_aqua_aquaterm/aquaterm/work/AquaTerm-1.1.1/aquaterm/build/AquaTerm.build/Default/AQTFwk.build/AquaTerm.hmap -I/Development/local/10_12/var/macports/build/_Development_sources_MacPorts_trunk_dports_aqua_aquaterm/aquaterm/work/AquaTerm-1.1.1/aquaterm/build/Default/include -I/Development/local/10_12/var/macports/build/_Development_sources_MacPorts_trunk_dports_aqua_aquaterm/aquaterm/work/AquaTerm-1.1.1/aquaterm/build/AquaTerm.build/Default/AQTFwk.build/DerivedSources/x86_64 -I/Development/local/10_12/var/macports/build/_Development_sources_MacPorts_trunk_dports_aqua_aquaterm/aquaterm/work/AquaTerm-1.1.1/aquaterm/build/AquaTerm.build/Default/AQTFwk.build/DerivedSources -Wmost -Wno-four-char-constants -Wno-unknown-pragmas -F/Development/local/10_12/var/macports/build/_Development_sources_MacPorts_trunk_dports_aqua_aquaterm/aquaterm/work/AquaTerm-1.1.1/aquaterm/build/Default -include /Development/local/10_12/var/macports/build/_Development_sources_MacPorts_trunk_dports_aqua_aquaterm/aquaterm/work/AquaTerm-1.1.1/aquaterm/build/SharedPrecompiledHeaders/AppKit-gdnhrywcmpbgcxbovxkmxwrsbjmc/AppKit.h -MMD -MT dependencies -MF /Development/local/10_12/var/macports/build/_Development_sources_MacPorts_trunk_dports_aqua_aquaterm/aquaterm/work/AquaTerm-1.1.1/aquaterm/build/AquaTerm.build/Default/AQTFwk.build/Objects-normal/x86_64/AQTColorMap.d --serialize-diagnostics /Development/local/10_12/var/macports/build/_Development_sources_MacPorts_trunk_dports_aqua_aquaterm/aquaterm/work/AquaTerm-1.1.1/aquaterm/build/AquaTerm.build/Default/AQTFwk.build/Objects-normal/x86_64/AQTColorMap.dia -c /Development/local/10_12/var/macports/build/_Development_sources_MacPorts_trunk_dports_aqua_aquaterm/aquaterm/work/AquaTerm-1.1.1/aquaterm/AQTColorMap.m -o /Development/local/10_12/var/macports/build/_Development_sources_MacPorts_trunk_dports_aqua_aquaterm/aquaterm/work/AquaTerm-1.1.1/aquaterm/build/AquaTerm.build/Default/AQTFwk.build/Objects-normal/x86_64/AQTColorMap.o
252:info:build CompileC build/AquaTerm.build/Default/AQTFwk.build/Objects-normal/x86_64/AQTGraphic.o AQTGraphic.m normal x86_64 objective-c com.apple.compilers.llvm.clang.1_0.compiler
253:info:build     cd /Development/local/10_12/var/macports/build/_Development_sources_MacPorts_trunk_dports_aqua_aquaterm/aquaterm/work/AquaTerm-1.1.1/aquaterm
254:info:build     export LANG=en_US.US-ASCII
255:info:build     /Applications/Xcode.app/Contents/Developer/Toolchains/XcodeDefault.xctoolchain/usr/bin/clang -x objective-c -arch x86_64 -fmessage-length=0 -fdiagnostics-show-note-include-stack -fmacro-backtrace-limit=0 -gmodules -Wno-trigraphs -fpascal-strings -Os -Wno-missing-field-initializers -Wno-missing-prototypes -Wno-return-type -Wno-implicit-atomic-properties -Wno-arc-repeated-use-of-weak -Wno-missing-braces -Wparentheses -Wswitch -Wno-unused-function -Wno-unused-label -Wno-unused-parameter -Wno-unused-variable -Wunused-value -Wno-empty-body -Wno-uninitialized -Wno-unknown-pragmas -Wno-shadow -Wno-four-char-constants -Wno-conversion -Wno-constant-conversion -Wno-int-conversion -Wno-bool-conversion -Wno-enum-conversion -Wno-shorten-64-to-32 -Wpointer-sign -Wno-newline-eof -Wno-selector -Wno-strict-selector-match -Wno-undeclared-selector -Wno-deprecated-implementations -isysroot /Applications/Xcode.app/Contents/Developer/Platforms/MacOSX.platform/Developer/SDKs/MacOSX10.12.sdk -fasm-blocks -fstrict-aliasing -Wprotocol -Wdeprecated-declarations -mmacosx-version-min=10.12 -g -Wno-sign-conversion -Wno-infinite-recursion -I/Development/local/10_12/var/macports/build/_Development_sources_MacPorts_trunk_dports_aqua_aquaterm/aquaterm/work/AquaTerm-1.1.1/aquaterm/build/AquaTerm.build/Default/AQTFwk.build/AquaTerm.hmap -I/Development/local/10_12/var/macports/build/_Development_sources_MacPorts_trunk_dports_aqua_aquaterm/aquaterm/work/AquaTerm-1.1.1/aquaterm/build/Default/include -I/Development/local/10_12/var/macports/build/_Development_sources_MacPorts_trunk_dports_aqua_aquaterm/aquaterm/work/AquaTerm-1.1.1/aquaterm/build/AquaTerm.build/Default/AQTFwk.build/DerivedSources/x86_64 -I/Development/local/10_12/var/macports/build/_Development_sources_MacPorts_trunk_dports_aqua_aquaterm/aquaterm/work/AquaTerm-1.1.1/aquaterm/build/AquaTerm.build/Default/AQTFwk.build/DerivedSources -Wmost -Wno-four-char-constants -Wno-unknown-pragmas -F/Development/local/10_12/var/macports/build/_Development_sources_MacPorts_trunk_dports_aqua_aquaterm/aquaterm/work/AquaTerm-1.1.1/aquaterm/build/Default -include /Development/local/10_12/var/macports/build/_Development_sources_MacPorts_trunk_dports_aqua_aquaterm/aquaterm/work/AquaTerm-1.1.1/aquaterm/build/SharedPrecompiledHeaders/AppKit-gdnhrywcmpbgcxbovxkmxwrsbjmc/AppKit.h -MMD -MT dependencies -MF /Development/local/10_12/var/macports/build/_Development_sources_MacPorts_trunk_dports_aqua_aquaterm/aquaterm/work/AquaTerm-1.1.1/aquaterm/build/AquaTerm.build/Default/AQTFwk.build/Objects-normal/x86_64/AQTGraphic.d --serialize-diagnostics /Development/local/10_12/var/macports/build/_Development_sources_MacPorts_trunk_dports_aqua_aquaterm/aquaterm/work/AquaTerm-1.1.1/aquaterm/build/AquaTerm.build/Default/AQTFwk.build/Objects-normal/x86_64/AQTGraphic.dia -c /Development/local/10_12/var/macports/build/_Development_sources_MacPorts_trunk_dports_aqua_aquaterm/aquaterm/work/AquaTerm-1.1.1/aquaterm/AQTGraphic.m -o /Development/local/10_12/var/macports/build/_Development_sources_MacPorts_trunk_dports_aqua_aquaterm/aquaterm/work/AquaTerm-1.1.1/aquaterm/build/AquaTerm.build/Default/AQTFwk.build/Objects-normal/x86_64/AQTGraphic.o
256:info:build CompileC build/AquaTerm.build/Default/AQTFwk.build/Objects-normal/x86_64/AQTAdapter.o AQTAdapter.m normal x86_64 objective-c com.apple.compilers.llvm.clang.1_0.compiler
257:info:build     cd /Development/local/10_12/var/macports/build/_Development_sources_MacPorts_trunk_dports_aqua_aquaterm/aquaterm/work/AquaTerm-1.1.1/aquaterm
258:info:build     export LANG=en_US.US-ASCII
259:info:build     /Applications/Xcode.app/Contents/Developer/Toolchains/XcodeDefault.xctoolchain/usr/bin/clang -x objective-c -arch x86_64 -fmessage-length=0 -fdiagnostics-show-note-include-stack -fmacro-backtrace-limit=0 -gmodules -Wno-trigraphs -fpascal-strings -Os -Wno-missing-field-initializers -Wno-missing-prototypes -Wno-return-type -Wno-implicit-atomic-properties -Wno-arc-repeated-use-of-weak -Wno-missing-braces -Wparentheses -Wswitch -Wno-unused-function -Wno-unused-label -Wno-unused-parameter -Wno-unused-variable -Wunused-value -Wno-empty-body -Wno-uninitialized -Wno-unknown-pragmas -Wno-shadow -Wno-four-char-constants -Wno-conversion -Wno-constant-conversion -Wno-int-conversion -Wno-bool-conversion -Wno-enum-conversion -Wno-shorten-64-to-32 -Wpointer-sign -Wno-newline-eof -Wno-selector -Wno-strict-selector-match -Wno-undeclared-selector -Wno-deprecated-implementations -isysroot /Applications/Xcode.app/Contents/Developer/Platforms/MacOSX.platform/Developer/SDKs/MacOSX10.12.sdk -fasm-blocks -fstrict-aliasing -Wprotocol -Wdeprecated-declarations -mmacosx-version-min=10.12 -g -Wno-sign-conversion -Wno-infinite-recursion -I/Development/local/10_12/var/macports/build/_Development_sources_MacPorts_trunk_dports_aqua_aquaterm/aquaterm/work/AquaTerm-1.1.1/aquaterm/build/AquaTerm.build/Default/AQTFwk.build/AquaTerm.hmap -I/Development/local/10_12/var/macports/build/_Development_sources_MacPorts_trunk_dports_aqua_aquaterm/aquaterm/work/AquaTerm-1.1.1/aquaterm/build/Default/include -I/Development/local/10_12/var/macports/build/_Development_sources_MacPorts_trunk_dports_aqua_aquaterm/aquaterm/work/AquaTerm-1.1.1/aquaterm/build/AquaTerm.build/Default/AQTFwk.build/DerivedSources/x86_64 -I/Development/local/10_12/var/macports/build/_Development_sources_MacPorts_trunk_dports_aqua_aquaterm/aquaterm/work/AquaTerm-1.1.1/aquaterm/build/AquaTerm.build/Default/AQTFwk.build/DerivedSources -Wmost -Wno-four-char-constants -Wno-unknown-pragmas -F/Development/local/10_12/var/macports/build/_Development_sources_MacPorts_trunk_dports_aqua_aquaterm/aquaterm/work/AquaTerm-1.1.1/aquaterm/build/Default -include /Development/local/10_12/var/macports/build/_Development_sources_MacPorts_trunk_dports_aqua_aquaterm/aquaterm/work/AquaTerm-1.1.1/aquaterm/build/SharedPrecompiledHeaders/AppKit-gdnhrywcmpbgcxbovxkmxwrsbjmc/AppKit.h -MMD -MT dependencies -MF /Development/local/10_12/var/macports/build/_Development_sources_MacPorts_trunk_dports_aqua_aquaterm/aquaterm/work/AquaTerm-1.1.1/aquaterm/build/AquaTerm.build/Default/AQTFwk.build/Objects-normal/x86_64/AQTAdapter.d --serialize-diagnostics /Development/local/10_12/var/macports/build/_Development_sources_MacPorts_trunk_dports_aqua_aquaterm/aquaterm/work/AquaTerm-1.1.1/aquaterm/build/AquaTerm.build/Default/AQTFwk.build/Objects-normal/x86_64/AQTAdapter.dia -c /Development/local/10_12/var/macports/build/_Development_sources_MacPorts_trunk_dports_aqua_aquaterm/aquaterm/work/AquaTerm-1.1.1/aquaterm/AQTAdapter.m -o /Development/local/10_12/var/macports/build/_Development_sources_MacPorts_trunk_dports_aqua_aquaterm/aquaterm/work/AquaTerm-1.1.1/aquaterm/build/AquaTerm.build/Default/AQTFwk.build/Objects-normal/x86_64/AQTAdapter.o
260:info:build /Development/local/10_12/var/macports/build/_Development_sources_MacPorts_trunk_dports_aqua_aquaterm/aquaterm/work/AquaTerm-1.1.1/aquaterm/AQTAdapter.m:79:78: warning: values of type 'NSUInteger' should not be used as format arguments; add an explicit cast to 'unsigned long' instead [-Wformat]
261:info:build    [_clientManager logMessage:[NSString stringWithFormat:@"adapter rc = %d", [self retainCount]] logLevel:3];
262:info:build                                                                         ~~   ^~~~~~~~~~~~~~~~~~
263:info:build                                                                         %lu  (unsigned long)
264:info:build /Development/local/10_12/var/macports/build/_Development_sources_MacPorts_trunk_dports_aqua_aquaterm/aquaterm/work/AquaTerm-1.1.1/aquaterm/AQTAdapter.m:77:1: warning: conflicting distributed object modifiers on return type in implementation of 'release' [-Wdistributed-object-modifiers]
265:info:build - (void)release
266:info:build ^  ~~~~
267:info:build In file included from /Development/local/10_12/var/macports/build/_Development_sources_MacPorts_trunk_dports_aqua_aquaterm/aquaterm/work/AquaTerm-1.1.1/aquaterm/AQTAdapter.m:1:
268:info:build In file included from /Applications/Xcode.app/Contents/Developer/Platforms/MacOSX.platform/Developer/SDKs/MacOSX10.12.sdk/System/Library/Frameworks/AppKit.framework/Headers/AppKit.h:10:
269:info:build In file included from /Applications/Xcode.app/Contents/Developer/Platforms/MacOSX.platform/Developer/SDKs/MacOSX10.12.sdk/System/Library/Frameworks/Foundation.framework/Headers/Foundation.h:6:
270:info:build In file included from /Applications/Xcode.app/Contents/Developer/Platforms/MacOSX.platform/Developer/SDKs/MacOSX10.12.sdk/System/Library/Frameworks/CoreFoundation.framework/Headers/CoreFoundation.h:60:
271:info:build In file included from /Applications/Xcode.app/Contents/Developer/Platforms/MacOSX.platform/Developer/SDKs/MacOSX10.12.sdk/System/Library/Frameworks/CoreFoundation.framework/Headers/CFPropertyList.h:13:
272:info:build In file included from /Applications/Xcode.app/Contents/Developer/Platforms/MacOSX.platform/Developer/SDKs/MacOSX10.12.sdk/System/Library/Frameworks/CoreFoundation.framework/Headers/CFStream.h:15:
273:info:build In file included from /Applications/Xcode.app/Contents/Developer/Platforms/MacOSX.platform/Developer/SDKs/MacOSX10.12.sdk/usr/include/dispatch/dispatch.h:64:
274:info:build In file included from /Applications/Xcode.app/Contents/Developer/Platforms/MacOSX.platform/Developer/SDKs/MacOSX10.12.sdk/usr/include/os/object.h:99:
275:info:build /Applications/Xcode.app/Contents/Developer/Platforms/MacOSX.platform/Developer/SDKs/MacOSX10.12.sdk/usr/include/objc/NSObject.h:37:1: note: previous declaration is here
276:info:build - (oneway void)release OBJC_ARC_UNAVAILABLE;
277:info:build ^         ~~~~
278:info:build 2 warnings generated.
279:info:build CompileC build/AquaTerm.build/Default/AQTFwk.build/Objects-normal/x86_64/AQTImage.o AQTImage.m normal x86_64 objective-c com.apple.compilers.llvm.clang.1_0.compiler
280:info:build     cd /Development/local/10_12/var/macports/build/_Development_sources_MacPorts_trunk_dports_aqua_aquaterm/aquaterm/work/AquaTerm-1.1.1/aquaterm
281:info:build     export LANG=en_US.US-ASCII
282:info:build     /Applications/Xcode.app/Contents/Developer/Toolchains/XcodeDefault.xctoolchain/usr/bin/clang -x objective-c -arch x86_64 -fmessage-length=0 -fdiagnostics-show-note-include-stack -fmacro-backtrace-limit=0 -gmodules -Wno-trigraphs -fpascal-strings -Os -Wno-missing-field-initializers -Wno-missing-prototypes -Wno-return-type -Wno-implicit-atomic-properties -Wno-arc-repeated-use-of-weak -Wno-missing-braces -Wparentheses -Wswitch -Wno-unused-function -Wno-unused-label -Wno-unused-parameter -Wno-unused-variable -Wunused-value -Wno-empty-body -Wno-uninitialized -Wno-unknown-pragmas -Wno-shadow -Wno-four-char-constants -Wno-conversion -Wno-constant-conversion -Wno-int-conversion -Wno-bool-conversion -Wno-enum-conversion -Wno-shorten-64-to-32 -Wpointer-sign -Wno-newline-eof -Wno-selector -Wno-strict-selector-match -Wno-undeclared-selector -Wno-deprecated-implementations -isysroot /Applications/Xcode.app/Contents/Developer/Platforms/MacOSX.platform/Developer/SDKs/MacOSX10.12.sdk -fasm-blocks -fstrict-aliasing -Wprotocol -Wdeprecated-declarations -mmacosx-version-min=10.12 -g -Wno-sign-conversion -Wno-infinite-recursion -I/Development/local/10_12/var/macports/build/_Development_sources_MacPorts_trunk_dports_aqua_aquaterm/aquaterm/work/AquaTerm-1.1.1/aquaterm/build/AquaTerm.build/Default/AQTFwk.build/AquaTerm.hmap -I/Development/local/10_12/var/macports/build/_Development_sources_MacPorts_trunk_dports_aqua_aquaterm/aquaterm/work/AquaTerm-1.1.1/aquaterm/build/Default/include -I/Development/local/10_12/var/macports/build/_Development_sources_MacPorts_trunk_dports_aqua_aquaterm/aquaterm/work/AquaTerm-1.1.1/aquaterm/build/AquaTerm.build/Default/AQTFwk.build/DerivedSources/x86_64 -I/Development/local/10_12/var/macports/build/_Development_sources_MacPorts_trunk_dports_aqua_aquaterm/aquaterm/work/AquaTerm-1.1.1/aquaterm/build/AquaTerm.build/Default/AQTFwk.build/DerivedSources -Wmost -Wno-four-char-constants -Wno-unknown-pragmas -F/Development/local/10_12/var/macports/build/_Development_sources_MacPorts_trunk_dports_aqua_aquaterm/aquaterm/work/AquaTerm-1.1.1/aquaterm/build/Default -include /Development/local/10_12/var/macports/build/_Development_sources_MacPorts_trunk_dports_aqua_aquaterm/aquaterm/work/AquaTerm-1.1.1/aquaterm/build/SharedPrecompiledHeaders/AppKit-gdnhrywcmpbgcxbovxkmxwrsbjmc/AppKit.h -MMD -MT dependencies -MF /Development/local/10_12/var/macports/build/_Development_sources_MacPorts_trunk_dports_aqua_aquaterm/aquaterm/work/AquaTerm-1.1.1/aquaterm/build/AquaTerm.build/Default/AQTFwk.build/Objects-normal/x86_64/AQTImage.d --serialize-diagnostics /Development/local/10_12/var/macports/build/_Development_sources_MacPorts_trunk_dports_aqua_aquaterm/aquaterm/work/AquaTerm-1.1.1/aquaterm/build/AquaTerm.build/Default/AQTFwk.build/Objects-normal/x86_64/AQTImage.dia -c /Development/local/10_12/var/macports/build/_Development_sources_MacPorts_trunk_dports_aqua_aquaterm/aquaterm/work/AquaTerm-1.1.1/aquaterm/AQTImage.m -o /Development/local/10_12/var/macports/build/_Development_sources_MacPorts_trunk_dports_aqua_aquaterm/aquaterm/work/AquaTerm-1.1.1/aquaterm/build/AquaTerm.build/Default/AQTFwk.build/Objects-normal/x86_64/AQTImage.o
283:info:build CompileC build/AquaTerm.build/Default/AQTFwk.build/Objects-normal/x86_64/AQTLabel.o AQTLabel.m normal x86_64 objective-c com.apple.compilers.llvm.clang.1_0.compiler
284:info:build     cd /Development/local/10_12/var/macports/build/_Development_sources_MacPorts_trunk_dports_aqua_aquaterm/aquaterm/work/AquaTerm-1.1.1/aquaterm
285:info:build     export LANG=en_US.US-ASCII
286:info:build     /Applications/Xcode.app/Contents/Developer/Toolchains/XcodeDefault.xctoolchain/usr/bin/clang -x objective-c -arch x86_64 -fmessage-length=0 -fdiagnostics-show-note-include-stack -fmacro-backtrace-limit=0 -gmodules -Wno-trigraphs -fpascal-strings -Os -Wno-missing-field-initializers -Wno-missing-prototypes -Wno-return-type -Wno-implicit-atomic-properties -Wno-arc-repeated-use-of-weak -Wno-missing-braces -Wparentheses -Wswitch -Wno-unused-function -Wno-unused-label -Wno-unused-parameter -Wno-unused-variable -Wunused-value -Wno-empty-body -Wno-uninitialized -Wno-unknown-pragmas -Wno-shadow -Wno-four-char-constants -Wno-conversion -Wno-constant-conversion -Wno-int-conversion -Wno-bool-conversion -Wno-enum-conversion -Wno-shorten-64-to-32 -Wpointer-sign -Wno-newline-eof -Wno-selector -Wno-strict-selector-match -Wno-undeclared-selector -Wno-deprecated-implementations -isysroot /Applications/Xcode.app/Contents/Developer/Platforms/MacOSX.platform/Developer/SDKs/MacOSX10.12.sdk -fasm-blocks -fstrict-aliasing -Wprotocol -Wdeprecated-declarations -mmacosx-version-min=10.12 -g -Wno-sign-conversion -Wno-infinite-recursion -I/Development/local/10_12/var/macports/build/_Development_sources_MacPorts_trunk_dports_aqua_aquaterm/aquaterm/work/AquaTerm-1.1.1/aquaterm/build/AquaTerm.build/Default/AQTFwk.build/AquaTerm.hmap -I/Development/local/10_12/var/macports/build/_Development_sources_MacPorts_trunk_dports_aqua_aquaterm/aquaterm/work/AquaTerm-1.1.1/aquaterm/build/Default/include -I/Development/local/10_12/var/macports/build/_Development_sources_MacPorts_trunk_dports_aqua_aquaterm/aquaterm/work/AquaTerm-1.1.1/aquaterm/build/AquaTerm.build/Default/AQTFwk.build/DerivedSources/x86_64 -I/Development/local/10_12/var/macports/build/_Development_sources_MacPorts_trunk_dports_aqua_aquaterm/aquaterm/work/AquaTerm-1.1.1/aquaterm/build/AquaTerm.build/Default/AQTFwk.build/DerivedSources -Wmost -Wno-four-char-constants -Wno-unknown-pragmas -F/Development/local/10_12/var/macports/build/_Development_sources_MacPorts_trunk_dports_aqua_aquaterm/aquaterm/work/AquaTerm-1.1.1/aquaterm/build/Default -include /Development/local/10_12/var/macports/build/_Development_sources_MacPorts_trunk_dports_aqua_aquaterm/aquaterm/work/AquaTerm-1.1.1/aquaterm/build/SharedPrecompiledHeaders/AppKit-gdnhrywcmpbgcxbovxkmxwrsbjmc/AppKit.h -MMD -MT dependencies -MF /Development/local/10_12/var/macports/build/_Development_sources_MacPorts_trunk_dports_aqua_aquaterm/aquaterm/work/AquaTerm-1.1.1/aquaterm/build/AquaTerm.build/Default/AQTFwk.build/Objects-normal/x86_64/AQTLabel.d --serialize-diagnostics /Development/local/10_12/var/macports/build/_Development_sources_MacPorts_trunk_dports_aqua_aquaterm/aquaterm/work/AquaTerm-1.1.1/aquaterm/build/AquaTerm.build/Default/AQTFwk.build/Objects-normal/x86_64/AQTLabel.dia -c /Development/local/10_12/var/macports/build/_Development_sources_MacPorts_trunk_dports_aqua_aquaterm/aquaterm/work/AquaTerm-1.1.1/aquaterm/AQTLabel.m -o /Development/local/10_12/var/macports/build/_Development_sources_MacPorts_trunk_dports_aqua_aquaterm/aquaterm/work/AquaTerm-1.1.1/aquaterm/build/AquaTerm.build/Default/AQTFwk.build/Objects-normal/x86_64/AQTLabel.o
287:info:build CompileC build/AquaTerm.build/Default/AQTFwk.build/Objects-normal/x86_64/AQTModel.o AQTModel.m normal x86_64 objective-c com.apple.compilers.llvm.clang.1_0.compiler
288:info:build     cd /Development/local/10_12/var/macports/build/_Development_sources_MacPorts_trunk_dports_aqua_aquaterm/aquaterm/work/AquaTerm-1.1.1/aquaterm
289:info:build     export LANG=en_US.US-ASCII
290:info:build     /Applications/Xcode.app/Contents/Developer/Toolchains/XcodeDefault.xctoolchain/usr/bin/clang -x objective-c -arch x86_64 -fmessage-length=0 -fdiagnostics-show-note-include-stack -fmacro-backtrace-limit=0 -gmodules -Wno-trigraphs -fpascal-strings -Os -Wno-missing-field-initializers -Wno-missing-prototypes -Wno-return-type -Wno-implicit-atomic-properties -Wno-arc-repeated-use-of-weak -Wno-missing-braces -Wparentheses -Wswitch -Wno-unused-function -Wno-unused-label -Wno-unused-parameter -Wno-unused-variable -Wunused-value -Wno-empty-body -Wno-uninitialized -Wno-unknown-pragmas -Wno-shadow -Wno-four-char-constants -Wno-conversion -Wno-constant-conversion -Wno-int-conversion -Wno-bool-conversion -Wno-enum-conversion -Wno-shorten-64-to-32 -Wpointer-sign -Wno-newline-eof -Wno-selector -Wno-strict-selector-match -Wno-undeclared-selector -Wno-deprecated-implementations -isysroot /Applications/Xcode.app/Contents/Developer/Platforms/MacOSX.platform/Developer/SDKs/MacOSX10.12.sdk -fasm-blocks -fstrict-aliasing -Wprotocol -Wdeprecated-declarations -mmacosx-version-min=10.12 -g -Wno-sign-conversion -Wno-infinite-recursion -I/Development/local/10_12/var/macports/build/_Development_sources_MacPorts_trunk_dports_aqua_aquaterm/aquaterm/work/AquaTerm-1.1.1/aquaterm/build/AquaTerm.build/Default/AQTFwk.build/AquaTerm.hmap -I/Development/local/10_12/var/macports/build/_Development_sources_MacPorts_trunk_dports_aqua_aquaterm/aquaterm/work/AquaTerm-1.1.1/aquaterm/build/Default/include -I/Development/local/10_12/var/macports/build/_Development_sources_MacPorts_trunk_dports_aqua_aquaterm/aquaterm/work/AquaTerm-1.1.1/aquaterm/build/AquaTerm.build/Default/AQTFwk.build/DerivedSources/x86_64 -I/Development/local/10_12/var/macports/build/_Development_sources_MacPorts_trunk_dports_aqua_aquaterm/aquaterm/work/AquaTerm-1.1.1/aquaterm/build/AquaTerm.build/Default/AQTFwk.build/DerivedSources -Wmost -Wno-four-char-constants -Wno-unknown-pragmas -F/Development/local/10_12/var/macports/build/_Development_sources_MacPorts_trunk_dports_aqua_aquaterm/aquaterm/work/AquaTerm-1.1.1/aquaterm/build/Default -include /Development/local/10_12/var/macports/build/_Development_sources_MacPorts_trunk_dports_aqua_aquaterm/aquaterm/work/AquaTerm-1.1.1/aquaterm/build/SharedPrecompiledHeaders/AppKit-gdnhrywcmpbgcxbovxkmxwrsbjmc/AppKit.h -MMD -MT dependencies -MF /Development/local/10_12/var/macports/build/_Development_sources_MacPorts_trunk_dports_aqua_aquaterm/aquaterm/work/AquaTerm-1.1.1/aquaterm/build/AquaTerm.build/Default/AQTFwk.build/Objects-normal/x86_64/AQTModel.d --serialize-diagnostics /Development/local/10_12/var/macports/build/_Development_sources_MacPorts_trunk_dports_aqua_aquaterm/aquaterm/work/AquaTerm-1.1.1/aquaterm/build/AquaTerm.build/Default/AQTFwk.build/Objects-normal/x86_64/AQTModel.dia -c /Development/local/10_12/var/macports/build/_Development_sources_MacPorts_trunk_dports_aqua_aquaterm/aquaterm/work/AquaTerm-1.1.1/aquaterm/AQTModel.m -o /Development/local/10_12/var/macports/build/_Development_sources_MacPorts_trunk_dports_aqua_aquaterm/aquaterm/work/AquaTerm-1.1.1/aquaterm/build/AquaTerm.build/Default/AQTFwk.build/Objects-normal/x86_64/AQTModel.o
291:info:build /Development/local/10_12/var/macports/build/_Development_sources_MacPorts_trunk_dports_aqua_aquaterm/aquaterm/work/AquaTerm-1.1.1/aquaterm/AQTModel.m:80:150: warning: values of type 'NSUInteger' should not be used as format arguments; add an explicit cast to 'unsigned long' instead [-Wformat]
292:info:build    return [NSString stringWithFormat:@"[AQTModel description] =\nTitle %@\nCanvasSize %@\nCount %d\nBounds %@", title, NSStringFromSize(canvasSize), [modelObjects count],  NSStringFromRect(_bounds)];
293:info:build                                                                                                 ~~                                                   ^~~~~~~~~~~~~~~~~~~~
294:info:build                                                                                                 %lu                                                  (unsigned long)
295:info:build 1 warning generated.
296:info:build CompileC build/AquaTerm.build/Default/AQTFwk.build/Objects-normal/x86_64/AQTPath.o AQTPath.m normal x86_64 objective-c com.apple.compilers.llvm.clang.1_0.compiler
297:info:build     cd /Development/local/10_12/var/macports/build/_Development_sources_MacPorts_trunk_dports_aqua_aquaterm/aquaterm/work/AquaTerm-1.1.1/aquaterm
298:info:build     export LANG=en_US.US-ASCII
299:info:build     /Applications/Xcode.app/Contents/Developer/Toolchains/XcodeDefault.xctoolchain/usr/bin/clang -x objective-c -arch x86_64 -fmessage-length=0 -fdiagnostics-show-note-include-stack -fmacro-backtrace-limit=0 -gmodules -Wno-trigraphs -fpascal-strings -Os -Wno-missing-field-initializers -Wno-missing-prototypes -Wno-return-type -Wno-implicit-atomic-properties -Wno-arc-repeated-use-of-weak -Wno-missing-braces -Wparentheses -Wswitch -Wno-unused-function -Wno-unused-label -Wno-unused-parameter -Wno-unused-variable -Wunused-value -Wno-empty-body -Wno-uninitialized -Wno-unknown-pragmas -Wno-shadow -Wno-four-char-constants -Wno-conversion -Wno-constant-conversion -Wno-int-conversion -Wno-bool-conversion -Wno-enum-conversion -Wno-shorten-64-to-32 -Wpointer-sign -Wno-newline-eof -Wno-selector -Wno-strict-selector-match -Wno-undeclared-selector -Wno-deprecated-implementations -isysroot /Applications/Xcode.app/Contents/Developer/Platforms/MacOSX.platform/Developer/SDKs/MacOSX10.12.sdk -fasm-blocks -fstrict-aliasing -Wprotocol -Wdeprecated-declarations -mmacosx-version-min=10.12 -g -Wno-sign-conversion -Wno-infinite-recursion -I/Development/local/10_12/var/macports/build/_Development_sources_MacPorts_trunk_dports_aqua_aquaterm/aquaterm/work/AquaTerm-1.1.1/aquaterm/build/AquaTerm.build/Default/AQTFwk.build/AquaTerm.hmap -I/Development/local/10_12/var/macports/build/_Development_sources_MacPorts_trunk_dports_aqua_aquaterm/aquaterm/work/AquaTerm-1.1.1/aquaterm/build/Default/include -I/Development/local/10_12/var/macports/build/_Development_sources_MacPorts_trunk_dports_aqua_aquaterm/aquaterm/work/AquaTerm-1.1.1/aquaterm/build/AquaTerm.build/Default/AQTFwk.build/DerivedSources/x86_64 -I/Development/local/10_12/var/macports/build/_Development_sources_MacPorts_trunk_dports_aqua_aquaterm/aquaterm/work/AquaTerm-1.1.1/aquaterm/build/AquaTerm.build/Default/AQTFwk.build/DerivedSources -Wmost -Wno-four-char-constants -Wno-unknown-pragmas -F/Development/local/10_12/var/macports/build/_Development_sources_MacPorts_trunk_dports_aqua_aquaterm/aquaterm/work/AquaTerm-1.1.1/aquaterm/build/Default -include /Development/local/10_12/var/macports/build/_Development_sources_MacPorts_trunk_dports_aqua_aquaterm/aquaterm/work/AquaTerm-1.1.1/aquaterm/build/SharedPrecompiledHeaders/AppKit-gdnhrywcmpbgcxbovxkmxwrsbjmc/AppKit.h -MMD -MT dependencies -MF /Development/local/10_12/var/macports/build/_Development_sources_MacPorts_trunk_dports_aqua_aquaterm/aquaterm/work/AquaTerm-1.1.1/aquaterm/build/AquaTerm.build/Default/AQTFwk.build/Objects-normal/x86_64/AQTPath.d --serialize-diagnostics /Development/local/10_12/var/macports/build/_Development_sources_MacPorts_trunk_dports_aqua_aquaterm/aquaterm/work/AquaTerm-1.1.1/aquaterm/build/AquaTerm.build/Default/AQTFwk.build/Objects-normal/x86_64/AQTPath.dia -c /Development/local/10_12/var/macports/build/_Development_sources_MacPorts_trunk_dports_aqua_aquaterm/aquaterm/work/AquaTerm-1.1.1/aquaterm/AQTPath.m -o /Development/local/10_12/var/macports/build/_Development_sources_MacPorts_trunk_dports_aqua_aquaterm/aquaterm/work/AquaTerm-1.1.1/aquaterm/build/AquaTerm.build/Default/AQTFwk.build/Objects-normal/x86_64/AQTPath.o
300:info:build /Development/local/10_12/var/macports/build/_Development_sources_MacPorts_trunk_dports_aqua_aquaterm/aquaterm/work/AquaTerm-1.1.1/aquaterm/AQTPath.m:21:27: warning: using the result of an assignment as a condition without parentheses [-Wparentheses]
301:info:build       if(dynamicPathStore = malloc(pc * sizeof(NSPoint)))
302:info:build          ~~~~~~~~~~~~~~~~~^~~~~~~~~~~~~~~~~~~~~~~~~~~~~~
303:info:build /Development/local/10_12/var/macports/build/_Development_sources_MacPorts_trunk_dports_aqua_aquaterm/aquaterm/work/AquaTerm-1.1.1/aquaterm/AQTPath.m:21:27: note: place parentheses around the assignment to silence this warning
304:info:build       if(dynamicPathStore = malloc(pc * sizeof(NSPoint)))
305:info:build                           ^
306:info:build          (                                              )
307:info:build /Development/local/10_12/var/macports/build/_Development_sources_MacPorts_trunk_dports_aqua_aquaterm/aquaterm/work/AquaTerm-1.1.1/aquaterm/AQTPath.m:21:27: note: use '==' to turn this assignment into an equality comparison
308:info:build       if(dynamicPathStore = malloc(pc * sizeof(NSPoint)))
309:info:build                           ^
310:info:build                           ==
311:info:build 1 warning generated.
312:info:build CompileC build/AquaTerm.build/Default/AQTFwk.build/Objects-normal/x86_64/AQTConstants.o AQTConstants.m normal x86_64 objective-c com.apple.compilers.llvm.clang.1_0.compiler
313:info:build     cd /Development/local/10_12/var/macports/build/_Development_sources_MacPorts_trunk_dports_aqua_aquaterm/aquaterm/work/AquaTerm-1.1.1/aquaterm
314:info:build     export LANG=en_US.US-ASCII
315:info:build     /Applications/Xcode.app/Contents/Developer/Toolchains/XcodeDefault.xctoolchain/usr/bin/clang -x objective-c -arch x86_64 -fmessage-length=0 -fdiagnostics-show-note-include-stack -fmacro-backtrace-limit=0 -gmodules -Wno-trigraphs -fpascal-strings -Os -Wno-missing-field-initializers -Wno-missing-prototypes -Wno-return-type -Wno-implicit-atomic-properties -Wno-arc-repeated-use-of-weak -Wno-missing-braces -Wparentheses -Wswitch -Wno-unused-function -Wno-unused-label -Wno-unused-parameter -Wno-unused-variable -Wunused-value -Wno-empty-body -Wno-uninitialized -Wno-unknown-pragmas -Wno-shadow -Wno-four-char-constants -Wno-conversion -Wno-constant-conversion -Wno-int-conversion -Wno-bool-conversion -Wno-enum-conversion -Wno-shorten-64-to-32 -Wpointer-sign -Wno-newline-eof -Wno-selector -Wno-strict-selector-match -Wno-undeclared-selector -Wno-deprecated-implementations -isysroot /Applications/Xcode.app/Contents/Developer/Platforms/MacOSX.platform/Developer/SDKs/MacOSX10.12.sdk -fasm-blocks -fstrict-aliasing -Wprotocol -Wdeprecated-declarations -mmacosx-version-min=10.12 -g -Wno-sign-conversion -Wno-infinite-recursion -I/Development/local/10_12/var/macports/build/_Development_sources_MacPorts_trunk_dports_aqua_aquaterm/aquaterm/work/AquaTerm-1.1.1/aquaterm/build/AquaTerm.build/Default/AQTFwk.build/AquaTerm.hmap -I/Development/local/10_12/var/macports/build/_Development_sources_MacPorts_trunk_dports_aqua_aquaterm/aquaterm/work/AquaTerm-1.1.1/aquaterm/build/Default/include -I/Development/local/10_12/var/macports/build/_Development_sources_MacPorts_trunk_dports_aqua_aquaterm/aquaterm/work/AquaTerm-1.1.1/aquaterm/build/AquaTerm.build/Default/AQTFwk.build/DerivedSources/x86_64 -I/Development/local/10_12/var/macports/build/_Development_sources_MacPorts_trunk_dports_aqua_aquaterm/aquaterm/work/AquaTerm-1.1.1/aquaterm/build/AquaTerm.build/Default/AQTFwk.build/DerivedSources -Wmost -Wno-four-char-constants -Wno-unknown-pragmas -F/Development/local/10_12/var/macports/build/_Development_sources_MacPorts_trunk_dports_aqua_aquaterm/aquaterm/work/AquaTerm-1.1.1/aquaterm/build/Default -include /Development/local/10_12/var/macports/build/_Development_sources_MacPorts_trunk_dports_aqua_aquaterm/aquaterm/work/AquaTerm-1.1.1/aquaterm/build/SharedPrecompiledHeaders/AppKit-gdnhrywcmpbgcxbovxkmxwrsbjmc/AppKit.h -MMD -MT dependencies -MF /Development/local/10_12/var/macports/build/_Development_sources_MacPorts_trunk_dports_aqua_aquaterm/aquaterm/work/AquaTerm-1.1.1/aquaterm/build/AquaTerm.build/Default/AQTFwk.build/Objects-normal/x86_64/AQTConstants.d --serialize-diagnostics /Development/local/10_12/var/macports/build/_Development_sources_MacPorts_trunk_dports_aqua_aquaterm/aquaterm/work/AquaTerm-1.1.1/aquaterm/build/AquaTerm.build/Default/AQTFwk.build/Objects-normal/x86_64/AQTConstants.dia -c /Development/local/10_12/var/macports/build/_Development_sources_MacPorts_trunk_dports_aqua_aquaterm/aquaterm/work/AquaTerm-1.1.1/aquaterm/AQTConstants.m -o /Development/local/10_12/var/macports/build/_Development_sources_MacPorts_trunk_dports_aqua_aquaterm/aquaterm/work/AquaTerm-1.1.1/aquaterm/build/AquaTerm.build/Default/AQTFwk.build/Objects-normal/x86_64/AQTConstants.o
316:info:build CompileC build/AquaTerm.build/Default/AQTFwk.build/Objects-normal/x86_64/AQTFunctions.o AQTFunctions.m normal x86_64 objective-c com.apple.compilers.llvm.clang.1_0.compiler
317:info:build     cd /Development/local/10_12/var/macports/build/_Development_sources_MacPorts_trunk_dports_aqua_aquaterm/aquaterm/work/AquaTerm-1.1.1/aquaterm
318:info:build     export LANG=en_US.US-ASCII
319:info:build     /Applications/Xcode.app/Contents/Developer/Toolchains/XcodeDefault.xctoolchain/usr/bin/clang -x objective-c -arch x86_64 -fmessage-length=0 -fdiagnostics-show-note-include-stack -fmacro-backtrace-limit=0 -gmodules -Wno-trigraphs -fpascal-strings -Os -Wno-missing-field-initializers -Wno-missing-prototypes -Wno-return-type -Wno-implicit-atomic-properties -Wno-arc-repeated-use-of-weak -Wno-missing-braces -Wparentheses -Wswitch -Wno-unused-function -Wno-unused-label -Wno-unused-parameter -Wno-unused-variable -Wunused-value -Wno-empty-body -Wno-uninitialized -Wno-unknown-pragmas -Wno-shadow -Wno-four-char-constants -Wno-conversion -Wno-constant-conversion -Wno-int-conversion -Wno-bool-conversion -Wno-enum-conversion -Wno-shorten-64-to-32 -Wpointer-sign -Wno-newline-eof -Wno-selector -Wno-strict-selector-match -Wno-undeclared-selector -Wno-deprecated-implementations -isysroot /Applications/Xcode.app/Contents/Developer/Platforms/MacOSX.platform/Developer/SDKs/MacOSX10.12.sdk -fasm-blocks -fstrict-aliasing -Wprotocol -Wdeprecated-declarations -mmacosx-version-min=10.12 -g -Wno-sign-conversion -Wno-infinite-recursion -I/Development/local/10_12/var/macports/build/_Development_sources_MacPorts_trunk_dports_aqua_aquaterm/aquaterm/work/AquaTerm-1.1.1/aquaterm/build/AquaTerm.build/Default/AQTFwk.build/AquaTerm.hmap -I/Development/local/10_12/var/macports/build/_Development_sources_MacPorts_trunk_dports_aqua_aquaterm/aquaterm/work/AquaTerm-1.1.1/aquaterm/build/Default/include -I/Development/local/10_12/var/macports/build/_Development_sources_MacPorts_trunk_dports_aqua_aquaterm/aquaterm/work/AquaTerm-1.1.1/aquaterm/build/AquaTerm.build/Default/AQTFwk.build/DerivedSources/x86_64 -I/Development/local/10_12/var/macports/build/_Development_sources_MacPorts_trunk_dports_aqua_aquaterm/aquaterm/work/AquaTerm-1.1.1/aquaterm/build/AquaTerm.build/Default/AQTFwk.build/DerivedSources -Wmost -Wno-four-char-constants -Wno-unknown-pragmas -F/Development/local/10_12/var/macports/build/_Development_sources_MacPorts_trunk_dports_aqua_aquaterm/aquaterm/work/AquaTerm-1.1.1/aquaterm/build/Default -include /Development/local/10_12/var/macports/build/_Development_sources_MacPorts_trunk_dports_aqua_aquaterm/aquaterm/work/AquaTerm-1.1.1/aquaterm/build/SharedPrecompiledHeaders/AppKit-gdnhrywcmpbgcxbovxkmxwrsbjmc/AppKit.h -MMD -MT dependencies -MF /Development/local/10_12/var/macports/build/_Development_sources_MacPorts_trunk_dports_aqua_aquaterm/aquaterm/work/AquaTerm-1.1.1/aquaterm/build/AquaTerm.build/Default/AQTFwk.build/Objects-normal/x86_64/AQTFunctions.d --serialize-diagnostics /Development/local/10_12/var/macports/build/_Development_sources_MacPorts_trunk_dports_aqua_aquaterm/aquaterm/work/AquaTerm-1.1.1/aquaterm/build/AquaTerm.build/Default/AQTFwk.build/Objects-normal/x86_64/AQTFunctions.dia -c /Development/local/10_12/var/macports/build/_Development_sources_MacPorts_trunk_dports_aqua_aquaterm/aquaterm/work/AquaTerm-1.1.1/aquaterm/AQTFunctions.m -o /Development/local/10_12/var/macports/build/_Development_sources_MacPorts_trunk_dports_aqua_aquaterm/aquaterm/work/AquaTerm-1.1.1/aquaterm/build/AquaTerm.build/Default/AQTFwk.build/Objects-normal/x86_64/AQTFunctions.o
320:info:build Ld build/Default/AquaTerm.framework/Versions/A/AquaTerm normal x86_64
321:info:build     cd /Development/local/10_12/var/macports/build/_Development_sources_MacPorts_trunk_dports_aqua_aquaterm/aquaterm/work/AquaTerm-1.1.1/aquaterm
322:info:build     export MACOSX_DEPLOYMENT_TARGET=10.12
323:info:build     /Applications/Xcode.app/Contents/Developer/Toolchains/XcodeDefault.xctoolchain/usr/bin/clang -arch x86_64 -dynamiclib -isysroot /Applications/Xcode.app/Contents/Developer/Platforms/MacOSX.platform/Developer/SDKs/MacOSX10.12.sdk -L/Development/local/10_12/var/macports/build/_Development_sources_MacPorts_trunk_dports_aqua_aquaterm/aquaterm/work/AquaTerm-1.1.1/aquaterm/build/Default -F/Development/local/10_12/var/macports/build/_Development_sources_MacPorts_trunk_dports_aqua_aquaterm/aquaterm/work/AquaTerm-1.1.1/aquaterm/build/Default -filelist /Development/local/10_12/var/macports/build/_Development_sources_MacPorts_trunk_dports_aqua_aquaterm/aquaterm/work/AquaTerm-1.1.1/aquaterm/build/AquaTerm.build/Default/AQTFwk.build/Objects-normal/x86_64/AquaTerm.LinkFileList -install_name /opt/local/Library/Frameworks/AquaTerm.framework/Versions/A/AquaTerm -mmacosx-version-min=10.12 -Xlinker -object_path_lto -Xlinker /Development/local/10_12/var/macports/build/_Development_sources_MacPorts_trunk_dports_aqua_aquaterm/aquaterm/work/AquaTerm-1.1.1/aquaterm/build/AquaTerm.build/Default/AQTFwk.build/Objects-normal/x86_64/AquaTerm_lto.o -fobjc-link-runtime -framework Foundation -framework AppKit -single_module -compatibility_version 1 -current_version 1 -Xlinker -dependency_info -Xlinker /Development/local/10_12/var/macports/build/_Development_sources_MacPorts_trunk_dports_aqua_aquaterm/aquaterm/work/AquaTerm-1.1.1/aquaterm/build/AquaTerm.build/Default/AQTFwk.build/Objects-normal/x86_64/AquaTerm_dependency_info.dat -o /Development/local/10_12/var/macports/build/_Development_sources_MacPorts_trunk_dports_aqua_aquaterm/aquaterm/work/AquaTerm-1.1.1/aquaterm/build/Default/AquaTerm.framework/Versions/A/AquaTerm
324:info:build Touch build/Default/AquaTerm.framework
325:info:build     cd /Development/local/10_12/var/macports/build/_Development_sources_MacPorts_trunk_dports_aqua_aquaterm/aquaterm/work/AquaTerm-1.1.1/aquaterm
326:info:build     /usr/bin/touch -c /Development/local/10_12/var/macports/build/_Development_sources_MacPorts_trunk_dports_aqua_aquaterm/aquaterm/work/AquaTerm-1.1.1/aquaterm/build/Default/AquaTerm.framework
327:info:build === BUILD TARGET AquaTerm OF PROJECT AquaTerm WITH CONFIGURATION Default ===
328:info:build Check dependencies
329:info:build Warning: Multiple build commands for output file /Development/local/10_12/var/macports/build/_Development_sources_MacPorts_trunk_dports_aqua_aquaterm/aquaterm/work/AquaTerm-1.1.1/aquaterm/build/Default/AquaTerm.app/Contents/Resources/help.html
330:info:build Write auxiliary files
331:info:build write-file /Development/local/10_12/var/macports/build/_Development_sources_MacPorts_trunk_dports_aqua_aquaterm/aquaterm/work/AquaTerm-1.1.1/aquaterm/build/AquaTerm.build/Default/AquaTerm.build/AquaTerm.hmap
332:info:build write-file /Development/local/10_12/var/macports/build/_Development_sources_MacPorts_trunk_dports_aqua_aquaterm/aquaterm/work/AquaTerm-1.1.1/aquaterm/build/AquaTerm.build/Default/AquaTerm.build/AquaTerm-project-headers.hmap
333:info:build write-file /Development/local/10_12/var/macports/build/_Development_sources_MacPorts_trunk_dports_aqua_aquaterm/aquaterm/work/AquaTerm-1.1.1/aquaterm/build/AquaTerm.build/Default/AquaTerm.build/AquaTerm-own-target-headers.hmap
334:info:build write-file /Development/local/10_12/var/macports/build/_Development_sources_MacPorts_trunk_dports_aqua_aquaterm/aquaterm/work/AquaTerm-1.1.1/aquaterm/build/AquaTerm.build/Default/AquaTerm.build/AquaTerm-generated-files.hmap
335:info:build write-file /Development/local/10_12/var/macports/build/_Development_sources_MacPorts_trunk_dports_aqua_aquaterm/aquaterm/work/AquaTerm-1.1.1/aquaterm/build/AquaTerm.build/Default/AquaTerm.build/AquaTerm-all-non-framework-target-headers.hmap
336:info:build /bin/mkdir -p /Development/local/10_12/var/macports/build/_Development_sources_MacPorts_trunk_dports_aqua_aquaterm/aquaterm/work/AquaTerm-1.1.1/aquaterm/build/SharedPrecompiledHeaders/AppKit-bddaiyepohxivycwdtnbfphoicld
337:info:build write-file /Development/local/10_12/var/macports/build/_Development_sources_MacPorts_trunk_dports_aqua_aquaterm/aquaterm/work/AquaTerm-1.1.1/aquaterm/build/SharedPrecompiledHeaders/AppKit-bddaiyepohxivycwdtnbfphoicld/AppKit.h.pch.hash-criteria
338:info:build /bin/mkdir -p /Development/local/10_12/var/macports/build/_Development_sources_MacPorts_trunk_dports_aqua_aquaterm/aquaterm/work/AquaTerm-1.1.1/aquaterm/build/AquaTerm.build/Default/AquaTerm.build/Objects-normal/x86_64
339:info:build write-file /Development/local/10_12/var/macports/build/_Development_sources_MacPorts_trunk_dports_aqua_aquaterm/aquaterm/work/AquaTerm-1.1.1/aquaterm/build/AquaTerm.build/Default/AquaTerm.build/Objects-normal/x86_64/AquaTerm.LinkFileList
340:info:build write-file /Development/local/10_12/var/macports/build/_Development_sources_MacPorts_trunk_dports_aqua_aquaterm/aquaterm/work/AquaTerm-1.1.1/aquaterm/build/AquaTerm.build/Default/AquaTerm.build/AquaTerm-all-target-headers.hmap
341:info:build Create product structure
342:info:build /bin/mkdir -p /Development/local/10_12/var/macports/build/_Development_sources_MacPorts_trunk_dports_aqua_aquaterm/aquaterm/work/AquaTerm-1.1.1/aquaterm/build/Default/AquaTerm.app/Contents
343:info:build /bin/mkdir -p /Development/local/10_12/var/macports/build/_Development_sources_MacPorts_trunk_dports_aqua_aquaterm/aquaterm/work/AquaTerm-1.1.1/aquaterm/build/Default/AquaTerm.app/Contents/MacOS
344:info:build /bin/mkdir -p /Development/local/10_12/var/macports/build/_Development_sources_MacPorts_trunk_dports_aqua_aquaterm/aquaterm/work/AquaTerm-1.1.1/aquaterm/build/Default/AquaTerm.app/Contents/Resources
345:info:build ProcessInfoPlistFile build/Default/AquaTerm.app/Contents/Info.plist AquaTerm.app-Info.plist
346:info:build     cd /Development/local/10_12/var/macports/build/_Development_sources_MacPorts_trunk_dports_aqua_aquaterm/aquaterm/work/AquaTerm-1.1.1/aquaterm
347:info:build     builtin-infoPlistUtility /Development/local/10_12/var/macports/build/_Development_sources_MacPorts_trunk_dports_aqua_aquaterm/aquaterm/work/AquaTerm-1.1.1/aquaterm/AquaTerm.app-Info.plist -genpkginfo /Development/local/10_12/var/macports/build/_Development_sources_MacPorts_trunk_dports_aqua_aquaterm/aquaterm/work/AquaTerm-1.1.1/aquaterm/build/Default/AquaTerm.app/Contents/PkgInfo -expandbuildsettings -platform macosx -o /Development/local/10_12/var/macports/build/_Development_sources_MacPorts_trunk_dports_aqua_aquaterm/aquaterm/work/AquaTerm-1.1.1/aquaterm/build/Default/AquaTerm.app/Contents/Info.plist
348:info:build CpResource English.lproj/Credits.rtf build/Default/AquaTerm.app/Contents/Resources/English.lproj/Credits.rtf
349:info:build     cd /Development/local/10_12/var/macports/build/_Development_sources_MacPorts_trunk_dports_aqua_aquaterm/aquaterm/work/AquaTerm-1.1.1/aquaterm
350:info:build     builtin-copy -exclude .DS_Store -exclude CVS -exclude .svn -exclude .git -exclude .hg -resolve-src-symlinks /Development/local/10_12/var/macports/build/_Development_sources_MacPorts_trunk_dports_aqua_aquaterm/aquaterm/work/AquaTerm-1.1.1/aquaterm/English.lproj/Credits.rtf /Development/local/10_12/var/macports/build/_Development_sources_MacPorts_trunk_dports_aqua_aquaterm/aquaterm/work/AquaTerm-1.1.1/aquaterm/build/Default/AquaTerm.app/Contents/Resources/English.lproj
351:info:build CpResource English.lproj/AquaTerm.icns build/Default/AquaTerm.app/Contents/Resources/English.lproj/AquaTerm.icns
352:info:build     cd /Development/local/10_12/var/macports/build/_Development_sources_MacPorts_trunk_dports_aqua_aquaterm/aquaterm/work/AquaTerm-1.1.1/aquaterm
353:info:build     builtin-copy -exclude .DS_Store -exclude CVS -exclude .svn -exclude .git -exclude .hg -resolve-src-symlinks /Development/local/10_12/var/macports/build/_Development_sources_MacPorts_trunk_dports_aqua_aquaterm/aquaterm/work/AquaTerm-1.1.1/aquaterm/English.lproj/AquaTerm.icns /Development/local/10_12/var/macports/build/_Development_sources_MacPorts_trunk_dports_aqua_aquaterm/aquaterm/work/AquaTerm-1.1.1/aquaterm/build/Default/AquaTerm.app/Contents/Resources/English.lproj
354:info:build StripNIB English.lproj/MainMenu1.nib
355:info:build     cd /Development/local/10_12/var/macports/build/_Development_sources_MacPorts_trunk_dports_aqua_aquaterm/aquaterm/work/AquaTerm-1.1.1/aquaterm
356:info:build     export XCODE_DEVELOPER_USR_PATH=/Applications/Xcode.app/Contents/Developer/usr/bin/..
357:info:build     /Applications/Xcode.app/Contents/Developer/usr/bin/ibtool --strip /Development/local/10_12/var/macports/build/_Development_sources_MacPorts_trunk_dports_aqua_aquaterm/aquaterm/work/AquaTerm-1.1.1/aquaterm/build/Default/AquaTerm.app/Contents/Resources/English.lproj/MainMenu1.nib --output-format human-readable-text /Development/local/10_12/var/macports/build/_Development_sources_MacPorts_trunk_dports_aqua_aquaterm/aquaterm/work/AquaTerm-1.1.1/aquaterm/English.lproj/MainMenu1.nib
358:info:build /* com.apple.ibtool.errors */
359:info:build /Development/local/10_12/var/macports/build/_Development_sources_MacPorts_trunk_dports_aqua_aquaterm/aquaterm/work/AquaTerm-1.1.1/aquaterm/English.lproj/MainMenu1.nib: error: ibtool could not strip "MainMenu1.nib" because it could not write to the path "/Development/local/10_12/var/macports/build/_Development_sources_MacPorts_trunk_dports_aqua_aquaterm/aquaterm/work/AquaTerm-1.1.1/aquaterm/build/Default/AquaTerm.app/Contents/Resources/English.lproj/MainMenu1.nib".
360:info:build StripNIB English.lproj/ColorInspector.nib
361:info:build     cd /Development/local/10_12/var/macports/build/_Development_sources_MacPorts_trunk_dports_aqua_aquaterm/aquaterm/work/AquaTerm-1.1.1/aquaterm
362:info:build     export XCODE_DEVELOPER_USR_PATH=/Applications/Xcode.app/Contents/Developer/usr/bin/..
363:info:build     /Applications/Xcode.app/Contents/Developer/usr/bin/ibtool --strip /Development/local/10_12/var/macports/build/_Development_sources_MacPorts_trunk_dports_aqua_aquaterm/aquaterm/work/AquaTerm-1.1.1/aquaterm/build/Default/AquaTerm.app/Contents/Resources/ColorInspector.nib --output-format human-readable-text /Development/local/10_12/var/macports/build/_Development_sources_MacPorts_trunk_dports_aqua_aquaterm/aquaterm/work/AquaTerm-1.1.1/aquaterm/English.lproj/ColorInspector.nib
364:info:build /* com.apple.ibtool.errors */
365:info:build /Development/local/10_12/var/macports/build/_Development_sources_MacPorts_trunk_dports_aqua_aquaterm/aquaterm/work/AquaTerm-1.1.1/aquaterm/English.lproj/ColorInspector.nib: error: ibtool could not strip "ColorInspector.nib" because it could not write to the path "/Development/local/10_12/var/macports/build/_Development_sources_MacPorts_trunk_dports_aqua_aquaterm/aquaterm/work/AquaTerm-1.1.1/aquaterm/build/Default/AquaTerm.app/Contents/Resources/ColorInspector.nib".
366:info:build StripNIB English.lproj/ExtendSavePanel.nib
367:info:build     cd /Development/local/10_12/var/macports/build/_Development_sources_MacPorts_trunk_dports_aqua_aquaterm/aquaterm/work/AquaTerm-1.1.1/aquaterm
368:info:build     export XCODE_DEVELOPER_USR_PATH=/Applications/Xcode.app/Contents/Developer/usr/bin/..
369:info:build     /Applications/Xcode.app/Contents/Developer/usr/bin/ibtool --strip /Development/local/10_12/var/macports/build/_Development_sources_MacPorts_trunk_dports_aqua_aquaterm/aquaterm/work/AquaTerm-1.1.1/aquaterm/build/Default/AquaTerm.app/Contents/Resources/ExtendSavePanel.nib --output-format human-readable-text /Development/local/10_12/var/macports/build/_Development_sources_MacPorts_trunk_dports_aqua_aquaterm/aquaterm/work/AquaTerm-1.1.1/aquaterm/English.lproj/ExtendSavePanel.nib
370:info:build /* com.apple.ibtool.errors */
371:info:build /Development/local/10_12/var/macports/build/_Development_sources_MacPorts_trunk_dports_aqua_aquaterm/aquaterm/work/AquaTerm-1.1.1/aquaterm/English.lproj/ExtendSavePanel.nib: error: ibtool could not strip "ExtendSavePanel.nib" because it could not write to the path "/Development/local/10_12/var/macports/build/_Development_sources_MacPorts_trunk_dports_aqua_aquaterm/aquaterm/work/AquaTerm-1.1.1/aquaterm/build/Default/AquaTerm.app/Contents/Resources/ExtendSavePanel.nib".
372:info:build StripNIB English.lproj/AQTWindow.nib
373:info:build     cd /Development/local/10_12/var/macports/build/_Development_sources_MacPorts_trunk_dports_aqua_aquaterm/aquaterm/work/AquaTerm-1.1.1/aquaterm
374:info:build     export XCODE_DEVELOPER_USR_PATH=/Applications/Xcode.app/Contents/Developer/usr/bin/..
375:info:build     /Applications/Xcode.app/Contents/Developer/usr/bin/ibtool --strip /Development/local/10_12/var/macports/build/_Development_sources_MacPorts_trunk_dports_aqua_aquaterm/aquaterm/work/AquaTerm-1.1.1/aquaterm/build/Default/AquaTerm.app/Contents/Resources/English.lproj/AQTWindow.nib --output-format human-readable-text /Development/local/10_12/var/macports/build/_Development_sources_MacPorts_trunk_dports_aqua_aquaterm/aquaterm/work/AquaTerm-1.1.1/aquaterm/English.lproj/AQTWindow.nib
376:info:build /* com.apple.ibtool.errors */
377:info:build /Development/local/10_12/var/macports/build/_Development_sources_MacPorts_trunk_dports_aqua_aquaterm/aquaterm/work/AquaTerm-1.1.1/aquaterm/English.lproj/AQTWindow.nib: error: ibtool could not strip "AQTWindow.nib" because it could not write to the path "/Development/local/10_12/var/macports/build/_Development_sources_MacPorts_trunk_dports_aqua_aquaterm/aquaterm/work/AquaTerm-1.1.1/aquaterm/build/Default/AquaTerm.app/Contents/Resources/English.lproj/AQTWindow.nib".
378:info:build CpResource ReleaseNotes build/Default/AquaTerm.app/Contents/Resources/ReleaseNotes
379:info:build     cd /Development/local/10_12/var/macports/build/_Development_sources_MacPorts_trunk_dports_aqua_aquaterm/aquaterm/work/AquaTerm-1.1.1/aquaterm
380:info:build     builtin-copy -exclude .DS_Store -exclude CVS -exclude .svn -exclude .git -exclude .hg -resolve-src-symlinks /Development/local/10_12/var/macports/build/_Development_sources_MacPorts_trunk_dports_aqua_aquaterm/aquaterm/work/AquaTerm-1.1.1/aquaterm/ReleaseNotes /Development/local/10_12/var/macports/build/_Development_sources_MacPorts_trunk_dports_aqua_aquaterm/aquaterm/work/AquaTerm-1.1.1/aquaterm/build/Default/AquaTerm.app/Contents/Resources
381:info:build CpResource Help/AQTAdapter.html build/Default/AquaTerm.app/Contents/Resources/AQTAdapter.html
382:info:build     cd /Development/local/10_12/var/macports/build/_Development_sources_MacPorts_trunk_dports_aqua_aquaterm/aquaterm/work/AquaTerm-1.1.1/aquaterm
383:info:build     builtin-copy -exclude .DS_Store -exclude CVS -exclude .svn -exclude .git -exclude .hg -resolve-src-symlinks /Development/local/10_12/var/macports/build/_Development_sources_MacPorts_trunk_dports_aqua_aquaterm/aquaterm/work/AquaTerm-1.1.1/aquaterm/Help/AQTAdapter.html /Development/local/10_12/var/macports/build/_Development_sources_MacPorts_trunk_dports_aqua_aquaterm/aquaterm/work/AquaTerm-1.1.1/aquaterm/build/Default/AquaTerm.app/Contents/Resources
384:info:build CpResource Help/help.html build/Default/AquaTerm.app/Contents/Resources/help.html
385:info:build     cd /Development/local/10_12/var/macports/build/_Development_sources_MacPorts_trunk_dports_aqua_aquaterm/aquaterm/work/AquaTerm-1.1.1/aquaterm
386:info:build     builtin-copy -exclude .DS_Store -exclude CVS -exclude .svn -exclude .git -exclude .hg -resolve-src-symlinks /Development/local/10_12/var/macports/build/_Development_sources_MacPorts_trunk_dports_aqua_aquaterm/aquaterm/work/AquaTerm-1.1.1/aquaterm/Help/help.html /Development/local/10_12/var/macports/build/_Development_sources_MacPorts_trunk_dports_aqua_aquaterm/aquaterm/work/AquaTerm-1.1.1/aquaterm/build/Default/AquaTerm.app/Contents/Resources
387:info:build CpResource ReadMe.rtf build/Default/AquaTerm.app/Contents/Resources/ReadMe.rtf
388:info:build     cd /Development/local/10_12/var/macports/build/_Development_sources_MacPorts_trunk_dports_aqua_aquaterm/aquaterm/work/AquaTerm-1.1.1/aquaterm
389:info:build     builtin-copy -exclude .DS_Store -exclude CVS -exclude .svn -exclude .git -exclude .hg -resolve-src-symlinks /Development/local/10_12/var/macports/build/_Development_sources_MacPorts_trunk_dports_aqua_aquaterm/aquaterm/work/AquaTerm-1.1.1/aquaterm/ReadMe.rtf /Development/local/10_12/var/macports/build/_Development_sources_MacPorts_trunk_dports_aqua_aquaterm/aquaterm/work/AquaTerm-1.1.1/aquaterm/build/Default/AquaTerm.app/Contents/Resources
390:info:build StripNIB English.lproj/Preferences.nib
391:info:build     cd /Development/local/10_12/var/macports/build/_Development_sources_MacPorts_trunk_dports_aqua_aquaterm/aquaterm/work/AquaTerm-1.1.1/aquaterm
392:info:build     export XCODE_DEVELOPER_USR_PATH=/Applications/Xcode.app/Contents/Developer/usr/bin/..
393:info:build     /Applications/Xcode.app/Contents/Developer/usr/bin/ibtool --strip /Development/local/10_12/var/macports/build/_Development_sources_MacPorts_trunk_dports_aqua_aquaterm/aquaterm/work/AquaTerm-1.1.1/aquaterm/build/Default/AquaTerm.app/Contents/Resources/English.lproj/Preferences.nib --output-format human-readable-text /Development/local/10_12/var/macports/build/_Development_sources_MacPorts_trunk_dports_aqua_aquaterm/aquaterm/work/AquaTerm-1.1.1/aquaterm/English.lproj/Preferences.nib
394:info:build /* com.apple.ibtool.errors */
395:info:build /Development/local/10_12/var/macports/build/_Development_sources_MacPorts_trunk_dports_aqua_aquaterm/aquaterm/work/AquaTerm-1.1.1/aquaterm/English.lproj/Preferences.nib: error: ibtool could not strip "Preferences.nib" because it could not write to the path "/Development/local/10_12/var/macports/build/_Development_sources_MacPorts_trunk_dports_aqua_aquaterm/aquaterm/work/AquaTerm-1.1.1/aquaterm/build/Default/AquaTerm.app/Contents/Resources/English.lproj/Preferences.nib".
396:info:build CopyTiffFile build/Default/AquaTerm.app/Contents/Resources/English.lproj/crossBlack.tiff English.lproj/crossBlack.tiff
397:info:build     cd /Development/local/10_12/var/macports/build/_Development_sources_MacPorts_trunk_dports_aqua_aquaterm/aquaterm/work/AquaTerm-1.1.1/aquaterm
398:info:build     builtin-copyTiff --outdir /Development/local/10_12/var/macports/build/_Development_sources_MacPorts_trunk_dports_aqua_aquaterm/aquaterm/work/AquaTerm-1.1.1/aquaterm/build/Default/AquaTerm.app/Contents/Resources/English.lproj -- English.lproj/crossBlack.tiff
399:info:build CopyTiffFile build/Default/AquaTerm.app/Contents/Resources/English.lproj/crossBlue.tiff English.lproj/crossBlue.tiff
400:info:build     cd /Development/local/10_12/var/macports/build/_Development_sources_MacPorts_trunk_dports_aqua_aquaterm/aquaterm/work/AquaTerm-1.1.1/aquaterm
401:info:build     builtin-copyTiff --outdir /Development/local/10_12/var/macports/build/_Development_sources_MacPorts_trunk_dports_aqua_aquaterm/aquaterm/work/AquaTerm-1.1.1/aquaterm/build/Default/AquaTerm.app/Contents/Resources/English.lproj -- English.lproj/crossBlue.tiff
402:info:build CopyTiffFile build/Default/AquaTerm.app/Contents/Resources/English.lproj/crossGreen.tiff English.lproj/crossGreen.tiff
403:info:build     cd /Development/local/10_12/var/macports/build/_Development_sources_MacPorts_trunk_dports_aqua_aquaterm/aquaterm/work/AquaTerm-1.1.1/aquaterm
404:info:build     builtin-copyTiff --outdir /Development/local/10_12/var/macports/build/_Development_sources_MacPorts_trunk_dports_aqua_aquaterm/aquaterm/work/AquaTerm-1.1.1/aquaterm/build/Default/AquaTerm.app/Contents/Resources/English.lproj -- English.lproj/crossGreen.tiff
405:info:build CopyTiffFile build/Default/AquaTerm.app/Contents/Resources/English.lproj/crossRed.tiff English.lproj/crossRed.tiff
406:info:build     cd /Development/local/10_12/var/macports/build/_Development_sources_MacPorts_trunk_dports_aqua_aquaterm/aquaterm/work/AquaTerm-1.1.1/aquaterm
407:info:build     builtin-copyTiff --outdir /Development/local/10_12/var/macports/build/_Development_sources_MacPorts_trunk_dports_aqua_aquaterm/aquaterm/work/AquaTerm-1.1.1/aquaterm/build/Default/AquaTerm.app/Contents/Resources/English.lproj -- English.lproj/crossRed.tiff
408:info:build CopyTiffFile build/Default/AquaTerm.app/Contents/Resources/English.lproj/crossWhite.tiff English.lproj/crossWhite.tiff
409:info:build     cd /Development/local/10_12/var/macports/build/_Development_sources_MacPorts_trunk_dports_aqua_aquaterm/aquaterm/work/AquaTerm-1.1.1/aquaterm
410:info:build     builtin-copyTiff --outdir /Development/local/10_12/var/macports/build/_Development_sources_MacPorts_trunk_dports_aqua_aquaterm/aquaterm/work/AquaTerm-1.1.1/aquaterm/build/Default/AquaTerm.app/Contents/Resources/English.lproj -- English.lproj/crossWhite.tiff
411:info:build CopyTiffFile build/Default/AquaTerm.app/Contents/Resources/English.lproj/crossYellow.tiff English.lproj/crossYellow.tiff
412:info:build     cd /Development/local/10_12/var/macports/build/_Development_sources_MacPorts_trunk_dports_aqua_aquaterm/aquaterm/work/AquaTerm-1.1.1/aquaterm
413:info:build     builtin-copyTiff --outdir /Development/local/10_12/var/macports/build/_Development_sources_MacPorts_trunk_dports_aqua_aquaterm/aquaterm/work/AquaTerm-1.1.1/aquaterm/build/Default/AquaTerm.app/Contents/Resources/English.lproj -- English.lproj/crossYellow.tiff
414:info:build ** BUILD FAILED **
415:info:build The following build commands failed:
416:info:build     StripNIB English.lproj/MainMenu1.nib
417:info:build     StripNIB English.lproj/ColorInspector.nib
418:info:build     StripNIB English.lproj/ExtendSavePanel.nib
419:info:build     StripNIB English.lproj/AQTWindow.nib
420:info:build     StripNIB English.lproj/Preferences.nib
421:info:build (5 failures)
422:info:build Command failed: cd "/Development/local/10_12/var/macports/build/_Development_sources_MacPorts_trunk_dports_aqua_aquaterm/aquaterm/work/AquaTerm-1.1.1/aquaterm" && /usr/bin/xcodebuild  -target "AquaTerm" -configuration Default build OBJROOT=build/ SYMROOT=build/ MACOSX_DEPLOYMENT_TARGET=10.12 ARCHS=x86_64 SDKROOT="" GCC_VERSION=com.apple.compilers.llvm.clang.1_0 CLANG_CXX_LIBRARY="libc++" LOCAL_APPS_DIR=/opt/local/Applications LOCAL_FRAMEWORKS_DIR=/opt/local/Library/Frameworks
423:info:build Exit code: 65
424:error:build Failed to build aquaterm: command execution failed
425:debug:build Error code: NONE
426:debug:build Backtrace: command execution failed
427:debug:build     while executing
428:debug:build "$procedure $targetname"
429:error:build See /opt/local/var/macports/logs/_Development_sources_MacPorts_trunk_dports_aqua_aquaterm/aquaterm/main.log for details.