Ticket #52328: main.log

File main.log, 123.0 KB (added by jefrey_c@…, 4 years ago)

log file for port opencv

Line 
1version:1
2:debug:main Found Dependency: path: /usr/bin filename: unzip regex: ^unzip$
3:debug:main epoch: in tree: 0 installed: 0
4:debug:main cmake 3.6.2_0 exists in the ports tree
5:debug:main cmake 3.6.2_0  is the latest installed
6:debug:main cmake 3.6.2_0  is active
7:debug:main Merging existing variants '' into variants
8:debug:main new fully merged portvariants:
9:debug:main Changing to port directory: /opt/local/var/macports/sources/rsync.macports.org/release/tarballs/ports/devel/cmake
10:debug:main OS darwin/16.0.0 (Mac OS X 10.12) arch i386
11:debug:main Reading variant descriptions from /opt/local/var/macports/sources/rsync.macports.org/release/tarballs/ports/_resources/port1.0/variant_descriptions.conf
12:debug:main Sourcing PortGroup muniversal 1.0 from /opt/local/var/macports/sources/rsync.macports.org/release/tarballs/ports/_resources/port1.0/group/muniversal-1.0.tcl
13:debug:main universal variant already exists, so not adding the default one
14:debug:main Running callback portconfigure::add_automatic_compiler_dependencies
15:debug:main Finished running callback portconfigure::add_automatic_compiler_dependencies
16:debug:main Running callback portbuild::add_automatic_buildsystem_dependencies
17:debug:main Finished running callback portbuild::add_automatic_buildsystem_dependencies
18:debug:main No need to upgrade! cmake 3.6.2_0 >= cmake 3.6.2_0
19:debug:main epoch: in tree: 0 installed: 0
20:debug:main curl 7.50.3_0 exists in the ports tree
21:debug:main curl 7.50.3_0 +ssl+universal is the latest installed
22:debug:main curl 7.50.3_0 +ssl+universal is active
23:debug:main Merging existing variants '+ssl+universal' into variants
24:debug:main new fully merged portvariants: universal + ssl +
25:debug:main Changing to port directory: /opt/local/var/macports/sources/rsync.macports.org/release/tarballs/ports/net/curl
26:debug:main OS darwin/16.0.0 (Mac OS X 10.12) arch i386
27:debug:main Reading variant descriptions from /opt/local/var/macports/sources/rsync.macports.org/release/tarballs/ports/_resources/port1.0/variant_descriptions.conf
28:debug:main Sourcing PortGroup muniversal 1.0 from /opt/local/var/macports/sources/rsync.macports.org/release/tarballs/ports/_resources/port1.0/group/muniversal-1.0.tcl
29:debug:main universal variant already exists, so not adding the default one
30:debug:main Executing variant universal provides universal
31:debug:main Executing variant ssl provides ssl
32:debug:main Running callback portconfigure::add_automatic_compiler_dependencies
33:debug:main Finished running callback portconfigure::add_automatic_compiler_dependencies
34:debug:main Running callback portbuild::add_automatic_buildsystem_dependencies
35:debug:main Finished running callback portbuild::add_automatic_buildsystem_dependencies
36:debug:main No need to upgrade! curl 7.50.3_0 >= curl 7.50.3_0
37:debug:main epoch: in tree: 0 installed: 0
38:debug:main zlib 1.2.8_0 exists in the ports tree
39:debug:main zlib 1.2.8_0 +universal is the latest installed
40:debug:main zlib 1.2.8_0 +universal is active
41:debug:main Merging existing variants '+universal' into variants
42:debug:main new fully merged portvariants: universal +
43:debug:main Changing to port directory: /opt/local/var/macports/sources/rsync.macports.org/release/tarballs/ports/archivers/zlib
44:debug:main OS darwin/16.0.0 (Mac OS X 10.12) arch i386
45:debug:main Sourcing PortGroup xcodeversion 1.0 from /opt/local/var/macports/sources/rsync.macports.org/release/tarballs/ports/_resources/port1.0/group/xcodeversion-1.0.tcl
46:debug:main adding the default universal variant
47:debug:main Reading variant descriptions from /opt/local/var/macports/sources/rsync.macports.org/release/tarballs/ports/_resources/port1.0/variant_descriptions.conf
48:debug:main Executing variant universal provides universal
49:debug:main Running callback portconfigure::add_automatic_compiler_dependencies
50:debug:main Finished running callback portconfigure::add_automatic_compiler_dependencies
51:debug:main Running callback portbuild::add_automatic_buildsystem_dependencies
52:debug:main Finished running callback portbuild::add_automatic_buildsystem_dependencies
53:debug:main No need to upgrade! zlib 1.2.8_0 >= zlib 1.2.8_0
54:debug:main epoch: in tree: 1 installed: 1
55:debug:main openssl 1.0.2h_1 exists in the ports tree
56:debug:main openssl 1.0.2h_1 +universal is the latest installed
57:debug:main openssl 1.0.2h_1 +universal is active
58:debug:main Merging existing variants '+universal' into variants
59:debug:main new fully merged portvariants: universal +
60:debug:main Changing to port directory: /opt/local/var/macports/sources/rsync.macports.org/release/tarballs/ports/devel/openssl
61:debug:main OS darwin/16.0.0 (Mac OS X 10.12) arch i386
62:debug:main Reading variant descriptions from /opt/local/var/macports/sources/rsync.macports.org/release/tarballs/ports/_resources/port1.0/variant_descriptions.conf
63:debug:main Sourcing PortGroup muniversal 1.0 from /opt/local/var/macports/sources/rsync.macports.org/release/tarballs/ports/_resources/port1.0/group/muniversal-1.0.tcl
64:debug:main universal variant already exists, so not adding the default one
65:debug:main Executing variant universal provides universal
66:debug:main Running callback portconfigure::add_automatic_compiler_dependencies
67:debug:main Finished running callback portconfigure::add_automatic_compiler_dependencies
68:debug:main Running callback portbuild::add_automatic_buildsystem_dependencies
69:debug:main Finished running callback portbuild::add_automatic_buildsystem_dependencies
70:debug:main No need to upgrade! openssl 1.0.2h_1 >= openssl 1.0.2h_1
71:debug:main epoch: in tree: 0 installed: 0
72:debug:main curl-ca-bundle 7.50.3_0 exists in the ports tree
73:debug:main curl-ca-bundle 7.50.3_0  is the latest installed
74:debug:main curl-ca-bundle 7.50.3_0  is active
75:debug:main Merging existing variants '' into variants
76:debug:main new fully merged portvariants:
77:debug:main Changing to port directory: /opt/local/var/macports/sources/rsync.macports.org/release/tarballs/ports/net/curl
78:debug:main OS darwin/16.0.0 (Mac OS X 10.12) arch i386
79:debug:main universal_variant is false, so not adding the default universal variant
80:debug:main Running callback portconfigure::add_automatic_compiler_dependencies
81:debug:main Finished running callback portconfigure::add_automatic_compiler_dependencies
82:debug:main Running callback portbuild::add_automatic_buildsystem_dependencies
83:debug:main Finished running callback portbuild::add_automatic_buildsystem_dependencies
84:debug:main No need to upgrade! curl-ca-bundle 7.50.3_0 >= curl-ca-bundle 7.50.3_0
85:debug:main epoch: in tree: 0 installed: 0
86:debug:main expat 2.2.0_0 exists in the ports tree
87:debug:main expat 2.2.0_0 +universal is the latest installed
88:debug:main expat 2.2.0_0 +universal is active
89:debug:main Merging existing variants '+universal' into variants
90:debug:main new fully merged portvariants: universal +
91:debug:main Changing to port directory: /opt/local/var/macports/sources/rsync.macports.org/release/tarballs/ports/textproc/expat
92:debug:main OS darwin/16.0.0 (Mac OS X 10.12) arch i386
93:debug:main adding the default universal variant
94:debug:main Reading variant descriptions from /opt/local/var/macports/sources/rsync.macports.org/release/tarballs/ports/_resources/port1.0/variant_descriptions.conf
95:debug:main Executing variant universal provides universal
96:debug:main Running callback portconfigure::add_automatic_compiler_dependencies
97:debug:main Finished running callback portconfigure::add_automatic_compiler_dependencies
98:debug:main Running callback portbuild::add_automatic_buildsystem_dependencies
99:debug:main Finished running callback portbuild::add_automatic_buildsystem_dependencies
100:debug:main No need to upgrade! expat 2.2.0_0 >= expat 2.2.0_0
101:debug:main epoch: in tree: 0 installed: 0
102:debug:main bzip2 1.0.6_0 exists in the ports tree
103:debug:main bzip2 1.0.6_0 +universal is the latest installed
104:debug:main bzip2 1.0.6_0 +universal is active
105:debug:main Merging existing variants '+universal' into variants
106:debug:main new fully merged portvariants: universal +
107:debug:main Changing to port directory: /opt/local/var/macports/sources/rsync.macports.org/release/tarballs/ports/archivers/bzip2
108:debug:main OS darwin/16.0.0 (Mac OS X 10.12) arch i386
109:debug:main Reading variant descriptions from /opt/local/var/macports/sources/rsync.macports.org/release/tarballs/ports/_resources/port1.0/variant_descriptions.conf
110:debug:main universal variant already exists, so not adding the default one
111:debug:main Executing variant universal provides universal
112:debug:main Running callback portconfigure::add_automatic_compiler_dependencies
113:debug:main Finished running callback portconfigure::add_automatic_compiler_dependencies
114:debug:main Running callback portbuild::add_automatic_buildsystem_dependencies
115:debug:main Finished running callback portbuild::add_automatic_buildsystem_dependencies
116:debug:main No need to upgrade! bzip2 1.0.6_0 >= bzip2 1.0.6_0
117:debug:main epoch: in tree: 0 installed: 0
118:debug:main libarchive 3.2.1_0 exists in the ports tree
119:debug:main libarchive 3.2.1_0  is the latest installed
120:debug:main libarchive 3.2.1_0  is active
121:debug:main Merging existing variants '' into variants
122:debug:main new fully merged portvariants:
123:debug:main Changing to port directory: /opt/local/var/macports/sources/rsync.macports.org/release/tarballs/ports/archivers/libarchive
124:debug:main OS darwin/16.0.0 (Mac OS X 10.12) arch i386
125:debug:main adding the default universal variant
126:debug:main Reading variant descriptions from /opt/local/var/macports/sources/rsync.macports.org/release/tarballs/ports/_resources/port1.0/variant_descriptions.conf
127:debug:main Running callback portconfigure::add_automatic_compiler_dependencies
128:debug:main Finished running callback portconfigure::add_automatic_compiler_dependencies
129:debug:main Running callback portbuild::add_automatic_buildsystem_dependencies
130:debug:main Finished running callback portbuild::add_automatic_buildsystem_dependencies
131:debug:main No need to upgrade! libarchive 3.2.1_0 >= libarchive 3.2.1_0
132:debug:main epoch: in tree: 0 installed: 0
133:debug:main libxml2 2.9.4_0 exists in the ports tree
134:debug:main libxml2 2.9.4_0 +universal is the latest installed
135:debug:main libxml2 2.9.4_0 +universal is active
136:debug:main Merging existing variants '+universal' into variants
137:debug:main new fully merged portvariants: universal +
138:debug:main Changing to port directory: /opt/local/var/macports/sources/rsync.macports.org/release/tarballs/ports/textproc/libxml2
139:debug:main OS darwin/16.0.0 (Mac OS X 10.12) arch i386
140:debug:main adding the default universal variant
141:debug:main Reading variant descriptions from /opt/local/var/macports/sources/rsync.macports.org/release/tarballs/ports/_resources/port1.0/variant_descriptions.conf
142:debug:main Executing variant universal provides universal
143:debug:main Running callback portconfigure::add_automatic_compiler_dependencies
144:debug:main Finished running callback portconfigure::add_automatic_compiler_dependencies
145:debug:main Running callback portbuild::add_automatic_buildsystem_dependencies
146:debug:main Finished running callback portbuild::add_automatic_buildsystem_dependencies
147:debug:main No need to upgrade! libxml2 2.9.4_0 >= libxml2 2.9.4_0
148:debug:main epoch: in tree: 0 installed: 0
149:debug:main libiconv 1.14_0 exists in the ports tree
150:debug:main libiconv 1.14_0 +universal is the latest installed
151:debug:main libiconv 1.14_0 +universal is active
152:debug:main Merging existing variants '+universal' into variants
153:debug:main new fully merged portvariants: universal +
154:debug:main Changing to port directory: /opt/local/var/macports/sources/rsync.macports.org/release/tarballs/ports/textproc/libiconv
155:debug:main OS darwin/16.0.0 (Mac OS X 10.12) arch i386
156:debug:main Reading variant descriptions from /opt/local/var/macports/sources/rsync.macports.org/release/tarballs/ports/_resources/port1.0/variant_descriptions.conf
157:debug:main Sourcing PortGroup muniversal 1.0 from /opt/local/var/macports/sources/rsync.macports.org/release/tarballs/ports/_resources/port1.0/group/muniversal-1.0.tcl
158:debug:main universal variant already exists, so not adding the default one
159:debug:main Executing variant universal provides universal
160:debug:main Running callback portconfigure::add_automatic_compiler_dependencies
161:debug:main Finished running callback portconfigure::add_automatic_compiler_dependencies
162:debug:main Running callback portbuild::add_automatic_buildsystem_dependencies
163:debug:main Finished running callback portbuild::add_automatic_buildsystem_dependencies
164:debug:main No need to upgrade! libiconv 1.14_0 >= libiconv 1.14_0
165:debug:main epoch: in tree: 0 installed: 0
166:debug:main xz 5.2.2_0 exists in the ports tree
167:debug:main xz 5.2.2_0 +universal is the latest installed
168:debug:main xz 5.2.2_0 +universal is active
169:debug:main Merging existing variants '+universal' into variants
170:debug:main new fully merged portvariants: universal +
171:debug:main Changing to port directory: /opt/local/var/macports/sources/rsync.macports.org/release/tarballs/ports/archivers/xz
172:debug:main OS darwin/16.0.0 (Mac OS X 10.12) arch i386
173:debug:main adding the default universal variant
174:debug:main Reading variant descriptions from /opt/local/var/macports/sources/rsync.macports.org/release/tarballs/ports/_resources/port1.0/variant_descriptions.conf
175:debug:main Executing variant universal provides universal
176:debug:main Running callback portconfigure::add_automatic_compiler_dependencies
177:debug:main Finished running callback portconfigure::add_automatic_compiler_dependencies
178:debug:main Running callback portbuild::add_automatic_buildsystem_dependencies
179:debug:main Finished running callback portbuild::add_automatic_buildsystem_dependencies
180:debug:main No need to upgrade! xz 5.2.2_0 >= xz 5.2.2_0
181:debug:main epoch: in tree: 2 installed: 2
182:debug:main gettext 0.19.8.1_0 exists in the ports tree
183:debug:main gettext 0.19.8.1_0 +universal is the latest installed
184:debug:main gettext 0.19.8.1_0 +universal is active
185:debug:main Merging existing variants '+universal' into variants
186:debug:main new fully merged portvariants: universal +
187:debug:main Changing to port directory: /opt/local/var/macports/sources/rsync.macports.org/release/tarballs/ports/devel/gettext
188:debug:main OS darwin/16.0.0 (Mac OS X 10.12) arch i386
189:debug:main Sourcing PortGroup compiler_blacklist_versions 1.0 from /opt/local/var/macports/sources/rsync.macports.org/release/tarballs/ports/_resources/port1.0/group/compiler_blacklist_versions-1.0.tcl
190:debug:main Reading variant descriptions from /opt/local/var/macports/sources/rsync.macports.org/release/tarballs/ports/_resources/port1.0/variant_descriptions.conf
191:debug:main Sourcing PortGroup muniversal 1.0 from /opt/local/var/macports/sources/rsync.macports.org/release/tarballs/ports/_resources/port1.0/group/muniversal-1.0.tcl
192:debug:main compiler clang 800.0.38 not blacklisted because it doesn't match {clang < 211.10.1}
193:debug:main universal variant already exists, so not adding the default one
194:debug:main Executing variant universal provides universal
195:debug:main Running callback portconfigure::add_automatic_compiler_dependencies
196:debug:main Finished running callback portconfigure::add_automatic_compiler_dependencies
197:debug:main Running callback portbuild::add_automatic_buildsystem_dependencies
198:debug:main Finished running callback portbuild::add_automatic_buildsystem_dependencies
199:debug:main No need to upgrade! gettext 0.19.8.1_0 >= gettext 0.19.8.1_0
200:debug:main epoch: in tree: 0 installed: 0
201:debug:main ncurses 6.0_0 exists in the ports tree
202:debug:main ncurses 6.0_0 +universal is the latest installed
203:debug:main ncurses 6.0_0 +universal is active
204:debug:main Merging existing variants '+universal' into variants
205:debug:main new fully merged portvariants: universal +
206:debug:main Changing to port directory: /opt/local/var/macports/sources/rsync.macports.org/release/tarballs/ports/devel/ncurses
207:debug:main OS darwin/16.0.0 (Mac OS X 10.12) arch i386
208:debug:main adding the default universal variant
209:debug:main Reading variant descriptions from /opt/local/var/macports/sources/rsync.macports.org/release/tarballs/ports/_resources/port1.0/variant_descriptions.conf
210:debug:main Executing variant universal provides universal
211:debug:main Running callback portconfigure::add_automatic_compiler_dependencies
212:debug:main Finished running callback portconfigure::add_automatic_compiler_dependencies
213:debug:main Running callback portbuild::add_automatic_buildsystem_dependencies
214:debug:main Finished running callback portbuild::add_automatic_buildsystem_dependencies
215:debug:main No need to upgrade! ncurses 6.0_0 >= ncurses 6.0_0
216:debug:main epoch: in tree: 0 installed: 0
217:debug:main lzo2 2.09_0 exists in the ports tree
218:debug:main lzo2 2.09_0  is the latest installed
219:debug:main lzo2 2.09_0  is active
220:debug:main Merging existing variants '' into variants
221:debug:main new fully merged portvariants:
222:debug:main Changing to port directory: /opt/local/var/macports/sources/rsync.macports.org/release/tarballs/ports/archivers/lzo2
223:debug:main OS darwin/16.0.0 (Mac OS X 10.12) arch i386
224:debug:main Reading variant descriptions from /opt/local/var/macports/sources/rsync.macports.org/release/tarballs/ports/_resources/port1.0/variant_descriptions.conf
225:debug:main Sourcing PortGroup muniversal 1.0 from /opt/local/var/macports/sources/rsync.macports.org/release/tarballs/ports/_resources/port1.0/group/muniversal-1.0.tcl
226:debug:main universal variant already exists, so not adding the default one
227:debug:main Running callback portconfigure::add_automatic_compiler_dependencies
228:debug:main Finished running callback portconfigure::add_automatic_compiler_dependencies
229:debug:main Running callback portbuild::add_automatic_buildsystem_dependencies
230:debug:main Finished running callback portbuild::add_automatic_buildsystem_dependencies
231:debug:main No need to upgrade! lzo2 2.09_0 >= lzo2 2.09_0
232:debug:main epoch: in tree: 0 installed: 0
233:debug:main pkgconfig 0.29.1_0 exists in the ports tree
234:debug:main pkgconfig 0.29.1_0  is the latest installed
235:debug:main pkgconfig 0.29.1_0  is active
236:debug:main Merging existing variants '' into variants
237:debug:main new fully merged portvariants:
238:debug:main Changing to port directory: /opt/local/var/macports/sources/rsync.macports.org/release/tarballs/ports/devel/pkgconfig
239:debug:main OS darwin/16.0.0 (Mac OS X 10.12) arch i386
240:debug:main adding the default universal variant
241:debug:main Reading variant descriptions from /opt/local/var/macports/sources/rsync.macports.org/release/tarballs/ports/_resources/port1.0/variant_descriptions.conf
242:debug:main Running callback portconfigure::add_automatic_compiler_dependencies
243:debug:main Finished running callback portconfigure::add_automatic_compiler_dependencies
244:debug:main Running callback portbuild::add_automatic_buildsystem_dependencies
245:debug:main Finished running callback portbuild::add_automatic_buildsystem_dependencies
246:debug:main No need to upgrade! pkgconfig 0.29.1_0 >= pkgconfig 0.29.1_0
247:debug:main epoch: in tree: 0 installed: 0
248:debug:main libpng 1.6.25_0 exists in the ports tree
249:debug:main libpng 1.6.25_0 +universal is the latest installed
250:debug:main libpng 1.6.25_0 +universal is active
251:debug:main Merging existing variants '+universal' into variants
252:debug:main new fully merged portvariants: universal +
253:debug:main Changing to port directory: /opt/local/var/macports/sources/rsync.macports.org/release/tarballs/ports/graphics/libpng
254:debug:main OS darwin/16.0.0 (Mac OS X 10.12) arch i386
255:debug:main adding the default universal variant
256:debug:main Reading variant descriptions from /opt/local/var/macports/sources/rsync.macports.org/release/tarballs/ports/_resources/port1.0/variant_descriptions.conf
257:debug:main Executing variant universal provides universal
258:debug:main Running callback portconfigure::add_automatic_compiler_dependencies
259:debug:main Finished running callback portconfigure::add_automatic_compiler_dependencies
260:debug:main Running callback portbuild::add_automatic_buildsystem_dependencies
261:debug:main Finished running callback portbuild::add_automatic_buildsystem_dependencies
262:debug:main No need to upgrade! libpng 1.6.25_0 >= libpng 1.6.25_0
263:debug:main epoch: in tree: 0 installed: 0
264:debug:main jpeg 9a_1 exists in the ports tree
265:debug:main jpeg 9a_1 +universal is the latest installed
266:debug:main jpeg 9a_1 +universal is active
267:debug:main Merging existing variants '+universal' into variants
268:debug:main new fully merged portvariants: universal +
269:debug:main Changing to port directory: /opt/local/var/macports/sources/rsync.macports.org/release/tarballs/ports/graphics/jpeg
270:debug:main OS darwin/16.0.0 (Mac OS X 10.12) arch i386
271:debug:main adding the default universal variant
272:debug:main Reading variant descriptions from /opt/local/var/macports/sources/rsync.macports.org/release/tarballs/ports/_resources/port1.0/variant_descriptions.conf
273:debug:main Executing variant universal provides universal
274:debug:main Running callback portconfigure::add_automatic_compiler_dependencies
275:debug:main Finished running callback portconfigure::add_automatic_compiler_dependencies
276:debug:main Running callback portbuild::add_automatic_buildsystem_dependencies
277:debug:main Finished running callback portbuild::add_automatic_buildsystem_dependencies
278:debug:main No need to upgrade! jpeg 9a_1 >= jpeg 9a_1
279:debug:main epoch: in tree: 0 installed: 0
280:debug:main jasper 1.900.1_10 exists in the ports tree
281:debug:main jasper 1.900.1_10 +universal is the latest installed
282:debug:main jasper 1.900.1_10 +universal is active
283:debug:main Merging existing variants '+universal' into variants
284:debug:main new fully merged portvariants: universal +
285:debug:main Changing to port directory: /opt/local/var/macports/sources/rsync.macports.org/release/tarballs/ports/graphics/jasper
286:debug:main OS darwin/16.0.0 (Mac OS X 10.12) arch i386
287:debug:main adding the default universal variant
288:debug:main Reading variant descriptions from /opt/local/var/macports/sources/rsync.macports.org/release/tarballs/ports/_resources/port1.0/variant_descriptions.conf
289:debug:main Executing variant universal provides universal
290:debug:main Running callback portconfigure::add_automatic_compiler_dependencies
291:debug:main Finished running callback portconfigure::add_automatic_compiler_dependencies
292:debug:main Running callback portbuild::add_automatic_buildsystem_dependencies
293:debug:main Finished running callback portbuild::add_automatic_buildsystem_dependencies
294:debug:main No need to upgrade! jasper 1.900.1_10 >= jasper 1.900.1_10
295:debug:main epoch: in tree: 0 installed: 0
296:debug:main tiff 4.0.6_1 exists in the ports tree
297:debug:main tiff 4.0.6_1 +universal is the latest installed
298:debug:main tiff 4.0.6_1 +universal is active
299:debug:main Merging existing variants '+universal' into variants
300:debug:main new fully merged portvariants: universal +
301:debug:main Changing to port directory: /opt/local/var/macports/sources/rsync.macports.org/release/tarballs/ports/graphics/tiff
302:debug:main OS darwin/16.0.0 (Mac OS X 10.12) arch i386
303:debug:main Sourcing PortGroup xcodeversion 1.0 from /opt/local/var/macports/sources/rsync.macports.org/release/tarballs/ports/_resources/port1.0/group/xcodeversion-1.0.tcl
304:debug:main Reading variant descriptions from /opt/local/var/macports/sources/rsync.macports.org/release/tarballs/ports/_resources/port1.0/variant_descriptions.conf
305:debug:main Sourcing PortGroup muniversal 1.0 from /opt/local/var/macports/sources/rsync.macports.org/release/tarballs/ports/_resources/port1.0/group/muniversal-1.0.tcl
306:debug:main universal variant already exists, so not adding the default one
307:debug:main Executing variant universal provides universal
308:debug:main Running callback portconfigure::add_automatic_compiler_dependencies
309:debug:main Finished running callback portconfigure::add_automatic_compiler_dependencies
310:debug:main Running callback portbuild::add_automatic_buildsystem_dependencies
311:debug:main Finished running callback portbuild::add_automatic_buildsystem_dependencies
312:debug:main No need to upgrade! tiff 4.0.6_1 >= tiff 4.0.6_1
313:debug:main epoch: in tree: 0 installed: 0
314:debug:main webp 0.5.1_0 exists in the ports tree
315:debug:main webp 0.5.1_0  is the latest installed
316:debug:main webp 0.5.1_0  is active
317:debug:main Merging existing variants '' into variants
318:debug:main new fully merged portvariants:
319:debug:main Changing to port directory: /opt/local/var/macports/sources/rsync.macports.org/release/tarballs/ports/graphics/webp
320:debug:main OS darwin/16.0.0 (Mac OS X 10.12) arch i386
321:debug:main adding the default universal variant
322:debug:main Reading variant descriptions from /opt/local/var/macports/sources/rsync.macports.org/release/tarballs/ports/_resources/port1.0/variant_descriptions.conf
323:debug:main Running callback portconfigure::add_automatic_compiler_dependencies
324:debug:main Finished running callback portconfigure::add_automatic_compiler_dependencies
325:debug:main Running callback portbuild::add_automatic_buildsystem_dependencies
326:debug:main Finished running callback portbuild::add_automatic_buildsystem_dependencies
327:debug:main No need to upgrade! webp 0.5.1_0 >= webp 0.5.1_0
328:debug:main epoch: in tree: 0 installed: 0
329:debug:main ilmbase 2.2.0_0 exists in the ports tree
330:debug:main ilmbase 2.2.0_0  is the latest installed
331:debug:main ilmbase 2.2.0_0  is active
332:debug:main Merging existing variants '' into variants
333:debug:main new fully merged portvariants:
334:debug:main Changing to port directory: /opt/local/var/macports/sources/rsync.macports.org/release/tarballs/ports/graphics/openexr
335:debug:main OS darwin/16.0.0 (Mac OS X 10.12) arch i386
336:debug:main adding the default universal variant
337:debug:main Reading variant descriptions from /opt/local/var/macports/sources/rsync.macports.org/release/tarballs/ports/_resources/port1.0/variant_descriptions.conf
338:debug:main Running callback portconfigure::add_automatic_compiler_dependencies
339:debug:main Finished running callback portconfigure::add_automatic_compiler_dependencies
340:debug:main Running callback portbuild::add_automatic_buildsystem_dependencies
341:debug:main Finished running callback portbuild::add_automatic_buildsystem_dependencies
342:debug:main No need to upgrade! ilmbase 2.2.0_0 >= ilmbase 2.2.0_0
343:debug:main epoch: in tree: 0 installed: 0
344:debug:main openexr 2.2.0_1 exists in the ports tree
345:debug:main openexr 2.2.0_1  is the latest installed
346:debug:main openexr 2.2.0_1  is active
347:debug:main Merging existing variants '' into variants
348:debug:main new fully merged portvariants:
349:debug:main Changing to port directory: /opt/local/var/macports/sources/rsync.macports.org/release/tarballs/ports/graphics/openexr
350:debug:main OS darwin/16.0.0 (Mac OS X 10.12) arch i386
351:debug:main adding the default universal variant
352:debug:main Reading variant descriptions from /opt/local/var/macports/sources/rsync.macports.org/release/tarballs/ports/_resources/port1.0/variant_descriptions.conf
353:debug:main Running callback portconfigure::add_automatic_compiler_dependencies
354:debug:main Finished running callback portconfigure::add_automatic_compiler_dependencies
355:debug:main Running callback portbuild::add_automatic_buildsystem_dependencies
356:debug:main Finished running callback portbuild::add_automatic_buildsystem_dependencies
357:debug:main No need to upgrade! openexr 2.2.0_1 >= openexr 2.2.0_1
358:debug:main epoch: in tree: 1 installed: 1
359:debug:main ffmpeg 3.1.3_0 exists in the ports tree
360:debug:main ffmpeg 3.1.3_0 +gpl2+x11 is the latest installed
361:debug:main ffmpeg 3.1.3_0 +gpl2+x11 is active
362:debug:main Merging existing variants '+gpl2+x11' into variants
363:debug:main new fully merged portvariants: gpl2 + x11 +
364:debug:main Changing to port directory: /opt/local/var/macports/sources/rsync.macports.org/release/tarballs/ports/multimedia/ffmpeg
365:debug:main OS darwin/16.0.0 (Mac OS X 10.12) arch i386
366:debug:main Sourcing PortGroup xcodeversion 1.0 from /opt/local/var/macports/sources/rsync.macports.org/release/tarballs/ports/_resources/port1.0/group/xcodeversion-1.0.tcl
367:debug:main Reading variant descriptions from /opt/local/var/macports/sources/rsync.macports.org/release/tarballs/ports/_resources/port1.0/variant_descriptions.conf
368:debug:main Sourcing PortGroup muniversal 1.0 from /opt/local/var/macports/sources/rsync.macports.org/release/tarballs/ports/_resources/port1.0/group/muniversal-1.0.tcl
369:debug:main Sourcing PortGroup compiler_blacklist_versions 1.0 from /opt/local/var/macports/sources/rsync.macports.org/release/tarballs/ports/_resources/port1.0/group/compiler_blacklist_versions-1.0.tcl
370:debug:main Sourcing PortGroup active_variants 1.1 from /opt/local/var/macports/sources/rsync.macports.org/release/tarballs/ports/_resources/port1.0/group/active_variants-1.1.tcl
371:debug:main universal variant already exists, so not adding the default one
372:debug:main Executing variant x11 provides x11
373:debug:main Executing variant gpl2 provides gpl2
374:debug:main Running callback portconfigure::add_automatic_compiler_dependencies
375:debug:main Finished running callback portconfigure::add_automatic_compiler_dependencies
376:debug:main Running callback portbuild::add_automatic_buildsystem_dependencies
377:debug:main Finished running callback portbuild::add_automatic_buildsystem_dependencies
378:debug:main No need to upgrade! ffmpeg 3.1.3_0 >= ffmpeg 3.1.3_0
379:debug:main epoch: in tree: 0 installed: 0
380:debug:main lame 3.99.5_1 exists in the ports tree
381:debug:main lame 3.99.5_1  is the latest installed
382:debug:main lame 3.99.5_1  is active
383:debug:main Merging existing variants '' into variants
384:debug:main new fully merged portvariants:
385:debug:main Changing to port directory: /opt/local/var/macports/sources/rsync.macports.org/release/tarballs/ports/audio/lame
386:debug:main OS darwin/16.0.0 (Mac OS X 10.12) arch i386
387:debug:main adding the default universal variant
388:debug:main Reading variant descriptions from /opt/local/var/macports/sources/rsync.macports.org/release/tarballs/ports/_resources/port1.0/variant_descriptions.conf
389:debug:main Running callback portconfigure::add_automatic_compiler_dependencies
390:debug:main Finished running callback portconfigure::add_automatic_compiler_dependencies
391:debug:main Running callback portbuild::add_automatic_buildsystem_dependencies
392:debug:main Finished running callback portbuild::add_automatic_buildsystem_dependencies
393:debug:main No need to upgrade! lame 3.99.5_1 >= lame 3.99.5_1
394:debug:main epoch: in tree: 0 installed: 0
395:debug:main libvorbis 1.3.5_0 exists in the ports tree
396:debug:main libvorbis 1.3.5_0 +universal is the latest installed
397:debug:main libvorbis 1.3.5_0 +universal is active
398:debug:main Merging existing variants '+universal' into variants
399:debug:main new fully merged portvariants: universal +
400:debug:main Changing to port directory: /opt/local/var/macports/sources/rsync.macports.org/release/tarballs/ports/audio/libvorbis
401:debug:main OS darwin/16.0.0 (Mac OS X 10.12) arch i386
402:debug:main Reading variant descriptions from /opt/local/var/macports/sources/rsync.macports.org/release/tarballs/ports/_resources/port1.0/variant_descriptions.conf
403:debug:main Sourcing PortGroup muniversal 1.0 from /opt/local/var/macports/sources/rsync.macports.org/release/tarballs/ports/_resources/port1.0/group/muniversal-1.0.tcl
404:debug:main universal variant already exists, so not adding the default one
405:debug:main Executing variant universal provides universal
406:debug:main Running callback portconfigure::add_automatic_compiler_dependencies
407:debug:main Finished running callback portconfigure::add_automatic_compiler_dependencies
408:debug:main Running callback portbuild::add_automatic_buildsystem_dependencies
409:debug:main Finished running callback portbuild::add_automatic_buildsystem_dependencies
410:debug:main No need to upgrade! libvorbis 1.3.5_0 >= libvorbis 1.3.5_0
411:debug:main epoch: in tree: 0 installed: 0
412:debug:main libogg 1.3.2_1 exists in the ports tree
413:debug:main libogg 1.3.2_1 +universal is the latest installed
414:debug:main libogg 1.3.2_1 +universal is active
415:debug:main Merging existing variants '+universal' into variants
416:debug:main new fully merged portvariants: universal +
417:debug:main Changing to port directory: /opt/local/var/macports/sources/rsync.macports.org/release/tarballs/ports/multimedia/libogg
418:debug:main OS darwin/16.0.0 (Mac OS X 10.12) arch i386
419:debug:main adding the default universal variant
420:debug:main Reading variant descriptions from /opt/local/var/macports/sources/rsync.macports.org/release/tarballs/ports/_resources/port1.0/variant_descriptions.conf
421:debug:main Executing variant universal provides universal
422:debug:main Running callback portconfigure::add_automatic_compiler_dependencies
423:debug:main Finished running callback portconfigure::add_automatic_compiler_dependencies
424:debug:main Running callback portbuild::add_automatic_buildsystem_dependencies
425:debug:main Finished running callback portbuild::add_automatic_buildsystem_dependencies
426:debug:main No need to upgrade! libogg 1.3.2_1 >= libogg 1.3.2_1
427:debug:main epoch: in tree: 0 installed: 0
428:debug:main libopus 1.1.2_0 exists in the ports tree
429:debug:main libopus 1.1.2_0  is the latest installed
430:debug:main libopus 1.1.2_0  is active
431:debug:main Merging existing variants '' into variants
432:debug:main new fully merged portvariants:
433:debug:main Changing to port directory: /opt/local/var/macports/sources/rsync.macports.org/release/tarballs/ports/audio/libopus
434:debug:main OS darwin/16.0.0 (Mac OS X 10.12) arch i386
435:debug:main Reading variant descriptions from /opt/local/var/macports/sources/rsync.macports.org/release/tarballs/ports/_resources/port1.0/variant_descriptions.conf
436:debug:main Sourcing PortGroup muniversal 1.0 from /opt/local/var/macports/sources/rsync.macports.org/release/tarballs/ports/_resources/port1.0/group/muniversal-1.0.tcl
437:debug:main universal variant already exists, so not adding the default one
438:debug:main Running callback portconfigure::add_automatic_compiler_dependencies
439:debug:main Finished running callback portconfigure::add_automatic_compiler_dependencies
440:debug:main Running callback portbuild::add_automatic_buildsystem_dependencies
441:debug:main Finished running callback portbuild::add_automatic_buildsystem_dependencies
442:debug:main No need to upgrade! libopus 1.1.2_0 >= libopus 1.1.2_0
443:debug:main epoch: in tree: 1 installed: 1
444:debug:main libtheora 1.1.1_2 exists in the ports tree
445:debug:main libtheora 1.1.1_2 +universal is the latest installed
446:debug:main libtheora 1.1.1_2 +universal is active
447:debug:main Merging existing variants '+universal' into variants
448:debug:main new fully merged portvariants: universal +
449:debug:main Changing to port directory: /opt/local/var/macports/sources/rsync.macports.org/release/tarballs/ports/multimedia/libtheora
450:debug:main OS darwin/16.0.0 (Mac OS X 10.12) arch i386
451:debug:main Sourcing PortGroup xcodeversion 1.0 from /opt/local/var/macports/sources/rsync.macports.org/release/tarballs/ports/_resources/port1.0/group/xcodeversion-1.0.tcl
452:debug:main adding the default universal variant
453:debug:main Reading variant descriptions from /opt/local/var/macports/sources/rsync.macports.org/release/tarballs/ports/_resources/port1.0/variant_descriptions.conf
454:debug:main Executing variant universal provides universal
455:debug:main Running callback portconfigure::add_automatic_compiler_dependencies
456:debug:main Finished running callback portconfigure::add_automatic_compiler_dependencies
457:debug:main Running callback portbuild::add_automatic_buildsystem_dependencies
458:debug:main Finished running callback portbuild::add_automatic_buildsystem_dependencies
459:debug:main No need to upgrade! libtheora 1.1.1_2 >= libtheora 1.1.1_2
460:debug:main epoch: in tree: 0 installed: 0
461:debug:main libmodplug 0.8.8.5_0 exists in the ports tree
462:debug:main libmodplug 0.8.8.5_0  is the latest installed
463:debug:main libmodplug 0.8.8.5_0  is active
464:debug:main Merging existing variants '' into variants
465:debug:main new fully merged portvariants:
466:debug:main Changing to port directory: /opt/local/var/macports/sources/rsync.macports.org/release/tarballs/ports/audio/libmodplug
467:debug:main OS darwin/16.0.0 (Mac OS X 10.12) arch i386
468:debug:main adding the default universal variant
469:debug:main Reading variant descriptions from /opt/local/var/macports/sources/rsync.macports.org/release/tarballs/ports/_resources/port1.0/variant_descriptions.conf
470:debug:main Running callback portconfigure::add_automatic_compiler_dependencies
471:debug:main Finished running callback portconfigure::add_automatic_compiler_dependencies
472:debug:main Running callback portbuild::add_automatic_buildsystem_dependencies
473:debug:main Finished running callback portbuild::add_automatic_buildsystem_dependencies
474:debug:main No need to upgrade! libmodplug 0.8.8.5_0 >= libmodplug 0.8.8.5_0
475:debug:main epoch: in tree: 0 installed: 0
476:debug:main schroedinger 1.0.11_0 exists in the ports tree
477:debug:main schroedinger 1.0.11_0  is the latest installed
478:debug:main schroedinger 1.0.11_0  is active
479:debug:main Merging existing variants '' into variants
480:debug:main new fully merged portvariants:
481:debug:main Changing to port directory: /opt/local/var/macports/sources/rsync.macports.org/release/tarballs/ports/multimedia/schroedinger
482:debug:main OS darwin/16.0.0 (Mac OS X 10.12) arch i386
483:debug:main adding the default universal variant
484:debug:main Reading variant descriptions from /opt/local/var/macports/sources/rsync.macports.org/release/tarballs/ports/_resources/port1.0/variant_descriptions.conf
485:debug:main Running callback portconfigure::add_automatic_compiler_dependencies
486:debug:main Finished running callback portconfigure::add_automatic_compiler_dependencies
487:debug:main Running callback portbuild::add_automatic_buildsystem_dependencies
488:debug:main Finished running callback portbuild::add_automatic_buildsystem_dependencies
489:debug:main No need to upgrade! schroedinger 1.0.11_0 >= schroedinger 1.0.11_0
490:debug:main epoch: in tree: 0 installed: 0
491:debug:main orc 0.4.26_0 exists in the ports tree
492:debug:main orc 0.4.26_0 +universal is the latest installed
493:debug:main orc 0.4.26_0 +universal is active
494:debug:main Merging existing variants '+universal' into variants
495:debug:main new fully merged portvariants: universal +
496:debug:main Changing to port directory: /opt/local/var/macports/sources/rsync.macports.org/release/tarballs/ports/devel/orc
497:debug:main OS darwin/16.0.0 (Mac OS X 10.12) arch i386
498:debug:main Reading variant descriptions from /opt/local/var/macports/sources/rsync.macports.org/release/tarballs/ports/_resources/port1.0/variant_descriptions.conf
499:debug:main Sourcing PortGroup muniversal 1.0 from /opt/local/var/macports/sources/rsync.macports.org/release/tarballs/ports/_resources/port1.0/group/muniversal-1.0.tcl
500:debug:main universal variant already exists, so not adding the default one
501:debug:main Executing variant universal provides universal
502:debug:main Running callback portconfigure::add_automatic_compiler_dependencies
503:debug:main Finished running callback portconfigure::add_automatic_compiler_dependencies
504:debug:main Running callback portbuild::add_automatic_buildsystem_dependencies
505:debug:main Finished running callback portbuild::add_automatic_buildsystem_dependencies
506:debug:main No need to upgrade! orc 0.4.26_0 >= orc 0.4.26_0
507:debug:main epoch: in tree: 0 installed: 0
508:debug:main libass 0.13.2_0 exists in the ports tree
509:debug:main libass 0.13.2_0  is the latest installed
510:debug:main libass 0.13.2_0  is active
511:debug:main Merging existing variants '' into variants
512:debug:main new fully merged portvariants:
513:debug:main Changing to port directory: /opt/local/var/macports/sources/rsync.macports.org/release/tarballs/ports/multimedia/libass
514:debug:main OS darwin/16.0.0 (Mac OS X 10.12) arch i386
515:debug:main Sourcing PortGroup github 1.0 from /opt/local/var/macports/sources/rsync.macports.org/release/tarballs/ports/_resources/port1.0/group/github-1.0.tcl
516:debug:main Reading variant descriptions from /opt/local/var/macports/sources/rsync.macports.org/release/tarballs/ports/_resources/port1.0/variant_descriptions.conf
517:debug:main Sourcing PortGroup muniversal 1.0 from /opt/local/var/macports/sources/rsync.macports.org/release/tarballs/ports/_resources/port1.0/group/muniversal-1.0.tcl
518:debug:main universal variant already exists, so not adding the default one
519:debug:main Running callback portconfigure::add_automatic_compiler_dependencies
520:debug:main Finished running callback portconfigure::add_automatic_compiler_dependencies
521:debug:main Running callback portbuild::add_automatic_buildsystem_dependencies
522:debug:main Finished running callback portbuild::add_automatic_buildsystem_dependencies
523:debug:main No need to upgrade! libass 0.13.2_0 >= libass 0.13.2_0
524:debug:main epoch: in tree: 0 installed: 0
525:debug:main fribidi 0.19.7_0 exists in the ports tree
526:debug:main fribidi 0.19.7_0  is the latest installed
527:debug:main fribidi 0.19.7_0  is active
528:debug:main Merging existing variants '' into variants
529:debug:main new fully merged portvariants:
530:debug:main Changing to port directory: /opt/local/var/macports/sources/rsync.macports.org/release/tarballs/ports/textproc/fribidi
531:debug:main OS darwin/16.0.0 (Mac OS X 10.12) arch i386
532:debug:main adding the default universal variant
533:debug:main Reading variant descriptions from /opt/local/var/macports/sources/rsync.macports.org/release/tarballs/ports/_resources/port1.0/variant_descriptions.conf
534:debug:main Running callback portconfigure::add_automatic_compiler_dependencies
535:debug:main Finished running callback portconfigure::add_automatic_compiler_dependencies
536:debug:main Running callback portbuild::add_automatic_buildsystem_dependencies
537:debug:main Finished running callback portbuild::add_automatic_buildsystem_dependencies
538:debug:main No need to upgrade! fribidi 0.19.7_0 >= fribidi 0.19.7_0
539:debug:main epoch: in tree: 0 installed: 0
540:debug:main glib2 2.48.2_0 exists in the ports tree
541:debug:main glib2 2.48.2_0 +universal is the latest installed
542:debug:main glib2 2.48.2_0 +universal is active
543:debug:main Merging existing variants '+universal' into variants
544:debug:main new fully merged portvariants: universal +
545:debug:main Changing to port directory: /opt/local/var/macports/sources/rsync.macports.org/release/tarballs/ports/devel/glib2
546:debug:main OS darwin/16.0.0 (Mac OS X 10.12) arch i386
547:debug:main Sourcing PortGroup compiler_blacklist_versions 1.0 from /opt/local/var/macports/sources/rsync.macports.org/release/tarballs/ports/_resources/port1.0/group/compiler_blacklist_versions-1.0.tcl
548:debug:main compiler clang 800.0.38 not blacklisted because it doesn't match {clang < 600}
549:debug:main compiler clang 800.0.38 not blacklisted because it doesn't match {clang < 318}
550:debug:main adding the default universal variant
551:debug:main Reading variant descriptions from /opt/local/var/macports/sources/rsync.macports.org/release/tarballs/ports/_resources/port1.0/variant_descriptions.conf
552:debug:main Executing variant universal provides universal
553:debug:main Running callback portconfigure::add_automatic_compiler_dependencies
554:debug:main Finished running callback portconfigure::add_automatic_compiler_dependencies
555:debug:main Running callback portbuild::add_automatic_buildsystem_dependencies
556:debug:main Finished running callback portbuild::add_automatic_buildsystem_dependencies
557:debug:main No need to upgrade! glib2 2.48.2_0 >= glib2 2.48.2_0
558:debug:main epoch: in tree: 0 installed: 0
559:debug:main libffi 3.2.1_0 exists in the ports tree
560:debug:main libffi 3.2.1_0 +universal is the latest installed
561:debug:main libffi 3.2.1_0 +universal is active
562:debug:main Merging existing variants '+universal' into variants
563:debug:main new fully merged portvariants: universal +
564:debug:main Changing to port directory: /opt/local/var/macports/sources/rsync.macports.org/release/tarballs/ports/devel/libffi
565:debug:main OS darwin/16.0.0 (Mac OS X 10.12) arch i386
566:debug:main Reading variant descriptions from /opt/local/var/macports/sources/rsync.macports.org/release/tarballs/ports/_resources/port1.0/variant_descriptions.conf
567:debug:main Sourcing PortGroup muniversal 1.0 from /opt/local/var/macports/sources/rsync.macports.org/release/tarballs/ports/_resources/port1.0/group/muniversal-1.0.tcl
568:debug:main universal variant already exists, so not adding the default one
569:debug:main Executing variant universal provides universal
570:debug:main Running callback portconfigure::add_automatic_compiler_dependencies
571:debug:main Finished running callback portconfigure::add_automatic_compiler_dependencies
572:debug:main Running callback portbuild::add_automatic_buildsystem_dependencies
573:debug:main Finished running callback portbuild::add_automatic_buildsystem_dependencies
574:debug:main No need to upgrade! libffi 3.2.1_0 >= libffi 3.2.1_0
575:debug:main epoch: in tree: 0 installed: 0
576:debug:main pcre 8.39_0 exists in the ports tree
577:debug:main pcre 8.39_0 +universal is the latest installed
578:debug:main pcre 8.39_0 +universal is active
579:debug:main Merging existing variants '+universal' into variants
580:debug:main new fully merged portvariants: universal +
581:debug:main Changing to port directory: /opt/local/var/macports/sources/rsync.macports.org/release/tarballs/ports/devel/pcre
582:debug:main OS darwin/16.0.0 (Mac OS X 10.12) arch i386
583:debug:main adding the default universal variant
584:debug:main Reading variant descriptions from /opt/local/var/macports/sources/rsync.macports.org/release/tarballs/ports/_resources/port1.0/variant_descriptions.conf
585:debug:main Executing variant universal provides universal
586:debug:main Running callback portconfigure::add_automatic_compiler_dependencies
587:debug:main Finished running callback portconfigure::add_automatic_compiler_dependencies
588:debug:main Running callback portbuild::add_automatic_buildsystem_dependencies
589:debug:main Finished running callback portbuild::add_automatic_buildsystem_dependencies
590:debug:main No need to upgrade! pcre 8.39_0 >= pcre 8.39_0
591:debug:main epoch: in tree: 20090923 installed: 20090923
592:debug:main libedit 20160618-3.1_1 exists in the ports tree
593:debug:main libedit 20160618-3.1_1 +universal is the latest installed
594:debug:main libedit 20160618-3.1_1 +universal is active
595:debug:main Merging existing variants '+universal' into variants
596:debug:main new fully merged portvariants: universal +
597:debug:main Changing to port directory: /opt/local/var/macports/sources/rsync.macports.org/release/tarballs/ports/devel/libedit
598:debug:main OS darwin/16.0.0 (Mac OS X 10.12) arch i386
599:debug:main Reading variant descriptions from /opt/local/var/macports/sources/rsync.macports.org/release/tarballs/ports/_resources/port1.0/variant_descriptions.conf
600:debug:main Sourcing PortGroup muniversal 1.0 from /opt/local/var/macports/sources/rsync.macports.org/release/tarballs/ports/_resources/port1.0/group/muniversal-1.0.tcl
601:debug:main universal variant already exists, so not adding the default one
602:debug:main Executing variant universal provides universal
603:debug:main Running callback portconfigure::add_automatic_compiler_dependencies
604:debug:main Finished running callback portconfigure::add_automatic_compiler_dependencies
605:debug:main Running callback portbuild::add_automatic_buildsystem_dependencies
606:debug:main Finished running callback portbuild::add_automatic_buildsystem_dependencies
607:debug:main No need to upgrade! libedit 20160618-3.1_1 >= libedit 20160618-3.1_1
608:debug:main epoch: in tree: 0 installed: 0
609:debug:main fontconfig 2.12.1_1 exists in the ports tree
610:debug:main fontconfig 2.12.1_1 +universal is the latest installed
611:debug:main fontconfig 2.12.1_1 +universal is active
612:debug:main Merging existing variants '+universal' into variants
613:debug:main new fully merged portvariants: universal +
614:debug:main Changing to port directory: /opt/local/var/macports/sources/rsync.macports.org/release/tarballs/ports/graphics/fontconfig
615:debug:main OS darwin/16.0.0 (Mac OS X 10.12) arch i386
616:debug:main Reading variant descriptions from /opt/local/var/macports/sources/rsync.macports.org/release/tarballs/ports/_resources/port1.0/variant_descriptions.conf
617:debug:main Sourcing PortGroup muniversal 1.0 from /opt/local/var/macports/sources/rsync.macports.org/release/tarballs/ports/_resources/port1.0/group/muniversal-1.0.tcl
618:debug:main universal variant already exists, so not adding the default one
619:debug:main Executing variant universal provides universal
620:debug:main Running callback portconfigure::add_automatic_compiler_dependencies
621:debug:main Finished running callback portconfigure::add_automatic_compiler_dependencies
622:debug:main Running callback portbuild::add_automatic_buildsystem_dependencies
623:debug:main Finished running callback portbuild::add_automatic_buildsystem_dependencies
624:debug:main No need to upgrade! fontconfig 2.12.1_1 >= fontconfig 2.12.1_1
625:debug:main epoch: in tree: 0 installed: 0
626:debug:main freetype 2.7_0 exists in the ports tree
627:debug:main freetype 2.7_0 +universal is the latest installed
628:debug:main freetype 2.7_0 +universal is active
629:debug:main Merging existing variants '+universal' into variants
630:debug:main new fully merged portvariants: universal +
631:debug:main Changing to port directory: /opt/local/var/macports/sources/rsync.macports.org/release/tarballs/ports/print/freetype
632:debug:main OS darwin/16.0.0 (Mac OS X 10.12) arch i386
633:debug:main Reading variant descriptions from /opt/local/var/macports/sources/rsync.macports.org/release/tarballs/ports/_resources/port1.0/variant_descriptions.conf
634:debug:main Sourcing PortGroup muniversal 1.0 from /opt/local/var/macports/sources/rsync.macports.org/release/tarballs/ports/_resources/port1.0/group/muniversal-1.0.tcl
635:debug:main universal variant already exists, so not adding the default one
636:debug:main Executing variant universal provides universal
637:debug:main Running callback portconfigure::add_automatic_compiler_dependencies
638:debug:main Finished running callback portconfigure::add_automatic_compiler_dependencies
639:debug:main Running callback portbuild::add_automatic_buildsystem_dependencies
640:debug:main Finished running callback portbuild::add_automatic_buildsystem_dependencies
641:debug:main No need to upgrade! freetype 2.7_0 >= freetype 2.7_0
642:debug:main epoch: in tree: 0 installed: 0
643:debug:main libbluray 0.9.2_0 exists in the ports tree
644:debug:main libbluray 0.9.2_0  is the latest installed
645:debug:main libbluray 0.9.2_0  is active
646:debug:main Merging existing variants '' into variants
647:debug:main new fully merged portvariants:
648:debug:main Changing to port directory: /opt/local/var/macports/sources/rsync.macports.org/release/tarballs/ports/multimedia/libbluray
649:debug:main OS darwin/16.0.0 (Mac OS X 10.12) arch i386
650:debug:main adding the default universal variant
651:debug:main Reading variant descriptions from /opt/local/var/macports/sources/rsync.macports.org/release/tarballs/ports/_resources/port1.0/variant_descriptions.conf
652:debug:main Running callback portconfigure::add_automatic_compiler_dependencies
653:debug:main Finished running callback portconfigure::add_automatic_compiler_dependencies
654:debug:main Running callback portbuild::add_automatic_buildsystem_dependencies
655:debug:main Finished running callback portbuild::add_automatic_buildsystem_dependencies
656:debug:main No need to upgrade! libbluray 0.9.2_0 >= libbluray 0.9.2_0
657:debug:main epoch: in tree: 0 installed: 0
658:debug:main gnutls 3.4.15_0 exists in the ports tree
659:debug:main gnutls 3.4.15_0 +universal is the latest installed
660:debug:main gnutls 3.4.15_0 +universal is active
661:debug:main Merging existing variants '+universal' into variants
662:debug:main new fully merged portvariants: universal +
663:debug:main Changing to port directory: /opt/local/var/macports/sources/rsync.macports.org/release/tarballs/ports/devel/gnutls
664:debug:main OS darwin/16.0.0 (Mac OS X 10.12) arch i386
665:debug:main Reading variant descriptions from /opt/local/var/macports/sources/rsync.macports.org/release/tarballs/ports/_resources/port1.0/variant_descriptions.conf
666:debug:main Sourcing PortGroup muniversal 1.0 from /opt/local/var/macports/sources/rsync.macports.org/release/tarballs/ports/_resources/port1.0/group/muniversal-1.0.tcl
667:debug:main universal variant already exists, so not adding the default one
668:debug:main Executing variant universal provides universal
669:debug:main Running callback portconfigure::add_automatic_compiler_dependencies
670:debug:main Finished running callback portconfigure::add_automatic_compiler_dependencies
671:debug:main Running callback portbuild::add_automatic_buildsystem_dependencies
672:debug:main Finished running callback portbuild::add_automatic_buildsystem_dependencies
673:debug:main No need to upgrade! gnutls 3.4.15_0 >= gnutls 3.4.15_0
674:debug:main epoch: in tree: 0 installed: 0
675:debug:main gmp 6.1.1_0 exists in the ports tree
676:debug:main gmp 6.1.1_0 +universal is the latest installed
677:debug:main gmp 6.1.1_0 +universal is active
678:debug:main Merging existing variants '+universal' into variants
679:debug:main new fully merged portvariants: universal +
680:debug:main Changing to port directory: /opt/local/var/macports/sources/rsync.macports.org/release/tarballs/ports/devel/gmp
681:debug:main OS darwin/16.0.0 (Mac OS X 10.12) arch i386
682:debug:main Reading variant descriptions from /opt/local/var/macports/sources/rsync.macports.org/release/tarballs/ports/_resources/port1.0/variant_descriptions.conf
683:debug:main Sourcing PortGroup muniversal 1.0 from /opt/local/var/macports/sources/rsync.macports.org/release/tarballs/ports/_resources/port1.0/group/muniversal-1.0.tcl
684:debug:main universal variant already exists, so not adding the default one
685:debug:main Executing variant universal provides universal
686:debug:main Running callback portconfigure::add_automatic_compiler_dependencies
687:debug:main Finished running callback portconfigure::add_automatic_compiler_dependencies
688:debug:main Running callback portbuild::add_automatic_buildsystem_dependencies
689:debug:main Finished running callback portbuild::add_automatic_buildsystem_dependencies
690:debug:main No need to upgrade! gmp 6.1.1_0 >= gmp 6.1.1_0
691:debug:main epoch: in tree: 0 installed: 0
692:debug:main libidn 1.33_0 exists in the ports tree
693:debug:main libidn 1.33_0 +universal is the latest installed
694:debug:main libidn 1.33_0 +universal is active
695:debug:main Merging existing variants '+universal' into variants
696:debug:main new fully merged portvariants: universal +
697:debug:main Changing to port directory: /opt/local/var/macports/sources/rsync.macports.org/release/tarballs/ports/mail/libidn
698:debug:main OS darwin/16.0.0 (Mac OS X 10.12) arch i386
699:debug:main adding the default universal variant
700:debug:main Reading variant descriptions from /opt/local/var/macports/sources/rsync.macports.org/release/tarballs/ports/_resources/port1.0/variant_descriptions.conf
701:debug:main Executing variant universal provides universal
702:debug:main Running callback portconfigure::add_automatic_compiler_dependencies
703:debug:main Finished running callback portconfigure::add_automatic_compiler_dependencies
704:debug:main Running callback portbuild::add_automatic_buildsystem_dependencies
705:debug:main Finished running callback portbuild::add_automatic_buildsystem_dependencies
706:debug:main No need to upgrade! libidn 1.33_0 >= libidn 1.33_0
707:debug:main epoch: in tree: 0 installed: 0
708:debug:main libtasn1 4.9_0 exists in the ports tree
709:debug:main libtasn1 4.9_0 +universal is the latest installed
710:debug:main libtasn1 4.9_0 +universal is active
711:debug:main Merging existing variants '+universal' into variants
712:debug:main new fully merged portvariants: universal +
713:debug:main Changing to port directory: /opt/local/var/macports/sources/rsync.macports.org/release/tarballs/ports/devel/libtasn1
714:debug:main OS darwin/16.0.0 (Mac OS X 10.12) arch i386
715:debug:main adding the default universal variant
716:debug:main Reading variant descriptions from /opt/local/var/macports/sources/rsync.macports.org/release/tarballs/ports/_resources/port1.0/variant_descriptions.conf
717:debug:main Executing variant universal provides universal
718:debug:main Running callback portconfigure::add_automatic_compiler_dependencies
719:debug:main Finished running callback portconfigure::add_automatic_compiler_dependencies
720:debug:main Running callback portbuild::add_automatic_buildsystem_dependencies
721:debug:main Finished running callback portbuild::add_automatic_buildsystem_dependencies
722:debug:main No need to upgrade! libtasn1 4.9_0 >= libtasn1 4.9_0
723:debug:main epoch: in tree: 0 installed: 0
724:debug:main p11-kit 0.23.2_0 exists in the ports tree
725:debug:main p11-kit 0.23.2_0 +universal is the latest installed
726:debug:main p11-kit 0.23.2_0 +universal is active
727:debug:main Merging existing variants '+universal' into variants
728:debug:main new fully merged portvariants: universal +
729:debug:main Changing to port directory: /opt/local/var/macports/sources/rsync.macports.org/release/tarballs/ports/security/p11-kit
730:debug:main OS darwin/16.0.0 (Mac OS X 10.12) arch i386
731:debug:main adding the default universal variant
732:debug:main Reading variant descriptions from /opt/local/var/macports/sources/rsync.macports.org/release/tarballs/ports/_resources/port1.0/variant_descriptions.conf
733:debug:main Executing variant universal provides universal
734:debug:main Running callback portconfigure::add_automatic_compiler_dependencies
735:debug:main Finished running callback portconfigure::add_automatic_compiler_dependencies
736:debug:main Running callback portbuild::add_automatic_buildsystem_dependencies
737:debug:main Finished running callback portbuild::add_automatic_buildsystem_dependencies
738:debug:main No need to upgrade! p11-kit 0.23.2_0 >= p11-kit 0.23.2_0
739:debug:main epoch: in tree: 0 installed: 0
740:debug:main desktop-file-utils 0.23_0 exists in the ports tree
741:debug:main desktop-file-utils 0.23_0 +universal is the latest installed
742:debug:main desktop-file-utils 0.23_0 +universal is active
743:debug:main Merging existing variants '+universal' into variants
744:debug:main new fully merged portvariants: universal +
745:debug:main Changing to port directory: /opt/local/var/macports/sources/rsync.macports.org/release/tarballs/ports/gnome/desktop-file-utils
746:debug:main OS darwin/16.0.0 (Mac OS X 10.12) arch i386
747:debug:main adding the default universal variant
748:debug:main Reading variant descriptions from /opt/local/var/macports/sources/rsync.macports.org/release/tarballs/ports/_resources/port1.0/variant_descriptions.conf
749:debug:main Executing variant universal provides universal
750:debug:main Running callback portconfigure::add_automatic_compiler_dependencies
751:debug:main Finished running callback portconfigure::add_automatic_compiler_dependencies
752:debug:main Running callback portbuild::add_automatic_buildsystem_dependencies
753:debug:main Finished running callback portbuild::add_automatic_buildsystem_dependencies
754:debug:main No need to upgrade! desktop-file-utils 0.23_0 >= desktop-file-utils 0.23_0
755:debug:main epoch: in tree: 0 installed: 0
756:debug:main popt 1.16_0 exists in the ports tree
757:debug:main popt 1.16_0 +universal is the latest installed
758:debug:main popt 1.16_0 +universal is active
759:debug:main Merging existing variants '+universal' into variants
760:debug:main new fully merged portvariants: universal +
761:debug:main Changing to port directory: /opt/local/var/macports/sources/rsync.macports.org/release/tarballs/ports/devel/popt
762:debug:main OS darwin/16.0.0 (Mac OS X 10.12) arch i386
763:debug:main adding the default universal variant
764:debug:main Reading variant descriptions from /opt/local/var/macports/sources/rsync.macports.org/release/tarballs/ports/_resources/port1.0/variant_descriptions.conf
765:debug:main Executing variant universal provides universal
766:debug:main Running callback portconfigure::add_automatic_compiler_dependencies
767:debug:main Finished running callback portconfigure::add_automatic_compiler_dependencies
768:debug:main Running callback portbuild::add_automatic_buildsystem_dependencies
769:debug:main Finished running callback portbuild::add_automatic_buildsystem_dependencies
770:debug:main No need to upgrade! popt 1.16_0 >= popt 1.16_0
771:debug:main epoch: in tree: 0 installed: 0
772:debug:main libxslt 1.1.29_1 exists in the ports tree
773:debug:main libxslt 1.1.29_1 +universal is the latest installed
774:debug:main libxslt 1.1.29_1 +universal is active
775:debug:main Merging existing variants '+universal' into variants
776:debug:main new fully merged portvariants: universal +
777:debug:main Changing to port directory: /opt/local/var/macports/sources/rsync.macports.org/release/tarballs/ports/textproc/libxslt
778:debug:main OS darwin/16.0.0 (Mac OS X 10.12) arch i386
779:debug:main adding the default universal variant
780:debug:main Reading variant descriptions from /opt/local/var/macports/sources/rsync.macports.org/release/tarballs/ports/_resources/port1.0/variant_descriptions.conf
781:debug:main Executing variant universal provides universal
782:debug:main Running callback portconfigure::add_automatic_compiler_dependencies
783:debug:main Finished running callback portconfigure::add_automatic_compiler_dependencies
784:debug:main Running callback portbuild::add_automatic_buildsystem_dependencies
785:debug:main Finished running callback portbuild::add_automatic_buildsystem_dependencies
786:debug:main No need to upgrade! libxslt 1.1.29_1 >= libxslt 1.1.29_1
787:debug:main epoch: in tree: 0 installed: 0
788:debug:main nettle 3.1.1_0 exists in the ports tree
789:debug:main nettle 3.1.1_0 +universal is the latest installed
790:debug:main nettle 3.1.1_0 +universal is active
791:debug:main Merging existing variants '+universal' into variants
792:debug:main new fully merged portvariants: universal +
793:debug:main Changing to port directory: /opt/local/var/macports/sources/rsync.macports.org/release/tarballs/ports/devel/nettle
794:debug:main OS darwin/16.0.0 (Mac OS X 10.12) arch i386
795:debug:main Reading variant descriptions from /opt/local/var/macports/sources/rsync.macports.org/release/tarballs/ports/_resources/port1.0/variant_descriptions.conf
796:debug:main Sourcing PortGroup muniversal 1.0 from /opt/local/var/macports/sources/rsync.macports.org/release/tarballs/ports/_resources/port1.0/group/muniversal-1.0.tcl
797:debug:main universal variant already exists, so not adding the default one
798:debug:main Executing variant universal provides universal
799:debug:main Running callback portconfigure::add_automatic_compiler_dependencies
800:debug:main Finished running callback portconfigure::add_automatic_compiler_dependencies
801:debug:main Running callback portbuild::add_automatic_buildsystem_dependencies
802:debug:main Finished running callback portbuild::add_automatic_buildsystem_dependencies
803:debug:main No need to upgrade! nettle 3.1.1_0 >= nettle 3.1.1_0
804:debug:main epoch: in tree: 0 installed: 0
805:debug:main openjpeg 2.1.0_0 exists in the ports tree
806:debug:main openjpeg 2.1.0_0  is the latest installed
807:debug:main openjpeg 2.1.0_0  is active
808:debug:main Merging existing variants '' into variants
809:debug:main new fully merged portvariants:
810:debug:main Changing to port directory: /opt/local/var/macports/sources/rsync.macports.org/release/tarballs/ports/graphics/openjpeg
811:debug:main OS darwin/16.0.0 (Mac OS X 10.12) arch i386
812:debug:main Re-registering default for configure.dir
813:debug:main Re-registering default for build.dir
814:debug:main Sourcing PortGroup cmake 1.0 from /opt/local/var/macports/sources/rsync.macports.org/release/tarballs/ports/_resources/port1.0/group/cmake-1.0.tcl
815:debug:main adding the default universal variant
816:debug:main Reading variant descriptions from /opt/local/var/macports/sources/rsync.macports.org/release/tarballs/ports/_resources/port1.0/variant_descriptions.conf
817:debug:main Running callback portconfigure::add_automatic_compiler_dependencies
818:debug:main Finished running callback portconfigure::add_automatic_compiler_dependencies
819:debug:main Running callback portbuild::add_automatic_buildsystem_dependencies
820:debug:main Finished running callback portbuild::add_automatic_buildsystem_dependencies
821:debug:main No need to upgrade! openjpeg 2.1.0_0 >= openjpeg 2.1.0_0
822:debug:main epoch: in tree: 0 installed: 0
823:debug:main lcms2 2.8_0 exists in the ports tree
824:debug:main lcms2 2.8_0 +universal is the latest installed
825:debug:main lcms2 2.8_0 +universal is active
826:debug:main Merging existing variants '+universal' into variants
827:debug:main new fully merged portvariants: universal +
828:debug:main Changing to port directory: /opt/local/var/macports/sources/rsync.macports.org/release/tarballs/ports/graphics/lcms2
829:debug:main OS darwin/16.0.0 (Mac OS X 10.12) arch i386
830:debug:main Reading variant descriptions from /opt/local/var/macports/sources/rsync.macports.org/release/tarballs/ports/_resources/port1.0/variant_descriptions.conf
831:debug:main Sourcing PortGroup muniversal 1.0 from /opt/local/var/macports/sources/rsync.macports.org/release/tarballs/ports/_resources/port1.0/group/muniversal-1.0.tcl
832:debug:main universal variant already exists, so not adding the default one
833:debug:main Executing variant universal provides universal
834:debug:main Running callback portconfigure::add_automatic_compiler_dependencies
835:debug:main Finished running callback portconfigure::add_automatic_compiler_dependencies
836:debug:main Running callback portbuild::add_automatic_buildsystem_dependencies
837:debug:main Finished running callback portbuild::add_automatic_buildsystem_dependencies
838:debug:main No need to upgrade! lcms2 2.8_0 >= lcms2 2.8_0
839:debug:main epoch: in tree: 0 installed: 0
840:debug:main jbigkit 2.1_0 exists in the ports tree
841:debug:main jbigkit 2.1_0  is the latest installed
842:debug:main jbigkit 2.1_0  is active
843:debug:main Merging existing variants '' into variants
844:debug:main new fully merged portvariants:
845:debug:main Changing to port directory: /opt/local/var/macports/sources/rsync.macports.org/release/tarballs/ports/graphics/jbigkit
846:debug:main OS darwin/16.0.0 (Mac OS X 10.12) arch i386
847:debug:main Reading variant descriptions from /opt/local/var/macports/sources/rsync.macports.org/release/tarballs/ports/_resources/port1.0/variant_descriptions.conf
848:debug:main universal variant already exists, so not adding the default one
849:debug:main Running callback portconfigure::add_automatic_compiler_dependencies
850:debug:main Finished running callback portconfigure::add_automatic_compiler_dependencies
851:debug:main Running callback portbuild::add_automatic_buildsystem_dependencies
852:debug:main Finished running callback portbuild::add_automatic_buildsystem_dependencies
853:debug:main No need to upgrade! jbigkit 2.1_0 >= jbigkit 2.1_0
854:debug:main epoch: in tree: 0 installed: 0
855:debug:main speex 1.2rc1_0 exists in the ports tree
856:debug:main speex 1.2rc1_0  is the latest installed
857:debug:main speex 1.2rc1_0  is active
858:debug:main Merging existing variants '' into variants
859:debug:main new fully merged portvariants:
860:debug:main Changing to port directory: /opt/local/var/macports/sources/rsync.macports.org/release/tarballs/ports/audio/speex
861:debug:main OS darwin/16.0.0 (Mac OS X 10.12) arch i386
862:debug:main adding the default universal variant
863:debug:main Reading variant descriptions from /opt/local/var/macports/sources/rsync.macports.org/release/tarballs/ports/_resources/port1.0/variant_descriptions.conf
864:debug:main Running callback portconfigure::add_automatic_compiler_dependencies
865:debug:main Finished running callback portconfigure::add_automatic_compiler_dependencies
866:debug:main Running callback portbuild::add_automatic_buildsystem_dependencies
867:debug:main Finished running callback portbuild::add_automatic_buildsystem_dependencies
868:debug:main No need to upgrade! speex 1.2rc1_0 >= speex 1.2rc1_0
869:debug:main epoch: in tree: 0 installed: 0
870:debug:main libsdl 1.2.15_3 exists in the ports tree
871:debug:main libsdl 1.2.15_3 +x11 is the latest installed
872:debug:main libsdl 1.2.15_3 +x11 is active
873:debug:main Merging existing variants '+x11' into variants
874:debug:main new fully merged portvariants: x11 +
875:debug:main Changing to port directory: /opt/local/var/macports/sources/rsync.macports.org/release/tarballs/ports/devel/libsdl
876:debug:main OS darwin/16.0.0 (Mac OS X 10.12) arch i386
877:debug:main Sourcing PortGroup xcodeversion 1.0 from /opt/local/var/macports/sources/rsync.macports.org/release/tarballs/ports/_resources/port1.0/group/xcodeversion-1.0.tcl
878:debug:main Reading variant descriptions from /opt/local/var/macports/sources/rsync.macports.org/release/tarballs/ports/_resources/port1.0/variant_descriptions.conf
879:debug:main adding the default universal variant
880:debug:main Executing variant x11 provides x11
881:debug:main Running callback portconfigure::add_automatic_compiler_dependencies
882:debug:main Finished running callback portconfigure::add_automatic_compiler_dependencies
883:debug:main Running callback portbuild::add_automatic_buildsystem_dependencies
884:debug:main Finished running callback portbuild::add_automatic_buildsystem_dependencies
885:debug:main No need to upgrade! libsdl 1.2.15_3 >= libsdl 1.2.15_3
886:debug:main epoch: in tree: 0 installed: 0
887:debug:main xorg-libXext 1.3.3_0 exists in the ports tree
888:debug:main xorg-libXext 1.3.3_0 +universal is the latest installed
889:debug:main xorg-libXext 1.3.3_0 +universal is active
890:debug:main Merging existing variants '+universal' into variants
891:debug:main new fully merged portvariants: universal +
892:debug:main Changing to port directory: /opt/local/var/macports/sources/rsync.macports.org/release/tarballs/ports/x11/xorg-libXext
893:debug:main OS darwin/16.0.0 (Mac OS X 10.12) arch i386
894:debug:main adding the default universal variant
895:debug:main Reading variant descriptions from /opt/local/var/macports/sources/rsync.macports.org/release/tarballs/ports/_resources/port1.0/variant_descriptions.conf
896:debug:main Executing variant universal provides universal
897:debug:main Running callback portconfigure::add_automatic_compiler_dependencies
898:debug:main Finished running callback portconfigure::add_automatic_compiler_dependencies
899:debug:main Running callback portbuild::add_automatic_buildsystem_dependencies
900:debug:main Finished running callback portbuild::add_automatic_buildsystem_dependencies
901:debug:main No need to upgrade! xorg-libXext 1.3.3_0 >= xorg-libXext 1.3.3_0
902:debug:main epoch: in tree: 0 installed: 0
903:debug:main xorg-libX11 1.6.3_0 exists in the ports tree
904:debug:main xorg-libX11 1.6.3_0 +universal is the latest installed
905:debug:main xorg-libX11 1.6.3_0 +universal is active
906:debug:main Merging existing variants '+universal' into variants
907:debug:main new fully merged portvariants: universal +
908:debug:main Changing to port directory: /opt/local/var/macports/sources/rsync.macports.org/release/tarballs/ports/x11/xorg-libX11
909:debug:main OS darwin/16.0.0 (Mac OS X 10.12) arch i386
910:debug:main adding the default universal variant
911:debug:main Reading variant descriptions from /opt/local/var/macports/sources/rsync.macports.org/release/tarballs/ports/_resources/port1.0/variant_descriptions.conf
912:debug:main Executing variant universal provides universal
913:debug:main Running callback portconfigure::add_automatic_compiler_dependencies
914:debug:main Finished running callback portconfigure::add_automatic_compiler_dependencies
915:debug:main Running callback portbuild::add_automatic_buildsystem_dependencies
916:debug:main Finished running callback portbuild::add_automatic_buildsystem_dependencies
917:debug:main No need to upgrade! xorg-libX11 1.6.3_0 >= xorg-libX11 1.6.3_0
918:debug:main epoch: in tree: 0 installed: 0
919:debug:main xorg-libXdmcp 1.1.2_0 exists in the ports tree
920:debug:main xorg-libXdmcp 1.1.2_0 +universal is the latest installed
921:debug:main xorg-libXdmcp 1.1.2_0 +universal is active
922:debug:main Merging existing variants '+universal' into variants
923:debug:main new fully merged portvariants: universal +
924:debug:main Changing to port directory: /opt/local/var/macports/sources/rsync.macports.org/release/tarballs/ports/x11/xorg-libXdmcp
925:debug:main OS darwin/16.0.0 (Mac OS X 10.12) arch i386
926:debug:main adding the default universal variant
927:debug:main Reading variant descriptions from /opt/local/var/macports/sources/rsync.macports.org/release/tarballs/ports/_resources/port1.0/variant_descriptions.conf
928:debug:main Executing variant universal provides universal
929:debug:main Running callback portconfigure::add_automatic_compiler_dependencies
930:debug:main Finished running callback portconfigure::add_automatic_compiler_dependencies
931:debug:main Running callback portbuild::add_automatic_buildsystem_dependencies
932:debug:main Finished running callback portbuild::add_automatic_buildsystem_dependencies
933:debug:main No need to upgrade! xorg-libXdmcp 1.1.2_0 >= xorg-libXdmcp 1.1.2_0
934:debug:main epoch: in tree: 0 installed: 0
935:debug:main xorg-libXau 1.0.8_0 exists in the ports tree
936:debug:main xorg-libXau 1.0.8_0 +universal is the latest installed
937:debug:main xorg-libXau 1.0.8_0 +universal is active
938:debug:main Merging existing variants '+universal' into variants
939:debug:main new fully merged portvariants: universal +
940:debug:main Changing to port directory: /opt/local/var/macports/sources/rsync.macports.org/release/tarballs/ports/x11/xorg-libXau
941:debug:main OS darwin/16.0.0 (Mac OS X 10.12) arch i386
942:debug:main adding the default universal variant
943:debug:main Reading variant descriptions from /opt/local/var/macports/sources/rsync.macports.org/release/tarballs/ports/_resources/port1.0/variant_descriptions.conf
944:debug:main Executing variant universal provides universal
945:debug:main Running callback portconfigure::add_automatic_compiler_dependencies
946:debug:main Finished running callback portconfigure::add_automatic_compiler_dependencies
947:debug:main Running callback portbuild::add_automatic_buildsystem_dependencies
948:debug:main Finished running callback portbuild::add_automatic_buildsystem_dependencies
949:debug:main No need to upgrade! xorg-libXau 1.0.8_0 >= xorg-libXau 1.0.8_0
950:debug:main epoch: in tree: 0 installed: 0
951:debug:main xorg-xproto 7.0.29_0 exists in the ports tree
952:debug:main xorg-xproto 7.0.29_0  is the latest installed
953:debug:main xorg-xproto 7.0.29_0  is active
954:debug:main Merging existing variants '' into variants
955:debug:main new fully merged portvariants:
956:debug:main Changing to port directory: /opt/local/var/macports/sources/rsync.macports.org/release/tarballs/ports/x11/xorg-xproto
957:debug:main OS darwin/16.0.0 (Mac OS X 10.12) arch i386
958:debug:main only one arch supported, so not adding the default universal variant
959:debug:main Running callback portconfigure::add_automatic_compiler_dependencies
960:debug:main Finished running callback portconfigure::add_automatic_compiler_dependencies
961:debug:main Running callback portbuild::add_automatic_buildsystem_dependencies
962:debug:main Finished running callback portbuild::add_automatic_buildsystem_dependencies
963:debug:main No need to upgrade! xorg-xproto 7.0.29_0 >= xorg-xproto 7.0.29_0
964:debug:main epoch: in tree: 0 installed: 0
965:debug:main xorg-libxcb 1.12_2 exists in the ports tree
966:debug:main xorg-libxcb 1.12_2 +python27+universal is the latest installed
967:debug:main xorg-libxcb 1.12_2 +python27+universal is active
968:debug:main Merging existing variants '+python27+universal' into variants
969:debug:main new fully merged portvariants: universal + python27 +
970:debug:main Changing to port directory: /opt/local/var/macports/sources/rsync.macports.org/release/tarballs/ports/x11/xorg-libxcb
971:debug:main OS darwin/16.0.0 (Mac OS X 10.12) arch i386
972:debug:main adding the default universal variant
973:debug:main Reading variant descriptions from /opt/local/var/macports/sources/rsync.macports.org/release/tarballs/ports/_resources/port1.0/variant_descriptions.conf
974:debug:main Executing variant python27 provides python27
975:debug:main Executing variant universal provides universal
976:debug:main Running callback portconfigure::add_automatic_compiler_dependencies
977:debug:main Finished running callback portconfigure::add_automatic_compiler_dependencies
978:debug:main Running callback portbuild::add_automatic_buildsystem_dependencies
979:debug:main Finished running callback portbuild::add_automatic_buildsystem_dependencies
980:debug:main No need to upgrade! xorg-libxcb 1.12_2 >= xorg-libxcb 1.12_2
981:debug:main epoch: in tree: 0 installed: 0
982:debug:main xorg-xcb-proto 1.12_1 exists in the ports tree
983:debug:main xorg-xcb-proto 1.12_1 +python27 is the latest installed
984:debug:main xorg-xcb-proto 1.12_1 +python27 is active
985:debug:main Merging existing variants '+python27' into variants
986:debug:main new fully merged portvariants: python27 +
987:debug:main Changing to port directory: /opt/local/var/macports/sources/rsync.macports.org/release/tarballs/ports/x11/xorg-xcb-proto
988:debug:main OS darwin/16.0.0 (Mac OS X 10.12) arch i386
989:debug:main only one arch supported, so not adding the default universal variant
990:debug:main Executing variant python27 provides python27
991:debug:main Running callback portconfigure::add_automatic_compiler_dependencies
992:debug:main Finished running callback portconfigure::add_automatic_compiler_dependencies
993:debug:main Running callback portbuild::add_automatic_buildsystem_dependencies
994:debug:main Finished running callback portbuild::add_automatic_buildsystem_dependencies
995:debug:main No need to upgrade! xorg-xcb-proto 1.12_1 >= xorg-xcb-proto 1.12_1
996:debug:main epoch: in tree: 2 installed: 2
997:debug:main python27 2.7.12_1 exists in the ports tree
998:debug:main python27 2.7.12_1 +universal is the latest installed
999:debug:main python27 2.7.12_1 +universal is active
1000:debug:main Merging existing variants '+universal' into variants
1001:debug:main new fully merged portvariants: universal +
1002:debug:main Changing to port directory: /opt/local/var/macports/sources/rsync.macports.org/release/tarballs/ports/lang/python27
1003:debug:main OS darwin/16.0.0 (Mac OS X 10.12) arch i386
1004:debug:main Sourcing PortGroup select 1.0 from /opt/local/var/macports/sources/rsync.macports.org/release/tarballs/ports/_resources/port1.0/group/select-1.0.tcl
1005:debug:main Reading variant descriptions from /opt/local/var/macports/sources/rsync.macports.org/release/tarballs/ports/_resources/port1.0/variant_descriptions.conf
1006:debug:main universal variant already exists, so not adding the default one
1007:debug:main Executing variant universal provides universal
1008:debug:main Running callback portconfigure::add_automatic_compiler_dependencies
1009:debug:main Finished running callback portconfigure::add_automatic_compiler_dependencies
1010:debug:main Running callback portbuild::add_automatic_buildsystem_dependencies
1011:debug:main Finished running callback portbuild::add_automatic_buildsystem_dependencies
1012:debug:main No need to upgrade! python27 2.7.12_1 >= python27 2.7.12_1
1013:debug:main epoch: in tree: 0 installed: 0
1014:debug:main sqlite3 3.14.2_0 exists in the ports tree
1015:debug:main sqlite3 3.14.2_0 +universal is the latest installed
1016:debug:main sqlite3 3.14.2_0 +universal is active
1017:debug:main Merging existing variants '+universal' into variants
1018:debug:main new fully merged portvariants: universal +
1019:debug:main Changing to port directory: /opt/local/var/macports/sources/rsync.macports.org/release/tarballs/ports/databases/sqlite3
1020:debug:main OS darwin/16.0.0 (Mac OS X 10.12) arch i386
1021:debug:main adding the default universal variant
1022:debug:main Reading variant descriptions from /opt/local/var/macports/sources/rsync.macports.org/release/tarballs/ports/_resources/port1.0/variant_descriptions.conf
1023:debug:main Executing variant universal provides universal
1024:debug:main Running callback portconfigure::add_automatic_compiler_dependencies
1025:debug:main Finished running callback portconfigure::add_automatic_compiler_dependencies
1026:debug:main Running callback portbuild::add_automatic_buildsystem_dependencies
1027:debug:main Finished running callback portbuild::add_automatic_buildsystem_dependencies
1028:debug:main No need to upgrade! sqlite3 3.14.2_0 >= sqlite3 3.14.2_0
1029:debug:main epoch: in tree: 0 installed: 0
1030:debug:main db48 4.8.30_4 exists in the ports tree
1031:debug:main db48 4.8.30_4 +universal is the latest installed
1032:debug:main db48 4.8.30_4 +universal is active
1033:debug:main Merging existing variants '+universal' into variants
1034:debug:main new fully merged portvariants: universal +
1035:debug:main Changing to port directory: /opt/local/var/macports/sources/rsync.macports.org/release/tarballs/ports/databases/db48
1036:debug:main OS darwin/16.0.0 (Mac OS X 10.12) arch i386
1037:debug:main Reading variant descriptions from /opt/local/var/macports/sources/rsync.macports.org/release/tarballs/ports/_resources/port1.0/variant_descriptions.conf
1038:debug:main Sourcing PortGroup muniversal 1.0 from /opt/local/var/macports/sources/rsync.macports.org/release/tarballs/ports/_resources/port1.0/group/muniversal-1.0.tcl
1039:debug:main universal variant already exists, so not adding the default one
1040:debug:main Executing variant universal provides universal
1041:debug:main Running callback portconfigure::add_automatic_compiler_dependencies
1042:debug:main Finished running callback portconfigure::add_automatic_compiler_dependencies
1043:debug:main Running callback portbuild::add_automatic_buildsystem_dependencies
1044:debug:main Finished running callback portbuild::add_automatic_buildsystem_dependencies
1045:debug:main No need to upgrade! db48 4.8.30_4 >= db48 4.8.30_4
1046:debug:main epoch: in tree: 0 installed: 0
1047:debug:main python_select 0.3_7 exists in the ports tree
1048:debug:main python_select 0.3_7  is the latest installed
1049:debug:main python_select 0.3_7  is active
1050:debug:main Merging existing variants '' into variants
1051:debug:main new fully merged portvariants:
1052:debug:main Changing to port directory: /opt/local/var/macports/sources/rsync.macports.org/release/tarballs/ports/sysutils/python_select
1053:debug:main OS darwin/16.0.0 (Mac OS X 10.12) arch i386
1054:debug:main Sourcing PortGroup select 1.0 from /opt/local/var/macports/sources/rsync.macports.org/release/tarballs/ports/_resources/port1.0/group/select-1.0.tcl
1055:debug:main universal_variant is false, so not adding the default universal variant
1056:debug:main Running callback portconfigure::add_automatic_compiler_dependencies
1057:debug:main Finished running callback portconfigure::add_automatic_compiler_dependencies
1058:debug:main Running callback portbuild::add_automatic_buildsystem_dependencies
1059:debug:main Finished running callback portbuild::add_automatic_buildsystem_dependencies
1060:debug:main No need to upgrade! python_select 0.3_7 >= python_select 0.3_7
1061:debug:main epoch: in tree: 0 installed: 0
1062:debug:main python2_select 0.0_2 exists in the ports tree
1063:debug:main python2_select 0.0_2  is the latest installed
1064:debug:main python2_select 0.0_2  is active
1065:debug:main Merging existing variants '' into variants
1066:debug:main new fully merged portvariants:
1067:debug:main Changing to port directory: /opt/local/var/macports/sources/rsync.macports.org/release/tarballs/ports/sysutils/python2_select
1068:debug:main OS darwin/16.0.0 (Mac OS X 10.12) arch i386
1069:debug:main Sourcing PortGroup select 1.0 from /opt/local/var/macports/sources/rsync.macports.org/release/tarballs/ports/_resources/port1.0/group/select-1.0.tcl
1070:debug:main universal_variant is false, so not adding the default universal variant
1071:debug:main Running callback portconfigure::add_automatic_compiler_dependencies
1072:debug:main Finished running callback portconfigure::add_automatic_compiler_dependencies
1073:debug:main Running callback portbuild::add_automatic_buildsystem_dependencies
1074:debug:main Finished running callback portbuild::add_automatic_buildsystem_dependencies
1075:debug:main No need to upgrade! python2_select 0.0_2 >= python2_select 0.0_2
1076:debug:main epoch: in tree: 0 installed: 0
1077:debug:main xorg-libpthread-stubs 0.3_0 exists in the ports tree
1078:debug:main xorg-libpthread-stubs 0.3_0  is the latest installed
1079:debug:main xorg-libpthread-stubs 0.3_0  is active
1080:debug:main Merging existing variants '' into variants
1081:debug:main new fully merged portvariants:
1082:debug:main Changing to port directory: /opt/local/var/macports/sources/rsync.macports.org/release/tarballs/ports/x11/xorg-libpthread-stubs
1083:debug:main OS darwin/16.0.0 (Mac OS X 10.12) arch i386
1084:debug:main only one arch supported, so not adding the default universal variant
1085:debug:main Running callback portconfigure::add_automatic_compiler_dependencies
1086:debug:main Finished running callback portconfigure::add_automatic_compiler_dependencies
1087:debug:main Running callback portbuild::add_automatic_buildsystem_dependencies
1088:debug:main Finished running callback portbuild::add_automatic_buildsystem_dependencies
1089:debug:main No need to upgrade! xorg-libpthread-stubs 0.3_0 >= xorg-libpthread-stubs 0.3_0
1090:debug:main epoch: in tree: 0 installed: 0
1091:debug:main xorg-kbproto 1.0.7_0 exists in the ports tree
1092:debug:main xorg-kbproto 1.0.7_0  is the latest installed
1093:debug:main xorg-kbproto 1.0.7_0  is active
1094:debug:main Merging existing variants '' into variants
1095:debug:main new fully merged portvariants:
1096:debug:main Changing to port directory: /opt/local/var/macports/sources/rsync.macports.org/release/tarballs/ports/x11/xorg-kbproto
1097:debug:main OS darwin/16.0.0 (Mac OS X 10.12) arch i386
1098:debug:main only one arch supported, so not adding the default universal variant
1099:debug:main Running callback portconfigure::add_automatic_compiler_dependencies
1100:debug:main Finished running callback portconfigure::add_automatic_compiler_dependencies
1101:debug:main Running callback portbuild::add_automatic_buildsystem_dependencies
1102:debug:main Finished running callback portbuild::add_automatic_buildsystem_dependencies
1103:debug:main No need to upgrade! xorg-kbproto 1.0.7_0 >= xorg-kbproto 1.0.7_0
1104:debug:main epoch: in tree: 0 installed: 0
1105:debug:main xorg-xextproto 7.3.0_0 exists in the ports tree
1106:debug:main xorg-xextproto 7.3.0_0  is the latest installed
1107:debug:main xorg-xextproto 7.3.0_0  is active
1108:debug:main Merging existing variants '' into variants
1109:debug:main new fully merged portvariants:
1110:debug:main Changing to port directory: /opt/local/var/macports/sources/rsync.macports.org/release/tarballs/ports/x11/xorg-xextproto
1111:debug:main OS darwin/16.0.0 (Mac OS X 10.12) arch i386
1112:debug:main only one arch supported, so not adding the default universal variant
1113:debug:main Running callback portconfigure::add_automatic_compiler_dependencies
1114:debug:main Finished running callback portconfigure::add_automatic_compiler_dependencies
1115:debug:main Running callback portbuild::add_automatic_buildsystem_dependencies
1116:debug:main Finished running callback portbuild::add_automatic_buildsystem_dependencies
1117:debug:main No need to upgrade! xorg-xextproto 7.3.0_0 >= xorg-xextproto 7.3.0_0
1118:debug:main epoch: in tree: 0 installed: 0
1119:debug:main xorg-libXrandr 1.5.0_0 exists in the ports tree
1120:debug:main xorg-libXrandr 1.5.0_0 +universal is the latest installed
1121:debug:main xorg-libXrandr 1.5.0_0 +universal is active
1122:debug:main Merging existing variants '+universal' into variants
1123:debug:main new fully merged portvariants: universal +
1124:debug:main Changing to port directory: /opt/local/var/macports/sources/rsync.macports.org/release/tarballs/ports/x11/xorg-libXrandr
1125:debug:main OS darwin/16.0.0 (Mac OS X 10.12) arch i386
1126:debug:main adding the default universal variant
1127:debug:main Reading variant descriptions from /opt/local/var/macports/sources/rsync.macports.org/release/tarballs/ports/_resources/port1.0/variant_descriptions.conf
1128:debug:main Executing variant universal provides universal
1129:debug:main Running callback portconfigure::add_automatic_compiler_dependencies
1130:debug:main Finished running callback portconfigure::add_automatic_compiler_dependencies
1131:debug:main Running callback portbuild::add_automatic_buildsystem_dependencies
1132:debug:main Finished running callback portbuild::add_automatic_buildsystem_dependencies
1133:debug:main No need to upgrade! xorg-libXrandr 1.5.0_0 >= xorg-libXrandr 1.5.0_0
1134:debug:main epoch: in tree: 0 installed: 0
1135:debug:main xrender 0.9.9_0 exists in the ports tree
1136:debug:main xrender 0.9.9_0 +universal is the latest installed
1137:debug:main xrender 0.9.9_0 +universal is active
1138:debug:main Merging existing variants '+universal' into variants
1139:debug:main new fully merged portvariants: universal +
1140:debug:main Changing to port directory: /opt/local/var/macports/sources/rsync.macports.org/release/tarballs/ports/x11/xrender
1141:debug:main OS darwin/16.0.0 (Mac OS X 10.12) arch i386
1142:debug:main adding the default universal variant
1143:debug:main Reading variant descriptions from /opt/local/var/macports/sources/rsync.macports.org/release/tarballs/ports/_resources/port1.0/variant_descriptions.conf
1144:debug:main Executing variant universal provides universal
1145:debug:main Running callback portconfigure::add_automatic_compiler_dependencies
1146:debug:main Finished running callback portconfigure::add_automatic_compiler_dependencies
1147:debug:main Running callback portbuild::add_automatic_buildsystem_dependencies
1148:debug:main Finished running callback portbuild::add_automatic_buildsystem_dependencies
1149:debug:main No need to upgrade! xrender 0.9.9_0 >= xrender 0.9.9_0
1150:debug:main epoch: in tree: 0 installed: 0
1151:debug:main xorg-renderproto 0.11.1_0 exists in the ports tree
1152:debug:main xorg-renderproto 0.11.1_0  is the latest installed
1153:debug:main xorg-renderproto 0.11.1_0  is active
1154:debug:main Merging existing variants '' into variants
1155:debug:main new fully merged portvariants:
1156:debug:main Changing to port directory: /opt/local/var/macports/sources/rsync.macports.org/release/tarballs/ports/x11/xorg-renderproto
1157:debug:main OS darwin/16.0.0 (Mac OS X 10.12) arch i386
1158:debug:main only one arch supported, so not adding the default universal variant
1159:debug:main Running callback portconfigure::add_automatic_compiler_dependencies
1160:debug:main Finished running callback portconfigure::add_automatic_compiler_dependencies
1161:debug:main Running callback portbuild::add_automatic_buildsystem_dependencies
1162:debug:main Finished running callback portbuild::add_automatic_buildsystem_dependencies
1163:debug:main No need to upgrade! xorg-renderproto 0.11.1_0 >= xorg-renderproto 0.11.1_0
1164:debug:main epoch: in tree: 0 installed: 0
1165:debug:main xorg-randrproto 1.5.0_0 exists in the ports tree
1166:debug:main xorg-randrproto 1.5.0_0  is the latest installed
1167:debug:main xorg-randrproto 1.5.0_0  is active
1168:debug:main Merging existing variants '' into variants
1169:debug:main new fully merged portvariants:
1170:debug:main Changing to port directory: /opt/local/var/macports/sources/rsync.macports.org/release/tarballs/ports/x11/xorg-randrproto
1171:debug:main OS darwin/16.0.0 (Mac OS X 10.12) arch i386
1172:debug:main only one arch supported, so not adding the default universal variant
1173:debug:main Running callback portconfigure::add_automatic_compiler_dependencies
1174:debug:main Finished running callback portconfigure::add_automatic_compiler_dependencies
1175:debug:main Running callback portbuild::add_automatic_buildsystem_dependencies
1176:debug:main Finished running callback portbuild::add_automatic_buildsystem_dependencies
1177:debug:main No need to upgrade! xorg-randrproto 1.5.0_0 >= xorg-randrproto 1.5.0_0
1178:debug:main epoch: in tree: 0 installed: 0
1179:debug:main soxr 0.1.2_0 exists in the ports tree
1180:debug:main soxr 0.1.2_0  is the latest installed
1181:debug:main soxr 0.1.2_0  is active
1182:debug:main Merging existing variants '' into variants
1183:debug:main new fully merged portvariants:
1184:debug:main Changing to port directory: /opt/local/var/macports/sources/rsync.macports.org/release/tarballs/ports/audio/soxr
1185:debug:main OS darwin/16.0.0 (Mac OS X 10.12) arch i386
1186:debug:main Re-registering default for configure.dir
1187:debug:main Re-registering default for build.dir
1188:debug:main Sourcing PortGroup cmake 1.0 from /opt/local/var/macports/sources/rsync.macports.org/release/tarballs/ports/_resources/port1.0/group/cmake-1.0.tcl
1189:debug:main adding the default universal variant
1190:debug:main Reading variant descriptions from /opt/local/var/macports/sources/rsync.macports.org/release/tarballs/ports/_resources/port1.0/variant_descriptions.conf
1191:debug:main Running callback portconfigure::add_automatic_compiler_dependencies
1192:debug:main Finished running callback portconfigure::add_automatic_compiler_dependencies
1193:debug:main Running callback portbuild::add_automatic_buildsystem_dependencies
1194:debug:main Finished running callback portbuild::add_automatic_buildsystem_dependencies
1195:debug:main No need to upgrade! soxr 0.1.2_0 >= soxr 0.1.2_0
1196:debug:main epoch: in tree: 0 installed: 0
1197:debug:main xorg-libXfixes 5.0.2_0 exists in the ports tree
1198:debug:main xorg-libXfixes 5.0.2_0 +universal is the latest installed
1199:debug:main xorg-libXfixes 5.0.2_0 +universal is active
1200:debug:main Merging existing variants '+universal' into variants
1201:debug:main new fully merged portvariants: universal +
1202:debug:main Changing to port directory: /opt/local/var/macports/sources/rsync.macports.org/release/tarballs/ports/x11/xorg-libXfixes
1203:debug:main OS darwin/16.0.0 (Mac OS X 10.12) arch i386
1204:debug:main adding the default universal variant
1205:debug:main Reading variant descriptions from /opt/local/var/macports/sources/rsync.macports.org/release/tarballs/ports/_resources/port1.0/variant_descriptions.conf
1206:debug:main Executing variant universal provides universal
1207:debug:main Running callback portconfigure::add_automatic_compiler_dependencies
1208:debug:main Finished running callback portconfigure::add_automatic_compiler_dependencies
1209:debug:main Running callback portbuild::add_automatic_buildsystem_dependencies
1210:debug:main Finished running callback portbuild::add_automatic_buildsystem_dependencies
1211:debug:main No need to upgrade! xorg-libXfixes 5.0.2_0 >= xorg-libXfixes 5.0.2_0
1212:debug:main epoch: in tree: 0 installed: 0
1213:debug:main xorg-fixesproto 5.0_0 exists in the ports tree
1214:debug:main xorg-fixesproto 5.0_0  is the latest installed
1215:debug:main xorg-fixesproto 5.0_0  is active
1216:debug:main Merging existing variants '' into variants
1217:debug:main new fully merged portvariants:
1218:debug:main Changing to port directory: /opt/local/var/macports/sources/rsync.macports.org/release/tarballs/ports/x11/xorg-fixesproto
1219:debug:main OS darwin/16.0.0 (Mac OS X 10.12) arch i386
1220:debug:main only one arch supported, so not adding the default universal variant
1221:debug:main Running callback portconfigure::add_automatic_compiler_dependencies
1222:debug:main Finished running callback portconfigure::add_automatic_compiler_dependencies
1223:debug:main Running callback portbuild::add_automatic_buildsystem_dependencies
1224:debug:main Finished running callback portbuild::add_automatic_buildsystem_dependencies
1225:debug:main No need to upgrade! xorg-fixesproto 5.0_0 >= xorg-fixesproto 5.0_0
1226:debug:main epoch: in tree: 0 installed: 0
1227:debug:main XviD 1.3.4_0 exists in the ports tree
1228:debug:main XviD 1.3.4_0  is the latest installed
1229:debug:main XviD 1.3.4_0  is active
1230:debug:main Merging existing variants '' into variants
1231:debug:main new fully merged portvariants:
1232:debug:main Changing to port directory: /opt/local/var/macports/sources/rsync.macports.org/release/tarballs/ports/multimedia/XviD
1233:debug:main OS darwin/16.0.0 (Mac OS X 10.12) arch i386
1234:debug:main Reading variant descriptions from /opt/local/var/macports/sources/rsync.macports.org/release/tarballs/ports/_resources/port1.0/variant_descriptions.conf
1235:debug:main Sourcing PortGroup muniversal 1.0 from /opt/local/var/macports/sources/rsync.macports.org/release/tarballs/ports/_resources/port1.0/group/muniversal-1.0.tcl
1236:debug:main universal variant already exists, so not adding the default one
1237:debug:main Running callback portconfigure::add_automatic_compiler_dependencies
1238:debug:main Finished running callback portconfigure::add_automatic_compiler_dependencies
1239:debug:main Running callback portbuild::add_automatic_buildsystem_dependencies
1240:debug:main Finished running callback portbuild::add_automatic_buildsystem_dependencies
1241:debug:main No need to upgrade! XviD 1.3.4_0 >= XviD 1.3.4_0
1242:debug:main epoch: in tree: 0 installed: 0
1243:debug:main x264 20160119_0 exists in the ports tree
1244:debug:main x264 20160119_0  is the latest installed
1245:debug:main x264 20160119_0  is active
1246:debug:main Merging existing variants '' into variants
1247:debug:main new fully merged portvariants:
1248:debug:main Changing to port directory: /opt/local/var/macports/sources/rsync.macports.org/release/tarballs/ports/multimedia/x264
1249:debug:main OS darwin/16.0.0 (Mac OS X 10.12) arch i386
1250:debug:main Reading variant descriptions from /opt/local/var/macports/sources/rsync.macports.org/release/tarballs/ports/_resources/port1.0/variant_descriptions.conf
1251:debug:main Sourcing PortGroup muniversal 1.0 from /opt/local/var/macports/sources/rsync.macports.org/release/tarballs/ports/_resources/port1.0/group/muniversal-1.0.tcl
1252:debug:main Sourcing PortGroup xcodeversion 1.0 from /opt/local/var/macports/sources/rsync.macports.org/release/tarballs/ports/_resources/port1.0/group/xcodeversion-1.0.tcl
1253:debug:main universal variant already exists, so not adding the default one
1254:debug:main Running callback portconfigure::add_automatic_compiler_dependencies
1255:debug:main Finished running callback portconfigure::add_automatic_compiler_dependencies
1256:debug:main Running callback portbuild::add_automatic_buildsystem_dependencies
1257:debug:main Finished running callback portbuild::add_automatic_buildsystem_dependencies
1258:debug:main No need to upgrade! x264 20160119_0 >= x264 20160119_0
1259:msg:main --->  Computing dependencies for opencv:info:main .:debug:main opencv has no conflicts
1260:debug:main Found Dependency: path: /usr/bin filename: unzip regex: ^unzip$
1261:debug:main Searching for dependency: unzip
1262:debug:main Didn't find receipt, going to depspec regex for: unzip
1263:debug:main Found Dependency: path: /usr/bin filename: unzip regex: ^unzip$
1264:debug:main Searching for dependency: cmake
1265:debug:main Found Dependency: receipt exists for cmake
1266:debug:main Searching for dependency: pkgconfig
1267:debug:main Found Dependency: receipt exists for pkgconfig
1268:debug:main Searching for dependency: zlib
1269:debug:main Found Dependency: receipt exists for zlib
1270:debug:main Searching for dependency: bzip2
1271:debug:main Found Dependency: receipt exists for bzip2
1272:debug:main Searching for dependency: libpng
1273:debug:main Found Dependency: receipt exists for libpng
1274:debug:main Searching for dependency: jpeg
1275:debug:main Found Dependency: receipt exists for jpeg
1276:debug:main Searching for dependency: jasper
1277:debug:main Found Dependency: receipt exists for jasper
1278:debug:main Searching for dependency: tiff
1279:debug:main Found Dependency: receipt exists for tiff
1280:debug:main Searching for dependency: webp
1281:debug:main Found Dependency: receipt exists for webp
1282:debug:main Searching for dependency: ilmbase
1283:debug:main Found Dependency: receipt exists for ilmbase
1284:debug:main Searching for dependency: openexr
1285:debug:main Found Dependency: receipt exists for openexr
1286:debug:main Searching for dependency: ffmpeg
1287:debug:main Found Dependency: receipt exists for ffmpeg
1288:msg:main
1289:debug:main Executing org.macports.main (opencv)
1290:debug:main changing euid/egid - current euid: 0 - current egid: 0
1291:debug:main egid changed to: 501
1292:debug:main euid changed to: 502
1293:debug:main Skipping completed org.macports.archivefetch (opencv)
1294:debug:main Privilege de-escalation not attempted as not running as root.
1295:debug:main Skipping completed org.macports.fetch (opencv)
1296:debug:main Privilege de-escalation not attempted as not running as root.
1297:debug:main Skipping completed org.macports.checksum (opencv)
1298:debug:main Privilege de-escalation not attempted as not running as root.
1299:debug:main Skipping completed org.macports.extract (opencv)
1300:debug:main Privilege de-escalation not attempted as not running as root.
1301:debug:main Skipping completed org.macports.patch (opencv)
1302:debug:main Privilege de-escalation not attempted as not running as root.
1303:debug:main Skipping completed org.macports.configure (opencv)
1304:debug:main Privilege de-escalation not attempted as not running as root.
1305:debug:build build phase started at Thu Sep 22 11:57:23 EDT 2016
1306:notice:build --->  Building opencv
1307:debug:build Executing org.macports.build (opencv)
1308:debug:build Environment:
1309CC_PRINT_OPTIONS='YES'
1310CC_PRINT_OPTIONS_FILE='/opt/local/var/macports/build/_opt_local_var_macports_sources_rsync.macports.org_release_tarballs_ports_graphics_opencv/opencv/work/.CC_PRINT_OPTIONS'
1311CPATH='/opt/local/include'
1312LIBRARY_PATH='/opt/local/lib'
1313MACOSX_DEPLOYMENT_TARGET='10.12'
1314:debug:build Assembled command: 'cd "/opt/local/var/macports/build/_opt_local_var_macports_sources_rsync.macports.org_release_tarballs_ports_graphics_opencv/opencv/work/build" && /usr/bin/make -j4 -w all VERBOSE=ON'
1315:debug:build Executing command line:  cd "/opt/local/var/macports/build/_opt_local_var_macports_sources_rsync.macports.org_release_tarballs_ports_graphics_opencv/opencv/work/build" && /usr/bin/make -j4 -w all VERBOSE=ON
1316:info:build make: Entering directory `/opt/local/var/macports/build/_opt_local_var_macports_sources_rsync.macports.org_release_tarballs_ports_graphics_opencv/opencv/work/build'
1317:info:build /opt/local/bin/cmake -H/opt/local/var/macports/build/_opt_local_var_macports_sources_rsync.macports.org_release_tarballs_ports_graphics_opencv/opencv/work/opencv-3.1.0 -B/opt/local/var/macports/build/_opt_local_var_macports_sources_rsync.macports.org_release_tarballs_ports_graphics_opencv/opencv/work/build --check-build-system CMakeFiles/Makefile.cmake 0
1318:info:build /opt/local/bin/cmake -E cmake_progress_start /opt/local/var/macports/build/_opt_local_var_macports_sources_rsync.macports.org_release_tarballs_ports_graphics_opencv/opencv/work/build/CMakeFiles /opt/local/var/macports/build/_opt_local_var_macports_sources_rsync.macports.org_release_tarballs_ports_graphics_opencv/opencv/work/build/CMakeFiles/progress.marks
1319:info:build /Applications/Xcode.app/Contents/Developer/usr/bin/make -f CMakeFiles/Makefile2 all
1320:info:build make[1]: Entering directory `/opt/local/var/macports/build/_opt_local_var_macports_sources_rsync.macports.org_release_tarballs_ports_graphics_opencv/opencv/work/build'
1321:info:build /Applications/Xcode.app/Contents/Developer/usr/bin/make -f modules/core/CMakeFiles/opencv_core.dir/build.make modules/core/CMakeFiles/opencv_core.dir/depend
1322:info:build make[2]: Entering directory `/opt/local/var/macports/build/_opt_local_var_macports_sources_rsync.macports.org_release_tarballs_ports_graphics_opencv/opencv/work/build'
1323:info:build cd /opt/local/var/macports/build/_opt_local_var_macports_sources_rsync.macports.org_release_tarballs_ports_graphics_opencv/opencv/work/build && /opt/local/bin/cmake -E cmake_depends "Unix Makefiles" /opt/local/var/macports/build/_opt_local_var_macports_sources_rsync.macports.org_release_tarballs_ports_graphics_opencv/opencv/work/opencv-3.1.0 /opt/local/var/macports/build/_opt_local_var_macports_sources_rsync.macports.org_release_tarballs_ports_graphics_opencv/opencv/work/opencv-3.1.0/modules/core /opt/local/var/macports/build/_opt_local_var_macports_sources_rsync.macports.org_release_tarballs_ports_graphics_opencv/opencv/work/build /opt/local/var/macports/build/_opt_local_var_macports_sources_rsync.macports.org_release_tarballs_ports_graphics_opencv/opencv/work/build/modules/core /opt/local/var/macports/build/_opt_local_var_macports_sources_rsync.macports.org_release_tarballs_ports_graphics_opencv/opencv/work/build/modules/core/CMakeFiles/opencv_core.dir/DependInfo.cmake --color=
1324:info:build make[2]: Leaving directory `/opt/local/var/macports/build/_opt_local_var_macports_sources_rsync.macports.org_release_tarballs_ports_graphics_opencv/opencv/work/build'
1325:info:build /Applications/Xcode.app/Contents/Developer/usr/bin/make -f modules/core/CMakeFiles/opencv_core.dir/build.make modules/core/CMakeFiles/opencv_core.dir/build
1326:info:build make[2]: Entering directory `/opt/local/var/macports/build/_opt_local_var_macports_sources_rsync.macports.org_release_tarballs_ports_graphics_opencv/opencv/work/build'
1327:info:build make[2]: Nothing to be done for `modules/core/CMakeFiles/opencv_core.dir/build'.
1328:info:build make[2]: Leaving directory `/opt/local/var/macports/build/_opt_local_var_macports_sources_rsync.macports.org_release_tarballs_ports_graphics_opencv/opencv/work/build'
1329:info:build [ 15%] Built target opencv_core
1330:info:build /Applications/Xcode.app/Contents/Developer/usr/bin/make -f modules/flann/CMakeFiles/opencv_flann.dir/build.make modules/flann/CMakeFiles/opencv_flann.dir/depend
1331:info:build /Applications/Xcode.app/Contents/Developer/usr/bin/make -f modules/imgproc/CMakeFiles/opencv_imgproc.dir/build.make modules/imgproc/CMakeFiles/opencv_imgproc.dir/depend
1332:info:build /Applications/Xcode.app/Contents/Developer/usr/bin/make -f modules/ml/CMakeFiles/opencv_ml.dir/build.make modules/ml/CMakeFiles/opencv_ml.dir/depend
1333:info:build make[2]: Entering directory `/opt/local/var/macports/build/_opt_local_var_macports_sources_rsync.macports.org_release_tarballs_ports_graphics_opencv/opencv/work/build'
1334:info:build cd /opt/local/var/macports/build/_opt_local_var_macports_sources_rsync.macports.org_release_tarballs_ports_graphics_opencv/opencv/work/build && /opt/local/bin/cmake -E cmake_depends "Unix Makefiles" /opt/local/var/macports/build/_opt_local_var_macports_sources_rsync.macports.org_release_tarballs_ports_graphics_opencv/opencv/work/opencv-3.1.0 /opt/local/var/macports/build/_opt_local_var_macports_sources_rsync.macports.org_release_tarballs_ports_graphics_opencv/opencv/work/opencv-3.1.0/modules/flann /opt/local/var/macports/build/_opt_local_var_macports_sources_rsync.macports.org_release_tarballs_ports_graphics_opencv/opencv/work/build /opt/local/var/macports/build/_opt_local_var_macports_sources_rsync.macports.org_release_tarballs_ports_graphics_opencv/opencv/work/build/modules/flann /opt/local/var/macports/build/_opt_local_var_macports_sources_rsync.macports.org_release_tarballs_ports_graphics_opencv/opencv/work/build/modules/flann/CMakeFiles/opencv_flann.dir/DependInfo.cmake --color=
1335:info:build make[2]: Entering directory `/opt/local/var/macports/build/_opt_local_var_macports_sources_rsync.macports.org_release_tarballs_ports_graphics_opencv/opencv/work/build'
1336:info:build cd /opt/local/var/macports/build/_opt_local_var_macports_sources_rsync.macports.org_release_tarballs_ports_graphics_opencv/opencv/work/build && /opt/local/bin/cmake -E cmake_depends "Unix Makefiles" /opt/local/var/macports/build/_opt_local_var_macports_sources_rsync.macports.org_release_tarballs_ports_graphics_opencv/opencv/work/opencv-3.1.0 /opt/local/var/macports/build/_opt_local_var_macports_sources_rsync.macports.org_release_tarballs_ports_graphics_opencv/opencv/work/opencv-3.1.0/modules/ml /opt/local/var/macports/build/_opt_local_var_macports_sources_rsync.macports.org_release_tarballs_ports_graphics_opencv/opencv/work/build /opt/local/var/macports/build/_opt_local_var_macports_sources_rsync.macports.org_release_tarballs_ports_graphics_opencv/opencv/work/build/modules/ml /opt/local/var/macports/build/_opt_local_var_macports_sources_rsync.macports.org_release_tarballs_ports_graphics_opencv/opencv/work/build/modules/ml/CMakeFiles/opencv_ml.dir/DependInfo.cmake --color=
1337:info:build make[2]: Leaving directory `/opt/local/var/macports/build/_opt_local_var_macports_sources_rsync.macports.org_release_tarballs_ports_graphics_opencv/opencv/work/build'
1338:info:build /Applications/Xcode.app/Contents/Developer/usr/bin/make -f modules/flann/CMakeFiles/opencv_flann.dir/build.make modules/flann/CMakeFiles/opencv_flann.dir/build
1339:info:build make[2]: Entering directory `/opt/local/var/macports/build/_opt_local_var_macports_sources_rsync.macports.org_release_tarballs_ports_graphics_opencv/opencv/work/build'
1340:info:build make[2]: Nothing to be done for `modules/flann/CMakeFiles/opencv_flann.dir/build'.
1341:info:build make[2]: Leaving directory `/opt/local/var/macports/build/_opt_local_var_macports_sources_rsync.macports.org_release_tarballs_ports_graphics_opencv/opencv/work/build'
1342:info:build make[2]: Entering directory `/opt/local/var/macports/build/_opt_local_var_macports_sources_rsync.macports.org_release_tarballs_ports_graphics_opencv/opencv/work/build'
1343:info:build cd /opt/local/var/macports/build/_opt_local_var_macports_sources_rsync.macports.org_release_tarballs_ports_graphics_opencv/opencv/work/build && /opt/local/bin/cmake -E cmake_depends "Unix Makefiles" /opt/local/var/macports/build/_opt_local_var_macports_sources_rsync.macports.org_release_tarballs_ports_graphics_opencv/opencv/work/opencv-3.1.0 /opt/local/var/macports/build/_opt_local_var_macports_sources_rsync.macports.org_release_tarballs_ports_graphics_opencv/opencv/work/opencv-3.1.0/modules/imgproc /opt/local/var/macports/build/_opt_local_var_macports_sources_rsync.macports.org_release_tarballs_ports_graphics_opencv/opencv/work/build /opt/local/var/macports/build/_opt_local_var_macports_sources_rsync.macports.org_release_tarballs_ports_graphics_opencv/opencv/work/build/modules/imgproc /opt/local/var/macports/build/_opt_local_var_macports_sources_rsync.macports.org_release_tarballs_ports_graphics_opencv/opencv/work/build/modules/imgproc/CMakeFiles/opencv_imgproc.dir/DependInfo.cmake --color=
1344:info:build make[2]: Leaving directory `/opt/local/var/macports/build/_opt_local_var_macports_sources_rsync.macports.org_release_tarballs_ports_graphics_opencv/opencv/work/build'
1345:info:build /Applications/Xcode.app/Contents/Developer/usr/bin/make -f modules/ml/CMakeFiles/opencv_ml.dir/build.make modules/ml/CMakeFiles/opencv_ml.dir/build
1346:info:build [ 17%] Built target opencv_flann
1347:info:build make[2]: Entering directory `/opt/local/var/macports/build/_opt_local_var_macports_sources_rsync.macports.org_release_tarballs_ports_graphics_opencv/opencv/work/build'
1348:info:build make[2]: Nothing to be done for `modules/ml/CMakeFiles/opencv_ml.dir/build'.
1349:info:build make[2]: Leaving directory `/opt/local/var/macports/build/_opt_local_var_macports_sources_rsync.macports.org_release_tarballs_ports_graphics_opencv/opencv/work/build'
1350:info:build [ 22%] Built target opencv_ml
1351:info:build make[2]: Leaving directory `/opt/local/var/macports/build/_opt_local_var_macports_sources_rsync.macports.org_release_tarballs_ports_graphics_opencv/opencv/work/build'
1352:info:build /Applications/Xcode.app/Contents/Developer/usr/bin/make -f modules/imgproc/CMakeFiles/opencv_imgproc.dir/build.make modules/imgproc/CMakeFiles/opencv_imgproc.dir/build
1353:info:build make[2]: Entering directory `/opt/local/var/macports/build/_opt_local_var_macports_sources_rsync.macports.org_release_tarballs_ports_graphics_opencv/opencv/work/build'
1354:info:build make[2]: Nothing to be done for `modules/imgproc/CMakeFiles/opencv_imgproc.dir/build'.
1355:info:build make[2]: Leaving directory `/opt/local/var/macports/build/_opt_local_var_macports_sources_rsync.macports.org_release_tarballs_ports_graphics_opencv/opencv/work/build'
1356:info:build [ 40%] Built target opencv_imgproc
1357:info:build /Applications/Xcode.app/Contents/Developer/usr/bin/make -f modules/photo/CMakeFiles/opencv_photo.dir/build.make modules/photo/CMakeFiles/opencv_photo.dir/depend
1358:info:build /Applications/Xcode.app/Contents/Developer/usr/bin/make -f modules/video/CMakeFiles/opencv_video.dir/build.make modules/video/CMakeFiles/opencv_video.dir/depend
1359:info:build /Applications/Xcode.app/Contents/Developer/usr/bin/make -f modules/imgcodecs/CMakeFiles/opencv_imgcodecs.dir/build.make modules/imgcodecs/CMakeFiles/opencv_imgcodecs.dir/depend
1360:info:build make[2]: Entering directory `/opt/local/var/macports/build/_opt_local_var_macports_sources_rsync.macports.org_release_tarballs_ports_graphics_opencv/opencv/work/build'
1361:info:build cd /opt/local/var/macports/build/_opt_local_var_macports_sources_rsync.macports.org_release_tarballs_ports_graphics_opencv/opencv/work/build && /opt/local/bin/cmake -E cmake_depends "Unix Makefiles" /opt/local/var/macports/build/_opt_local_var_macports_sources_rsync.macports.org_release_tarballs_ports_graphics_opencv/opencv/work/opencv-3.1.0 /opt/local/var/macports/build/_opt_local_var_macports_sources_rsync.macports.org_release_tarballs_ports_graphics_opencv/opencv/work/opencv-3.1.0/modules/video /opt/local/var/macports/build/_opt_local_var_macports_sources_rsync.macports.org_release_tarballs_ports_graphics_opencv/opencv/work/build /opt/local/var/macports/build/_opt_local_var_macports_sources_rsync.macports.org_release_tarballs_ports_graphics_opencv/opencv/work/build/modules/video /opt/local/var/macports/build/_opt_local_var_macports_sources_rsync.macports.org_release_tarballs_ports_graphics_opencv/opencv/work/build/modules/video/CMakeFiles/opencv_video.dir/DependInfo.cmake --color=
1362:info:build make[2]: Entering directory `/opt/local/var/macports/build/_opt_local_var_macports_sources_rsync.macports.org_release_tarballs_ports_graphics_opencv/opencv/work/build'
1363:info:build cd /opt/local/var/macports/build/_opt_local_var_macports_sources_rsync.macports.org_release_tarballs_ports_graphics_opencv/opencv/work/build && /opt/local/bin/cmake -E cmake_depends "Unix Makefiles" /opt/local/var/macports/build/_opt_local_var_macports_sources_rsync.macports.org_release_tarballs_ports_graphics_opencv/opencv/work/opencv-3.1.0 /opt/local/var/macports/build/_opt_local_var_macports_sources_rsync.macports.org_release_tarballs_ports_graphics_opencv/opencv/work/opencv-3.1.0/modules/photo /opt/local/var/macports/build/_opt_local_var_macports_sources_rsync.macports.org_release_tarballs_ports_graphics_opencv/opencv/work/build /opt/local/var/macports/build/_opt_local_var_macports_sources_rsync.macports.org_release_tarballs_ports_graphics_opencv/opencv/work/build/modules/photo /opt/local/var/macports/build/_opt_local_var_macports_sources_rsync.macports.org_release_tarballs_ports_graphics_opencv/opencv/work/build/modules/photo/CMakeFiles/opencv_photo.dir/DependInfo.cmake --color=
1364:info:build make[2]: Entering directory `/opt/local/var/macports/build/_opt_local_var_macports_sources_rsync.macports.org_release_tarballs_ports_graphics_opencv/opencv/work/build'
1365:info:build cd /opt/local/var/macports/build/_opt_local_var_macports_sources_rsync.macports.org_release_tarballs_ports_graphics_opencv/opencv/work/build && /opt/local/bin/cmake -E cmake_depends "Unix Makefiles" /opt/local/var/macports/build/_opt_local_var_macports_sources_rsync.macports.org_release_tarballs_ports_graphics_opencv/opencv/work/opencv-3.1.0 /opt/local/var/macports/build/_opt_local_var_macports_sources_rsync.macports.org_release_tarballs_ports_graphics_opencv/opencv/work/opencv-3.1.0/modules/imgcodecs /opt/local/var/macports/build/_opt_local_var_macports_sources_rsync.macports.org_release_tarballs_ports_graphics_opencv/opencv/work/build /opt/local/var/macports/build/_opt_local_var_macports_sources_rsync.macports.org_release_tarballs_ports_graphics_opencv/opencv/work/build/modules/imgcodecs /opt/local/var/macports/build/_opt_local_var_macports_sources_rsync.macports.org_release_tarballs_ports_graphics_opencv/opencv/work/build/modules/imgcodecs/CMakeFiles/opencv_imgcodecs.dir/DependInfo.cmake --color=
1366:info:build make[2]: Leaving directory `/opt/local/var/macports/build/_opt_local_var_macports_sources_rsync.macports.org_release_tarballs_ports_graphics_opencv/opencv/work/build'
1367:info:build /Applications/Xcode.app/Contents/Developer/usr/bin/make -f modules/video/CMakeFiles/opencv_video.dir/build.make modules/video/CMakeFiles/opencv_video.dir/build
1368:info:build make[2]: Leaving directory `/opt/local/var/macports/build/_opt_local_var_macports_sources_rsync.macports.org_release_tarballs_ports_graphics_opencv/opencv/work/build'
1369:info:build /Applications/Xcode.app/Contents/Developer/usr/bin/make -f modules/photo/CMakeFiles/opencv_photo.dir/build.make modules/photo/CMakeFiles/opencv_photo.dir/build
1370:info:build make[2]: Leaving directory `/opt/local/var/macports/build/_opt_local_var_macports_sources_rsync.macports.org_release_tarballs_ports_graphics_opencv/opencv/work/build'
1371:info:build /Applications/Xcode.app/Contents/Developer/usr/bin/make -f modules/imgcodecs/CMakeFiles/opencv_imgcodecs.dir/build.make modules/imgcodecs/CMakeFiles/opencv_imgcodecs.dir/build
1372:info:build make[2]: Entering directory `/opt/local/var/macports/build/_opt_local_var_macports_sources_rsync.macports.org_release_tarballs_ports_graphics_opencv/opencv/work/build'
1373:info:build make[2]: Nothing to be done for `modules/video/CMakeFiles/opencv_video.dir/build'.
1374:info:build make[2]: Leaving directory `/opt/local/var/macports/build/_opt_local_var_macports_sources_rsync.macports.org_release_tarballs_ports_graphics_opencv/opencv/work/build'
1375:info:build make[2]: Entering directory `/opt/local/var/macports/build/_opt_local_var_macports_sources_rsync.macports.org_release_tarballs_ports_graphics_opencv/opencv/work/build'
1376:info:build make[2]: Nothing to be done for `modules/photo/CMakeFiles/opencv_photo.dir/build'.
1377:info:build make[2]: Leaving directory `/opt/local/var/macports/build/_opt_local_var_macports_sources_rsync.macports.org_release_tarballs_ports_graphics_opencv/opencv/work/build'
1378:info:build [ 43%] Built target opencv_video
1379:info:build /Applications/Xcode.app/Contents/Developer/usr/bin/make -f modules/shape/CMakeFiles/opencv_shape.dir/build.make modules/shape/CMakeFiles/opencv_shape.dir/depend
1380:info:build make[2]: Entering directory `/opt/local/var/macports/build/_opt_local_var_macports_sources_rsync.macports.org_release_tarballs_ports_graphics_opencv/opencv/work/build'
1381:info:build make[2]: Nothing to be done for `modules/imgcodecs/CMakeFiles/opencv_imgcodecs.dir/build'.
1382:info:build make[2]: Leaving directory `/opt/local/var/macports/build/_opt_local_var_macports_sources_rsync.macports.org_release_tarballs_ports_graphics_opencv/opencv/work/build'
1383:info:build [ 49%] Built target opencv_photo
1384:info:build make[2]: Entering directory `/opt/local/var/macports/build/_opt_local_var_macports_sources_rsync.macports.org_release_tarballs_ports_graphics_opencv/opencv/work/build'
1385:info:build cd /opt/local/var/macports/build/_opt_local_var_macports_sources_rsync.macports.org_release_tarballs_ports_graphics_opencv/opencv/work/build && /opt/local/bin/cmake -E cmake_depends "Unix Makefiles" /opt/local/var/macports/build/_opt_local_var_macports_sources_rsync.macports.org_release_tarballs_ports_graphics_opencv/opencv/work/opencv-3.1.0 /opt/local/var/macports/build/_opt_local_var_macports_sources_rsync.macports.org_release_tarballs_ports_graphics_opencv/opencv/work/opencv-3.1.0/modules/shape /opt/local/var/macports/build/_opt_local_var_macports_sources_rsync.macports.org_release_tarballs_ports_graphics_opencv/opencv/work/build /opt/local/var/macports/build/_opt_local_var_macports_sources_rsync.macports.org_release_tarballs_ports_graphics_opencv/opencv/work/build/modules/shape /opt/local/var/macports/build/_opt_local_var_macports_sources_rsync.macports.org_release_tarballs_ports_graphics_opencv/opencv/work/build/modules/shape/CMakeFiles/opencv_shape.dir/DependInfo.cmake --color=
1386:info:build [ 54%] Built target opencv_imgcodecs
1387:info:build /Applications/Xcode.app/Contents/Developer/usr/bin/make -f modules/videoio/CMakeFiles/opencv_videoio.dir/build.make modules/videoio/CMakeFiles/opencv_videoio.dir/depend
1388:info:build make[2]: Entering directory `/opt/local/var/macports/build/_opt_local_var_macports_sources_rsync.macports.org_release_tarballs_ports_graphics_opencv/opencv/work/build'
1389:info:build cd /opt/local/var/macports/build/_opt_local_var_macports_sources_rsync.macports.org_release_tarballs_ports_graphics_opencv/opencv/work/build && /opt/local/bin/cmake -E cmake_depends "Unix Makefiles" /opt/local/var/macports/build/_opt_local_var_macports_sources_rsync.macports.org_release_tarballs_ports_graphics_opencv/opencv/work/opencv-3.1.0 /opt/local/var/macports/build/_opt_local_var_macports_sources_rsync.macports.org_release_tarballs_ports_graphics_opencv/opencv/work/opencv-3.1.0/modules/videoio /opt/local/var/macports/build/_opt_local_var_macports_sources_rsync.macports.org_release_tarballs_ports_graphics_opencv/opencv/work/build /opt/local/var/macports/build/_opt_local_var_macports_sources_rsync.macports.org_release_tarballs_ports_graphics_opencv/opencv/work/build/modules/videoio /opt/local/var/macports/build/_opt_local_var_macports_sources_rsync.macports.org_release_tarballs_ports_graphics_opencv/opencv/work/build/modules/videoio/CMakeFiles/opencv_videoio.dir/DependInfo.cmake --color=
1390:info:build make[2]: Leaving directory `/opt/local/var/macports/build/_opt_local_var_macports_sources_rsync.macports.org_release_tarballs_ports_graphics_opencv/opencv/work/build'
1391:info:build /Applications/Xcode.app/Contents/Developer/usr/bin/make -f modules/shape/CMakeFiles/opencv_shape.dir/build.make modules/shape/CMakeFiles/opencv_shape.dir/build
1392:info:build make[2]: Entering directory `/opt/local/var/macports/build/_opt_local_var_macports_sources_rsync.macports.org_release_tarballs_ports_graphics_opencv/opencv/work/build'
1393:info:build make[2]: Nothing to be done for `modules/shape/CMakeFiles/opencv_shape.dir/build'.
1394:info:build make[2]: Leaving directory `/opt/local/var/macports/build/_opt_local_var_macports_sources_rsync.macports.org_release_tarballs_ports_graphics_opencv/opencv/work/build'
1395:info:build make[2]: Leaving directory `/opt/local/var/macports/build/_opt_local_var_macports_sources_rsync.macports.org_release_tarballs_ports_graphics_opencv/opencv/work/build'
1396:info:build /Applications/Xcode.app/Contents/Developer/usr/bin/make -f modules/videoio/CMakeFiles/opencv_videoio.dir/build.make modules/videoio/CMakeFiles/opencv_videoio.dir/build
1397:info:build [ 57%] Built target opencv_shape
1398:info:build make[2]: Entering directory `/opt/local/var/macports/build/_opt_local_var_macports_sources_rsync.macports.org_release_tarballs_ports_graphics_opencv/opencv/work/build'
1399:info:build [ 57%] Building CXX object modules/videoio/CMakeFiles/opencv_videoio.dir/src/cap_qtkit.mm.o
1400:info:build cd /opt/local/var/macports/build/_opt_local_var_macports_sources_rsync.macports.org_release_tarballs_ports_graphics_opencv/opencv/work/build/modules/videoio && /Applications/Xcode.app/Contents/Developer/Toolchains/XcodeDefault.xctoolchain/usr/bin/clang++   -DCVAPI_EXPORTS -DVIDEOIO_EXPORTS -D__OPENCV_BUILD=1 -I/opt/local/var/macports/build/_opt_local_var_macports_sources_rsync.macports.org_release_tarballs_ports_graphics_opencv/opencv/work/build -isystem /opt/local/include -I/opt/local/var/macports/build/_opt_local_var_macports_sources_rsync.macports.org_release_tarballs_ports_graphics_opencv/opencv/work/opencv-3.1.0/modules/videoio/include -I/opt/local/var/macports/build/_opt_local_var_macports_sources_rsync.macports.org_release_tarballs_ports_graphics_opencv/opencv/work/opencv-3.1.0/modules/videoio/src -I/opt/local/var/macports/build/_opt_local_var_macports_sources_rsync.macports.org_release_tarballs_ports_graphics_opencv/opencv/work/build/modules/videoio -I/opt/local/var/macports/build/_opt_local_var_macports_sources_rsync.macports.org_release_tarballs_ports_graphics_opencv/opencv/work/opencv-3.1.0/modules/core/include -I/opt/local/var/macports/build/_opt_local_var_macports_sources_rsync.macports.org_release_tarballs_ports_graphics_opencv/opencv/work/opencv-3.1.0/modules/imgproc/include -I/opt/local/var/macports/build/_opt_local_var_macports_sources_rsync.macports.org_release_tarballs_ports_graphics_opencv/opencv/work/opencv-3.1.0/modules/imgcodecs/include  -pipe -Os -stdlib=libc++    -fsigned-char -W -Werror=return-type -Werror=non-virtual-dtor -Werror=address -Wformat -Werror=format-security -Wmissing-declarations -Wmissing-prototypes -Wstrict-prototypes -Wundef -Winit-self -Wpointer-arith -Wshadow -Wsign-promo -Wno-narrowing -Wno-delete-non-virtual-dtor -Wno-unnamed-type-template-args -fdiagnostics-show-option -Wno-long-long -Qunused-arguments -Wno-semicolon-before-method-body -fno-omit-frame-pointer -msse -msse2 -mno-avx -msse3 -mno-ssse3 -mno-sse4.1 -mno-sse4.2 -fvisibility=hidden -fvisibility-inlines-hidden -Wno-deprecated-declarations -DNDEBUG  -DNDEBUG -arch x86_64 -mmacosx-version-min=10.12 -fPIC   -o CMakeFiles/opencv_videoio.dir/src/cap_qtkit.mm.o -c /opt/local/var/macports/build/_opt_local_var_macports_sources_rsync.macports.org_release_tarballs_ports_graphics_opencv/opencv/work/opencv-3.1.0/modules/videoio/src/cap_qtkit.mm
1401:info:build /opt/local/var/macports/build/_opt_local_var_macports_sources_rsync.macports.org_release_tarballs_ports_graphics_opencv/opencv/work/opencv-3.1.0/modules/videoio/src/cap_qtkit.mm:46:9: fatal error: 'QTKit/QTKit.h' file not found
1402:info:build #import <QTKit/QTKit.h>
1403:info:build         ^
1404:info:build 1 error generated.
1405:info:build make[2]: *** [modules/videoio/CMakeFiles/opencv_videoio.dir/src/cap_qtkit.mm.o] Error 1
1406:info:build make[2]: Leaving directory `/opt/local/var/macports/build/_opt_local_var_macports_sources_rsync.macports.org_release_tarballs_ports_graphics_opencv/opencv/work/build'
1407:info:build make[1]: *** [modules/videoio/CMakeFiles/opencv_videoio.dir/all] Error 2
1408:info:build make[1]: Leaving directory `/opt/local/var/macports/build/_opt_local_var_macports_sources_rsync.macports.org_release_tarballs_ports_graphics_opencv/opencv/work/build'
1409:info:build make: *** [all] Error 2
1410:info:build make: Leaving directory `/opt/local/var/macports/build/_opt_local_var_macports_sources_rsync.macports.org_release_tarballs_ports_graphics_opencv/opencv/work/build'
1411:info:build Command failed:  cd "/opt/local/var/macports/build/_opt_local_var_macports_sources_rsync.macports.org_release_tarballs_ports_graphics_opencv/opencv/work/build" && /usr/bin/make -j4 -w all VERBOSE=ON
1412:info:build Exit code: 2
1413:error:build org.macports.build for port opencv returned: command execution failed
1414:debug:build Error code: CHILDSTATUS 96881 2
1415:debug:build Backtrace: command execution failed
1416    while executing
1417"system -nice 0 $fullcmdstring"
1418    ("eval" body line 1)
1419    invoked from within
1420"eval system $notty $nice \$fullcmdstring"
1421    invoked from within
1422"command_exec build"
1423    (procedure "portbuild::build_main" line 8)
1424    invoked from within
1425"portbuild::build_main org.macports.build"
1426    ("eval" body line 1)
1427    invoked from within
1428"eval $procedure $targetname"
1429:info:build Warning: targets not executed for opencv: org.macports.activate org.macports.build org.macports.destroot org.macports.install
1430:notice:build Please see the log file for port opencv for details:
1431    /opt/local/var/macports/logs/_opt_local_var_macports_sources_rsync.macports.org_release_tarballs_ports_graphics_opencv/opencv/main.log