Ticket #52684: main.log

File main.log, 169.5 KB (added by bakki, 4 years ago)

main.log

Line 
1version:1
2:debug:main epoch: in tree: 0 installed: 0
3:debug:main pkgconfig 0.29.1_0 exists in the ports tree
4:debug:main pkgconfig 0.29.1_0  is the latest installed
5:debug:main pkgconfig 0.29.1_0  is active
6:debug:main Merging existing variants '' into variants
7:debug:main new fully merged portvariants:
8:debug:main Changing to port directory: /opt/local/var/macports/sources/rsync.macports.org/release/tarballs/ports/devel/pkgconfig
9:debug:main OS darwin/16.1.0 (Mac OS X 10.12) arch i386
10:debug:main adding the default universal variant
11:debug:main Reading variant descriptions from /opt/local/var/macports/sources/rsync.macports.org/release/tarballs/ports/_resources/port1.0/variant_descriptions.conf
12:debug:main Running callback portconfigure::add_automatic_compiler_dependencies
13:debug:main Finished running callback portconfigure::add_automatic_compiler_dependencies
14:debug:main Running callback portbuild::add_automatic_buildsystem_dependencies
15:debug:main Finished running callback portbuild::add_automatic_buildsystem_dependencies
16:debug:main No need to upgrade! pkgconfig 0.29.1_0 >= pkgconfig 0.29.1_0
17:debug:main epoch: in tree: 0 installed: 0
18:debug:main libiconv 1.14_0 exists in the ports tree
19:debug:main libiconv 1.14_0  is the latest installed
20:debug:main libiconv 1.14_0  is active
21:debug:main Merging existing variants '' into variants
22:debug:main new fully merged portvariants:
23:debug:main Changing to port directory: /opt/local/var/macports/sources/rsync.macports.org/release/tarballs/ports/textproc/libiconv
24:debug:main OS darwin/16.1.0 (Mac OS X 10.12) arch i386
25:debug:main Reading variant descriptions from /opt/local/var/macports/sources/rsync.macports.org/release/tarballs/ports/_resources/port1.0/variant_descriptions.conf
26:debug:main Sourcing PortGroup muniversal 1.0 from /opt/local/var/macports/sources/rsync.macports.org/release/tarballs/ports/_resources/port1.0/group/muniversal-1.0.tcl
27:debug:main universal variant already exists, so not adding the default one
28:debug:main Running callback portconfigure::add_automatic_compiler_dependencies
29:debug:main Finished running callback portconfigure::add_automatic_compiler_dependencies
30:debug:main Running callback portbuild::add_automatic_buildsystem_dependencies
31:debug:main Finished running callback portbuild::add_automatic_buildsystem_dependencies
32:debug:main No need to upgrade! libiconv 1.14_0 >= libiconv 1.14_0
33:debug:main epoch: in tree: 0 installed: 0
34:debug:main icu 55.1_0 exists in the ports tree
35:debug:main icu 55.1_0  is the latest installed
36:debug:main icu 55.1_0  is active
37:debug:main Merging existing variants '' into variants
38:debug:main new fully merged portvariants:
39:debug:main Changing to port directory: /opt/local/var/macports/sources/rsync.macports.org/release/tarballs/ports/devel/icu
40:debug:main OS darwin/16.1.0 (Mac OS X 10.12) arch i386
41:debug:main Reading variant descriptions from /opt/local/var/macports/sources/rsync.macports.org/release/tarballs/ports/_resources/port1.0/variant_descriptions.conf
42:debug:main Sourcing PortGroup muniversal 1.0 from /opt/local/var/macports/sources/rsync.macports.org/release/tarballs/ports/_resources/port1.0/group/muniversal-1.0.tcl
43:debug:main universal variant already exists, so not adding the default one
44:debug:main Running callback portconfigure::add_automatic_compiler_dependencies
45:debug:main Finished running callback portconfigure::add_automatic_compiler_dependencies
46:debug:main Running callback portbuild::add_automatic_buildsystem_dependencies
47:debug:main Finished running callback portbuild::add_automatic_buildsystem_dependencies
48:debug:main No need to upgrade! icu 55.1_0 >= icu 55.1_0
49:debug:main epoch: in tree: 0 installed: 0
50:debug:main erlang 19.1_0 exists in the ports tree
51:debug:main erlang 19.1_0 +hipe+ssl+wxwidgets is the latest installed
52:debug:main erlang 19.1_0 +hipe+ssl+wxwidgets is active
53:debug:main Merging existing variants '+hipe+ssl+wxwidgets' into variants
54:debug:main new fully merged portvariants: wxwidgets + ssl + hipe +
55:debug:main Changing to port directory: /opt/local/var/macports/sources/rsync.macports.org/release/tarballs/ports/lang/erlang
56:debug:main OS darwin/16.1.0 (Mac OS X 10.12) arch i386
57:debug:main Sourcing PortGroup wxWidgets 1.0 from /opt/local/var/macports/sources/rsync.macports.org/release/tarballs/ports/_resources/port1.0/group/wxWidgets-1.0.tcl
58:debug:main Sourcing PortGroup compiler_blacklist_versions 1.0 from /opt/local/var/macports/sources/rsync.macports.org/release/tarballs/ports/_resources/port1.0/group/compiler_blacklist_versions-1.0.tcl
59:debug:main compiler clang 800.0.42.1 not blacklisted because it doesn't match {clang < 300}
60:debug:main universal_variant is false, so not adding the default universal variant
61:debug:main Executing variant wxwidgets provides wxwidgets
62:debug:main Executing variant ssl provides ssl
63:debug:main Executing variant hipe provides hipe
64:debug:main Running callback portconfigure::add_automatic_compiler_dependencies
65:debug:main Finished running callback portconfigure::add_automatic_compiler_dependencies
66:debug:main Running callback portbuild::add_automatic_buildsystem_dependencies
67:debug:main Finished running callback portbuild::add_automatic_buildsystem_dependencies
68:debug:main No need to upgrade! erlang 19.1_0 >= erlang 19.1_0
69:debug:main epoch: in tree: 0 installed: 0
70:debug:main ncurses 6.0_0 exists in the ports tree
71:debug:main ncurses 6.0_0  is the latest installed
72:debug:main ncurses 6.0_0  is active
73:debug:main Merging existing variants '' into variants
74:debug:main new fully merged portvariants:
75:debug:main Changing to port directory: /opt/local/var/macports/sources/rsync.macports.org/release/tarballs/ports/devel/ncurses
76:debug:main OS darwin/16.1.0 (Mac OS X 10.12) arch i386
77:debug:main adding the default universal variant
78:debug:main Reading variant descriptions from /opt/local/var/macports/sources/rsync.macports.org/release/tarballs/ports/_resources/port1.0/variant_descriptions.conf
79:debug:main Running callback portconfigure::add_automatic_compiler_dependencies
80:debug:main Finished running callback portconfigure::add_automatic_compiler_dependencies
81:debug:main Running callback portbuild::add_automatic_buildsystem_dependencies
82:debug:main Finished running callback portbuild::add_automatic_buildsystem_dependencies
83:debug:main No need to upgrade! ncurses 6.0_0 >= ncurses 6.0_0
84:debug:main epoch: in tree: 0 installed: 0
85:debug:main wxWidgets-3.0 3.0.2_4 exists in the ports tree
86:debug:main wxWidgets-3.0 3.0.2_4  is the latest installed
87:debug:main wxWidgets-3.0 3.0.2_4  is active
88:debug:main Merging existing variants '' into variants
89:debug:main new fully merged portvariants:
90:debug:main Changing to port directory: /opt/local/var/macports/sources/rsync.macports.org/release/tarballs/ports/graphics/wxWidgets-3.0
91:debug:main OS darwin/16.1.0 (Mac OS X 10.12) arch i386
92:debug:main Sourcing PortGroup active_variants 1.1 from /opt/local/var/macports/sources/rsync.macports.org/release/tarballs/ports/_resources/port1.0/group/active_variants-1.1.tcl
93:debug:main Sourcing PortGroup select 1.0 from /opt/local/var/macports/sources/rsync.macports.org/release/tarballs/ports/_resources/port1.0/group/select-1.0.tcl
94:debug:main Sourcing PortGroup wxWidgets 1.0 from /opt/local/var/macports/sources/rsync.macports.org/release/tarballs/ports/_resources/port1.0/group/wxWidgets-1.0.tcl
95:debug:main Sourcing PortGroup compiler_blacklist_versions 1.0 from /opt/local/var/macports/sources/rsync.macports.org/release/tarballs/ports/_resources/port1.0/group/compiler_blacklist_versions-1.0.tcl
96:debug:main Reading variant descriptions from /opt/local/var/macports/sources/rsync.macports.org/release/tarballs/ports/_resources/port1.0/variant_descriptions.conf
97:debug:main universal variant already exists, so not adding the default one
98:debug:main Running callback portconfigure::add_automatic_compiler_dependencies
99:debug:main Finished running callback portconfigure::add_automatic_compiler_dependencies
100:debug:main Running callback portbuild::add_automatic_buildsystem_dependencies
101:debug:main Finished running callback portbuild::add_automatic_buildsystem_dependencies
102:debug:main No need to upgrade! wxWidgets-3.0 3.0.2_4 >= wxWidgets-3.0 3.0.2_4
103:debug:main epoch: in tree: 0 installed: 0
104:debug:main jpeg 9b_0 exists in the ports tree
105:debug:main jpeg 9b_0  is the latest installed
106:debug:main jpeg 9b_0  is active
107:debug:main Merging existing variants '' into variants
108:debug:main new fully merged portvariants:
109:debug:main Changing to port directory: /opt/local/var/macports/sources/rsync.macports.org/release/tarballs/ports/graphics/jpeg
110:debug:main OS darwin/16.1.0 (Mac OS X 10.12) arch i386
111:debug:main adding the default universal variant
112:debug:main Reading variant descriptions from /opt/local/var/macports/sources/rsync.macports.org/release/tarballs/ports/_resources/port1.0/variant_descriptions.conf
113:debug:main Running callback portconfigure::add_automatic_compiler_dependencies
114:debug:main Finished running callback portconfigure::add_automatic_compiler_dependencies
115:debug:main Running callback portbuild::add_automatic_buildsystem_dependencies
116:debug:main Finished running callback portbuild::add_automatic_buildsystem_dependencies
117:debug:main No need to upgrade! jpeg 9b_0 >= jpeg 9b_0
118:debug:main epoch: in tree: 0 installed: 0
119:debug:main tiff 4.0.6_1 exists in the ports tree
120:debug:main tiff 4.0.6_1  is the latest installed
121:debug:main tiff 4.0.6_1  is active
122:debug:main Merging existing variants '' into variants
123:debug:main new fully merged portvariants:
124:debug:main Changing to port directory: /opt/local/var/macports/sources/rsync.macports.org/release/tarballs/ports/graphics/tiff
125:debug:main OS darwin/16.1.0 (Mac OS X 10.12) arch i386
126:debug:main Sourcing PortGroup xcodeversion 1.0 from /opt/local/var/macports/sources/rsync.macports.org/release/tarballs/ports/_resources/port1.0/group/xcodeversion-1.0.tcl
127:debug:main Reading variant descriptions from /opt/local/var/macports/sources/rsync.macports.org/release/tarballs/ports/_resources/port1.0/variant_descriptions.conf
128:debug:main Sourcing PortGroup muniversal 1.0 from /opt/local/var/macports/sources/rsync.macports.org/release/tarballs/ports/_resources/port1.0/group/muniversal-1.0.tcl
129:debug:main universal variant already exists, so not adding the default one
130:debug:main Running callback portconfigure::add_automatic_compiler_dependencies
131:debug:main Finished running callback portconfigure::add_automatic_compiler_dependencies
132:debug:main Running callback portbuild::add_automatic_buildsystem_dependencies
133:debug:main Finished running callback portbuild::add_automatic_buildsystem_dependencies
134:debug:main No need to upgrade! tiff 4.0.6_1 >= tiff 4.0.6_1
135:debug:main epoch: in tree: 0 installed: 0
136:debug:main xz 5.2.2_0 exists in the ports tree
137:debug:main xz 5.2.2_0  is the latest installed
138:debug:main xz 5.2.2_0  is active
139:debug:main Merging existing variants '' into variants
140:debug:main new fully merged portvariants:
141:debug:main Changing to port directory: /opt/local/var/macports/sources/rsync.macports.org/release/tarballs/ports/archivers/xz
142:debug:main OS darwin/16.1.0 (Mac OS X 10.12) arch i386
143:debug:main adding the default universal variant
144:debug:main Reading variant descriptions from /opt/local/var/macports/sources/rsync.macports.org/release/tarballs/ports/_resources/port1.0/variant_descriptions.conf
145:debug:main Running callback portconfigure::add_automatic_compiler_dependencies
146:debug:main Finished running callback portconfigure::add_automatic_compiler_dependencies
147:debug:main Running callback portbuild::add_automatic_buildsystem_dependencies
148:debug:main Finished running callback portbuild::add_automatic_buildsystem_dependencies
149:debug:main No need to upgrade! xz 5.2.2_0 >= xz 5.2.2_0
150:debug:main epoch: in tree: 2 installed: 2
151:debug:main gettext 0.19.8.1_0 exists in the ports tree
152:debug:main gettext 0.19.8.1_0  is the latest installed
153:debug:main gettext 0.19.8.1_0  is active
154:debug:main Merging existing variants '' into variants
155:debug:main new fully merged portvariants:
156:debug:main Changing to port directory: /opt/local/var/macports/sources/rsync.macports.org/release/tarballs/ports/devel/gettext
157:debug:main OS darwin/16.1.0 (Mac OS X 10.12) arch i386
158:debug:main Sourcing PortGroup compiler_blacklist_versions 1.0 from /opt/local/var/macports/sources/rsync.macports.org/release/tarballs/ports/_resources/port1.0/group/compiler_blacklist_versions-1.0.tcl
159:debug:main Reading variant descriptions from /opt/local/var/macports/sources/rsync.macports.org/release/tarballs/ports/_resources/port1.0/variant_descriptions.conf
160:debug:main Sourcing PortGroup muniversal 1.0 from /opt/local/var/macports/sources/rsync.macports.org/release/tarballs/ports/_resources/port1.0/group/muniversal-1.0.tcl
161:debug:main compiler clang 800.0.42.1 not blacklisted because it doesn't match {clang < 211.10.1}
162:debug:main universal variant already exists, so not adding the default one
163:debug:main Running callback portconfigure::add_automatic_compiler_dependencies
164:debug:main Finished running callback portconfigure::add_automatic_compiler_dependencies
165:debug:main Running callback portbuild::add_automatic_buildsystem_dependencies
166:debug:main Finished running callback portbuild::add_automatic_buildsystem_dependencies
167:debug:main No need to upgrade! gettext 0.19.8.1_0 >= gettext 0.19.8.1_0
168:debug:main epoch: in tree: 0 installed: 0
169:debug:main expat 2.2.0_0 exists in the ports tree
170:debug:main expat 2.2.0_0  is the latest installed
171:debug:main expat 2.2.0_0  is active
172:debug:main Merging existing variants '' into variants
173:debug:main new fully merged portvariants:
174:debug:main Changing to port directory: /opt/local/var/macports/sources/rsync.macports.org/release/tarballs/ports/textproc/expat
175:debug:main OS darwin/16.1.0 (Mac OS X 10.12) arch i386
176:debug:main adding the default universal variant
177:debug:main Reading variant descriptions from /opt/local/var/macports/sources/rsync.macports.org/release/tarballs/ports/_resources/port1.0/variant_descriptions.conf
178:debug:main Running callback portconfigure::add_automatic_compiler_dependencies
179:debug:main Finished running callback portconfigure::add_automatic_compiler_dependencies
180:debug:main Running callback portbuild::add_automatic_buildsystem_dependencies
181:debug:main Finished running callback portbuild::add_automatic_buildsystem_dependencies
182:debug:main No need to upgrade! expat 2.2.0_0 >= expat 2.2.0_0
183:debug:main epoch: in tree: 0 installed: 0
184:debug:main zlib 1.2.8_0 exists in the ports tree
185:debug:main zlib 1.2.8_0  is the latest installed
186:debug:main zlib 1.2.8_0  is active
187:debug:main Merging existing variants '' into variants
188:debug:main new fully merged portvariants:
189:debug:main Changing to port directory: /opt/local/var/macports/sources/rsync.macports.org/release/tarballs/ports/archivers/zlib
190:debug:main OS darwin/16.1.0 (Mac OS X 10.12) arch i386
191:debug:main Sourcing PortGroup xcodeversion 1.0 from /opt/local/var/macports/sources/rsync.macports.org/release/tarballs/ports/_resources/port1.0/group/xcodeversion-1.0.tcl
192:debug:main adding the default universal variant
193:debug:main Reading variant descriptions from /opt/local/var/macports/sources/rsync.macports.org/release/tarballs/ports/_resources/port1.0/variant_descriptions.conf
194:debug:main Running callback portconfigure::add_automatic_compiler_dependencies
195:debug:main Finished running callback portconfigure::add_automatic_compiler_dependencies
196:debug:main Running callback portbuild::add_automatic_buildsystem_dependencies
197:debug:main Finished running callback portbuild::add_automatic_buildsystem_dependencies
198:debug:main No need to upgrade! zlib 1.2.8_0 >= zlib 1.2.8_0
199:debug:main epoch: in tree: 0 installed: 0
200:debug:main libpng 1.6.26_0 exists in the ports tree
201:debug:main libpng 1.6.26_0  is the latest installed
202:debug:main libpng 1.6.26_0  is active
203:debug:main Merging existing variants '' into variants
204:debug:main new fully merged portvariants:
205:debug:main Changing to port directory: /opt/local/var/macports/sources/rsync.macports.org/release/tarballs/ports/graphics/libpng
206:debug:main OS darwin/16.1.0 (Mac OS X 10.12) arch i386
207:debug:main adding the default universal variant
208:debug:main Reading variant descriptions from /opt/local/var/macports/sources/rsync.macports.org/release/tarballs/ports/_resources/port1.0/variant_descriptions.conf
209:debug:main Running callback portconfigure::add_automatic_compiler_dependencies
210:debug:main Finished running callback portconfigure::add_automatic_compiler_dependencies
211:debug:main Running callback portbuild::add_automatic_buildsystem_dependencies
212:debug:main Finished running callback portbuild::add_automatic_buildsystem_dependencies
213:debug:main No need to upgrade! libpng 1.6.26_0 >= libpng 1.6.26_0
214:debug:main epoch: in tree: 0 installed: 0
215:debug:main wxWidgets-common 3.1.0_0 exists in the ports tree
216:debug:main wxWidgets-common 3.1.0_0  is the latest installed
217:debug:main wxWidgets-common 3.1.0_0  is active
218:debug:main Merging existing variants '' into variants
219:debug:main new fully merged portvariants:
220:debug:main Changing to port directory: /opt/local/var/macports/sources/rsync.macports.org/release/tarballs/ports/graphics/wxWidgets-common
221:debug:main OS darwin/16.1.0 (Mac OS X 10.12) arch i386
222:debug:main universal_variant is false, so not adding the default universal variant
223:debug:main Running callback portconfigure::add_automatic_compiler_dependencies
224:debug:main Finished running callback portconfigure::add_automatic_compiler_dependencies
225:debug:main Running callback portbuild::add_automatic_buildsystem_dependencies
226:debug:main Finished running callback portbuild::add_automatic_buildsystem_dependencies
227:debug:main No need to upgrade! wxWidgets-common 3.1.0_0 >= wxWidgets-common 3.1.0_0
228:debug:main epoch: in tree: 0 installed: 0
229:debug:main wxWidgets_select 1.0_1 exists in the ports tree
230:debug:main wxWidgets_select 1.0_1  is the latest installed
231:debug:main wxWidgets_select 1.0_1  is active
232:debug:main Merging existing variants '' into variants
233:debug:main new fully merged portvariants:
234:debug:main Changing to port directory: /opt/local/var/macports/sources/rsync.macports.org/release/tarballs/ports/sysutils/wxWidgets_select
235:debug:main OS darwin/16.1.0 (Mac OS X 10.12) arch i386
236:debug:main Sourcing PortGroup select 1.0 from /opt/local/var/macports/sources/rsync.macports.org/release/tarballs/ports/_resources/port1.0/group/select-1.0.tcl
237:debug:main Sourcing PortGroup wxWidgets 1.0 from /opt/local/var/macports/sources/rsync.macports.org/release/tarballs/ports/_resources/port1.0/group/wxWidgets-1.0.tcl
238:debug:main universal_variant is false, so not adding the default universal variant
239:debug:main Running callback portconfigure::add_automatic_compiler_dependencies
240:debug:main Finished running callback portconfigure::add_automatic_compiler_dependencies
241:debug:main Running callback portbuild::add_automatic_buildsystem_dependencies
242:debug:main Finished running callback portbuild::add_automatic_buildsystem_dependencies
243:debug:main No need to upgrade! wxWidgets_select 1.0_1 >= wxWidgets_select 1.0_1
244:debug:main epoch: in tree: 0 installed: 0
245:debug:main libGLU 9.0.0_0 exists in the ports tree
246:debug:main libGLU 9.0.0_0  is the latest installed
247:debug:main libGLU 9.0.0_0  is active
248:debug:main Merging existing variants '' into variants
249:debug:main new fully merged portvariants:
250:debug:main Changing to port directory: /opt/local/var/macports/sources/rsync.macports.org/release/tarballs/ports/x11/libGLU
251:debug:main OS darwin/16.1.0 (Mac OS X 10.12) arch i386
252:debug:main adding the default universal variant
253:debug:main Reading variant descriptions from /opt/local/var/macports/sources/rsync.macports.org/release/tarballs/ports/_resources/port1.0/variant_descriptions.conf
254:debug:main Running callback portconfigure::add_automatic_compiler_dependencies
255:debug:main Finished running callback portconfigure::add_automatic_compiler_dependencies
256:debug:main Running callback portbuild::add_automatic_buildsystem_dependencies
257:debug:main Finished running callback portbuild::add_automatic_buildsystem_dependencies
258:debug:main No need to upgrade! libGLU 9.0.0_0 >= libGLU 9.0.0_0
259:debug:main epoch: in tree: 1 installed: 1
260:debug:main mesa 12.0.1_1 exists in the ports tree
261:debug:main mesa 12.0.1_1 +osmesa+python27 is the latest installed
262:debug:main mesa 12.0.1_1 +osmesa+python27 is active
263:debug:main Merging existing variants '+osmesa+python27' into variants
264:debug:main new fully merged portvariants: osmesa + python27 +
265:debug:main Changing to port directory: /opt/local/var/macports/sources/rsync.macports.org/release/tarballs/ports/x11/mesa
266:debug:main OS darwin/16.1.0 (Mac OS X 10.12) arch i386
267:debug:main Sourcing PortGroup compiler_blacklist_versions 1.0 from /opt/local/var/macports/sources/rsync.macports.org/release/tarballs/ports/_resources/port1.0/group/compiler_blacklist_versions-1.0.tcl
268:debug:main compiler clang 800.0.42.1 not blacklisted because it doesn't match {clang < 100}
269:debug:main adding the default universal variant
270:debug:main Reading variant descriptions from /opt/local/var/macports/sources/rsync.macports.org/release/tarballs/ports/_resources/port1.0/variant_descriptions.conf
271:debug:main Executing variant python27 provides python27
272:debug:main Executing variant osmesa provides osmesa
273:debug:main Running callback portconfigure::add_automatic_compiler_dependencies
274:debug:main Finished running callback portconfigure::add_automatic_compiler_dependencies
275:debug:main Running callback portbuild::add_automatic_buildsystem_dependencies
276:debug:main Finished running callback portbuild::add_automatic_buildsystem_dependencies
277:debug:main No need to upgrade! mesa 12.0.1_1 >= mesa 12.0.1_1
278:debug:main epoch: in tree: 0 installed: 0
279:debug:main xorg-glproto 1.4.17_0 exists in the ports tree
280:debug:main xorg-glproto 1.4.17_0  is the latest installed
281:debug:main xorg-glproto 1.4.17_0  is active
282:debug:main Merging existing variants '' into variants
283:debug:main new fully merged portvariants:
284:debug:main Changing to port directory: /opt/local/var/macports/sources/rsync.macports.org/release/tarballs/ports/x11/xorg-glproto
285:debug:main OS darwin/16.1.0 (Mac OS X 10.12) arch i386
286:debug:main only one arch supported, so not adding the default universal variant
287:debug:main Running callback portconfigure::add_automatic_compiler_dependencies
288:debug:main Finished running callback portconfigure::add_automatic_compiler_dependencies
289:debug:main Running callback portbuild::add_automatic_buildsystem_dependencies
290:debug:main Finished running callback portbuild::add_automatic_buildsystem_dependencies
291:debug:main No need to upgrade! xorg-glproto 1.4.17_0 >= xorg-glproto 1.4.17_0
292:debug:main epoch: in tree: 0 installed: 0
293:debug:main xorg-dri2proto 2.8_0 exists in the ports tree
294:debug:main xorg-dri2proto 2.8_0  is the latest installed
295:debug:main xorg-dri2proto 2.8_0  is active
296:debug:main Merging existing variants '' into variants
297:debug:main new fully merged portvariants:
298:debug:main Changing to port directory: /opt/local/var/macports/sources/rsync.macports.org/release/tarballs/ports/x11/xorg-dri2proto
299:debug:main OS darwin/16.1.0 (Mac OS X 10.12) arch i386
300:debug:main only one arch supported, so not adding the default universal variant
301:debug:main Running callback portconfigure::add_automatic_compiler_dependencies
302:debug:main Finished running callback portconfigure::add_automatic_compiler_dependencies
303:debug:main Running callback portbuild::add_automatic_buildsystem_dependencies
304:debug:main Finished running callback portbuild::add_automatic_buildsystem_dependencies
305:debug:main No need to upgrade! xorg-dri2proto 2.8_0 >= xorg-dri2proto 2.8_0
306:debug:main epoch: in tree: 0 installed: 0
307:debug:main xorg-libxcb 1.12_2 exists in the ports tree
308:debug:main xorg-libxcb 1.12_2 +python27 is the latest installed
309:debug:main xorg-libxcb 1.12_2 +python27 is active
310:debug:main Merging existing variants '+python27' into variants
311:debug:main new fully merged portvariants: python27 +
312:debug:main Changing to port directory: /opt/local/var/macports/sources/rsync.macports.org/release/tarballs/ports/x11/xorg-libxcb
313:debug:main OS darwin/16.1.0 (Mac OS X 10.12) arch i386
314:debug:main adding the default universal variant
315:debug:main Reading variant descriptions from /opt/local/var/macports/sources/rsync.macports.org/release/tarballs/ports/_resources/port1.0/variant_descriptions.conf
316:debug:main Executing variant python27 provides python27
317:debug:main Running callback portconfigure::add_automatic_compiler_dependencies
318:debug:main Finished running callback portconfigure::add_automatic_compiler_dependencies
319:debug:main Running callback portbuild::add_automatic_buildsystem_dependencies
320:debug:main Finished running callback portbuild::add_automatic_buildsystem_dependencies
321:debug:main No need to upgrade! xorg-libxcb 1.12_2 >= xorg-libxcb 1.12_2
322:debug:main epoch: in tree: 0 installed: 0
323:debug:main xorg-libXau 1.0.8_0 exists in the ports tree
324:debug:main xorg-libXau 1.0.8_0  is the latest installed
325:debug:main xorg-libXau 1.0.8_0  is active
326:debug:main Merging existing variants '' into variants
327:debug:main new fully merged portvariants:
328:debug:main Changing to port directory: /opt/local/var/macports/sources/rsync.macports.org/release/tarballs/ports/x11/xorg-libXau
329:debug:main OS darwin/16.1.0 (Mac OS X 10.12) arch i386
330:debug:main adding the default universal variant
331:debug:main Reading variant descriptions from /opt/local/var/macports/sources/rsync.macports.org/release/tarballs/ports/_resources/port1.0/variant_descriptions.conf
332:debug:main Running callback portconfigure::add_automatic_compiler_dependencies
333:debug:main Finished running callback portconfigure::add_automatic_compiler_dependencies
334:debug:main Running callback portbuild::add_automatic_buildsystem_dependencies
335:debug:main Finished running callback portbuild::add_automatic_buildsystem_dependencies
336:debug:main No need to upgrade! xorg-libXau 1.0.8_0 >= xorg-libXau 1.0.8_0
337:debug:main epoch: in tree: 0 installed: 0
338:debug:main xorg-xproto 7.0.31_0 exists in the ports tree
339:debug:main xorg-xproto 7.0.31_0  is the latest installed
340:debug:main xorg-xproto 7.0.31_0  is active
341:debug:main Merging existing variants '' into variants
342:debug:main new fully merged portvariants:
343:debug:main Changing to port directory: /opt/local/var/macports/sources/rsync.macports.org/release/tarballs/ports/x11/xorg-xproto
344:debug:main OS darwin/16.1.0 (Mac OS X 10.12) arch i386
345:debug:main only one arch supported, so not adding the default universal variant
346:debug:main Running callback portconfigure::add_automatic_compiler_dependencies
347:debug:main Finished running callback portconfigure::add_automatic_compiler_dependencies
348:debug:main Running callback portbuild::add_automatic_buildsystem_dependencies
349:debug:main Finished running callback portbuild::add_automatic_buildsystem_dependencies
350:debug:main No need to upgrade! xorg-xproto 7.0.31_0 >= xorg-xproto 7.0.31_0
351:debug:main epoch: in tree: 0 installed: 0
352:debug:main xorg-libXdmcp 1.1.2_0 exists in the ports tree
353:debug:main xorg-libXdmcp 1.1.2_0  is the latest installed
354:debug:main xorg-libXdmcp 1.1.2_0  is active
355:debug:main Merging existing variants '' into variants
356:debug:main new fully merged portvariants:
357:debug:main Changing to port directory: /opt/local/var/macports/sources/rsync.macports.org/release/tarballs/ports/x11/xorg-libXdmcp
358:debug:main OS darwin/16.1.0 (Mac OS X 10.12) arch i386
359:debug:main adding the default universal variant
360:debug:main Reading variant descriptions from /opt/local/var/macports/sources/rsync.macports.org/release/tarballs/ports/_resources/port1.0/variant_descriptions.conf
361:debug:main Running callback portconfigure::add_automatic_compiler_dependencies
362:debug:main Finished running callback portconfigure::add_automatic_compiler_dependencies
363:debug:main Running callback portbuild::add_automatic_buildsystem_dependencies
364:debug:main Finished running callback portbuild::add_automatic_buildsystem_dependencies
365:debug:main No need to upgrade! xorg-libXdmcp 1.1.2_0 >= xorg-libXdmcp 1.1.2_0
366:debug:main epoch: in tree: 0 installed: 0
367:debug:main xorg-xcb-proto 1.12_1 exists in the ports tree
368:debug:main xorg-xcb-proto 1.12_1 +python27 is the latest installed
369:debug:main xorg-xcb-proto 1.12_1 +python27 is active
370:debug:main Merging existing variants '+python27' into variants
371:debug:main new fully merged portvariants: python27 +
372:debug:main Changing to port directory: /opt/local/var/macports/sources/rsync.macports.org/release/tarballs/ports/x11/xorg-xcb-proto
373:debug:main OS darwin/16.1.0 (Mac OS X 10.12) arch i386
374:debug:main only one arch supported, so not adding the default universal variant
375:debug:main Executing variant python27 provides python27
376:debug:main Running callback portconfigure::add_automatic_compiler_dependencies
377:debug:main Finished running callback portconfigure::add_automatic_compiler_dependencies
378:debug:main Running callback portbuild::add_automatic_buildsystem_dependencies
379:debug:main Finished running callback portbuild::add_automatic_buildsystem_dependencies
380:debug:main No need to upgrade! xorg-xcb-proto 1.12_1 >= xorg-xcb-proto 1.12_1
381:debug:main epoch: in tree: 2 installed: 2
382:debug:main python27 2.7.12_2 exists in the ports tree
383:debug:main python27 2.7.12_2  is the latest installed
384:debug:main python27 2.7.12_2  is active
385:debug:main Merging existing variants '' into variants
386:debug:main new fully merged portvariants:
387:debug:main Changing to port directory: /opt/local/var/macports/sources/rsync.macports.org/release/tarballs/ports/lang/python27
388:debug:main OS darwin/16.1.0 (Mac OS X 10.12) arch i386
389:debug:main Sourcing PortGroup select 1.0 from /opt/local/var/macports/sources/rsync.macports.org/release/tarballs/ports/_resources/port1.0/group/select-1.0.tcl
390:debug:main Reading variant descriptions from /opt/local/var/macports/sources/rsync.macports.org/release/tarballs/ports/_resources/port1.0/variant_descriptions.conf
391:debug:main universal variant already exists, so not adding the default one
392:debug:main Running callback portconfigure::add_automatic_compiler_dependencies
393:debug:main Finished running callback portconfigure::add_automatic_compiler_dependencies
394:debug:main Running callback portbuild::add_automatic_buildsystem_dependencies
395:debug:main Finished running callback portbuild::add_automatic_buildsystem_dependencies
396:debug:main No need to upgrade! python27 2.7.12_2 >= python27 2.7.12_2
397:debug:main epoch: in tree: 1 installed: 1
398:debug:main openssl 1.0.2j_0 exists in the ports tree
399:debug:main openssl 1.0.2j_0  is the latest installed
400:debug:main openssl 1.0.2j_0  is active
401:debug:main Merging existing variants '' into variants
402:debug:main new fully merged portvariants:
403:debug:main Changing to port directory: /opt/local/var/macports/sources/rsync.macports.org/release/tarballs/ports/devel/openssl
404:debug:main OS darwin/16.1.0 (Mac OS X 10.12) arch i386
405:debug:main Reading variant descriptions from /opt/local/var/macports/sources/rsync.macports.org/release/tarballs/ports/_resources/port1.0/variant_descriptions.conf
406:debug:main Sourcing PortGroup muniversal 1.0 from /opt/local/var/macports/sources/rsync.macports.org/release/tarballs/ports/_resources/port1.0/group/muniversal-1.0.tcl
407:debug:main universal variant already exists, so not adding the default one
408:debug:main Running callback portconfigure::add_automatic_compiler_dependencies
409:debug:main Finished running callback portconfigure::add_automatic_compiler_dependencies
410:debug:main Running callback portbuild::add_automatic_buildsystem_dependencies
411:debug:main Finished running callback portbuild::add_automatic_buildsystem_dependencies
412:debug:main No need to upgrade! openssl 1.0.2j_0 >= openssl 1.0.2j_0
413:debug:main epoch: in tree: 0 installed: 0
414:debug:main sqlite3 3.15.1_1 exists in the ports tree
415:debug:main sqlite3 3.15.1_1  is the latest installed
416:debug:main sqlite3 3.15.1_1  is active
417:debug:main Merging existing variants '' into variants
418:debug:main new fully merged portvariants:
419:debug:main Changing to port directory: /opt/local/var/macports/sources/rsync.macports.org/release/tarballs/ports/databases/sqlite3
420:debug:main OS darwin/16.1.0 (Mac OS X 10.12) arch i386
421:debug:main adding the default universal variant
422:debug:main Reading variant descriptions from /opt/local/var/macports/sources/rsync.macports.org/release/tarballs/ports/_resources/port1.0/variant_descriptions.conf
423:debug:main Running callback portconfigure::add_automatic_compiler_dependencies
424:debug:main Finished running callback portconfigure::add_automatic_compiler_dependencies
425:debug:main Running callback portbuild::add_automatic_buildsystem_dependencies
426:debug:main Finished running callback portbuild::add_automatic_buildsystem_dependencies
427:debug:main No need to upgrade! sqlite3 3.15.1_1 >= sqlite3 3.15.1_1
428:debug:main epoch: in tree: 20090923 installed: 20090923
429:debug:main libedit 20160618-3.1_1 exists in the ports tree
430:debug:main libedit 20160618-3.1_1  is the latest installed
431:debug:main libedit 20160618-3.1_1  is active
432:debug:main Merging existing variants '' into variants
433:debug:main new fully merged portvariants:
434:debug:main Changing to port directory: /opt/local/var/macports/sources/rsync.macports.org/release/tarballs/ports/devel/libedit
435:debug:main OS darwin/16.1.0 (Mac OS X 10.12) arch i386
436:debug:main Reading variant descriptions from /opt/local/var/macports/sources/rsync.macports.org/release/tarballs/ports/_resources/port1.0/variant_descriptions.conf
437:debug:main Sourcing PortGroup muniversal 1.0 from /opt/local/var/macports/sources/rsync.macports.org/release/tarballs/ports/_resources/port1.0/group/muniversal-1.0.tcl
438:debug:main universal variant already exists, so not adding the default one
439:debug:main Running callback portconfigure::add_automatic_compiler_dependencies
440:debug:main Finished running callback portconfigure::add_automatic_compiler_dependencies
441:debug:main Running callback portbuild::add_automatic_buildsystem_dependencies
442:debug:main Finished running callback portbuild::add_automatic_buildsystem_dependencies
443:debug:main No need to upgrade! libedit 20160618-3.1_1 >= libedit 20160618-3.1_1
444:debug:main epoch: in tree: 0 installed: 0
445:debug:main readline 6.3.003_1 exists in the ports tree
446:debug:main readline 6.3.003_1  is the latest installed
447:debug:main readline 6.3.003_1  is active
448:debug:main Merging existing variants '' into variants
449:debug:main new fully merged portvariants:
450:debug:main Changing to port directory: /opt/local/var/macports/sources/rsync.macports.org/release/tarballs/ports/devel/readline
451:debug:main OS darwin/16.1.0 (Mac OS X 10.12) arch i386
452:debug:main Reading variant descriptions from /opt/local/var/macports/sources/rsync.macports.org/release/tarballs/ports/_resources/port1.0/variant_descriptions.conf
453:debug:main Sourcing PortGroup muniversal 1.0 from /opt/local/var/macports/sources/rsync.macports.org/release/tarballs/ports/_resources/port1.0/group/muniversal-1.0.tcl
454:debug:main universal variant already exists, so not adding the default one
455:debug:main Running callback portconfigure::add_automatic_compiler_dependencies
456:debug:main Finished running callback portconfigure::add_automatic_compiler_dependencies
457:debug:main Running callback portbuild::add_automatic_buildsystem_dependencies
458:debug:main Finished running callback portbuild::add_automatic_buildsystem_dependencies
459:debug:main No need to upgrade! readline 6.3.003_1 >= readline 6.3.003_1
460:debug:main epoch: in tree: 0 installed: 0
461:debug:main db48 4.8.30_4 exists in the ports tree
462:debug:main db48 4.8.30_4  is the latest installed
463:debug:main db48 4.8.30_4  is active
464:debug:main Merging existing variants '' into variants
465:debug:main new fully merged portvariants:
466:debug:main Changing to port directory: /opt/local/var/macports/sources/rsync.macports.org/release/tarballs/ports/databases/db48
467:debug:main OS darwin/16.1.0 (Mac OS X 10.12) arch i386
468:debug:main Reading variant descriptions from /opt/local/var/macports/sources/rsync.macports.org/release/tarballs/ports/_resources/port1.0/variant_descriptions.conf
469:debug:main Sourcing PortGroup muniversal 1.0 from /opt/local/var/macports/sources/rsync.macports.org/release/tarballs/ports/_resources/port1.0/group/muniversal-1.0.tcl
470:debug:main universal variant already exists, so not adding the default one
471:debug:main Running callback portconfigure::add_automatic_compiler_dependencies
472:debug:main Finished running callback portconfigure::add_automatic_compiler_dependencies
473:debug:main Running callback portbuild::add_automatic_buildsystem_dependencies
474:debug:main Finished running callback portbuild::add_automatic_buildsystem_dependencies
475:debug:main No need to upgrade! db48 4.8.30_4 >= db48 4.8.30_4
476:debug:main epoch: in tree: 0 installed: 0
477:debug:main bzip2 1.0.6_0 exists in the ports tree
478:debug:main bzip2 1.0.6_0  is the latest installed
479:debug:main bzip2 1.0.6_0  is active
480:debug:main Merging existing variants '' into variants
481:debug:main new fully merged portvariants:
482:debug:main Changing to port directory: /opt/local/var/macports/sources/rsync.macports.org/release/tarballs/ports/archivers/bzip2
483:debug:main OS darwin/16.1.0 (Mac OS X 10.12) arch i386
484:debug:main Reading variant descriptions from /opt/local/var/macports/sources/rsync.macports.org/release/tarballs/ports/_resources/port1.0/variant_descriptions.conf
485:debug:main universal variant already exists, so not adding the default one
486:debug:main Running callback portconfigure::add_automatic_compiler_dependencies
487:debug:main Finished running callback portconfigure::add_automatic_compiler_dependencies
488:debug:main Running callback portbuild::add_automatic_buildsystem_dependencies
489:debug:main Finished running callback portbuild::add_automatic_buildsystem_dependencies
490:debug:main No need to upgrade! bzip2 1.0.6_0 >= bzip2 1.0.6_0
491:debug:main epoch: in tree: 0 installed: 0
492:debug:main python_select 0.3_7 exists in the ports tree
493:debug:main python_select 0.3_7  is the latest installed
494:debug:main python_select 0.3_7  is active
495:debug:main Merging existing variants '' into variants
496:debug:main new fully merged portvariants:
497:debug:main Changing to port directory: /opt/local/var/macports/sources/rsync.macports.org/release/tarballs/ports/sysutils/python_select
498:debug:main OS darwin/16.1.0 (Mac OS X 10.12) arch i386
499:debug:main Sourcing PortGroup select 1.0 from /opt/local/var/macports/sources/rsync.macports.org/release/tarballs/ports/_resources/port1.0/group/select-1.0.tcl
500:debug:main universal_variant is false, so not adding the default universal variant
501:debug:main Running callback portconfigure::add_automatic_compiler_dependencies
502:debug:main Finished running callback portconfigure::add_automatic_compiler_dependencies
503:debug:main Running callback portbuild::add_automatic_buildsystem_dependencies
504:debug:main Finished running callback portbuild::add_automatic_buildsystem_dependencies
505:debug:main No need to upgrade! python_select 0.3_7 >= python_select 0.3_7
506:debug:main epoch: in tree: 0 installed: 0
507:debug:main python2_select 0.0_2 exists in the ports tree
508:debug:main python2_select 0.0_2  is the latest installed
509:debug:main python2_select 0.0_2  is active
510:debug:main Merging existing variants '' into variants
511:debug:main new fully merged portvariants:
512:debug:main Changing to port directory: /opt/local/var/macports/sources/rsync.macports.org/release/tarballs/ports/sysutils/python2_select
513:debug:main OS darwin/16.1.0 (Mac OS X 10.12) arch i386
514:debug:main Sourcing PortGroup select 1.0 from /opt/local/var/macports/sources/rsync.macports.org/release/tarballs/ports/_resources/port1.0/group/select-1.0.tcl
515:debug:main universal_variant is false, so not adding the default universal variant
516:debug:main Running callback portconfigure::add_automatic_compiler_dependencies
517:debug:main Finished running callback portconfigure::add_automatic_compiler_dependencies
518:debug:main Running callback portbuild::add_automatic_buildsystem_dependencies
519:debug:main Finished running callback portbuild::add_automatic_buildsystem_dependencies
520:debug:main No need to upgrade! python2_select 0.0_2 >= python2_select 0.0_2
521:debug:main epoch: in tree: 0 installed: 0
522:debug:main libxml2 2.9.4_0 exists in the ports tree
523:debug:main libxml2 2.9.4_0  is the latest installed
524:debug:main libxml2 2.9.4_0  is active
525:debug:main Merging existing variants '' into variants
526:debug:main new fully merged portvariants:
527:debug:main Changing to port directory: /opt/local/var/macports/sources/rsync.macports.org/release/tarballs/ports/textproc/libxml2
528:debug:main OS darwin/16.1.0 (Mac OS X 10.12) arch i386
529:debug:main adding the default universal variant
530:debug:main Reading variant descriptions from /opt/local/var/macports/sources/rsync.macports.org/release/tarballs/ports/_resources/port1.0/variant_descriptions.conf
531:debug:main Running callback portconfigure::add_automatic_compiler_dependencies
532:debug:main Finished running callback portconfigure::add_automatic_compiler_dependencies
533:debug:main Running callback portbuild::add_automatic_buildsystem_dependencies
534:debug:main Finished running callback portbuild::add_automatic_buildsystem_dependencies
535:debug:main No need to upgrade! libxml2 2.9.4_0 >= libxml2 2.9.4_0
536:debug:main epoch: in tree: 0 installed: 0
537:debug:main xorg-libpthread-stubs 0.3_0 exists in the ports tree
538:debug:main xorg-libpthread-stubs 0.3_0  is the latest installed
539:debug:main xorg-libpthread-stubs 0.3_0  is active
540:debug:main Merging existing variants '' into variants
541:debug:main new fully merged portvariants:
542:debug:main Changing to port directory: /opt/local/var/macports/sources/rsync.macports.org/release/tarballs/ports/x11/xorg-libpthread-stubs
543:debug:main OS darwin/16.1.0 (Mac OS X 10.12) arch i386
544:debug:main only one arch supported, so not adding the default universal variant
545:debug:main Running callback portconfigure::add_automatic_compiler_dependencies
546:debug:main Finished running callback portconfigure::add_automatic_compiler_dependencies
547:debug:main Running callback portbuild::add_automatic_buildsystem_dependencies
548:debug:main Finished running callback portbuild::add_automatic_buildsystem_dependencies
549:debug:main No need to upgrade! xorg-libpthread-stubs 0.3_0 >= xorg-libpthread-stubs 0.3_0
550:debug:main epoch: in tree: 0 installed: 0
551:debug:main xorg-libX11 1.6.4_0 exists in the ports tree
552:debug:main xorg-libX11 1.6.4_0  is the latest installed
553:debug:main xorg-libX11 1.6.4_0  is active
554:debug:main Merging existing variants '' into variants
555:debug:main new fully merged portvariants:
556:debug:main Changing to port directory: /opt/local/var/macports/sources/rsync.macports.org/release/tarballs/ports/x11/xorg-libX11
557:debug:main OS darwin/16.1.0 (Mac OS X 10.12) arch i386
558:debug:main adding the default universal variant
559:debug:main Reading variant descriptions from /opt/local/var/macports/sources/rsync.macports.org/release/tarballs/ports/_resources/port1.0/variant_descriptions.conf
560:debug:main Running callback portconfigure::add_automatic_compiler_dependencies
561:debug:main Finished running callback portconfigure::add_automatic_compiler_dependencies
562:debug:main Running callback portbuild::add_automatic_buildsystem_dependencies
563:debug:main Finished running callback portbuild::add_automatic_buildsystem_dependencies
564:debug:main No need to upgrade! xorg-libX11 1.6.4_0 >= xorg-libX11 1.6.4_0
565:debug:main epoch: in tree: 0 installed: 0
566:debug:main xorg-kbproto 1.0.7_0 exists in the ports tree
567:debug:main xorg-kbproto 1.0.7_0  is the latest installed
568:debug:main xorg-kbproto 1.0.7_0  is active
569:debug:main Merging existing variants '' into variants
570:debug:main new fully merged portvariants:
571:debug:main Changing to port directory: /opt/local/var/macports/sources/rsync.macports.org/release/tarballs/ports/x11/xorg-kbproto
572:debug:main OS darwin/16.1.0 (Mac OS X 10.12) arch i386
573:debug:main only one arch supported, so not adding the default universal variant
574:debug:main Running callback portconfigure::add_automatic_compiler_dependencies
575:debug:main Finished running callback portconfigure::add_automatic_compiler_dependencies
576:debug:main Running callback portbuild::add_automatic_buildsystem_dependencies
577:debug:main Finished running callback portbuild::add_automatic_buildsystem_dependencies
578:debug:main No need to upgrade! xorg-kbproto 1.0.7_0 >= xorg-kbproto 1.0.7_0
579:debug:main epoch: in tree: 0 installed: 0
580:debug:main xorg-libXext 1.3.3_0 exists in the ports tree
581:debug:main xorg-libXext 1.3.3_0  is the latest installed
582:debug:main xorg-libXext 1.3.3_0  is active
583:debug:main Merging existing variants '' into variants
584:debug:main new fully merged portvariants:
585:debug:main Changing to port directory: /opt/local/var/macports/sources/rsync.macports.org/release/tarballs/ports/x11/xorg-libXext
586:debug:main OS darwin/16.1.0 (Mac OS X 10.12) arch i386
587:debug:main adding the default universal variant
588:debug:main Reading variant descriptions from /opt/local/var/macports/sources/rsync.macports.org/release/tarballs/ports/_resources/port1.0/variant_descriptions.conf
589:debug:main Running callback portconfigure::add_automatic_compiler_dependencies
590:debug:main Finished running callback portconfigure::add_automatic_compiler_dependencies
591:debug:main Running callback portbuild::add_automatic_buildsystem_dependencies
592:debug:main Finished running callback portbuild::add_automatic_buildsystem_dependencies
593:debug:main No need to upgrade! xorg-libXext 1.3.3_0 >= xorg-libXext 1.3.3_0
594:debug:main epoch: in tree: 0 installed: 0
595:debug:main xorg-xextproto 7.3.0_0 exists in the ports tree
596:debug:main xorg-xextproto 7.3.0_0  is the latest installed
597:debug:main xorg-xextproto 7.3.0_0  is active
598:debug:main Merging existing variants '' into variants
599:debug:main new fully merged portvariants:
600:debug:main Changing to port directory: /opt/local/var/macports/sources/rsync.macports.org/release/tarballs/ports/x11/xorg-xextproto
601:debug:main OS darwin/16.1.0 (Mac OS X 10.12) arch i386
602:debug:main only one arch supported, so not adding the default universal variant
603:debug:main Running callback portconfigure::add_automatic_compiler_dependencies
604:debug:main Finished running callback portconfigure::add_automatic_compiler_dependencies
605:debug:main Running callback portbuild::add_automatic_buildsystem_dependencies
606:debug:main Finished running callback portbuild::add_automatic_buildsystem_dependencies
607:debug:main No need to upgrade! xorg-xextproto 7.3.0_0 >= xorg-xextproto 7.3.0_0
608:debug:main epoch: in tree: 0 installed: 0
609:debug:main xorg-libXdamage 1.1.4_0 exists in the ports tree
610:debug:main xorg-libXdamage 1.1.4_0  is the latest installed
611:debug:main xorg-libXdamage 1.1.4_0  is active
612:debug:main Merging existing variants '' into variants
613:debug:main new fully merged portvariants:
614:debug:main Changing to port directory: /opt/local/var/macports/sources/rsync.macports.org/release/tarballs/ports/x11/xorg-libXdamage
615:debug:main OS darwin/16.1.0 (Mac OS X 10.12) arch i386
616:debug:main adding the default universal variant
617:debug:main Reading variant descriptions from /opt/local/var/macports/sources/rsync.macports.org/release/tarballs/ports/_resources/port1.0/variant_descriptions.conf
618:debug:main Running callback portconfigure::add_automatic_compiler_dependencies
619:debug:main Finished running callback portconfigure::add_automatic_compiler_dependencies
620:debug:main Running callback portbuild::add_automatic_buildsystem_dependencies
621:debug:main Finished running callback portbuild::add_automatic_buildsystem_dependencies
622:debug:main No need to upgrade! xorg-libXdamage 1.1.4_0 >= xorg-libXdamage 1.1.4_0
623:debug:main epoch: in tree: 0 installed: 0
624:debug:main xorg-libXfixes 5.0.3_0 exists in the ports tree
625:debug:main xorg-libXfixes 5.0.3_0  is the latest installed
626:debug:main xorg-libXfixes 5.0.3_0  is active
627:debug:main Merging existing variants '' into variants
628:debug:main new fully merged portvariants:
629:debug:main Changing to port directory: /opt/local/var/macports/sources/rsync.macports.org/release/tarballs/ports/x11/xorg-libXfixes
630:debug:main OS darwin/16.1.0 (Mac OS X 10.12) arch i386
631:debug:main adding the default universal variant
632:debug:main Reading variant descriptions from /opt/local/var/macports/sources/rsync.macports.org/release/tarballs/ports/_resources/port1.0/variant_descriptions.conf
633:debug:main Running callback portconfigure::add_automatic_compiler_dependencies
634:debug:main Finished running callback portconfigure::add_automatic_compiler_dependencies
635:debug:main Running callback portbuild::add_automatic_buildsystem_dependencies
636:debug:main Finished running callback portbuild::add_automatic_buildsystem_dependencies
637:debug:main No need to upgrade! xorg-libXfixes 5.0.3_0 >= xorg-libXfixes 5.0.3_0
638:debug:main epoch: in tree: 0 installed: 0
639:debug:main xorg-fixesproto 5.0_0 exists in the ports tree
640:debug:main xorg-fixesproto 5.0_0  is the latest installed
641:debug:main xorg-fixesproto 5.0_0  is active
642:debug:main Merging existing variants '' into variants
643:debug:main new fully merged portvariants:
644:debug:main Changing to port directory: /opt/local/var/macports/sources/rsync.macports.org/release/tarballs/ports/x11/xorg-fixesproto
645:debug:main OS darwin/16.1.0 (Mac OS X 10.12) arch i386
646:debug:main only one arch supported, so not adding the default universal variant
647:debug:main Running callback portconfigure::add_automatic_compiler_dependencies
648:debug:main Finished running callback portconfigure::add_automatic_compiler_dependencies
649:debug:main Running callback portbuild::add_automatic_buildsystem_dependencies
650:debug:main Finished running callback portbuild::add_automatic_buildsystem_dependencies
651:debug:main No need to upgrade! xorg-fixesproto 5.0_0 >= xorg-fixesproto 5.0_0
652:debug:main epoch: in tree: 0 installed: 0
653:debug:main xorg-damageproto 1.2.1_0 exists in the ports tree
654:debug:main xorg-damageproto 1.2.1_0  is the latest installed
655:debug:main xorg-damageproto 1.2.1_0  is active
656:debug:main Merging existing variants '' into variants
657:debug:main new fully merged portvariants:
658:debug:main Changing to port directory: /opt/local/var/macports/sources/rsync.macports.org/release/tarballs/ports/x11/xorg-damageproto
659:debug:main OS darwin/16.1.0 (Mac OS X 10.12) arch i386
660:debug:main only one arch supported, so not adding the default universal variant
661:debug:main Running callback portconfigure::add_automatic_compiler_dependencies
662:debug:main Finished running callback portconfigure::add_automatic_compiler_dependencies
663:debug:main Running callback portbuild::add_automatic_buildsystem_dependencies
664:debug:main Finished running callback portbuild::add_automatic_buildsystem_dependencies
665:debug:main No need to upgrade! xorg-damageproto 1.2.1_0 >= xorg-damageproto 1.2.1_0
666:debug:main epoch: in tree: 0 installed: 0
667:debug:main xorg-libXi 1.7.8_0 exists in the ports tree
668:debug:main xorg-libXi 1.7.8_0  is the latest installed
669:debug:main xorg-libXi 1.7.8_0  is active
670:debug:main Merging existing variants '' into variants
671:debug:main new fully merged portvariants:
672:debug:main Changing to port directory: /opt/local/var/macports/sources/rsync.macports.org/release/tarballs/ports/x11/xorg-libXi
673:debug:main OS darwin/16.1.0 (Mac OS X 10.12) arch i386
674:debug:main adding the default universal variant
675:debug:main Reading variant descriptions from /opt/local/var/macports/sources/rsync.macports.org/release/tarballs/ports/_resources/port1.0/variant_descriptions.conf
676:debug:main Running callback portconfigure::add_automatic_compiler_dependencies
677:debug:main Finished running callback portconfigure::add_automatic_compiler_dependencies
678:debug:main Running callback portbuild::add_automatic_buildsystem_dependencies
679:debug:main Finished running callback portbuild::add_automatic_buildsystem_dependencies
680:debug:main No need to upgrade! xorg-libXi 1.7.8_0 >= xorg-libXi 1.7.8_0
681:debug:main epoch: in tree: 0 installed: 0
682:debug:main xorg-inputproto 2.3.2_0 exists in the ports tree
683:debug:main xorg-inputproto 2.3.2_0  is the latest installed
684:debug:main xorg-inputproto 2.3.2_0  is active
685:debug:main Merging existing variants '' into variants
686:debug:main new fully merged portvariants:
687:debug:main Changing to port directory: /opt/local/var/macports/sources/rsync.macports.org/release/tarballs/ports/x11/xorg-inputproto
688:debug:main OS darwin/16.1.0 (Mac OS X 10.12) arch i386
689:debug:main only one arch supported, so not adding the default universal variant
690:debug:main Running callback portconfigure::add_automatic_compiler_dependencies
691:debug:main Finished running callback portconfigure::add_automatic_compiler_dependencies
692:debug:main Running callback portbuild::add_automatic_buildsystem_dependencies
693:debug:main Finished running callback portbuild::add_automatic_buildsystem_dependencies
694:debug:main No need to upgrade! xorg-inputproto 2.3.2_0 >= xorg-inputproto 2.3.2_0
695:debug:main epoch: in tree: 0 installed: 0
696:debug:main xorg-libXmu 1.1.2_0 exists in the ports tree
697:debug:main xorg-libXmu 1.1.2_0  is the latest installed
698:debug:main xorg-libXmu 1.1.2_0  is active
699:debug:main Merging existing variants '' into variants
700:debug:main new fully merged portvariants:
701:debug:main Changing to port directory: /opt/local/var/macports/sources/rsync.macports.org/release/tarballs/ports/x11/xorg-libXmu
702:debug:main OS darwin/16.1.0 (Mac OS X 10.12) arch i386
703:debug:main adding the default universal variant
704:debug:main Reading variant descriptions from /opt/local/var/macports/sources/rsync.macports.org/release/tarballs/ports/_resources/port1.0/variant_descriptions.conf
705:debug:main Running callback portconfigure::add_automatic_compiler_dependencies
706:debug:main Finished running callback portconfigure::add_automatic_compiler_dependencies
707:debug:main Running callback portbuild::add_automatic_buildsystem_dependencies
708:debug:main Finished running callback portbuild::add_automatic_buildsystem_dependencies
709:debug:main No need to upgrade! xorg-libXmu 1.1.2_0 >= xorg-libXmu 1.1.2_0
710:debug:main epoch: in tree: 0 installed: 0
711:debug:main xorg-libXt 1.1.5_1 exists in the ports tree
712:debug:main xorg-libXt 1.1.5_1  is the latest installed
713:debug:main xorg-libXt 1.1.5_1  is active
714:debug:main Merging existing variants '' into variants
715:debug:main new fully merged portvariants:
716:debug:main Changing to port directory: /opt/local/var/macports/sources/rsync.macports.org/release/tarballs/ports/x11/xorg-libXt
717:debug:main OS darwin/16.1.0 (Mac OS X 10.12) arch i386
718:debug:main adding the default universal variant
719:debug:main Reading variant descriptions from /opt/local/var/macports/sources/rsync.macports.org/release/tarballs/ports/_resources/port1.0/variant_descriptions.conf
720:debug:main Running callback portconfigure::add_automatic_compiler_dependencies
721:debug:main Finished running callback portconfigure::add_automatic_compiler_dependencies
722:debug:main Running callback portbuild::add_automatic_buildsystem_dependencies
723:debug:main Finished running callback portbuild::add_automatic_buildsystem_dependencies
724:debug:main No need to upgrade! xorg-libXt 1.1.5_1 >= xorg-libXt 1.1.5_1
725:debug:main epoch: in tree: 0 installed: 0
726:debug:main xorg-libsm 1.2.1_0 exists in the ports tree
727:debug:main xorg-libsm 1.2.1_0  is the latest installed
728:debug:main xorg-libsm 1.2.1_0  is active
729:debug:main Merging existing variants '' into variants
730:debug:main new fully merged portvariants:
731:debug:main Changing to port directory: /opt/local/var/macports/sources/rsync.macports.org/release/tarballs/ports/x11/xorg-libsm
732:debug:main OS darwin/16.1.0 (Mac OS X 10.12) arch i386
733:debug:main adding the default universal variant
734:debug:main Reading variant descriptions from /opt/local/var/macports/sources/rsync.macports.org/release/tarballs/ports/_resources/port1.0/variant_descriptions.conf
735:debug:main Running callback portconfigure::add_automatic_compiler_dependencies
736:debug:main Finished running callback portconfigure::add_automatic_compiler_dependencies
737:debug:main Running callback portbuild::add_automatic_buildsystem_dependencies
738:debug:main Finished running callback portbuild::add_automatic_buildsystem_dependencies
739:debug:main No need to upgrade! xorg-libsm 1.2.1_0 >= xorg-libsm 1.2.1_0
740:debug:main epoch: in tree: 0 installed: 0
741:debug:main xorg-libice 1.0.9_0 exists in the ports tree
742:debug:main xorg-libice 1.0.9_0  is the latest installed
743:debug:main xorg-libice 1.0.9_0  is active
744:debug:main Merging existing variants '' into variants
745:debug:main new fully merged portvariants:
746:debug:main Changing to port directory: /opt/local/var/macports/sources/rsync.macports.org/release/tarballs/ports/x11/xorg-libice
747:debug:main OS darwin/16.1.0 (Mac OS X 10.12) arch i386
748:debug:main adding the default universal variant
749:debug:main Reading variant descriptions from /opt/local/var/macports/sources/rsync.macports.org/release/tarballs/ports/_resources/port1.0/variant_descriptions.conf
750:debug:main Running callback portconfigure::add_automatic_compiler_dependencies
751:debug:main Finished running callback portconfigure::add_automatic_compiler_dependencies
752:debug:main Running callback portbuild::add_automatic_buildsystem_dependencies
753:debug:main Finished running callback portbuild::add_automatic_buildsystem_dependencies
754:debug:main No need to upgrade! xorg-libice 1.0.9_0 >= xorg-libice 1.0.9_0
755:debug:main epoch: in tree: 0 installed: 0
756:debug:main xorg-libXxf86vm 1.1.4_0 exists in the ports tree
757:debug:main xorg-libXxf86vm 1.1.4_0  is the latest installed
758:debug:main xorg-libXxf86vm 1.1.4_0  is active
759:debug:main Merging existing variants '' into variants
760:debug:main new fully merged portvariants:
761:debug:main Changing to port directory: /opt/local/var/macports/sources/rsync.macports.org/release/tarballs/ports/x11/xorg-libXxf86vm
762:debug:main OS darwin/16.1.0 (Mac OS X 10.12) arch i386
763:debug:main adding the default universal variant
764:debug:main Reading variant descriptions from /opt/local/var/macports/sources/rsync.macports.org/release/tarballs/ports/_resources/port1.0/variant_descriptions.conf
765:debug:main Running callback portconfigure::add_automatic_compiler_dependencies
766:debug:main Finished running callback portconfigure::add_automatic_compiler_dependencies
767:debug:main Running callback portbuild::add_automatic_buildsystem_dependencies
768:debug:main Finished running callback portbuild::add_automatic_buildsystem_dependencies
769:debug:main No need to upgrade! xorg-libXxf86vm 1.1.4_0 >= xorg-libXxf86vm 1.1.4_0
770:debug:main epoch: in tree: 0 installed: 0
771:debug:main xorg-xf86vidmodeproto 2.3.1_0 exists in the ports tree
772:debug:main xorg-xf86vidmodeproto 2.3.1_0  is the latest installed
773:debug:main xorg-xf86vidmodeproto 2.3.1_0  is active
774:debug:main Merging existing variants '' into variants
775:debug:main new fully merged portvariants:
776:debug:main Changing to port directory: /opt/local/var/macports/sources/rsync.macports.org/release/tarballs/ports/x11/xorg-xf86vidmodeproto
777:debug:main OS darwin/16.1.0 (Mac OS X 10.12) arch i386
778:debug:main only one arch supported, so not adding the default universal variant
779:debug:main Running callback portconfigure::add_automatic_compiler_dependencies
780:debug:main Finished running callback portconfigure::add_automatic_compiler_dependencies
781:debug:main Running callback portbuild::add_automatic_buildsystem_dependencies
782:debug:main Finished running callback portbuild::add_automatic_buildsystem_dependencies
783:debug:main No need to upgrade! xorg-xf86vidmodeproto 2.3.1_0 >= xorg-xf86vidmodeproto 2.3.1_0
784:debug:main epoch: in tree: 0 installed: 0
785:debug:main curl 7.51.0_1 exists in the ports tree
786:debug:main curl 7.51.0_1 +ssl is the latest installed
787:debug:main curl 7.51.0_1 +ssl is active
788:debug:main Merging existing variants '+ssl' into variants
789:debug:main new fully merged portvariants: ssl +
790:debug:main Changing to port directory: /opt/local/var/macports/sources/rsync.macports.org/release/tarballs/ports/net/curl
791:debug:main OS darwin/16.1.0 (Mac OS X 10.12) arch i386
792:debug:main Reading variant descriptions from /opt/local/var/macports/sources/rsync.macports.org/release/tarballs/ports/_resources/port1.0/variant_descriptions.conf
793:debug:main Sourcing PortGroup muniversal 1.0 from /opt/local/var/macports/sources/rsync.macports.org/release/tarballs/ports/_resources/port1.0/group/muniversal-1.0.tcl
794:debug:main universal variant already exists, so not adding the default one
795:debug:main Executing variant ssl provides ssl
796:debug:main Running callback portconfigure::add_automatic_compiler_dependencies
797:debug:main Finished running callback portconfigure::add_automatic_compiler_dependencies
798:debug:main Running callback portbuild::add_automatic_buildsystem_dependencies
799:debug:main Finished running callback portbuild::add_automatic_buildsystem_dependencies
800:debug:main No need to upgrade! curl 7.51.0_1 >= curl 7.51.0_1
801:debug:main epoch: in tree: 0 installed: 0
802:debug:main curl-ca-bundle 7.51.0_0 exists in the ports tree
803:debug:main curl-ca-bundle 7.51.0_0  is the latest installed
804:debug:main curl-ca-bundle 7.51.0_0  is active
805:debug:main Merging existing variants '' into variants
806:debug:main new fully merged portvariants:
807:debug:main Changing to port directory: /opt/local/var/macports/sources/rsync.macports.org/release/tarballs/ports/net/curl
808:debug:main OS darwin/16.1.0 (Mac OS X 10.12) arch i386
809:debug:main universal_variant is false, so not adding the default universal variant
810:debug:main Running callback portconfigure::add_automatic_compiler_dependencies
811:debug:main Finished running callback portconfigure::add_automatic_compiler_dependencies
812:debug:main Running callback portbuild::add_automatic_buildsystem_dependencies
813:debug:main Finished running callback portbuild::add_automatic_buildsystem_dependencies
814:debug:main No need to upgrade! curl-ca-bundle 7.51.0_0 >= curl-ca-bundle 7.51.0_0
815:msg:main --->  Computing dependencies for couchdb:info:main .:debug:main Checking for conflicts against couchdb
816:debug:main Searching for dependency: couchdb-devel
817:debug:main Didn't find receipt, going to depspec regex for: couchdb-devel
818:debug:main Searching for dependency: help2man
819:debug:main Didn't find receipt, going to depspec regex for: help2man
820:debug:main Changing to port directory: /opt/local/var/macports/sources/rsync.macports.org/release/tarballs/ports/textproc/help2man
821:debug:main OS darwin/16.1.0 (Mac OS X 10.12) arch i386
822:debug:main Reading variant descriptions from /opt/local/var/macports/sources/rsync.macports.org/release/tarballs/ports/_resources/port1.0/variant_descriptions.conf
823:debug:main universal variant already exists, so not adding the default one
824:debug:main Running callback portconfigure::add_automatic_compiler_dependencies
825:debug:main Finished running callback portconfigure::add_automatic_compiler_dependencies
826:debug:main Running callback portbuild::add_automatic_buildsystem_dependencies
827:debug:main Finished running callback portbuild::add_automatic_buildsystem_dependencies
828:debug:main Searching for dependency: pkgconfig
829:debug:main Found Dependency: receipt exists for pkgconfig
830:debug:main Searching for dependency: icu
831:debug:main Found Dependency: receipt exists for icu
832:debug:main Searching for dependency: spidermonkey185
833:debug:main Didn't find receipt, going to depspec regex for: spidermonkey185
834:debug:main Changing to port directory: /opt/local/var/macports/sources/rsync.macports.org/release/tarballs/ports/lang/spidermonkey185
835:debug:main OS darwin/16.1.0 (Mac OS X 10.12) arch i386
836:debug:main universal_variant is false, so not adding the default universal variant
837:debug:main Running callback portconfigure::add_automatic_compiler_dependencies
838:debug:main Finished running callback portconfigure::add_automatic_compiler_dependencies
839:debug:main Running callback portbuild::add_automatic_buildsystem_dependencies
840:debug:main Finished running callback portbuild::add_automatic_buildsystem_dependencies
841:debug:main Searching for dependency: erlang
842:debug:main Found Dependency: receipt exists for erlang
843:debug:main Searching for dependency: curl
844:debug:main Found Dependency: receipt exists for curl
845:info:main .:debug:main help2man has no conflicts
846:debug:main Searching for dependency: perl5.24
847:debug:main Found Dependency: receipt exists for perl5.24
848:debug:main Searching for dependency: p5.24-locale-gettext
849:debug:main Didn't find receipt, going to depspec regex for: p5.24-locale-gettext
850:debug:main Changing to port directory: /opt/local/var/macports/sources/rsync.macports.org/release/tarballs/ports/perl/p5-locale-gettext
851:debug:main OS darwin/16.1.0 (Mac OS X 10.12) arch i386
852:debug:main Sourcing PortGroup compiler_blacklist_versions 1.0 from /opt/local/var/macports/sources/rsync.macports.org/release/tarballs/ports/_resources/port1.0/group/compiler_blacklist_versions-1.0.tcl
853:debug:main Re-registering default for configure.universal_args
854:debug:main Sourcing PortGroup perl5 1.0 from /opt/local/var/macports/sources/rsync.macports.org/release/tarballs/ports/_resources/port1.0/group/perl5-1.0.tcl
855:debug:main Re-registering default for livecheck.version
856:debug:main compiler clang 800.0.42.1 not blacklisted because it doesn't match {clang < 319}
857:debug:main adding the default universal variant
858:debug:main Reading variant descriptions from /opt/local/var/macports/sources/rsync.macports.org/release/tarballs/ports/_resources/port1.0/variant_descriptions.conf
859:debug:main Running callback portconfigure::add_automatic_compiler_dependencies
860:debug:main Finished running callback portconfigure::add_automatic_compiler_dependencies
861:debug:main Running callback portbuild::add_automatic_buildsystem_dependencies
862:debug:main Finished running callback portbuild::add_automatic_buildsystem_dependencies
863:debug:main Searching for dependency: gettext
864:debug:main Found Dependency: receipt exists for gettext
865:debug:main Searching for dependency: libiconv
866:debug:main Found Dependency: receipt exists for libiconv
867:info:main .:debug:main p5.24-locale-gettext has no conflicts
868:info:main .:debug:main spidermonkey185 has no conflicts
869:debug:main Searching for dependency: nspr
870:debug:main Found Dependency: receipt exists for nspr
871:debug:main Searching for dependency: readline
872:debug:main Found Dependency: receipt exists for readline
873:msg:main
874:msg:main --->  Dependencies to be installed: help2man p5.24-locale-gettext spidermonkey185
875:debug:main Starting logging for p5.24-locale-gettext
876:debug:clean Starting logging for help2man
877:debug:clean Starting logging for spidermonkey185
878:debug:main Executing org.macports.main (couchdb)
879:debug:main changing euid/egid - current euid: 0 - current egid: 0
880:debug:main egid changed to: 501
881:debug:main euid changed to: 502
882:debug:archivefetch archivefetch phase started at Thu Nov 17 21:02:30 EST 2016
883:msg:archivefetch --->  Fetching archive for couchdb
884:debug:archivefetch Executing proc-pre-org.macports.archivefetch-archivefetch-0
885:debug:archivefetch Active variants check for archivefetch-type install considers depends_lib depends_run: icu spidermonkey185 erlang curl
886:debug:archivefetch erlang is installed with the following variants: +hipe+ssl+wxwidgets
887:debug:archivefetch   required: ssl, forbidden:
888:debug:archivefetch   accepted
889:debug:archivefetch Executing org.macports.archivefetch (couchdb)
890:debug:archivefetch euid/egid changed to: 0/0
891:debug:archivefetch chowned /opt/local/var/macports/incoming to macports
892:debug:archivefetch euid/egid changed to: 502/501
893:info:archivefetch --->  couchdb-1.6.1_2.darwin_16.x86_64.tbz2 doesn't seem to exist in /opt/local/var/macports/incoming/verified
894:msg:archivefetch --->  Attempting to fetch couchdb-1.6.1_2.darwin_16.x86_64.tbz2 from https://packages.macports.org/couchdb
895:debug:archivefetch Fetching archive failed:: The requested URL returned error: 404 Not Found
896:msg:archivefetch --->  Attempting to fetch couchdb-1.6.1_2.darwin_16.x86_64.tbz2 from http://sea.us.packages.macports.org/macports/packages/couchdb
897:debug:archivefetch Fetching archive failed:: The requested URL returned error: 404 Not Found
898:msg:archivefetch --->  Attempting to fetch couchdb-1.6.1_2.darwin_16.x86_64.tbz2 from http://lil.fr.packages.macports.org/couchdb
899:debug:archivefetch Fetching archive failed:: The requested URL returned error: 404 Not Found
900:debug:archivefetch Privilege de-escalation not attempted as not running as root.
901:debug:fetch fetch phase started at Thu Nov 17 21:02:31 EST 2016
902:notice:fetch --->  Fetching distfiles for couchdb
903:debug:fetch Can't run fetch on this port without elevated privileges. Escalating privileges back to root.
904:debug:fetch euid changed to: 0. egid changed to: 0.
905:debug:fetch changing euid/egid - current euid: 0 - current egid: 0
906:debug:fetch egid changed to: 501
907:debug:fetch euid changed to: 502
908:debug:fetch Executing org.macports.fetch (couchdb)
909:info:fetch --->  apache-couchdb-1.6.1.tar.gz doesn't seem to exist in /opt/local/var/macports/distfiles/couchdb
910:notice:fetch --->  Attempting to fetch apache-couchdb-1.6.1.tar.gz from https://distfiles.macports.org/couchdb
911:debug:fetch Privilege de-escalation not attempted as not running as root.
912:debug:checksum checksum phase started at Thu Nov 17 21:03:20 EST 2016
913:notice:checksum --->  Verifying checksums for couchdb
914:debug:checksum Executing org.macports.checksum (couchdb)
915:info:checksum --->  Checksumming apache-couchdb-1.6.1.tar.gz
916:debug:checksum Calculated (rmd160) is 9701c8cb7f712ce792ede3fc73e9cf028cea54b5
917:debug:checksum Correct (rmd160) checksum for apache-couchdb-1.6.1.tar.gz
918:debug:checksum Calculated (sha256) is 5a601b173733ce3ed31b654805c793aa907131cd70b06d03825f169aa48c8627
919:debug:checksum Correct (sha256) checksum for apache-couchdb-1.6.1.tar.gz
920:debug:checksum Privilege de-escalation not attempted as not running as root.
921:debug:extract extract phase started at Thu Nov 17 21:03:20 EST 2016
922:notice:extract --->  Extracting couchdb
923:debug:extract changing euid/egid - current euid: 0 - current egid: 0
924:debug:extract egid changed to: 501
925:debug:extract euid changed to: 502
926:debug:extract changing euid/egid - current euid: 0 - current egid: 0
927:debug:extract egid changed to: 501
928:debug:extract euid changed to: 502
929:debug:extract Executing org.macports.extract (couchdb)
930:info:extract --->  Extracting apache-couchdb-1.6.1.tar.gz
931:debug:extract setting option extract.args to '/opt/local/var/macports/distfiles/couchdb/apache-couchdb-1.6.1.tar.gz'
932:debug:extract Environment:
933CC_PRINT_OPTIONS='YES'
934CC_PRINT_OPTIONS_FILE='/opt/local/var/macports/build/_opt_local_var_macports_sources_rsync.macports.org_release_tarballs_ports_databases_couchdb/couchdb/work/.CC_PRINT_OPTIONS'
935CPATH='/opt/local/include'
936LIBRARY_PATH='/opt/local/lib'
937MACOSX_DEPLOYMENT_TARGET='10.12'
938:debug:extract Assembled command: 'cd "/opt/local/var/macports/build/_opt_local_var_macports_sources_rsync.macports.org_release_tarballs_ports_databases_couchdb/couchdb/work" && /usr/bin/gzip -dc '/opt/local/var/macports/distfiles/couchdb/apache-couchdb-1.6.1.tar.gz' | /usr/bin/tar -xf -'
939:debug:extract Executing command line:  cd "/opt/local/var/macports/build/_opt_local_var_macports_sources_rsync.macports.org_release_tarballs_ports_databases_couchdb/couchdb/work" && /usr/bin/gzip -dc '/opt/local/var/macports/distfiles/couchdb/apache-couchdb-1.6.1.tar.gz' | /usr/bin/tar -xf -
940:debug:extract euid/egid changed to: 0/0
941:debug:extract chowned /opt/local/var/macports/build/_opt_local_var_macports_sources_rsync.macports.org_release_tarballs_ports_databases_couchdb/couchdb/work to macports
942:debug:extract euid/egid changed to: 502/501
943:debug:extract Privilege de-escalation not attempted as not running as root.
944:debug:patch patch phase started at Thu Nov 17 21:03:22 EST 2016
945:debug:patch Executing org.macports.patch (couchdb)
946:notice:patch --->  Applying patches to couchdb
947:info:patch --->  Applying patch-etc-launchd-org.apache.couchdb.plist.tpl.in.diff
948:debug:patch Environment:
949CC_PRINT_OPTIONS='YES'
950CC_PRINT_OPTIONS_FILE='/opt/local/var/macports/build/_opt_local_var_macports_sources_rsync.macports.org_release_tarballs_ports_databases_couchdb/couchdb/work/.CC_PRINT_OPTIONS'
951CPATH='/opt/local/include'
952LIBRARY_PATH='/opt/local/lib'
953MACOSX_DEPLOYMENT_TARGET='10.12'
954:debug:patch Assembled command: 'cd "/opt/local/var/macports/build/_opt_local_var_macports_sources_rsync.macports.org_release_tarballs_ports_databases_couchdb/couchdb/work/apache-couchdb-1.6.1" && /usr/bin/patch -p0'
955:debug:patch Executing command line:  cd "/opt/local/var/macports/build/_opt_local_var_macports_sources_rsync.macports.org_release_tarballs_ports_databases_couchdb/couchdb/work/apache-couchdb-1.6.1" && /usr/bin/patch -p0 < '/opt/local/var/macports/sources/rsync.macports.org/release/tarballs/ports/databases/couchdb/files/patch-etc-launchd-org.apache.couchdb.plist.tpl.in.diff'
956:info:patch patching file ./etc/launchd/org.apache.couchdb.plist.tpl.in
957:info:patch --->  Applying patch-support-dual-spidermonkey.diff
958:debug:patch Environment:
959CC_PRINT_OPTIONS='YES'
960CC_PRINT_OPTIONS_FILE='/opt/local/var/macports/build/_opt_local_var_macports_sources_rsync.macports.org_release_tarballs_ports_databases_couchdb/couchdb/work/.CC_PRINT_OPTIONS'
961CPATH='/opt/local/include'
962LIBRARY_PATH='/opt/local/lib'
963MACOSX_DEPLOYMENT_TARGET='10.12'
964:debug:patch Assembled command: 'cd "/opt/local/var/macports/build/_opt_local_var_macports_sources_rsync.macports.org_release_tarballs_ports_databases_couchdb/couchdb/work/apache-couchdb-1.6.1" && /usr/bin/patch -p0'
965:debug:patch Executing command line:  cd "/opt/local/var/macports/build/_opt_local_var_macports_sources_rsync.macports.org_release_tarballs_ports_databases_couchdb/couchdb/work/apache-couchdb-1.6.1" && /usr/bin/patch -p0 < '/opt/local/var/macports/sources/rsync.macports.org/release/tarballs/ports/databases/couchdb/files/patch-support-dual-spidermonkey.diff'
966:info:patch patching file ./configure
967:info:patch Hunk #1 succeeded at 17468 (offset 57 lines).
968:info:patch --->  Applying patch-src-couchdb-priv-Makefile.in.diff
969:debug:patch Environment:
970CC_PRINT_OPTIONS='YES'
971CC_PRINT_OPTIONS_FILE='/opt/local/var/macports/build/_opt_local_var_macports_sources_rsync.macports.org_release_tarballs_ports_databases_couchdb/couchdb/work/.CC_PRINT_OPTIONS'
972CPATH='/opt/local/include'
973LIBRARY_PATH='/opt/local/lib'
974MACOSX_DEPLOYMENT_TARGET='10.12'
975:debug:patch Assembled command: 'cd "/opt/local/var/macports/build/_opt_local_var_macports_sources_rsync.macports.org_release_tarballs_ports_databases_couchdb/couchdb/work/apache-couchdb-1.6.1" && /usr/bin/patch -p0'
976:debug:patch Executing command line:  cd "/opt/local/var/macports/build/_opt_local_var_macports_sources_rsync.macports.org_release_tarballs_ports_databases_couchdb/couchdb/work/apache-couchdb-1.6.1" && /usr/bin/patch -p0 < '/opt/local/var/macports/sources/rsync.macports.org/release/tarballs/ports/databases/couchdb/files/patch-src-couchdb-priv-Makefile.in.diff'
977:info:patch patching file ./src/couchdb/priv/Makefile.in
978:info:patch Hunk #1 succeeded at 389 (offset 7 lines).
979:info:patch --->  Applying patch-configure.ac.diff
980:debug:patch Environment:
981CC_PRINT_OPTIONS='YES'
982CC_PRINT_OPTIONS_FILE='/opt/local/var/macports/build/_opt_local_var_macports_sources_rsync.macports.org_release_tarballs_ports_databases_couchdb/couchdb/work/.CC_PRINT_OPTIONS'
983CPATH='/opt/local/include'
984LIBRARY_PATH='/opt/local/lib'
985MACOSX_DEPLOYMENT_TARGET='10.12'
986:debug:patch Assembled command: 'cd "/opt/local/var/macports/build/_opt_local_var_macports_sources_rsync.macports.org_release_tarballs_ports_databases_couchdb/couchdb/work/apache-couchdb-1.6.1" && /usr/bin/patch -p0'
987:debug:patch Executing command line:  cd "/opt/local/var/macports/build/_opt_local_var_macports_sources_rsync.macports.org_release_tarballs_ports_databases_couchdb/couchdb/work/apache-couchdb-1.6.1" && /usr/bin/patch -p0 < '/opt/local/var/macports/sources/rsync.macports.org/release/tarballs/ports/databases/couchdb/files/patch-configure.ac.diff'
988:info:patch patching file configure.ac
989:info:patch --->  Applying patch-configure.diff
990:debug:patch Environment:
991CC_PRINT_OPTIONS='YES'
992CC_PRINT_OPTIONS_FILE='/opt/local/var/macports/build/_opt_local_var_macports_sources_rsync.macports.org_release_tarballs_ports_databases_couchdb/couchdb/work/.CC_PRINT_OPTIONS'
993CPATH='/opt/local/include'
994LIBRARY_PATH='/opt/local/lib'
995MACOSX_DEPLOYMENT_TARGET='10.12'
996:debug:patch Assembled command: 'cd "/opt/local/var/macports/build/_opt_local_var_macports_sources_rsync.macports.org_release_tarballs_ports_databases_couchdb/couchdb/work/apache-couchdb-1.6.1" && /usr/bin/patch -p0'
997:debug:patch Executing command line:  cd "/opt/local/var/macports/build/_opt_local_var_macports_sources_rsync.macports.org_release_tarballs_ports_databases_couchdb/couchdb/work/apache-couchdb-1.6.1" && /usr/bin/patch -p0 < '/opt/local/var/macports/sources/rsync.macports.org/release/tarballs/ports/databases/couchdb/files/patch-configure.diff'
998:info:patch patching file configure
999:info:patch Hunk #1 succeeded at 18529 (offset -3 lines).
1000:info:patch Hunk #2 succeeded at 18537 (offset -3 lines).
1001:info:patch Hunk #3 succeeded at 18548 (offset -3 lines).
1002:info:patch Hunk #4 succeeded at 18556 (offset -3 lines).
1003:info:patch Hunk #5 succeeded at 18564 (offset -3 lines).
1004:debug:patch Privilege de-escalation not attempted as not running as root.
1005:debug:configure configure phase started at Thu Nov 17 21:03:22 EST 2016
1006:notice:configure --->  Configuring couchdb
1007:debug:configure Using compiler 'Xcode Clang'
1008:debug:configure Executing proc-pre-org.macports.configure-configure-0
1009:debug:configure Active variants check for source-type install considers depends_fetch depends_extract depends_lib depends_build depends_run: icu spidermonkey185 erlang curl help2man pkgconfig
1010:debug:configure erlang is installed with the following variants: +hipe+ssl+wxwidgets
1011:debug:configure   required: ssl, forbidden:
1012:debug:configure   accepted
1013:debug:configure Executing org.macports.configure (couchdb)
1014:debug:configure Environment:
1015CC='/usr/bin/clang'
1016CC_PRINT_OPTIONS='YES'
1017CC_PRINT_OPTIONS_FILE='/opt/local/var/macports/build/_opt_local_var_macports_sources_rsync.macports.org_release_tarballs_ports_databases_couchdb/couchdb/work/.CC_PRINT_OPTIONS'
1018CFLAGS='-pipe -Os -arch x86_64'
1019CPATH='/opt/local/include'
1020CPPFLAGS='-I/opt/local/include'
1021CXX='/usr/bin/clang++'
1022CXXFLAGS='-pipe -Os -arch x86_64 -stdlib=libc++'
1023F77FLAGS='-m64'
1024F90FLAGS='-pipe -Os -m64'
1025FCFLAGS='-pipe -Os -m64'
1026FFLAGS='-pipe -Os'
1027INSTALL='/usr/bin/install -c'
1028LDFLAGS='-L/opt/local/lib -Wl,-headerpad_max_install_names -arch x86_64'
1029LIBRARY_PATH='/opt/local/lib'
1030MACOSX_DEPLOYMENT_TARGET='10.12'
1031OBJC='/usr/bin/clang'
1032OBJCFLAGS='-pipe -Os -arch x86_64'
1033OBJCXX='/usr/bin/clang++'
1034OBJCXXFLAGS='-pipe -Os -arch x86_64 -stdlib=libc++'
1035:debug:configure Assembled command: 'cd "/opt/local/var/macports/build/_opt_local_var_macports_sources_rsync.macports.org_release_tarballs_ports_databases_couchdb/couchdb/work/apache-couchdb-1.6.1" && ./configure --prefix=/opt/local --enable-js-trunk'
1036:debug:configure Executing command line:  cd "/opt/local/var/macports/build/_opt_local_var_macports_sources_rsync.macports.org_release_tarballs_ports_databases_couchdb/couchdb/work/apache-couchdb-1.6.1" && ./configure --prefix=/opt/local --enable-js-trunk
1037:info:configure checking for a BSD-compatible install... /usr/bin/install -c
1038:info:configure checking whether build environment is sane... yes
1039:info:configure checking for a thread-safe mkdir -p... build-aux/install-sh -c -d
1040:info:configure checking for gawk... gawk
1041:info:configure checking whether make sets $(MAKE)... yes
1042:info:configure checking how to create a ustar tar archive... gnutar
1043:info:configure checking for style of include used by make... GNU
1044:info:configure checking for gcc... /usr/bin/clang
1045:info:configure checking whether the C compiler works... yes
1046:info:configure checking for C compiler default output file name... a.out
1047:info:configure checking for suffix of executables...
1048:info:configure checking whether we are cross compiling... no
1049:info:configure checking for suffix of object files... o
1050:info:configure checking whether we are using the GNU C compiler... yes
1051:info:configure checking whether /usr/bin/clang accepts -g... yes
1052:info:configure checking for /usr/bin/clang option to accept ISO C89... none needed
1053:info:configure checking dependency style of /usr/bin/clang... gcc3
1054:info:configure checking how to run the C preprocessor... /usr/bin/clang -E
1055:info:configure checking for grep that handles long lines and -e... /usr/bin/grep
1056:info:configure checking for egrep... /usr/bin/grep -E
1057:info:configure checking for ANSI C header files... yes
1058:info:configure checking for sys/types.h... yes
1059:info:configure checking for sys/stat.h... yes
1060:info:configure checking for stdlib.h... yes
1061:info:configure checking for string.h... yes
1062:info:configure checking for memory.h... yes
1063:info:configure checking for strings.h... yes
1064:info:configure checking for inttypes.h... yes
1065:info:configure checking for stdint.h... yes
1066:info:configure checking for unistd.h... yes
1067:info:configure checking minix/config.h usability... no
1068:info:configure checking minix/config.h presence... no
1069:info:configure checking for minix/config.h... no
1070:info:configure checking whether it is safe to define __EXTENSIONS__... yes
1071:info:configure checking for gcc... (cached) /usr/bin/clang
1072:info:configure checking whether we are using the GNU C compiler... (cached) yes
1073:info:configure checking whether /usr/bin/clang accepts -g... (cached) yes
1074:info:configure checking for /usr/bin/clang option to accept ISO C89... (cached) none needed
1075:info:configure checking dependency style of /usr/bin/clang... (cached) gcc3
1076:info:configure checking build system type... x86_64-apple-darwin16.1.0
1077:info:configure checking host system type... x86_64-apple-darwin16.1.0
1078:info:configure checking how to print strings... printf
1079:info:configure checking for a sed that does not truncate output... /usr/bin/sed
1080:info:configure checking for fgrep... /usr/bin/grep -F
1081:info:configure checking for ld used by /usr/bin/clang... /Applications/Xcode.app/Contents/Developer/Toolchains/XcodeDefault.xctoolchain/usr/bin/ld
1082:info:configure checking if the linker (/Applications/Xcode.app/Contents/Developer/Toolchains/XcodeDefault.xctoolchain/usr/bin/ld) is GNU ld... no
1083:info:configure checking for BSD- or MS-compatible name lister (nm)... /usr/bin/nm -B
1084:info:configure checking the name lister (/usr/bin/nm -B) interface... BSD nm
1085:info:configure checking whether ln -s works... yes
1086:info:configure checking the maximum length of command line arguments... 196608
1087:info:configure checking whether the shell understands some XSI constructs... yes
1088:info:configure checking whether the shell understands "+="... yes
1089:info:configure checking how to convert x86_64-apple-darwin16.1.0 file names to x86_64-apple-darwin16.1.0 format... func_convert_file_noop
1090:info:configure checking how to convert x86_64-apple-darwin16.1.0 file names to toolchain format... func_convert_file_noop
1091:info:configure checking for /Applications/Xcode.app/Contents/Developer/Toolchains/XcodeDefault.xctoolchain/usr/bin/ld option to reload object files... -r
1092:info:configure checking for objdump... objdump
1093:info:configure checking how to recognize dependent libraries... pass_all
1094:info:configure checking for dlltool... no
1095:info:configure checking how to associate runtime and link libraries... printf %s\n
1096:info:configure checking for ar... ar
1097:info:configure checking for archiver @FILE support... no
1098:info:configure checking for strip... strip
1099:info:configure checking for ranlib... ranlib
1100:info:configure checking command to parse /usr/bin/nm -B output from /usr/bin/clang object... ok
1101:info:configure checking for sysroot... no
1102:info:configure checking for mt... no
1103:info:configure checking if : is a manifest tool... no
1104:info:configure checking for dsymutil... dsymutil
1105:info:configure checking for nmedit... nmedit
1106:info:configure checking for lipo... lipo
1107:info:configure checking for otool... otool
1108:info:configure checking for otool64... no
1109:info:configure checking for -single_module linker flag... yes
1110:info:configure checking for -exported_symbols_list linker flag... yes
1111:info:configure checking for -force_load linker flag... yes
1112:info:configure checking for dlfcn.h... yes
1113:info:configure checking for objdir... .libs
1114:info:configure checking if /usr/bin/clang supports -fno-rtti -fno-exceptions... yes
1115:info:configure checking for /usr/bin/clang option to produce PIC... -fno-common -DPIC
1116:info:configure checking if /usr/bin/clang PIC flag -fno-common -DPIC works... yes
1117:info:configure checking if /usr/bin/clang static flag -static works... no
1118:info:configure checking if /usr/bin/clang supports -c -o file.o... yes
1119:info:configure checking if /usr/bin/clang supports -c -o file.o... (cached) yes
1120:info:configure checking whether the /usr/bin/clang linker (/Applications/Xcode.app/Contents/Developer/Toolchains/XcodeDefault.xctoolchain/usr/bin/ld) supports shared libraries... yes
1121:info:configure checking dynamic linker characteristics... darwin16.1.0 dyld
1122:info:configure checking how to hardcode library paths into programs... immediate
1123:info:configure checking whether stripping libraries is possible... yes
1124:info:configure checking if libtool supports shared libraries... yes
1125:info:configure checking whether to build shared libraries... yes
1126:info:configure checking whether to build static libraries... no
1127:info:configure checking whether ln -s works... yes
1128:info:configure checking for pkg-config... /opt/local/bin/pkg-config
1129:info:configure checking pkg-config is at least version 0.9.0... yes
1130:info:configure checking whether we are using the GNU C++ compiler... yes
1131:info:configure checking whether /usr/bin/clang++ accepts -g... yes
1132:info:configure checking dependency style of /usr/bin/clang++... gcc3
1133:info:configure checking how to run the C++ preprocessor... /usr/bin/clang++ -E
1134:info:configure checking for ld used by /usr/bin/clang++... /Applications/Xcode.app/Contents/Developer/Toolchains/XcodeDefault.xctoolchain/usr/bin/ld
1135:info:configure checking if the linker (/Applications/Xcode.app/Contents/Developer/Toolchains/XcodeDefault.xctoolchain/usr/bin/ld) is GNU ld... no
1136:info:configure checking whether the /usr/bin/clang++ linker (/Applications/Xcode.app/Contents/Developer/Toolchains/XcodeDefault.xctoolchain/usr/bin/ld) supports shared libraries... yes
1137:info:configure checking for /usr/bin/clang++ option to produce PIC... -fno-common -DPIC
1138:info:configure checking if /usr/bin/clang++ PIC flag -fno-common -DPIC works... yes
1139:info:configure checking if /usr/bin/clang++ static flag -static works... no
1140:info:configure checking if /usr/bin/clang++ supports -c -o file.o... yes
1141:info:configure checking if /usr/bin/clang++ supports -c -o file.o... (cached) yes
1142:info:configure checking whether the /usr/bin/clang++ linker (/Applications/Xcode.app/Contents/Developer/Toolchains/XcodeDefault.xctoolchain/usr/bin/ld) supports shared libraries... yes
1143:info:configure checking dynamic linker characteristics... darwin16.1.0 dyld
1144:info:configure checking how to hardcode library paths into programs... immediate
1145:info:configure checking whether byte ordering is bigendian... no
1146:info:configure checking for stdint.h... (cached) yes
1147:info:configure checking stddef.h usability... yes
1148:info:configure checking stddef.h presence... yes
1149:info:configure checking for stddef.h... yes
1150:info:configure checking sys/mman.h usability... yes
1151:info:configure checking sys/mman.h presence... yes
1152:info:configure checking for sys/mman.h... yes
1153:info:configure checking sys/resource.h usability... yes
1154:info:configure checking sys/resource.h presence... yes
1155:info:configure checking for sys/resource.h... yes
1156:info:configure checking for mmap... yes
1157:info:configure checking if the compiler supports __builtin_expect... yes
1158:info:configure checking if the compiler supports __builtin_ctzll... yes
1159:info:configure checking for pthread_create in -lpthread... no
1160:info:configure checking for erl... /opt/local/bin/erl
1161:info:configure checking for escript... /opt/local/bin/escript
1162:info:configure checking for JS... yes
1163:info:configure checking jsapi.h usability... yes
1164:info:configure checking jsapi.h presence... yes
1165:info:configure checking for jsapi.h... yes
1166:info:configure checking for JS_NewContext in -lmozjs185... yes
1167:info:configure checking for JS_NewCompartmentAndGlobalObject in -lmozjs185... yes
1168:info:configure checking for JS_ThrowStopIteration in -lmozjs185... yes
1169:info:configure checking for JS_GetStringCharsAndLength in -lmozjs185... yes
1170:info:configure checking for JSScript*... no
1171:info:configure ./configure: line 18135: fg: no job control
1172:info:configure checking for icu-config... /opt/local/bin/icu-config
1173:info:configure checking for ICU >= 3.4.1... yes
1174:info:configure checking ICU_CPPFLAGS... -I/opt/local/include
1175:info:configure checking ICU_CFLAGS... 
1176:info:configure checking ICU_CXXFLAGS... --std=c++0x
1177:info:configure checking ICU_LIBS...  -L/opt/local/lib -licui18n -licuuc -licudata 
1178:info:configure checking for curl-config... /opt/local/bin/curl-config
1179:info:configure checking for curl (libcurl 7.51.0) >= 7.18.0... yes
1180:info:configure checking Erlang version compatibility... -n detected Erlang version: 8.1.0...
1181:info:configure compatible
1182:info:configure checking for erlc... /opt/local/bin/erlc
1183:info:configure checking erl_driver.h usability... yes
1184:info:configure checking erl_driver.h presence... yes
1185:info:configure checking for erl_driver.h... yes
1186:info:configure checking location of init directory... not found
1187:info:configure checking location of launchd directory... ${prefix}/Library/LaunchDaemons
1188:info:configure checking for help2man... yes
1189:info:configure checking for pdflatex... no
1190:info:configure configure: WARNING: You will be unable to regenerate PDF documentation.
1191:info:configure checking for makeinfo... yes
1192:info:configure checking for install-info... yes
1193:info:configure checking for sphinx-build... no
1194:info:configure configure: WARNING: You will be unable to regenerate documentation.
1195:info:configure checking python module: pygments... no
1196:info:configure checking pygments version >= 1.5... no
1197:info:configure configure: WARNING: Syntax highlighting may not work.
1198:info:configure configure: creating ./config.status
1199:info:configure config.status: creating Makefile
1200:info:configure config.status: creating bin/couch-config.tpl
1201:info:configure config.status: creating bin/couchdb.tpl
1202:info:configure config.status: creating bin/couchdb.bat.tpl
1203:info:configure config.status: creating bin/Makefile
1204:info:configure config.status: creating etc/couchdb/Makefile
1205:info:configure config.status: creating etc/couchdb/default.ini.tpl
1206:info:configure config.status: creating etc/default/Makefile
1207:info:configure config.status: creating etc/init/couchdb.tpl
1208:info:configure config.status: creating etc/init/Makefile
1209:info:configure config.status: creating etc/launchd/org.apache.couchdb.plist.tpl
1210:info:configure config.status: creating etc/launchd/Makefile
1211:info:configure config.status: creating etc/logrotate.d/couchdb.tpl
1212:info:configure config.status: creating etc/logrotate.d/Makefile
1213:info:configure config.status: creating etc/windows/Makefile
1214:info:configure config.status: creating etc/Makefile
1215:info:configure config.status: creating share/Makefile
1216:info:configure config.status: creating share/doc/Makefile
1217:info:configure config.status: creating share/doc/build/Makefile
1218:info:configure config.status: creating src/Makefile
1219:info:configure config.status: creating src/couch_dbupdates/Makefile
1220:info:configure config.status: creating src/couch_index/Makefile
1221:info:configure config.status: creating src/couch_mrview/Makefile
1222:info:configure config.status: creating src/couch_plugins/Makefile
1223:info:configure config.status: creating src/couch_replicator/Makefile
1224:info:configure config.status: creating src/couchjs-node/Makefile
1225:info:configure config.status: creating src/couchdb/couch.app.tpl
1226:info:configure config.status: creating src/couchdb/Makefile
1227:info:configure config.status: creating src/couchdb/priv/Makefile
1228:info:configure config.status: creating src/erlang-oauth/Makefile
1229:info:configure config.status: creating src/etap/Makefile
1230:info:configure config.status: creating src/ibrowse/Makefile
1231:info:configure config.status: creating src/mochiweb/Makefile
1232:info:configure config.status: creating src/snappy/Makefile
1233:info:configure config.status: creating src/snappy/google-snappy/snappy-stubs-public.h
1234:info:configure config.status: creating src/ejson/Makefile
1235:info:configure config.status: creating test/Makefile
1236:info:configure config.status: creating test/bench/Makefile
1237:info:configure config.status: creating test/etap/Makefile
1238:info:configure config.status: creating test/etap/test_util.erl
1239:info:configure config.status: creating test/javascript/Makefile
1240:info:configure config.status: creating test/view_server/Makefile
1241:info:configure config.status: creating utils/Makefile
1242:info:configure config.status: creating var/Makefile
1243:info:configure config.status: creating config.h
1244:info:configure config.status: creating src/snappy/google-snappy/config.h
1245:info:configure config.status: executing depfiles commands
1246:info:configure config.status: executing libtool commands
1247:info:configure
1248:info:configure You have configured Apache CouchDB, time to relax.
1249:info:configure
1250:info:configure Run `make && sudo make install' to install.
1251:debug:configure Privilege de-escalation not attempted as not running as root.
1252:debug:build build phase started at Thu Nov 17 21:03:33 EST 2016
1253:notice:build --->  Building couchdb
1254:debug:build Executing org.macports.build (couchdb)
1255:debug:build Environment:
1256CC_PRINT_OPTIONS='YES'
1257CC_PRINT_OPTIONS_FILE='/opt/local/var/macports/build/_opt_local_var_macports_sources_rsync.macports.org_release_tarballs_ports_databases_couchdb/couchdb/work/.CC_PRINT_OPTIONS'
1258CPATH='/opt/local/include'
1259LIBRARY_PATH='/opt/local/lib'
1260MACOSX_DEPLOYMENT_TARGET='10.12'
1261:debug:build Assembled command: 'cd "/opt/local/var/macports/build/_opt_local_var_macports_sources_rsync.macports.org_release_tarballs_ports_databases_couchdb/couchdb/work/apache-couchdb-1.6.1" && /usr/bin/make -j8 -w all'
1262:debug:build Executing command line:  cd "/opt/local/var/macports/build/_opt_local_var_macports_sources_rsync.macports.org_release_tarballs_ports_databases_couchdb/couchdb/work/apache-couchdb-1.6.1" && /usr/bin/make -j8 -w all
1263:info:build make: Entering directory `/opt/local/var/macports/build/_opt_local_var_macports_sources_rsync.macports.org_release_tarballs_ports_databases_couchdb/couchdb/work/apache-couchdb-1.6.1'
1264:info:build CDPATH="${ZSH_VERSION+.}:" && cd . && /bin/sh /opt/local/var/macports/build/_opt_local_var_macports_sources_rsync.macports.org_release_tarballs_ports_databases_couchdb/couchdb/work/apache-couchdb-1.6.1/build-aux/missing --run aclocal-1.11 -I m4
1265:info:build /opt/local/var/macports/build/_opt_local_var_macports_sources_rsync.macports.org_release_tarballs_ports_databases_couchdb/couchdb/work/apache-couchdb-1.6.1/build-aux/missing: line 52: aclocal-1.11: command not found
1266:info:build WARNING: `aclocal-1.11' is missing on your system.  You should only need it if
1267:info:build          you modified `acinclude.m4' or `configure.ac'.  You might want
1268:info:build          to install the `Automake' and `Perl' packages.  Grab them from
1269:info:build          any GNU archive site.
1270:info:build CDPATH="${ZSH_VERSION+.}:" && cd . && /bin/sh /opt/local/var/macports/build/_opt_local_var_macports_sources_rsync.macports.org_release_tarballs_ports_databases_couchdb/couchdb/work/apache-couchdb-1.6.1/build-aux/missing --run autoconf
1271:info:build  cd . && /bin/sh /opt/local/var/macports/build/_opt_local_var_macports_sources_rsync.macports.org_release_tarballs_ports_databases_couchdb/couchdb/work/apache-couchdb-1.6.1/build-aux/missing --run automake-1.11 --foreign
1272:info:build /opt/local/var/macports/build/_opt_local_var_macports_sources_rsync.macports.org_release_tarballs_ports_databases_couchdb/couchdb/work/apache-couchdb-1.6.1/build-aux/missing: line 52: automake-1.11: command not found
1273:info:build WARNING: `automake-1.11' is missing on your system.  You should only need it if
1274:info:build          you modified `Makefile.am', `acinclude.m4' or `configure.ac'.
1275:info:build          You might want to install the `Automake' and `Perl' packages.
1276:info:build          Grab them from any GNU archive site.
1277:info:build /bin/sh ./config.status --recheck
1278:info:build running CONFIG_SHELL=/bin/sh /bin/sh ./configure --prefix=/opt/local --enable-js-trunk CC=/usr/bin/clang CFLAGS=-pipe -Os -arch x86_64 LDFLAGS=-L/opt/local/lib -Wl,-headerpad_max_install_names -arch x86_64 CPPFLAGS=-I/opt/local/include CXX=/usr/bin/clang++ CXXFLAGS=-pipe -Os -arch x86_64 -stdlib=libc++ --no-create --no-recursion
1279:info:build checking for a BSD-compatible install... /usr/bin/install -c
1280:info:build checking whether build environment is sane... yes
1281:info:build checking for a thread-safe mkdir -p... build-aux/install-sh -c -d
1282:info:build checking for gawk... gawk
1283:info:build checking whether make sets $(MAKE)... yes
1284:info:build checking how to create a ustar tar archive... gnutar
1285:info:build checking for style of include used by make... GNU
1286:info:build checking for gcc... /usr/bin/clang
1287:info:build checking whether the C compiler works... yes
1288:info:build checking for C compiler default output file name... a.out
1289:info:build checking for suffix of executables...
1290:info:build checking whether we are cross compiling... no
1291:info:build checking for suffix of object files... o
1292:info:build checking whether we are using the GNU C compiler... yes
1293:info:build checking whether /usr/bin/clang accepts -g... yes
1294:info:build checking for /usr/bin/clang option to accept ISO C89... none needed
1295:info:build checking dependency style of /usr/bin/clang... gcc3
1296:info:build checking how to run the C preprocessor... /usr/bin/clang -E
1297:info:build checking for grep that handles long lines and -e... /usr/bin/grep
1298:info:build checking for egrep... /usr/bin/grep -E
1299:info:build checking for ANSI C header files... yes
1300:info:build checking for sys/types.h... yes
1301:info:build checking for sys/stat.h... yes
1302:info:build checking for stdlib.h... yes
1303:info:build checking for string.h... yes
1304:info:build checking for memory.h... yes
1305:info:build checking for strings.h... yes
1306:info:build checking for inttypes.h... yes
1307:info:build checking for stdint.h... yes
1308:info:build checking for unistd.h... yes
1309:info:build checking minix/config.h usability... no
1310:info:build checking minix/config.h presence... no
1311:info:build checking for minix/config.h... no
1312:info:build checking whether it is safe to define __EXTENSIONS__... yes
1313:info:build checking for gcc... (cached) /usr/bin/clang
1314:info:build checking whether we are using the GNU C compiler... (cached) yes
1315:info:build checking whether /usr/bin/clang accepts -g... (cached) yes
1316:info:build checking for /usr/bin/clang option to accept ISO C89... (cached) none needed
1317:info:build checking dependency style of /usr/bin/clang... (cached) gcc3
1318:info:build checking build system type... x86_64-apple-darwin16.1.0
1319:info:build checking host system type... x86_64-apple-darwin16.1.0
1320:info:build checking how to print strings... printf
1321:info:build checking for a sed that does not truncate output... /usr/bin/sed
1322:info:build checking for fgrep... /usr/bin/grep -F
1323:info:build checking for ld used by /usr/bin/clang... /Applications/Xcode.app/Contents/Developer/Toolchains/XcodeDefault.xctoolchain/usr/bin/ld
1324:info:build checking if the linker (/Applications/Xcode.app/Contents/Developer/Toolchains/XcodeDefault.xctoolchain/usr/bin/ld) is GNU ld... no
1325:info:build checking for BSD- or MS-compatible name lister (nm)... /usr/bin/nm -B
1326:info:build checking the name lister (/usr/bin/nm -B) interface... BSD nm
1327:info:build checking whether ln -s works... yes
1328:info:build checking the maximum length of command line arguments... 196608
1329:info:build checking whether the shell understands some XSI constructs... yes
1330:info:build checking whether the shell understands "+="... yes
1331:info:build checking how to convert x86_64-apple-darwin16.1.0 file names to x86_64-apple-darwin16.1.0 format... func_convert_file_noop
1332:info:build checking how to convert x86_64-apple-darwin16.1.0 file names to toolchain format... func_convert_file_noop
1333:info:build checking for /Applications/Xcode.app/Contents/Developer/Toolchains/XcodeDefault.xctoolchain/usr/bin/ld option to reload object files... -r
1334:info:build checking for objdump... objdump
1335:info:build checking how to recognize dependent libraries... pass_all
1336:info:build checking for dlltool... no
1337:info:build checking how to associate runtime and link libraries... printf %s\n
1338:info:build checking for ar... ar
1339:info:build checking for archiver @FILE support... no
1340:info:build checking for strip... strip
1341:info:build checking for ranlib... ranlib
1342:info:build checking command to parse /usr/bin/nm -B output from /usr/bin/clang object... ok
1343:info:build checking for sysroot... no
1344:info:build checking for mt... no
1345:info:build checking if : is a manifest tool... no
1346:info:build checking for dsymutil... dsymutil
1347:info:build checking for nmedit... nmedit
1348:info:build checking for lipo... lipo
1349:info:build checking for otool... otool
1350:info:build checking for otool64... no
1351:info:build checking for -single_module linker flag... yes
1352:info:build checking for -exported_symbols_list linker flag... yes
1353:info:build checking for -force_load linker flag... yes
1354:info:build checking for dlfcn.h... yes
1355:info:build checking for objdir... .libs
1356:info:build checking if /usr/bin/clang supports -fno-rtti -fno-exceptions... yes
1357:info:build checking for /usr/bin/clang option to produce PIC... -fno-common -DPIC
1358:info:build checking if /usr/bin/clang PIC flag -fno-common -DPIC works... yes
1359:info:build checking if /usr/bin/clang static flag -static works... no
1360:info:build checking if /usr/bin/clang supports -c -o file.o... yes
1361:info:build checking if /usr/bin/clang supports -c -o file.o... (cached) yes
1362:info:build checking whether the /usr/bin/clang linker (/Applications/Xcode.app/Contents/Developer/Toolchains/XcodeDefault.xctoolchain/usr/bin/ld) supports shared libraries... yes
1363:info:build checking dynamic linker characteristics... darwin16.1.0 dyld
1364:info:build checking how to hardcode library paths into programs... immediate
1365:info:build checking whether stripping libraries is possible... yes
1366:info:build checking if libtool supports shared libraries... yes
1367:info:build checking whether to build shared libraries... yes
1368:info:build checking whether to build static libraries... no
1369:info:build checking whether ln -s works... yes
1370:info:build checking for pkg-config... /opt/local/bin/pkg-config
1371:info:build checking pkg-config is at least version 0.9.0... yes
1372:info:build checking whether we are using the GNU C++ compiler... yes
1373:info:build checking whether /usr/bin/clang++ accepts -g... yes
1374:info:build checking dependency style of /usr/bin/clang++... gcc3
1375:info:build checking how to run the C++ preprocessor... /usr/bin/clang++ -E
1376:info:build checking for ld used by /usr/bin/clang++... /Applications/Xcode.app/Contents/Developer/Toolchains/XcodeDefault.xctoolchain/usr/bin/ld
1377:info:build checking if the linker (/Applications/Xcode.app/Contents/Developer/Toolchains/XcodeDefault.xctoolchain/usr/bin/ld) is GNU ld... no
1378:info:build checking whether the /usr/bin/clang++ linker (/Applications/Xcode.app/Contents/Developer/Toolchains/XcodeDefault.xctoolchain/usr/bin/ld) supports shared libraries... yes
1379:info:build checking for /usr/bin/clang++ option to produce PIC... -fno-common -DPIC
1380:info:build checking if /usr/bin/clang++ PIC flag -fno-common -DPIC works... yes
1381:info:build checking if /usr/bin/clang++ static flag -static works... no
1382:info:build checking if /usr/bin/clang++ supports -c -o file.o... yes
1383:info:build checking if /usr/bin/clang++ supports -c -o file.o... (cached) yes
1384:info:build checking whether the /usr/bin/clang++ linker (/Applications/Xcode.app/Contents/Developer/Toolchains/XcodeDefault.xctoolchain/usr/bin/ld) supports shared libraries... yes
1385:info:build checking dynamic linker characteristics... darwin16.1.0 dyld
1386:info:build checking how to hardcode library paths into programs... immediate
1387:info:build checking whether byte ordering is bigendian... no
1388:info:build checking for stdint.h... (cached) yes
1389:info:build checking stddef.h usability... yes
1390:info:build checking stddef.h presence... yes
1391:info:build checking for stddef.h... yes
1392:info:build checking sys/mman.h usability... yes
1393:info:build checking sys/mman.h presence... yes
1394:info:build checking for sys/mman.h... yes
1395:info:build checking sys/resource.h usability... yes
1396:info:build checking sys/resource.h presence... yes
1397:info:build checking for sys/resource.h... yes
1398:info:build checking for mmap... yes
1399:info:build checking if the compiler supports __builtin_expect... yes
1400:info:build checking if the compiler supports __builtin_ctzll... yes
1401:info:build checking for pthread_create in -lpthread... no
1402:info:build checking for erl... /opt/local/bin/erl
1403:info:build checking for escript... /opt/local/bin/escript
1404:info:build checking for JS... yes
1405:info:build checking jsapi.h usability... yes
1406:info:build checking jsapi.h presence... yes
1407:info:build checking for jsapi.h... yes
1408:info:build checking for JS_NewContext in -lmozjs185... yes
1409:info:build checking for JS_NewCompartmentAndGlobalObject in -lmozjs185... yes
1410:info:build checking for JS_ThrowStopIteration in -lmozjs185... yes
1411:info:build checking for JS_GetStringCharsAndLength in -lmozjs185... yes
1412:info:build checking for JSScript*... no
1413:info:build ./configure: line 18138: fg: no job control
1414:info:build checking for icu-config... /opt/local/bin/icu-config
1415:info:build checking for ICU >= 3.4.1... yes
1416:info:build checking ICU_CPPFLAGS... -I/opt/local/include
1417:info:build checking ICU_CFLAGS... 
1418:info:build checking ICU_CXXFLAGS... --std=c++0x
1419:info:build checking ICU_LIBS...  -L/opt/local/lib -licui18n -licuuc -licudata 
1420:info:build checking for curl-config... /opt/local/bin/curl-config
1421:info:build checking for curl (libcurl 7.51.0) >= 7.18.0... yes
1422:info:build checking Erlang version compatibility... -n detected Erlang version: 8.1.0...
1423:info:build compatible
1424:info:build checking for erlc... /opt/local/bin/erlc
1425:info:build checking erl_driver.h usability... yes
1426:info:build checking erl_driver.h presence... yes
1427:info:build checking for erl_driver.h... yes
1428:info:build checking location of init directory... not found
1429:info:build checking location of launchd directory... ${prefix}/Library/LaunchDaemons
1430:info:build checking for help2man... yes
1431:info:build checking for pdflatex... no
1432:info:build configure: WARNING: You will be unable to regenerate PDF documentation.
1433:info:build checking for makeinfo... yes
1434:info:build checking for install-info... yes
1435:info:build checking for sphinx-build... no
1436:info:build configure: WARNING: You will be unable to regenerate documentation.
1437:info:build checking python module: pygments... no
1438:info:build checking pygments version >= 1.5... no
1439:info:build configure: WARNING: Syntax highlighting may not work.
1440:info:build configure: creating ./config.status
1441:info:build
1442:info:build You have configured Apache CouchDB, time to relax.
1443:info:build
1444:info:build Run `make && sudo make install' to install.
1445:info:build  /bin/sh ./config.status
1446:info:build config.status: creating Makefile
1447:info:build config.status: creating bin/couch-config.tpl
1448:info:build config.status: creating bin/couchdb.tpl
1449:info:build config.status: creating bin/couchdb.bat.tpl
1450:info:build config.status: creating bin/Makefile
1451:info:build config.status: creating etc/couchdb/Makefile
1452:info:build config.status: creating etc/couchdb/default.ini.tpl
1453:info:build config.status: creating etc/default/Makefile
1454:info:build config.status: creating etc/init/couchdb.tpl
1455:info:build config.status: creating etc/init/Makefile
1456:info:build config.status: creating etc/launchd/org.apache.couchdb.plist.tpl
1457:info:build config.status: creating etc/launchd/Makefile
1458:info:build config.status: creating etc/logrotate.d/couchdb.tpl
1459:info:build config.status: creating etc/logrotate.d/Makefile
1460:info:build config.status: creating etc/windows/Makefile
1461:info:build config.status: creating etc/Makefile
1462:info:build config.status: creating share/Makefile
1463:info:build config.status: creating share/doc/Makefile
1464:info:build config.status: creating share/doc/build/Makefile
1465:info:build config.status: creating src/Makefile
1466:info:build config.status: creating src/couch_dbupdates/Makefile
1467:info:build config.status: creating src/couch_index/Makefile
1468:info:build config.status: creating src/couch_mrview/Makefile
1469:info:build config.status: creating src/couch_plugins/Makefile
1470:info:build config.status: creating src/couch_replicator/Makefile
1471:info:build config.status: creating src/couchjs-node/Makefile
1472:info:build config.status: creating src/couchdb/couch.app.tpl
1473:info:build config.status: creating src/couchdb/Makefile
1474:info:build config.status: creating src/couchdb/priv/Makefile
1475:info:build config.status: creating src/erlang-oauth/Makefile
1476:info:build config.status: creating src/etap/Makefile
1477:info:build config.status: creating src/ibrowse/Makefile
1478:info:build config.status: creating src/mochiweb/Makefile
1479:info:build config.status: creating src/snappy/Makefile
1480:info:build config.status: creating src/snappy/google-snappy/snappy-stubs-public.h
1481:info:build config.status: creating src/ejson/Makefile
1482:info:build config.status: creating test/Makefile
1483:info:build config.status: creating test/bench/Makefile
1484:info:build config.status: creating test/etap/Makefile
1485:info:build config.status: creating test/etap/test_util.erl
1486:info:build config.status: creating test/javascript/Makefile
1487:info:build config.status: creating test/view_server/Makefile
1488:info:build config.status: creating utils/Makefile
1489:info:build config.status: creating var/Makefile
1490:info:build config.status: creating config.h
1491:info:build config.status: config.h is unchanged
1492:info:build config.status: creating src/snappy/google-snappy/config.h
1493:info:build config.status: src/snappy/google-snappy/config.h is unchanged
1494:info:build config.status: executing depfiles commands
1495:info:build config.status: executing libtool commands
1496:info:build make: Leaving directory `/opt/local/var/macports/build/_opt_local_var_macports_sources_rsync.macports.org_release_tarballs_ports_databases_couchdb/couchdb/work/apache-couchdb-1.6.1'
1497:info:build make: Entering directory `/opt/local/var/macports/build/_opt_local_var_macports_sources_rsync.macports.org_release_tarballs_ports_databases_couchdb/couchdb/work/apache-couchdb-1.6.1'
1498:info:build (CDPATH="${ZSH_VERSION+.}:" && cd . && /bin/sh /opt/local/var/macports/build/_opt_local_var_macports_sources_rsync.macports.org_release_tarballs_ports_databases_couchdb/couchdb/work/apache-couchdb-1.6.1/build-aux/missing --run autoheader)
1499:info:build rm -f stamp-h1
1500:info:build touch config.h.in
1501:info:build cd . && /bin/sh ./config.status config.h
1502:info:build config.status: creating config.h
1503:info:build config.status: config.h is unchanged
1504:info:build /Applications/Xcode.app/Contents/Developer/usr/bin/make  all-recursive
1505:info:build make[1]: Entering directory `/opt/local/var/macports/build/_opt_local_var_macports_sources_rsync.macports.org_release_tarballs_ports_databases_couchdb/couchdb/work/apache-couchdb-1.6.1'
1506:info:build Making all in bin
1507:info:build make[2]: Entering directory `/opt/local/var/macports/build/_opt_local_var_macports_sources_rsync.macports.org_release_tarballs_ports_databases_couchdb/couchdb/work/apache-couchdb-1.6.1/bin'
1508:info:build /Applications/Xcode.app/Contents/Developer/usr/bin/make  all-am
1509:info:build make[3]: Entering directory `/opt/local/var/macports/build/_opt_local_var_macports_sources_rsync.macports.org_release_tarballs_ports_databases_couchdb/couchdb/work/apache-couchdb-1.6.1/bin'
1510:info:build sed -e "s|%ERL%|/opt/local/bin/erl|g" \
1511:info:build         -e "s|%ICU_CONFIG%|/opt/local/bin/icu-config|g" \
1512:info:build         -e "s|%bindir%|/opt/local/bin|g" \
1513:info:build         -e "s|%localerlanglibdir%|/opt/local/lib/couchdb/erlang/lib|g" \
1514:info:build         -e "s|%defaultini%|default.ini|g" \
1515:info:build         -e "s|%localini%|local.ini|g" \
1516:info:build         -e "s|%localconfdir%|/opt/local/etc/couchdb|g" \
1517:info:build         -e "s|%localstatelogdir%|/opt/local/var/log/couchdb|g" \
1518:info:build         -e "s|%localstatelibdir%|/opt/local/var/lib/couchdb|g" \
1519:info:build         -e "s|%localstatedir%|/opt/local/var|g" \
1520:info:build         -e "s|%locallibdir%|/opt/local/lib/couchdb|g" \
1521:info:build         -e "s|%bug_uri%|https://issues.apache.org/jira/browse/COUCHDB|g" \
1522:info:build         -e "s|%package_author_address%|dev@couchdb.apache.org|g" \
1523:info:build         -e "s|%package_author_name%|The Apache Software Foundation|g" \
1524:info:build         -e "s|%package_name%|Apache CouchDB|g" \
1525:info:build         -e "s|%version%|1.6.1|g" \
1526:info:build         -e "s|%couchdb_command_name%|`echo couchdb | sed 's,x,x,'`|g" > \
1527:info:build     couchdb < couchdb.tpl
1528:info:build sed -e "s|%ERL%|/opt/local/bin/erl|g" \
1529:info:build         -e "s|%bindir%|/opt/local/bin|g" \
1530:info:build         -e "s|%localerlanglibdir%|/opt/local/lib/couchdb/erlang/lib|g" \
1531:info:build         -e "s|%localconfdir%|/opt/local/etc/couchdb|g" \
1532:info:build         -e "s|%localdatadir%|/opt/local/share/couchdb|g" \
1533:info:build         -e "s|%localbuilddatadir%|/opt/local/share/couchdb|g" \
1534:info:build         -e "s|%localstatelogdir%|/opt/local/var/log/couchdb|g" \
1535:info:build         -e "s|%localstatelibdir%|/opt/local/var/lib/couchdb|g" \
1536:info:build         -e "s|%localstatedir%|/opt/local/var|g" \
1537:info:build         -e "s|%localstaterundir%|/opt/local/var/run/couchdb|g" \
1538:info:build         -e "s|%couchlibdir%|/opt/local/lib/couchdb/erlang/lib/couch-%version%|g"\
1539:info:build         -e "s|%couchincludedir%|/opt/local/lib/couchdb/erlang/lib/include|g"\
1540:info:build         -e "s|%couchebindir%|/opt/local/lib/couchdb/erlang/lib/ebin|g"\
1541:info:build         -e "s|%couchprivlibdir%|/opt/local/lib/couchdb/erlang/lib/couch-%version%/priv/lib|g"\
1542:info:build         -e "s|%bug_uri%|https://issues.apache.org/jira/browse/COUCHDB|g" \
1543:info:build         -e "s|%package_author_address%|dev@couchdb.apache.org|g" \
1544:info:build         -e "s|%package_author_name%|The Apache Software Foundation|g" \
1545:info:build         -e "s|%package_name%|Apache CouchDB|g" \
1546:info:build         -e "s|%version%|1.6.1|g" \
1547:info:build         -e "s|%erlangversion%|19|g" \
1548:info:build         -e "s|%erlangbin%|/opt/local/bin/erl|g" \
1549:info:build         -e "s|%couchdb_command_name%|`echo couchdb | sed 's,x,x,'`|g" > \
1550:info:build     couch-config < couch-config.tpl
1551:info:build ln -s -f "/opt/local/var/macports/build/_opt_local_var_macports_sources_rsync.macports.org_release_tarballs_ports_databases_couchdb/couchdb/work/apache-couchdb-1.6.1/src/couchdb/priv/couchjs" "couchjs_dev"
1552:info:build sed -e "s|%ERL%|/opt/local/bin/erl|g" \
1553:info:build         -e "s|%bindir%|/opt/local/var/macports/build/_opt_local_var_macports_sources_rsync.macports.org_release_tarballs_ports_databases_couchdb/couchdb/work/apache-couchdb-1.6.1/bin|g" \
1554:info:build         -e "s|%localerlanglibdir%|/opt/local/var/macports/build/_opt_local_var_macports_sources_rsync.macports.org_release_tarballs_ports_databases_couchdb/couchdb/work/apache-couchdb-1.6.1\/src\/couchdb|g" \
1555:info:build         -e "s|%couchlibdir%|/opt/local/var/macports/build/_opt_local_var_macports_sources_rsync.macports.org_release_tarballs_ports_databases_couchdb/couchdb/work/apache-couchdb-1.6.1\/src\/couchdb|g"\
1556:info:build         -e "s|%couchincludedir%|/opt/local/var/macports/build/_opt_local_var_macports_sources_rsync.macports.org_release_tarballs_ports_databases_couchdb/couchdb/work/apache-couchdb-1.6.1\/src\/couchdb|g"\
1557:info:build         -e "s|%couchebindir%|/opt/local/var/macports/build/_opt_local_var_macports_sources_rsync.macports.org_release_tarballs_ports_databases_couchdb/couchdb/work/apache-couchdb-1.6.1\/src\/couchdb|g"\
1558:info:build         -e "s|%couchprivlibdir%|/opt/local/var/macports/build/_opt_local_var_macports_sources_rsync.macports.org_release_tarballs_ports_databases_couchdb/couchdb/work/apache-couchdb-1.6.1/src/couchdb/priv/.libs|g"\
1559:info:build         -e "s|%localdatadir%|/opt/local/var/macports/build/_opt_local_var_macports_sources_rsync.macports.org_release_tarballs_ports_databases_couchdb/couchdb/work/apache-couchdb-1.6.1/share|g" \
1560:info:build         -e "s|%localbuilddatadir%|/opt/local/var/macports/build/_opt_local_var_macports_sources_rsync.macports.org_release_tarballs_ports_databases_couchdb/couchdb/work/apache-couchdb-1.6.1/share|g" \
1561:info:build         -e "s|%localstatelibdir%|/opt/local/var/macports/build/_opt_local_var_macports_sources_rsync.macports.org_release_tarballs_ports_databases_couchdb/couchdb/work/apache-couchdb-1.6.1/tmp/lib|g" \
1562:info:build         -e "s|%localstatelogdir%|/opt/local/var/macports/build/_opt_local_var_macports_sources_rsync.macports.org_release_tarballs_ports_databases_couchdb/couchdb/work/apache-couchdb-1.6.1/tmp/log|g" \
1563:info:build         -e "s|%localstatedir%|/opt/local/var/macports/build/_opt_local_var_macports_sources_rsync.macports.org_release_tarballs_ports_databases_couchdb/couchdb/work/apache-couchdb-1.6.1/tmp|g" \
1564:info:build         -e "s|%localstaterundir%|/opt/local/var/macports/build/_opt_local_var_macports_sources_rsync.macports.org_release_tarballs_ports_databases_couchdb/couchdb/work/apache-couchdb-1.6.1/tmp/run|g" \
1565:info:build         -e "s|%bug_uri%|https://issues.apache.org/jira/browse/COUCHDB|g" \
1566:info:build         -e "s|%package_author_address%|dev@couchdb.apache.org|g" \
1567:info:build         -e "s|%package_author_name%|The Apache Software Foundation|g" \
1568:info:build         -e "s|%package_name%|Apache CouchDB|g" \
1569:info:build         -e "s|%version%|1.6.1|g" \
1570:info:build         -e "s|%erlangversion%|19|g" \
1571:info:build         -e "s|%erlangbin%|/opt/local/bin/erl|g" \
1572:info:build         -e "s|%couchdb_command_name%|/opt/local/var/macports/build/_opt_local_var_macports_sources_rsync.macports.org_release_tarballs_ports_databases_couchdb/couchdb/work/apache-couchdb-1.6.1/utils/run|g" > \
1573:info:build     couch-config_dev < couch-config.tpl
1574:info:build chmod +x couch-config_dev
1575:info:build chmod +x couch-config
1576:info:build chmod +x couchdb
1577:info:build make[3]: Leaving directory `/opt/local/var/macports/build/_opt_local_var_macports_sources_rsync.macports.org_release_tarballs_ports_databases_couchdb/couchdb/work/apache-couchdb-1.6.1/bin'
1578:info:build make[2]: Leaving directory `/opt/local/var/macports/build/_opt_local_var_macports_sources_rsync.macports.org_release_tarballs_ports_databases_couchdb/couchdb/work/apache-couchdb-1.6.1/bin'
1579:info:build Making all in etc
1580:info:build make[2]: Entering directory `/opt/local/var/macports/build/_opt_local_var_macports_sources_rsync.macports.org_release_tarballs_ports_databases_couchdb/couchdb/work/apache-couchdb-1.6.1/etc'
1581:info:build Making all in couchdb
1582:info:build make[3]: Entering directory `/opt/local/var/macports/build/_opt_local_var_macports_sources_rsync.macports.org_release_tarballs_ports_databases_couchdb/couchdb/work/apache-couchdb-1.6.1/etc/couchdb'
1583:info:build sed -e "s|%bindir%|/opt/local/bin|g" \
1584:info:build         -e "s|%localconfdir%|/opt/local/etc/couchdb|g" \
1585:info:build         -e "s|%localdatadir%|/opt/local/share/couchdb|g" \
1586:info:build         -e "s|%localbuilddatadir%|/opt/local/share/couchdb|g" \
1587:info:build         -e "s|%locallibdir%|/opt/local/lib/couchdb|g" \
1588:info:build         -e "s|%localstatelibdir%|/opt/local/var/lib/couchdb|g" \
1589:info:build         -e "s|%localstatelogdir%|/opt/local/var/log/couchdb|g" \
1590:info:build         -e "s|%localstaterundir%|/opt/local/var/run/couchdb|g" \
1591:info:build         -e "s|%couchprivlibdir%|/opt/local/lib/couchdb/erlang/lib/couch-1.6.1/priv/lib|g" \
1592:info:build         -e "s|%couchjs_command_name%|`echo couchjs | sed 's,x,x,'`|g" \
1593:info:build         -e "s|%package_author_name%|The Apache Software Foundation|g" \
1594:info:build         -e "s|%version%|1.6.1|g" \
1595:info:build     < default.ini.tpl > default.ini
1596:info:build sed -e "s|%bindir%|/opt/local/var/macports/build/_opt_local_var_macports_sources_rsync.macports.org_release_tarballs_ports_databases_couchdb/couchdb/work/apache-couchdb-1.6.1/bin|g" \
1597:info:build         -e "s|%localconfdir%|/opt/local/var/macports/build/_opt_local_var_macports_sources_rsync.macports.org_release_tarballs_ports_databases_couchdb/couchdb/work/apache-couchdb-1.6.1/etc/couchdb|g" \
1598:info:build         -e "s|%localdatadir%|/opt/local/var/macports/build/_opt_local_var_macports_sources_rsync.macports.org_release_tarballs_ports_databases_couchdb/couchdb/work/apache-couchdb-1.6.1/share|g" \
1599:info:build         -e "s|%locallibdir%|/opt/local/var/macports/build/_opt_local_var_macports_sources_rsync.macports.org_release_tarballs_ports_databases_couchdb/couchdb/work/apache-couchdb-1.6.1/tmp|g" \
1600:info:build         -e "s|%localbuilddatadir%|/opt/local/var/macports/build/_opt_local_var_macports_sources_rsync.macports.org_release_tarballs_ports_databases_couchdb/couchdb/work/apache-couchdb-1.6.1/share|g" \
1601:info:build         -e "s|%localstatelibdir%|/opt/local/var/macports/build/_opt_local_var_macports_sources_rsync.macports.org_release_tarballs_ports_databases_couchdb/couchdb/work/apache-couchdb-1.6.1/tmp/lib|g" \
1602:info:build         -e "s|%localstatelogdir%|/opt/local/var/macports/build/_opt_local_var_macports_sources_rsync.macports.org_release_tarballs_ports_databases_couchdb/couchdb/work/apache-couchdb-1.6.1/tmp/log|g" \
1603:info:build         -e "s|%localstaterundir%|/opt/local/var/macports/build/_opt_local_var_macports_sources_rsync.macports.org_release_tarballs_ports_databases_couchdb/couchdb/work/apache-couchdb-1.6.1/tmp/run|g" \
1604:info:build         -e "s|%couchprivlibdir%|/opt/local/var/macports/build/_opt_local_var_macports_sources_rsync.macports.org_release_tarballs_ports_databases_couchdb/couchdb/work/apache-couchdb-1.6.1/src/couchdb/priv/.libs|g" \
1605:info:build         -e "s|%couchjs_command_name%|`echo couchjs_dev | sed 's,x,x,'`|g" \
1606:info:build         -e "s|%package_author_name%|The Apache Software Foundation|g" \
1607:info:build         -e "s|%version%|1.6.1|g" \
1608:info:build     < default.ini.tpl > default_dev.ini
1609:info:build if test ! -f "local_dev.ini"; then \
1610:info:build         cp local.ini local_dev.ini; \
1611:info:build         chmod +w local_dev.ini; \
1612:info:build     fi
1613:info:build make[3]: Leaving directory `/opt/local/var/macports/build/_opt_local_var_macports_sources_rsync.macports.org_release_tarballs_ports_databases_couchdb/couchdb/work/apache-couchdb-1.6.1/etc/couchdb'
1614:info:build Making all in default
1615:info:build make[3]: Entering directory `/opt/local/var/macports/build/_opt_local_var_macports_sources_rsync.macports.org_release_tarballs_ports_databases_couchdb/couchdb/work/apache-couchdb-1.6.1/etc/default'
1616:info:build make[3]: Nothing to be done for `all'.
1617:info:build make[3]: Leaving directory `/opt/local/var/macports/build/_opt_local_var_macports_sources_rsync.macports.org_release_tarballs_ports_databases_couchdb/couchdb/work/apache-couchdb-1.6.1/etc/default'
1618:info:build Making all in init
1619:info:build make[3]: Entering directory `/opt/local/var/macports/build/_opt_local_var_macports_sources_rsync.macports.org_release_tarballs_ports_databases_couchdb/couchdb/work/apache-couchdb-1.6.1/etc/init'
1620:info:build make[3]: Nothing to be done for `all'.
1621:info:build make[3]: Leaving directory `/opt/local/var/macports/build/_opt_local_var_macports_sources_rsync.macports.org_release_tarballs_ports_databases_couchdb/couchdb/work/apache-couchdb-1.6.1/etc/init'
1622:info:build Making all in launchd
1623:info:build make[3]: Entering directory `/opt/local/var/macports/build/_opt_local_var_macports_sources_rsync.macports.org_release_tarballs_ports_databases_couchdb/couchdb/work/apache-couchdb-1.6.1/etc/launchd'
1624:info:build make[3]: Nothing to be done for `all'.
1625:info:build make[3]: Leaving directory `/opt/local/var/macports/build/_opt_local_var_macports_sources_rsync.macports.org_release_tarballs_ports_databases_couchdb/couchdb/work/apache-couchdb-1.6.1/etc/launchd'
1626:info:build Making all in logrotate.d
1627:info:build make[3]: Entering directory `/opt/local/var/macports/build/_opt_local_var_macports_sources_rsync.macports.org_release_tarballs_ports_databases_couchdb/couchdb/work/apache-couchdb-1.6.1/etc/logrotate.d'
1628:info:build make[3]: Nothing to be done for `all'.
1629:info:build make[3]: Leaving directory `/opt/local/var/macports/build/_opt_local_var_macports_sources_rsync.macports.org_release_tarballs_ports_databases_couchdb/couchdb/work/apache-couchdb-1.6.1/etc/logrotate.d'
1630:info:build Making all in windows
1631:info:build make[3]: Entering directory `/opt/local/var/macports/build/_opt_local_var_macports_sources_rsync.macports.org_release_tarballs_ports_databases_couchdb/couchdb/work/apache-couchdb-1.6.1/etc/windows'
1632:info:build make[3]: Nothing to be done for `all'.
1633:info:build make[3]: Leaving directory `/opt/local/var/macports/build/_opt_local_var_macports_sources_rsync.macports.org_release_tarballs_ports_databases_couchdb/couchdb/work/apache-couchdb-1.6.1/etc/windows'
1634:info:build make[3]: Entering directory `/opt/local/var/macports/build/_opt_local_var_macports_sources_rsync.macports.org_release_tarballs_ports_databases_couchdb/couchdb/work/apache-couchdb-1.6.1/etc'
1635:info:build if test "../build-aux/install-sh -c -d"; then \
1636:info:build         ../build-aux/install-sh -c -d launchd; \
1637:info:build     else \
1638:info:build         if test ! -d launchd; then \
1639:info:build             mkdir launchd; \
1640:info:build         fi \
1641:info:build     fi
1642:info:build sed -e "s|%localstatelogdir%|/opt/local/var/log/couchdb|g" < logrotate.d/couchdb.tpl > logrotate.d/couchdb
1643:info:build sed -e "s|%configure_input%|launchd/org.apache.couchdb.plist. Generated from launchd/org.apache.couchdb.plist.tpl by configure.|" \
1644:info:build         -e "s|%bindir%|/opt/local/bin|" \
1645:info:build         -e "s|%couchdb_command_name%|`echo couchdb | sed 's,x,x,'`|" \
1646:info:build     < launchd/org.apache.couchdb.plist.tpl > launchd/org.apache.couchdb.plist
1647:info:build make[3]: Leaving directory `/opt/local/var/macports/build/_opt_local_var_macports_sources_rsync.macports.org_release_tarballs_ports_databases_couchdb/couchdb/work/apache-couchdb-1.6.1/etc'
1648:info:build make[2]: Leaving directory `/opt/local/var/macports/build/_opt_local_var_macports_sources_rsync.macports.org_release_tarballs_ports_databases_couchdb/couchdb/work/apache-couchdb-1.6.1/etc'
1649:info:build Making all in src
1650:info:build make[2]: Entering directory `/opt/local/var/macports/build/_opt_local_var_macports_sources_rsync.macports.org_release_tarballs_ports_databases_couchdb/couchdb/work/apache-couchdb-1.6.1/src'
1651:info:build Making all in couch_dbupdates
1652:info:build make[3]: Entering directory `/opt/local/var/macports/build/_opt_local_var_macports_sources_rsync.macports.org_release_tarballs_ports_databases_couchdb/couchdb/work/apache-couchdb-1.6.1/src/couch_dbupdates'
1653:info:build /opt/local/bin/erlc -I../../src/couchdb -o ebin/   src/couch_dbupdates.erl;
1654:info:build /opt/local/bin/erlc -I../../src/couchdb -o ebin/   src/couch_dbupdates_httpd.erl;
1655:info:build make[3]: Leaving directory `/opt/local/var/macports/build/_opt_local_var_macports_sources_rsync.macports.org_release_tarballs_ports_databases_couchdb/couchdb/work/apache-couchdb-1.6.1/src/couch_dbupdates'
1656:info:build Making all in couch_index
1657:info:build make[3]: Entering directory `/opt/local/var/macports/build/_opt_local_var_macports_sources_rsync.macports.org_release_tarballs_ports_databases_couchdb/couchdb/work/apache-couchdb-1.6.1/src/couch_index'
1658:info:build /opt/local/bin/erlc -I../../src/couchdb -o ebin/   src/couch_index.erl;
1659:info:build /opt/local/bin/erlc -I../../src/couchdb -o ebin/   src/couch_index_compactor.erl;
1660:info:build /opt/local/bin/erlc -I../../src/couchdb -o ebin/   src/couch_index_updater.erl;
1661:info:build /opt/local/bin/erlc -I../../src/couchdb -o ebin/   src/couch_index_server.erl;
1662:info:build /opt/local/bin/erlc -I../../src/couchdb -o ebin/   src/couch_index_util.erl;
1663:info:build make[3]: Leaving directory `/opt/local/var/macports/build/_opt_local_var_macports_sources_rsync.macports.org_release_tarballs_ports_databases_couchdb/couchdb/work/apache-couchdb-1.6.1/src/couch_index'
1664:info:build Making all in couch_mrview
1665:info:build make[3]: Entering directory `/opt/local/var/macports/build/_opt_local_var_macports_sources_rsync.macports.org_release_tarballs_ports_databases_couchdb/couchdb/work/apache-couchdb-1.6.1/src/couch_mrview'
1666:info:build sed -e "s|%version%|1.6.1|g" \
1667:info:build     < src/couch_mrview.app.src > ebin/couch_mrview.app
1668:info:build /opt/local/bin/erlc -Wall -I../../src -I../../src/couchdb \
1669:info:build         -o ebin/   src/couch_mrview.erl;
1670:info:build /opt/local/bin/erlc -Wall -I../../src -I../../src/couchdb \
1671:info:build         -o ebin/   src/couch_mrview_cleanup.erl;
1672:info:build /opt/local/bin/erlc -Wall -I../../src -I../../src/couchdb \
1673:info:build         -o ebin/   src/couch_mrview_compactor.erl;
1674:info:build /opt/local/bin/erlc -Wall -I../../src -I../../src/couchdb \
1675:info:build         -o ebin/   src/couch_mrview_index.erl;
1676:info:build /opt/local/bin/erlc -Wall -I../../src -I../../src/couchdb \
1677:info:build         -o ebin/   src/couch_mrview_http.erl;
1678:info:build /opt/local/bin/erlc -Wall -I../../src -I../../src/couchdb \
1679:info:build         -o ebin/   src/couch_mrview_show.erl;
1680:info:build /opt/local/bin/erlc -Wall -I../../src -I../../src/couchdb \
1681:info:build         -o ebin/   src/couch_mrview_test_util.erl;
1682:info:build /opt/local/bin/erlc -Wall -I../../src -I../../src/couchdb \
1683:info:build         -o ebin/   src/couch_mrview_updater.erl;
1684:info:build /opt/local/bin/erlc -Wall -I../../src -I../../src/couchdb \
1685:info:build         -o ebin/   src/couch_mrview_util.erl;
1686:info:build make[3]: Leaving directory `/opt/local/var/macports/build/_opt_local_var_macports_sources_rsync.macports.org_release_tarballs_ports_databases_couchdb/couchdb/work/apache-couchdb-1.6.1/src/couch_mrview'
1687:info:build Making all in couch_plugins
1688:info:build make[3]: Entering directory `/opt/local/var/macports/build/_opt_local_var_macports_sources_rsync.macports.org_release_tarballs_ports_databases_couchdb/couchdb/work/apache-couchdb-1.6.1/src/couch_plugins'
1689:info:build /opt/local/bin/erlc -Wall -I../../src -I../../src/couchdb \
1690:info:build             -o ebin/   src/couch_plugins.erl;
1691:info:build /opt/local/bin/erlc -Wall -I../../src -I../../src/couchdb \
1692:info:build             -o ebin/   src/couch_plugins_httpd.erl;
1693:info:build sed -e "s|%version%|1.6.1|g" \
1694:info:build     < src/couch_plugins.app.src > ebin/couch_plugins.app
1695:info:build src/couch_plugins.erl:231: Warning: crypto:sha/1 is deprecated and will be removed in a future release; use crypto:hash/2
1696:info:build make[3]: Leaving directory `/opt/local/var/macports/build/_opt_local_var_macports_sources_rsync.macports.org_release_tarballs_ports_databases_couchdb/couchdb/work/apache-couchdb-1.6.1/src/couch_plugins'
1697:info:build Making all in couch_replicator
1698:info:build make[3]: Entering directory `/opt/local/var/macports/build/_opt_local_var_macports_sources_rsync.macports.org_release_tarballs_ports_databases_couchdb/couchdb/work/apache-couchdb-1.6.1/src/couch_replicator'
1699:info:build /opt/local/bin/erlc -Wall -I../../src -I../../src/couchdb \
1700:info:build         -o ebin/   src/couch_replicator_api_wrap.erl;
1701:info:build /opt/local/bin/erlc -Wall -I../../src -I../../src/couchdb \
1702:info:build         -o ebin/   src/couch_replicator_httpc_pool.erl;
1703:info:build /opt/local/bin/erlc -Wall -I../../src -I../../src/couchdb \
1704:info:build         -o ebin/   src/couch_replicator_httpc.erl;
1705:info:build /opt/local/bin/erlc -Wall -I../../src -I../../src/couchdb \
1706:info:build         -o ebin/   src/couch_replicator_httpd.erl;
1707:info:build /opt/local/bin/erlc -Wall -I../../src -I../../src/couchdb \
1708:info:build         -o ebin/   src/couch_replicator_job_sup.erl;
1709:info:build /opt/local/bin/erlc -Wall -I../../src -I../../src/couchdb \
1710:info:build         -o ebin/   src/couch_replicator_notifier.erl;
1711:info:build /opt/local/bin/erlc -Wall -I../../src -I../../src/couchdb \
1712:info:build         -o ebin/   src/couch_replicator_manager.erl;
1713:info:build /opt/local/bin/erlc -Wall -I../../src -I../../src/couchdb \
1714:info:build         -o ebin/   src/couch_replicator_utils.erl;
1715:info:build /opt/local/bin/erlc -Wall -I../../src -I../../src/couchdb \
1716:info:build         -o ebin/   src/couch_replicator_worker.erl;
1717:info:build sed -e "s|%version%|1.6.1|g" \
1718:info:build     < src/couch_replicator.app.src > ebin/couch_replicator.app
1719:info:build /opt/local/bin/erlc -Wall -I../../src -I../../src/couchdb \
1720:info:build         -o ebin/   src/couch_replicator.erl;
1721:info:build src/couch_replicator_manager.erl:564: Warning: erlang:now/0: Deprecated BIF. See the "Time and Time Correction in Erlang" chapter of the ERTS User's Guide for more information.
1722:info:build src/couch_replicator_worker.erl:75: Warning: erlang:now/0: Deprecated BIF. See the "Time and Time Correction in Erlang" chapter of the ERTS User's Guide for more information.
1723:info:build src/couch_replicator_worker.erl:91: Warning: erlang:now/0: Deprecated BIF. See the "Time and Time Correction in Erlang" chapter of the ERTS User's Guide for more information.
1724:info:build src/couch_replicator_worker.erl:238: Warning: erlang:now/0: Deprecated BIF. See the "Time and Time Correction in Erlang" chapter of the ERTS User's Guide for more information.
1725:info:build src/couch_replicator_worker.erl:378: Warning: erlang:now/0: Deprecated BIF. See the "Time and Time Correction in Erlang" chapter of the ERTS User's Guide for more information.
1726:info:build src/couch_replicator_worker.erl:507: Warning: erlang:now/0: Deprecated BIF. See the "Time and Time Correction in Erlang" chapter of the ERTS User's Guide for more information.
1727:info:build make[3]: Leaving directory `/opt/local/var/macports/build/_opt_local_var_macports_sources_rsync.macports.org_release_tarballs_ports_databases_couchdb/couchdb/work/apache-couchdb-1.6.1/src/couch_replicator'
1728:info:build Making all in couchdb
1729:info:build make[3]: Entering directory `/opt/local/var/macports/build/_opt_local_var_macports_sources_rsync.macports.org_release_tarballs_ports_databases_couchdb/couchdb/work/apache-couchdb-1.6.1/src/couchdb'
1730:info:build Making all in priv
1731:info:build make[4]: Entering directory `/opt/local/var/macports/build/_opt_local_var_macports_sources_rsync.macports.org_release_tarballs_ports_databases_couchdb/couchdb/work/apache-couchdb-1.6.1/src/couchdb/priv'
1732:info:build /Applications/Xcode.app/Contents/Developer/usr/bin/make  all-am
1733:info:build make[5]: Entering directory `/opt/local/var/macports/build/_opt_local_var_macports_sources_rsync.macports.org_release_tarballs_ports_databases_couchdb/couchdb/work/apache-couchdb-1.6.1/src/couchdb/priv'
1734:info:build cp spawnkillable/couchspawnkillable.sh couchspawnkillable
1735:info:build cp stat_descriptions.cfg.in stat_descriptions.cfg
1736:info:build chmod +x couchspawnkillable
1737:info:build /bin/sh ../../../libtool  --tag=CC   --mode=compile /usr/bin/clang -DHAVE_CONFIG_H -I. -I../../.. -I../../../src/snappy/google-snappy  -D_BSD_SOURCE -I/opt/local/include  -I/opt/local/lib/erlang/usr/include -I/usr/lib/erlang/usr/include -I/usr/local/lib/erlang/usr/include -I/opt/local/lib/erlang/usr/include -I/opt/local/include -I/opt/local/include -I/opt/local/include/js -I/usr/local/include -I/usr/local/include/js -I/usr/include -I/usr/include/js   -O2 -pipe -Os -arch x86_64 -MT couch_ejson_compare/couch_ejson_compare_la-couch_ejson_compare.lo -MD -MP -MF couch_ejson_compare/.deps/couch_ejson_compare_la-couch_ejson_compare.Tpo -c -o couch_ejson_compare/couch_ejson_compare_la-couch_ejson_compare.lo `test -f 'couch_ejson_compare/couch_ejson_compare.c' || echo './'`couch_ejson_compare/couch_ejson_compare.c
1738:info:build /bin/sh ../../../libtool  --tag=CC   --mode=compile /usr/bin/clang -DHAVE_CONFIG_H -I. -I../../.. -I../../../src/snappy/google-snappy  -I/opt/local/include  -I/opt/local/lib/erlang/usr/include -I/usr/lib/erlang/usr/include -I/usr/local/lib/erlang/usr/include -I/opt/local/lib/erlang/usr/include -I/opt/local/include -I/opt/local/include -I/opt/local/include/js -I/usr/local/include -I/usr/local/include/js -I/usr/include -I/usr/include/js   -O2 -pipe -Os -arch x86_64 -MT icu_driver/couch_icu_driver_la-couch_icu_driver.lo -MD -MP -MF icu_driver/.deps/couch_icu_driver_la-couch_icu_driver.Tpo -c -o icu_driver/couch_icu_driver_la-couch_icu_driver.lo `test -f 'icu_driver/couch_icu_driver.c' || echo './'`icu_driver/couch_icu_driver.c
1739:info:build /usr/bin/clang -DHAVE_CONFIG_H -I. -I../../.. -I../../../src/snappy/google-snappy   -I/opt/local/include -I/opt/local/include -I/opt/local/include/js -I/usr/local/include -I/usr/local/include/js -I/usr/include -I/usr/include/js  -g -Wall -D_BSD_SOURCE -I/opt/local/include -DXP_UNIX -I/opt/local/include/mozjs185 -I/opt/local/include/nspr -O2 -pipe -Os -arch x86_64 -MT couch_js/couchjs-http.o -MD -MP -MF couch_js/.deps/couchjs-http.Tpo -c -o couch_js/couchjs-http.o `test -f 'couch_js/http.c' || echo './'`couch_js/http.c
1740:info:build /usr/bin/clang -DHAVE_CONFIG_H -I. -I../../.. -I../../../src/snappy/google-snappy   -I/opt/local/include -I/opt/local/include -I/opt/local/include/js -I/usr/local/include -I/usr/local/include/js -I/usr/include -I/usr/include/js  -g -Wall -D_BSD_SOURCE -I/opt/local/include -DXP_UNIX -I/opt/local/include/mozjs185 -I/opt/local/include/nspr -O2 -pipe -Os -arch x86_64 -MT couch_js/couchjs-main.o -MD -MP -MF couch_js/.deps/couchjs-main.Tpo -c -o couch_js/couchjs-main.o `test -f 'couch_js/main.c' || echo './'`couch_js/main.c
1741:info:build /usr/bin/clang -DHAVE_CONFIG_H -I. -I../../.. -I../../../src/snappy/google-snappy   -I/opt/local/include -I/opt/local/include -I/opt/local/include/js -I/usr/local/include -I/usr/local/include/js -I/usr/include -I/usr/include/js  -g -Wall -D_BSD_SOURCE -I/opt/local/include -DXP_UNIX -I/opt/local/include/mozjs185 -I/opt/local/include/nspr -O2 -pipe -Os -arch x86_64 -MT couch_js/couchjs-utf8.o -MD -MP -MF couch_js/.deps/couchjs-utf8.Tpo -c -o couch_js/couchjs-utf8.o `test -f 'couch_js/utf8.c' || echo './'`couch_js/utf8.c
1742:info:build /usr/bin/clang -DHAVE_CONFIG_H -I. -I../../.. -I../../../src/snappy/google-snappy   -I/opt/local/include -I/opt/local/include -I/opt/local/include/js -I/usr/local/include -I/usr/local/include/js -I/usr/include -I/usr/include/js  -g -Wall -D_BSD_SOURCE -I/opt/local/include -DXP_UNIX -I/opt/local/include/mozjs185 -I/opt/local/include/nspr -O2 -pipe -Os -arch x86_64 -MT couch_js/couchjs-util.o -MD -MP -MF couch_js/.deps/couchjs-util.Tpo -c -o couch_js/couchjs-util.o `test -f 'couch_js/util.c' || echo './'`couch_js/util.c
1743:info:build libtool: compile:  /usr/bin/clang -DHAVE_CONFIG_H -I. -I../../.. -I../../../src/snappy/google-snappy -D_BSD_SOURCE -I/opt/local/include -I/opt/local/lib/erlang/usr/include -I/usr/lib/erlang/usr/include -I/usr/local/lib/erlang/usr/include -I/opt/local/lib/erlang/usr/include -I/opt/local/include -I/opt/local/include -I/opt/local/include/js -I/usr/local/include -I/usr/local/include/js -I/usr/include -I/usr/include/js -O2 -pipe -Os -arch x86_64 -MT couch_ejson_compare/couch_ejson_compare_la-couch_ejson_compare.lo -MD -MP -MF couch_ejson_compare/.deps/couch_ejson_compare_la-couch_ejson_compare.Tpo -c couch_ejson_compare/couch_ejson_compare.c  -fno-common -DPIC -o couch_ejson_compare/.libs/couch_ejson_compare_la-couch_ejson_compare.o
1744:info:build couch_js/utf8.c:137:11: warning: implicit declaration of function 'JS_GetStringCharsAndLength' is invalid in C99 [-Wimplicit-function-declaration]
1745:info:build     src = JS_GetStringCharsAndLength(cx, str, &srclen);
1746:info:build           ^
1747:info:build couch_js/utf8.c:137:9: warning: incompatible integer to pointer conversion assigning to 'const jschar *' (aka 'const unsigned short *') from 'int' [-Wint-conversion]
1748:info:build     src = JS_GetStringCharsAndLength(cx, str, &srclen);
1749:info:build         ^ ~~~~~~~~~~~~~~~~~~~~~~~~~~~~~~~~~~~~~~~~~~~~
1750:info:build libtool: compile:  /usr/bin/clang -DHAVE_CONFIG_H -I. -I../../.. -I../../../src/snappy/google-snappy -I/opt/local/include -I/opt/local/lib/erlang/usr/include -I/usr/lib/erlang/usr/include -I/usr/local/lib/erlang/usr/include -I/opt/local/lib/erlang/usr/include -I/opt/local/include -I/opt/local/include -I/opt/local/include/js -I/usr/local/include -I/usr/local/include/js -I/usr/include -I/usr/include/js -O2 -pipe -Os -arch x86_64 -MT icu_driver/couch_icu_driver_la-couch_icu_driver.lo -MD -MP -MF icu_driver/.deps/couch_icu_driver_la-couch_icu_driver.Tpo -c icu_driver/couch_icu_driver.c  -fno-common -DPIC -o icu_driver/.libs/couch_icu_driver_la-couch_icu_driver.o
1751:info:build In file included from couch_js/main.c:16:
1752:info:build couch_js/sm185.c:37:5: error: use of undeclared identifier 'JS_StrictPropertyStub'; did you mean 'JS_PropertyStub'?
1753:info:build     JS_StrictPropertyStub,
1754:info:build     ^~~~~~~~~~~~~~~~~~~~~
1755:info:build     JS_PropertyStub
1756:info:build /opt/local/include/js/jsapi.h:1130:1: note: 'JS_PropertyStub' declared here
1757:info:build JS_PropertyStub(JSContext *cx, JSObject *obj, jsval id, jsval *vp);
1758:info:build ^
1759:info:build In file included from couch_js/main.c:16:
1760:info:build couch_js/sm185.c:50:21: warning: implicit declaration of function 'JS_NewObjectForConstructor' is invalid in C99 [-Wimplicit-function-declaration]
1761:info:build     JSObject* obj = JS_NewObjectForConstructor(cx, vp);
1762:info:build                     ^
1763:info:build couch_js/sm185.c:50:15: warning: incompatible integer to pointer conversion initializing 'JSObject *' (aka 'struct JSObject *') with an expression of type 'int' [-Wint-conversion]
1764:info:build     JSObject* obj = JS_NewObjectForConstructor(cx, vp);
1765:info:build               ^     ~~~~~~~~~~~~~~~~~~~~~~~~~~~~~~~~~~
1766:info:build couch_js/sm185.c:56:5: warning: implicit declaration of function 'JS_SET_RVAL' is invalid in C99 [-Wimplicit-function-declaration]
1767:info:build     JS_SET_RVAL(cx, vp, OBJECT_TO_JSVAL(obj));
1768:info:build     ^
1769:info:build couch_js/sm185.c:71:21: warning: implicit declaration of function 'JS_THIS_OBJECT' is invalid in C99 [-Wimplicit-function-declaration]
1770:info:build     JSObject* obj = JS_THIS_OBJECT(cx, vp);
1771:info:build                     ^
1772:info:build couch_js/sm185.c:71:15: warning: incompatible integer to pointer conversion initializing 'JSObject *' (aka 'struct JSObject *') with an expression of type 'int' [-Wint-conversion]
1773:info:build     JSObject* obj = JS_THIS_OBJECT(cx, vp);
1774:info:build               ^     ~~~~~~~~~~~~~~~~~~~~~~
1775:info:build couch_js/sm185.c:72:19: warning: implicit declaration of function 'JS_ARGV' is invalid in C99 [-Wimplicit-function-declaration]
1776:info:build     jsval* argv = JS_ARGV(cx, vp);
1777:info:build                   ^
1778:info:build couch_js/sm185.c:72:12: warning: incompatible integer to pointer conversion initializing 'jsval *' (aka 'long *') with an expression of type 'int' [-Wint-conversion]
1779:info:build     jsval* argv = JS_ARGV(cx, vp);
1780:info:build            ^      ~~~~~~~~~~~~~~~
1781:info:build couch_js/sm185.ccouch_js/util.c::25583:25::26: warning:  warning: shifting a negative signed value is undefined [-Wshift-negative-value]
1782:info:build implicit declaration of function 'JS_NewRegExpObjectNoStatics' is invalid in C99 [-Wimplicit-function-declaration]
1783:info:build     JS_SET_RVAL(cx, vp, JSVAL_VOID);
1784:info:build                         ^~~~~~~~~~
1785:info:build /opt/local/include/js/jsapi.h:205:33: note: expanded from macro 'JSVAL_VOID'
1786:info:build                (regexp = JS_NewRegExpObjectNoStatics(
1787:info:build                          ^
1788:info:build #define JSVAL_VOID              INT_TO_JSVAL(0 - JSVAL_INT_POW2(30))
1789:info:build                                 ^~~~~~~~~~~~~~~~~~~~~~~~~~~~~~~~~~~~
1790:info:build /opt/local/include/js/jsapi.h:104:46: note: expanded from macro 'INT_TO_JSVAL'
1791:info:build #define INT_TO_JSVAL(i)         (((jsval)(i) << 1) | JSVAL_INT)
1792:info:build                                   ~~~~~~~~~~ ^
1793:info:build couch_js/util.c:255:24: warning: incompatible integer to pointer conversion assigning to 'JSObject *' (aka 'struct JSObject *') from 'int' [-Wint-conversion]
1794:info:build In file included from couch_js/main.c:16:
1795:info:build couch_js/sm185.c:91:15: warning               (regexp = JS_NewRegExpObjectNoStatics(:
1796:info:build incompatible integer to pointer conversion initializing 'JSObject *' (aka 'struct JSObject *') with an expression of type 'int' [-Wint-conversion]                       ^ ~~~~~~~~~~~~~~~~~~~~~~~~~~~~
1797:info:build
1798:info:build     JSObject* obj = JS_THIS_OBJECT(cx, vp);
1799:info:build               ^     ~~~~~~~~~~~~~~~~~~~~~~
1800:info:build couch_js/sm185.c:92:12: warning: incompatible integer to pointer conversion initializing 'jsval *' (aka 'long *') with an expression of type 'int' [-Wint-conversion]
1801:info:build     jsval* argv = JS_ARGV(cx, vp);
1802:info:build            ^      ~~~~~~~~~~~~~~~
1803:info:build couch_js/sm185.c:101:25: warning: shifting a negative signed value is undefined [-Wshift-negative-value]
1804:info:build     JS_SET_RVAL(cx, vp, JSVAL_VOID);
1805:info:build                         ^~~~~~~~~~
1806:info:build /opt/local/include/js/jsapi.h:205:33: note: expanded from macro 'JSVAL_VOID'
1807:info:build #define JSVAL_VOID              INT_TO_JSVAL(0 - JSVAL_INT_POW2(30))
1808:info:build                                 ^~~~~~~~~~~~~~~~~~~~~~~~~~~~~~~~~~~~
1809:info:build /opt/local/include/js/jsapi.h:104:46: note: expanded from macro 'INT_TO_JSVAL'
1810:info:build #define INT_TO_JSVAL(i)         (((jsval)(i) << 1) | JSVAL_INT)
1811:info:build                                   ~~~~~~~~~~ ^
1812:info:build In file included from couch_js/main.c:16:
1813:info:build couch_js/sm185.c:109:15: warning: incompatible integer to pointer conversion initializing 'JSObject *' (aka 'struct JSObject *') with an expression of type 'int' [-Wint-conversion]
1814:info:build     JSObject* obj = JS_THIS_OBJECT(cx, vp);
1815:info:build               ^     ~~~~~~~~~~~~~~~~~~~~~~
1816:info:build couch_js/sm185.c:110:12: warning: incompatible integer to pointer conversion initializing 'jsval *' (aka 'long *') with an expression of type 'int' [-Wint-conversion]
1817:info:build     jsval* argv = JS_ARGV(cx, vp);
1818:info:build            ^      ~~~~~~~~~~~~~~~
1819:info:build couch_js/sm185.c:119:25: warning: shifting a negative signed value is undefined [-Wshift-negative-value]
1820:info:build     JS_SET_RVAL(cx, vp, JSVAL_VOID);
1821:info:build                         ^~~~~~~~~~
1822:info:build /opt/local/include/js/jsapi.h:205:33: note: expanded from macro 'JSVAL_VOID'
1823:info:build #define JSVAL_VOID              INT_TO_JSVAL(0 - JSVAL_INT_POW2(30))
1824:info:build                                 ^~~~~~~~~~~~~~~~~~~~~~~~~~~~~~~~~~~~
1825:info:build /opt/local/include/js/jsapi.h:104:46: note: expanded from macro 'INT_TO_JSVAL'
1826:info:build #define INT_TO_JSVAL(i)         (((jsval)(i) << 1) | JSVAL_INT)
1827:info:build                                   ~~~~~~~~~~ ^
1828:info:build In file included from couch_js/main.c:16:
1829:info:build couch_js/sm185.c:140:37: warning: implicit declaration of function 'JS_RVAL' is invalid in C99 [-Wimplicit-function-declaration]
1830:info:build     return http_uri(cx, obj, args, &JS_RVAL(cx, vp));
1831:info:build                                     ^
1832:info:build couch_js/sm185.c:140:36: error: cannot take the address of an rvalue of type 'int'
1833:info:build     return http_uri(cx, obj, args, &JS_RVAL(cx, vp));
1834:info:build                                    ^~~~~~~~~~~~~~~~
1835:info:build couch_js/sm185.c:147:12: warning: incompatible integer to pointer conversion initializing 'jsval *' (aka 'long *') with an expression of type 'int' [-Wint-conversion]
1836:info:build     jsval* argv = JS_ARGV(cx, vp);
1837:info:build            ^      ~~~~~~~~~~~~~~~
1838:info:build couch_js/sm185.c:152:5: error: use of undeclared identifier 'JSCrossCompartmentCall'
1839:info:build     JSCrossCompartmentCall* call = NULL;
1840:info:build     ^
1841:info:build couch_js/sm185.c:152:29: error: use of undeclared identifier 'call'
1842:info:build     JSCrossCompartmentCall* call = NULL;
1843:info:build                             ^
1844:info:build couch_js/sm185.c:170:5: warning: implicit declaration of function 'JS_SetContextThread' is invalid in C99 [-Wimplicit-function-declaration]
1845:info:build     SETUP_REQUEST(subcx);
1846:info:build     ^
1847:info:build couch_js/sm185.c:24:5: note: expanded from macro 'SETUP_REQUEST'
1848:info:build     JS_SetContextThread(cx); \
1849:info:build     ^
1850:info:build couch_js/sm185.c:170:5: warning: implicit declaration of function 'JS_BeginRequest' is invalid in C99 [-Wimplicit-function-declaration]
1851:info:build couch_js/sm185.c:25:5: note: expanded from macro 'SETUP_REQUEST'
1852:info:build     JS_BeginRequest(cx);
1853:info:build     ^
1854:info:build couch_js/sm185.c:172:11: warning: implicit declaration of function 'JS_GetStringCharsAndLength' is invalid in C99 [-Wimplicit-function-declaration]
1855:info:build     src = JS_GetStringCharsAndLength(cx, str, &srclen);
1856:info:build           ^
1857:info:build couch_js/sm185.c:172:9: warning: incompatible integer to pointer conversion assigning to 'const jschar *' (aka 'const unsigned short *') from 'int' [-Wint-conversion]
1858:info:build     src = JS_GetStringCharsAndLength(cx, str, &srclen);
1859:info:build         ^ ~~~~~~~~~~~~~~~~~~~~~~~~~~~~~~~~~~~~~~~~~~~~
1860:info:build couch_js/sm185.c:178:5: error: use of undeclared identifier 'call'
1861:info:build     call = JS_EnterCrossCompartmentCall(subcx, global);
1862:info:build     ^
1863:info:build couch_js/sm185.c:178:12: warning: implicit declaration of function 'JS_EnterCrossCompartmentCall' is invalid in C99 [-Wimplicit-function-declaration]
1864:info:build     call = JS_EnterCrossCompartmentCall(subcx, global);
1865:info:build            ^
1866:info:build couch_js/sm185.c:181:19: warning: implicit declaration of function 'JS_NewGlobalObject' is invalid in C99 [-Wimplicit-function-declaration]
1867:info:build         sandbox = JS_NewGlobalObject(subcx, &global_class);
1868:info:build                   ^
1869:info:build couch_js/sm185.c:181:17: warning: incompatible integer to pointer conversion assigning to 'JSObject *' (aka 'struct JSObject *') from 'int' [-Wint-conversion]
1870:info:build         sandbox = JS_NewGlobalObject(subcx, &global_class);
1871:info:build                 ^ ~~~~~~~~~~~~~~~~~~~~~~~~~~~~~~~~~~~~~~~~
1872:info:build couch_js/sm185.c:202:5: warning: implicit declaration of function 'JS_LeaveCrossCompartmentCall' is invalid in C99 [-Wimplicit-function-declaration]
1873:info:build     JS_LeaveCrossCompartmentCall(call);
1874:info:build     ^
1875:info:build couch_js/sm185.c:202:34: error: use of undeclared identifier 'call'
1876:info:build     JS_LeaveCrossCompartmentCall(call);
1877:info:build                                  ^
1878:info:build couch_js/sm185.c:203:5: warning: implicit declaration of function 'JS_EndRequest' is invalid in C99 [-Wimplicit-function-declaration]
1879:info:build     FINISH_REQUEST(subcx);
1880:info:build     ^
1881:info:build couch_js/sm185.c:27:5: note: expanded from macro 'FINISH_REQUEST'
1882:info:build     JS_EndRequest(cx); \
1883:info:build     ^
1884:info:build couch_js/sm185.c:203:5: warning: implicit declaration of function 'JS_ClearContextThread' is invalid in C99 [-Wimplicit-function-declaration]
1885:info:build couch_js/sm185.c:28:5: note: expanded from macro 'FINISH_REQUEST'
1886:info:build     JS_ClearContextThread(cx);
1887:info:build     ^
1888:info:build couch_js/sm185.c:213:25: warning: shifting a negative signed value is undefined [-Wshift-negative-value]
1889:info:build     JS_SET_RVAL(cx, vp, JSVAL_VOID);
1890:info:build                         ^~~~~~~~~~
1891:info:build /opt/local/include/js/jsapi.h:205:33: note: expanded from macro 'JSVAL_VOID'
1892:info:build #define JSVAL_VOID              INT_TO_JSVAL(0 - JSVAL_INT_POW2(30))
1893:info:build                                 ^~~~~~~~~~~~~~~~~~~~~~~~~~~~~~~~~~~~
1894:info:build /opt/local/include/js/jsapi.h:104:46: note: expanded from macro 'INT_TO_JSVAL'
1895:info:build #define INT_TO_JSVAL(i)         (((jsval)(i) << 1) | JSVAL_INT)
1896:info:build                                   ~~~~~~~~~~ ^
1897:info:build In file included from couch_js/main.c:16:
1898:info:build couch_js/sm185.c:221:12: warning: incompatible integer to pointer conversion initializing 'jsval *' (aka 'long *') with an expression of type 'int' [-Wint-conversion]
1899:info:build     jsval* argv = JS_ARGV(cx, vp);
1900:info:build            ^      ~~~~~~~~~~~~~~~
1901:info:build couch_js/sm185.c:223:25: warning: shifting a negative signed value is undefined [-Wshift-negative-value]
1902:info:build     JS_SET_RVAL(cx, vp, JSVAL_VOID);
1903:info:build                         ^~~~~~~~~~
1904:info:build /opt/local/include/js/jsapi.h:205:33: note: expanded from macro 'JSVAL_VOID'
1905:info:build #define JSVAL_VOID              INT_TO_JSVAL(0 - JSVAL_INT_POW2(30))
1906:info:build                                 ^~~~~~~~~~~~~~~~~~~~~~~~~~~~~~~~~~~~
1907:info:build /opt/local/include/js/jsapi.h:104:46: note: expanded from macro 'INT_TO_JSVAL'
1908:info:build #define INT_TO_JSVAL(i)         (((jsval)(i) << 1) | JSVAL_INT)
1909:info:build                                   ~~~~~~~~~~ ^
1910:info:build In file included from couch_js/main.c:16:
1911:info:build couch_js/sm185.c:231:12: warning: incompatible integer to pointer conversion initializing 'jsval *' (aka 'long *') with an expression of type 'int' [-Wint-conversion]
1912:info:build     jsval* argv = JS_ARGV(cx, vp);
1913:info:build            ^      ~~~~~~~~~~~~~~~
1914:info:build couch_js/sm185.c:257:12: warning: incompatible integer to pointer conversion initializing 'jsval *' (aka 'long *') with an expression of type 'int' [-Wint-conversion]
1915:info:build     jsval* argv = JS_ARGV(cx, vp);
1916:info:build            ^      ~~~~~~~~~~~~~~~
1917:info:build couch_js/sm185.c:271:18: warning: implicit declaration of function 'JS_DeepFreezeObject' is invalid in C99 [-Wimplicit-function-declaration]
1918:info:build     ret = deep ? JS_DeepFreezeObject(cx, target) : JS_FreezeObject(cx, target);
1919:info:build                  ^
1920:info:build couch_js/sm185.c:271:52: warning: implicit declaration of function 'JS_FreezeObject' is invalid in C99 [-Wimplicit-function-declaration]
1921:info:build     ret = deep ? JS_DeepFreezeObject(cx, target) : JS_FreezeObject(cx, target);
1922:info:build                                                    ^
1923:info:build couch_js/sm185.c:266:29: warning: shifting a negative signed value is undefined [-Wshift-negative-value]
1924:info:build         JS_SET_RVAL(cx, vp, JSVAL_VOID);
1925:info:build                             ^~~~~~~~~~
1926:info:build /opt/local/include/js/jsapi.h:205:33: note: expanded from macro 'JSVAL_VOID'
1927:info:build #define JSVAL_VOID              INT_TO_JSVAL(0 - JSVAL_INT_POW2(30))
1928:info:build                                 ^~~~~~~~~~~~~~~~~~~~~~~~~~~~~~~~~~~~
1929:info:build /opt/local/include/js/jsapi.h:104:46: note: expanded from macro 'INT_TO_JSVAL'
1930:info:build #define INT_TO_JSVAL(i)         (((jsval)(i) << 1) | JSVAL_INT)
1931:info:build                                   ~~~~~~~~~~ ^
1932:info:build In file included from couch_js/main.c:16:
1933:info:build couch_js/sm185.c:272:25: warning: shifting a negative signed value is undefined [-Wshift-negative-value]
1934:info:build     JS_SET_RVAL(cx, vp, JSVAL_VOID);
1935:info:build                         ^~~~~~~~~~
1936:info:build /opt/local/include/js/jsapi.h:205:33: note: expanded from macro 'JSVAL_VOID'
1937:info:build #define JSVAL_VOID              INT_TO_JSVAL(0 - JSVAL_INT_POW2(30))
1938:info:build                                 ^~~~~~~~~~~~~~~~~~~~~~~~~~~~~~~~~~~~
1939:info:build /opt/local/include/js/jsapi.h:104:46: note: expanded from macro 'INT_TO_JSVAL'
1940:info:build #define INT_TO_JSVAL(i)         (((jsval)(i) << 1) | JSVAL_INT)
1941:info:build                                   ~~~~~~~~~~ ^
1942:info:build couch_js/http.c:195:8: warning: shifting a negative signed value is undefined [-Wshift-negative-value]
1943:info:build     if(JSVAL_IS_VOID(mth)) {
1944:info:build        ^~~~~~~~~~~~~~~~~~
1945:info:build /opt/local/include/js/jsapi.h:76:41: In file included from couch_js/main.c:16:
1946:info:build couch_js/sm185.cnote: :285expanded from macro 'JSVAL_IS_VOID':
1947:info:build 5: error: use of undeclared identifier 'JS_StrictPropertyStub'; did you mean 'JS_PropertyStub'?
1948:info:build #define JSVAL_IS_VOID(v)        ((v) == JSVAL_VOID)
1949:info:build                                         ^~~~~~~~~~
1950:info:build     JS_StrictPropertyStub,
1951:info:build     ^~~~~~~~~~~~~~~~~~~~~
1952:info:build     JS_PropertyStub
1953:info:build /opt/local/include/js/jsapi.h:205:33/opt/local/include/js/jsapi.h:1130:1::  notenote: : 'JS_PropertyStub' declared here
1954:info:build expanded from macro 'JSVAL_VOID'
1955:info:build JS_PropertyStub(JSContext *cx, JSObject *obj, jsval id, jsval *vp);
1956:info:build ^
1957:info:build #define JSVAL_VOID              INT_TO_JSVAL(0 - JSVAL_INT_POW2(30))
1958:info:build                                 ^~~~~~~~~~~~~~~~~~~~~~~~~~~~~~~~~~~~
1959:info:build /opt/local/include/js/jsapi.h:104:46: note: expanded from macro 'INT_TO_JSVAL'
1960:info:build #define INT_TO_JSVAL(i)         (((jsval)(i) << 1) | JSVAL_INT)
1961:info:build                                   ~~~~~~~~~~ ^
1962:info:build couch_js/http.c:217:8: warning: shifting a negative signed value is undefined [-Wshift-negative-value]
1963:info:build     if(JSVAL_IS_VOID(url)) {
1964:info:build        ^~~~~~~~~~~~~~~~~~
1965:info:build /opt/local/include/js/jsapi.h:76:41: note: expanded from macro 'JSVAL_IS_VOID'
1966:info:build #define JSVAL_IS_VOID(v)        ((v) == JSVAL_VOID)
1967:info:build                                         ^~~~~~~~~~
1968:info:build /opt/local/include/js/jsapi.h:205:33: note: expanded from macro 'JSVAL_VOID'
1969:info:build #define JSVAL_VOID              INT_TO_JSVAL(0 - JSVAL_INT_POW2(30))
1970:info:build                                 ^~~~~~~~~~~~~~~~~~~~~~~~~~~~~~~~~~~~
1971:info:build /opt/local/include/js/jsapi.h:104:46: note: expanded from macro 'INT_TO_JSVAL'
1972:info:build In file included from #define INT_TO_JSVAL(i)         (((jsval)(i) << 1) | JSVAL_INT)couch_js/main.c
1973:info:build :                                  ~~~~~~~~~~ ^16
1974:info:build :
1975:info:build couch_js/sm185.c:302:5: warning: implicit declaration of function 'JS_FS' is invalid in C99 [-Wimplicit-function-declaration]
1976:info:build     JS_FS("_open", req_open, 3, 0),
1977:info:build     ^
1978:info:build couch_js/sm185.c:305:5: error: use of undeclared identifier 'JS_FS_END'; did you mean 'JSGC_END'?
1979:info:build     JS_FS_END
1980:info:build     ^~~~~~~~~
1981:info:build     JSGC_END
1982:info:build /opt/local/include/js/jspubtd.h:565:5: note: 'JSGC_END' declared here
1983:info:build     JSGC_END,
1984:info:build     ^
1985:info:build In file included from couch_js/main.c:16:
1986:info:build couch_js/sm185.c:302:5: warning: incompatible integer to pointer conversion initializing 'const char *' with an expression of type 'int' [-Wint-conversion]
1987:info:build     JS_FS("_open", req_open, 3, 0),
1988:info:build     ^~~~~~~~~~~~~~~~~~~~~~~~~~~~~~
1989:info:build couch_js/sm185.c:303:5: warning: incompatible integer to pointer conversion initializing 'JSNative' (aka 'int (*)(struct JSContext *, struct JSObject *, unsigned int, long *, long *)') with an expression of type 'int' [-Wint-conversion]
1990:info:build     JS_FS("_setRequestHeader", req_set_hdr, 2, 0),
1991:info:build     ^~~~~~~~~~~~~~~~~~~~~~~~~~~~~~~~~~~~~~~~~~~~~
1992:info:build couch_js/sm185.c:302:5: warning: suggest braces around initialization of subobject [-Wmissing-braces]
1993:info:build couch_js/http.c:269:8: warning: shifting a negative signed value is undefined [-Wshift-negative-value]
1994:info:build     JS_FS("_open", req_open, 3, 0),
1995:info:build     ^~~~~~~~~~~~~~~~~~~~~~~~~~~~~~~
1996:info:build     if(JSVAL_IS_VOID(name))
1997:info:build        ^~~~~~~~~~~~~~~~~~~
1998:info:build couch_js/sm185.c:302:5: error: initializer element is not a compile-time constant
1999:info:build /opt/local/include/js/jsapi.h:76:41: note: expanded from macro 'JSVAL_IS_VOID'
2000:info:build     JS_FS("_open", req_open, 3, 0),
2001:info:build     ^~~~~~~~~~~~~~~~~~~~~~~~~~~~~~
2002:info:build #define JSVAL_IS_VOID(v)        ((v) == JSVAL_VOID)
2003:info:build                                         ^~~~~~~~~~
2004:info:build /opt/local/include/js/jsapi.h:205:33: note: expanded from macro 'JSVAL_VOID'
2005:info:build #define JSVAL_VOID              INT_TO_JSVAL(0 - JSVAL_INT_POW2(30))
2006:info:build                                 ^~~~~~~~~~~~~~~~~~~~~~~~~~~~~~~~~~~~
2007:info:build /opt/local/include/js/jsapi.h:104:46: note: expanded from macro 'INT_TO_JSVAL'
2008:info:build #define INT_TO_JSVAL(i)         (((jsval)(i) << 1) | JSVAL_INT)
2009:info:build                                   ~~~~~~~~~~ ^
2010:info:build couch_js/http.c:282:8: warning: shifting a negative signed value is undefined [-Wshift-negative-value]
2011:info:build     if(JSVAL_IS_VOID(val))
2012:info:build        ^~~~~~~~~~~~~~~~~~
2013:info:build /opt/local/include/js/jsapi.h:76:41: note: expanded from macro 'JSVAL_IS_VOID'
2014:info:build #define JSVAL_IS_VOID(v)        ((v) == JSVAL_VOID)
2015:info:build                                         ^~~~~~~~~~
2016:info:build /opt/local/include/js/jsapi.h:205:33: note: expanded from macro 'JSVAL_VOID'
2017:info:build #define JSVAL_VOID              INT_TO_JSVAL(0 - JSVAL_INT_POW2(30))
2018:info:build                                 ^~~~~~~~~~~~~~~~~~~~~~~~~~~~~~~~~~~~
2019:info:build /opt/local/include/js/jsapi.h:104:46: note: expanded from macro 'INT_TO_JSVAL'
2020:info:build #define INT_TO_JSVAL(i)         (((jsval)(i) << 1) | JSVAL_INT)
2021:info:build                                   ~~~~~~~~~~ ^
2022:info:build couch_js/sm185.c:316:5: error: use of undeclared identifier 'JS_FS_END'; did you mean 'JSGC_END'?
2023:info:build     JS_FS_END
2024:info:build     ^~~~~~~~~
2025:info:build     JSGC_END
2026:info:build /opt/local/include/js/jspubtd.h:565:5: note: 'JSGC_END' declared here
2027:info:build     JSGC_END,
2028:info:build     ^
2029:info:build In file included from couch_js/main.c:16:
2030:info:build couch_js/sm185.c:310:5: warning: incompatible integer to pointer conversion initializing 'const char *' with an expression of type 'int' [-Wint-conversion]
2031:info:build     JS_FS("evalcx", evalcx, 0, 0),
2032:info:build     ^~~~~~~~~~~~~~~~~~~~~~~~~~~~~
2033:info:build couch_js/sm185.c:311:5: warning: incompatible integer to pointer conversion initializing 'JSNative' (aka 'int (*)(struct JSContext *, struct JSObject *, unsigned int, long *, long *)') with an expression of type 'int' [-Wint-conversion]
2034:info:build     JS_FS("gc", gc, 0, 0),
2035:info:build     ^~~~~~~~~~~~~~~~~~~~~
2036:info:build couch_js/sm185.c:310:5: warning: suggest braces around initialization of subobject [-Wmissing-braces]
2037:info:build     JS_FS("evalcx", evalcx, 0, 0),
2038:info:build     ^~~~~~~~~~~~~~~~~~~~~~~~~~~~~~
2039:info:build couch_js/sm185.c:315:5: warning: incompatible integer to pointer conversion initializing 'const char *' with an expression of type 'int' [-Wint-conversion]
2040:info:build     JS_FS("seal", seal, 0, 0),
2041:info:build     ^~~~~~~~~~~~~~~~~~~~~~~~~
2042:info:build couch_js/http.c:327:couch_js/sm185.c:316:5: warning: 9incompatible integer to pointer conversion initializing 'JSNative' (aka 'int (*)(struct JSContext *, struct JSObject *, unsigned int, long *, long *)') with an expression of type 'int' [-Wint-conversion]:
2043:info:build  warning: shifting a negative signed value is undefined [-Wshift-negative-value]
2044:info:build     JS_FS_END
2045:info:build     ^~~~~~~~~
2046:info:build     if(!JSVAL_IS_VOID(body)) {
2047:info:build         ^~~~~~~~~~~~~~~~~~~
2048:info:build /opt/local/include/js/jsapi.h:76:41: note: couch_js/sm185.c:315:5: warning: expanded from macro 'JSVAL_IS_VOID'
2049:info:build suggest braces around initialization of subobject [-Wmissing-braces]
2050:info:build     JS_FS("seal", seal, 0, 0),
2051:info:build     ^~~~~~~~~~~~~~~~~~~~~~~~~~
2052:info:build #define JSVAL_IS_VOID(v)        ((v) == JSVAL_VOID)
2053:info:build                                         ^~~~~~~~~~
2054:info:build /opt/local/include/js/jsapi.h:205:33: note: expanded from macro 'JSVAL_VOID'
2055:info:build couch_js/sm185.c:310:5: error: initializer element is not a compile-time constant
2056:info:build #define JSVAL_VOID              INT_TO_JSVAL(0 - JSVAL_INT_POW2(30))
2057:info:build                                 ^~~~~~~~~~~~~~~~~~~~~~~~~~~~~~~~~~~~
2058:info:build /opt/local/include/js/jsapi.h:    JS_FS("evalcx", evalcx, 0, 0),104
2059:info:build :    ^~~~~~~~~~~~~~~~~~~~~~~~~~~~~46
2060:info:build : note: expanded from macro 'INT_TO_JSVAL'
2061:info:build #define INT_TO_JSVAL(i)         (((jsval)(i) << 1) | JSVAL_INT)
2062:info:build                                   ~~~~~~~~~~ ^
2063:info:build couch_js/http.c:369:53: warning: shifting a negative signed value is undefined [-Wshift-negative-value]
2064:info:build     if (JS_GetReservedSlot(cx, req, 0, uri_val) && !JSVAL_IS_VOID(*uri_val)) {
2065:info:build                                                     ^~~~~~~~~~~~~~~~~~~~~~~
2066:info:build /opt/local/include/js/jsapi.h:76:41: note: expanded from macro 'JSVAL_IS_VOID'
2067:info:build #define JSVAL_IS_VOID(v)        ((v) == JSVAL_VOID)
2068:info:build                                         ^~~~~~~~~~
2069:info:build /opt/local/include/js/jsapi.h:205:33: note: expanded from macro 'JSVAL_VOID'
2070:info:build #define JSVAL_VOID              INT_TO_JSVAL(0 - JSVAL_INT_POW2(30))
2071:info:build                                 ^~~~~~~~~~~~~~~~~~~~~~~~~~~~~~~~~~~~
2072:info:build /opt/local/include/js/jsapi.h:104:46: note: expanded from macro 'INT_TO_JSVAL'
2073:info:build #define INT_TO_JSVAL(i)         (((jsval)(i) << 1) | JSVAL_INT)
2074:info:build                                   ~~~~~~~~~~ ^
2075:info:build couch_js/sm185.c:326:5: error: use of undeclared identifier 'JSCrossCompartmentCall'
2076:info:build     JSCrossCompartmentCall *call = NULL;
2077:info:build     ^
2078:info:build couch_js/sm185.c:326:29: error: use of undeclared identifier 'call'
2079:info:build     JSCrossCompartmentCall *call = NULL;
2080:info:build                             ^
2081:info:build couch_js/sm185.c:348:23: error: use of undeclared identifier 'JSOPTION_METHODJIT'
2082:info:build     JS_SetOptions(cx, JSOPTION_METHODJIT);
2083:info:build                       ^
2084:info:build couch_js/sm185.c:356:14: warning: implicit declaration of function 'JS_NewCompartmentAndGlobalObject' is invalid in C99 [-Wimplicit-function-declaration]
2085:info:build     global = JS_NewCompartmentAndGlobalObject(cx, &global_class, NULL);
2086:info:build              ^
2087:info:build couch_js/sm185.c:356:12: warning: incompatible integer to pointer conversion assigning to 'JSObject *' (aka 'struct JSObject *') from 'int' [-Wint-conversion]
2088:info:build     global = JS_NewCompartmentAndGlobalObject(cx, &global_class, NULL);
2089:info:build            ^ ~~~~~~~~~~~~~~~~~~~~~~~~~~~~~~~~~~~~~~~~~~~~~~~~~~~~~~~~~
2090:info:build couch_js/sm185.c:360:5: error: use of undeclared identifier 'call'
2091:info:build     call = JS_EnterCrossCompartmentCall(cx, global);
2092:info:build     ^
2093:info:build couch_js/sm185.c:376:30: warning: incompatible pointer types passing 'JSBool (JSContext *, uintN, jsval *)' (aka 'int (struct JSContext *, unsigned int, long *)') to parameter of type 'JSNative' (aka 'int (*)(struct JSContext *, struct JSObject *, unsigned int, long *, long *)') [-Wincompatible-pointer-types]
2094:info:build             &CouchHTTPClass, req_ctor,
2095:info:build                              ^~~~~~~~
2096:info:build /opt/local/include/js/jsapi.h:1183:39: note: passing argument to parameter 'constructor' here
2097:info:build              JSClass *clasp, JSNative constructor, uintN nargs,
2098:info:build                                       ^
2099:info:build In file included from couch_js/main.c:16:
2100:info:build couch_js/sm185.c:395:16: warning: incompatible integer to pointer conversion assigning to 'const jschar *' (aka 'const unsigned short *') from 'int' [-Wint-conversion]
2101:info:build         schars = JS_GetStringCharsAndLength(cx, scriptsrc, &slen);
2102:info:build                ^ ~~~~~~~~~~~~~~~~~~~~~~~~~~~~~~~~~~~~~~~~~~~~~~~~
2103:info:build couch_js/sm185.c:399:12: warning: implicit declaration of function 'JS_AddValueRoot' is invalid in C99 [-Wimplicit-function-declaration]
2104:info:build         if(JS_AddValueRoot(cx, &sroot) != JS_TRUE) {
2105:info:build            ^
2106:info:build couch_js/sm185.c:405:16: warning: incompatible pointer types assigning to 'JSObject *' (aka 'struct JSObject *') from 'JSScript *' (aka 'struct JSScript *') [-Wincompatible-pointer-types]
2107:info:build         script = JS_CompileUCScript(cx, global, schars, slen,
2108:info:build                ^ ~~~~~~~~~~~~~~~~~~~~~~~~~~~~~~~~~~~~~~~~~~~~
2109:info:build couch_js/sm185.c:412:41: warning: incompatible pointer types passing 'JSObject *' (aka 'struct JSObject *') to parameter of type 'JSScript *' (aka 'struct JSScript *') [-Wincompatible-pointer-types]
2110:info:build         if(JS_ExecuteScript(cx, global, script, &result) != JS_TRUE) {
2111:info:build                                         ^~~~~~
2112:info:build /opt/local/include/js/jsapi.h:1757:58: note: passing argument to parameter 'script' here
2113:info:build JS_ExecuteScript(JSContext *cx, JSObject *obj, JSScript *script, jsval *rval);
2114:info:build                                                          ^
2115:info:build In file included from couch_js/main.c:16:
2116:info:build couch_js/sm185.c:418:9: warning: implicit declaration of function 'JS_RemoveValueRoot' is invalid in C99 [-Wimplicit-function-declaration]
2117:info:build         JS_RemoveValueRoot(cx, &sroot);
2118:info:build         ^
2119:info:build couch_js/sm185.c:424:34: error: use of undeclared identifier 'call'
2120:info:build     JS_LeaveCrossCompartmentCall(call);
2121:info:build                                  ^
2122:info:build 53 warnings and 16 errors generated.
2123:info:build make[5]: *** [couch_js/couchjs-main.o] Error 1
2124:info:build make[5]: *** Waiting for unfinished jobs....
2125:info:build 2 warnings generated.
2126:info:build mv -f couch_js/.deps/couchjs-util.Tpo couch_js/.deps/couchjs-util.Po
2127:info:build 2 warnings generated.
2128:info:build mv -f couch_js/.deps/couchjs-utf8.Tpo couch_js/.deps/couchjs-utf8.Po
2129:info:build icu_driver/couch_icu_driver.c:171:9: warning: incompatible pointer types initializing 'ErlDrvSSizeT (*)(ErlDrvData, unsigned int, char *, ErlDrvSizeT, char **, ErlDrvSizeT)' (aka 'long (*)(struct _erl_drv_data *, unsigned int, char *, unsigned long, char **, unsigned long)') with an expression of type 'COUCH_SSIZET (ErlDrvData, unsigned int, char *, COUCH_SSIZET, char **, COUCH_SSIZET)' (aka 'long (struct _erl_drv_data *, unsigned int, char *, long, char **, long)') [-Wincompatible-pointer-types]
2130:info:build         couch_drv_control,  /* F_PTR control, port_command callback */
2131:info:build         ^~~~~~~~~~~~~~~~~
2132:info:build 1 warning generated.
2133:info:build mv -f icu_driver/.deps/couch_icu_driver_la-couch_icu_driver.Tpo icu_driver/.deps/couch_icu_driver_la-couch_icu_driver.Plo
2134:info:build 6 warnings generated.
2135:info:build mv -f couch_js/.deps/couchjs-http.Tpo couch_js/.deps/couchjs-http.Po
2136:info:build mv -f couch_ejson_compare/.deps/couch_ejson_compare_la-couch_ejson_compare.Tpo couch_ejson_compare/.deps/couch_ejson_compare_la-couch_ejson_compare.Plo
2137:info:build make[5]: Leaving directory `/opt/local/var/macports/build/_opt_local_var_macports_sources_rsync.macports.org_release_tarballs_ports_databases_couchdb/couchdb/work/apache-couchdb-1.6.1/src/couchdb/priv'
2138:info:build make[4]: *** [all] Error 2
2139:info:build make[4]: Leaving directory `/opt/local/var/macports/build/_opt_local_var_macports_sources_rsync.macports.org_release_tarballs_ports_databases_couchdb/couchdb/work/apache-couchdb-1.6.1/src/couchdb/priv'
2140:info:build make[3]: *** [all-recursive] Error 1
2141:info:build make[3]: Leaving directory `/opt/local/var/macports/build/_opt_local_var_macports_sources_rsync.macports.org_release_tarballs_ports_databases_couchdb/couchdb/work/apache-couchdb-1.6.1/src/couchdb'
2142:info:build make[2]: *** [all-recursive] Error 1
2143:info:build make[2]: Leaving directory `/opt/local/var/macports/build/_opt_local_var_macports_sources_rsync.macports.org_release_tarballs_ports_databases_couchdb/couchdb/work/apache-couchdb-1.6.1/src'
2144:info:build make[1]: *** [all-recursive] Error 1
2145:info:build make[1]: Leaving directory `/opt/local/var/macports/build/_opt_local_var_macports_sources_rsync.macports.org_release_tarballs_ports_databases_couchdb/couchdb/work/apache-couchdb-1.6.1'
2146:info:build make: *** [all] Error 2
2147:info:build make: Leaving directory `/opt/local/var/macports/build/_opt_local_var_macports_sources_rsync.macports.org_release_tarballs_ports_databases_couchdb/couchdb/work/apache-couchdb-1.6.1'
2148:info:build Command failed:  cd "/opt/local/var/macports/build/_opt_local_var_macports_sources_rsync.macports.org_release_tarballs_ports_databases_couchdb/couchdb/work/apache-couchdb-1.6.1" && /usr/bin/make -j8 -w all
2149:info:build Exit code: 2
2150:error:build org.macports.build for port couchdb returned: command execution failed
2151:debug:build Error code: CHILDSTATUS 6884 2
2152:debug:build Backtrace: command execution failed
2153    while executing
2154"system -nice 0 $fullcmdstring"
2155    ("eval" body line 1)
2156    invoked from within
2157"eval system $notty $nice \$fullcmdstring"
2158    invoked from within
2159"command_exec build"
2160    (procedure "portbuild::build_main" line 8)
2161    invoked from within
2162"portbuild::build_main org.macports.build"
2163    ("eval" body line 1)
2164    invoked from within
2165"eval $procedure $targetname"
2166:info:build Warning: targets not executed for couchdb: org.macports.activate org.macports.build org.macports.destroot org.macports.install
2167:notice:build Please see the log file for port couchdb for details:
2168    /opt/local/var/macports/logs/_opt_local_var_macports_sources_rsync.macports.org_release_tarballs_ports_databases_couchdb/couchdb/main.log