Ticket #52747: main.log

File main.log, 96.4 KB (added by lauracrews, 4 years ago)

lauracrews log

Line 
1version:1
2:debug:main Found Dependency: path: /usr/bin filename: unzip regex: ^unzip$
3:debug:main epoch: in tree: 0 installed: 0
4:debug:main cmake 3.6.3_0 exists in the ports tree
5:debug:main cmake 3.6.3_0  is the latest installed
6:debug:main cmake 3.6.3_0  is active
7:debug:main Merging existing variants '' into variants
8:debug:main new fully merged portvariants:
9:debug:main Changing to port directory: /opt/local/var/macports/sources/rsync.macports.org/release/tarballs/ports/devel/cmake
10:debug:main OS darwin/16.1.0 (Mac OS X 10.12) arch i386
11:debug:main Reading variant descriptions from /opt/local/var/macports/sources/rsync.macports.org/release/tarballs/ports/_resources/port1.0/variant_descriptions.conf
12:debug:main Sourcing PortGroup muniversal 1.0 from /opt/local/var/macports/sources/rsync.macports.org/release/tarballs/ports/_resources/port1.0/group/muniversal-1.0.tcl
13:debug:main universal variant already exists, so not adding the default one
14:debug:main Running callback portconfigure::add_automatic_compiler_dependencies
15:debug:main Finished running callback portconfigure::add_automatic_compiler_dependencies
16:debug:main Running callback portbuild::add_automatic_buildsystem_dependencies
17:debug:main Finished running callback portbuild::add_automatic_buildsystem_dependencies
18:debug:main No need to upgrade! cmake 3.6.3_0 >= cmake 3.6.3_0
19:debug:main epoch: in tree: 0 installed: 0
20:debug:main curl 7.51.0_1 exists in the ports tree
21:debug:main curl 7.51.0_1 +ssl is the latest installed
22:debug:main curl 7.51.0_1 +ssl is active
23:debug:main Merging existing variants '+ssl' into variants
24:debug:main new fully merged portvariants: ssl +
25:debug:main Changing to port directory: /opt/local/var/macports/sources/rsync.macports.org/release/tarballs/ports/net/curl
26:debug:main OS darwin/16.1.0 (Mac OS X 10.12) arch i386
27:debug:main Reading variant descriptions from /opt/local/var/macports/sources/rsync.macports.org/release/tarballs/ports/_resources/port1.0/variant_descriptions.conf
28:debug:main Sourcing PortGroup muniversal 1.0 from /opt/local/var/macports/sources/rsync.macports.org/release/tarballs/ports/_resources/port1.0/group/muniversal-1.0.tcl
29:debug:main universal variant already exists, so not adding the default one
30:debug:main Executing variant ssl provides ssl
31:debug:main Running callback portconfigure::add_automatic_compiler_dependencies
32:debug:main Finished running callback portconfigure::add_automatic_compiler_dependencies
33:debug:main Running callback portbuild::add_automatic_buildsystem_dependencies
34:debug:main Finished running callback portbuild::add_automatic_buildsystem_dependencies
35:debug:main No need to upgrade! curl 7.51.0_1 >= curl 7.51.0_1
36:debug:main epoch: in tree: 0 installed: 0
37:debug:main zlib 1.2.8_0 exists in the ports tree
38:debug:main zlib 1.2.8_0  is the latest installed
39:debug:main zlib 1.2.8_0  is active
40:debug:main Merging existing variants '' into variants
41:debug:main new fully merged portvariants:
42:debug:main Changing to port directory: /opt/local/var/macports/sources/rsync.macports.org/release/tarballs/ports/archivers/zlib
43:debug:main OS darwin/16.1.0 (Mac OS X 10.12) arch i386
44:debug:main Sourcing PortGroup xcodeversion 1.0 from /opt/local/var/macports/sources/rsync.macports.org/release/tarballs/ports/_resources/port1.0/group/xcodeversion-1.0.tcl
45:debug:main adding the default universal variant
46:debug:main Reading variant descriptions from /opt/local/var/macports/sources/rsync.macports.org/release/tarballs/ports/_resources/port1.0/variant_descriptions.conf
47:debug:main Running callback portconfigure::add_automatic_compiler_dependencies
48:debug:main Finished running callback portconfigure::add_automatic_compiler_dependencies
49:debug:main Running callback portbuild::add_automatic_buildsystem_dependencies
50:debug:main Finished running callback portbuild::add_automatic_buildsystem_dependencies
51:debug:main No need to upgrade! zlib 1.2.8_0 >= zlib 1.2.8_0
52:debug:main epoch: in tree: 1 installed: 1
53:debug:main openssl 1.0.2j_0 exists in the ports tree
54:debug:main openssl 1.0.2j_0  is the latest installed
55:debug:main openssl 1.0.2j_0  is active
56:debug:main Merging existing variants '' into variants
57:debug:main new fully merged portvariants:
58:debug:main Changing to port directory: /opt/local/var/macports/sources/rsync.macports.org/release/tarballs/ports/devel/openssl
59:debug:main OS darwin/16.1.0 (Mac OS X 10.12) arch i386
60:debug:main Reading variant descriptions from /opt/local/var/macports/sources/rsync.macports.org/release/tarballs/ports/_resources/port1.0/variant_descriptions.conf
61:debug:main Sourcing PortGroup muniversal 1.0 from /opt/local/var/macports/sources/rsync.macports.org/release/tarballs/ports/_resources/port1.0/group/muniversal-1.0.tcl
62:debug:main universal variant already exists, so not adding the default one
63:debug:main Running callback portconfigure::add_automatic_compiler_dependencies
64:debug:main Finished running callback portconfigure::add_automatic_compiler_dependencies
65:debug:main Running callback portbuild::add_automatic_buildsystem_dependencies
66:debug:main Finished running callback portbuild::add_automatic_buildsystem_dependencies
67:debug:main No need to upgrade! openssl 1.0.2j_0 >= openssl 1.0.2j_0
68:debug:main epoch: in tree: 0 installed: 0
69:debug:main curl-ca-bundle 7.51.0_0 exists in the ports tree
70:debug:main curl-ca-bundle 7.51.0_0  is the latest installed
71:debug:main curl-ca-bundle 7.51.0_0  is active
72:debug:main Merging existing variants '' into variants
73:debug:main new fully merged portvariants:
74:debug:main Changing to port directory: /opt/local/var/macports/sources/rsync.macports.org/release/tarballs/ports/net/curl
75:debug:main OS darwin/16.1.0 (Mac OS X 10.12) arch i386
76:debug:main universal_variant is false, so not adding the default universal variant
77:debug:main Running callback portconfigure::add_automatic_compiler_dependencies
78:debug:main Finished running callback portconfigure::add_automatic_compiler_dependencies
79:debug:main Running callback portbuild::add_automatic_buildsystem_dependencies
80:debug:main Finished running callback portbuild::add_automatic_buildsystem_dependencies
81:debug:main No need to upgrade! curl-ca-bundle 7.51.0_0 >= curl-ca-bundle 7.51.0_0
82:debug:main epoch: in tree: 0 installed: 0
83:debug:main expat 2.2.0_0 exists in the ports tree
84:debug:main expat 2.2.0_0  is the latest installed
85:debug:main expat 2.2.0_0  is active
86:debug:main Merging existing variants '' into variants
87:debug:main new fully merged portvariants:
88:debug:main Changing to port directory: /opt/local/var/macports/sources/rsync.macports.org/release/tarballs/ports/textproc/expat
89:debug:main OS darwin/16.1.0 (Mac OS X 10.12) arch i386
90:debug:main adding the default universal variant
91:debug:main Reading variant descriptions from /opt/local/var/macports/sources/rsync.macports.org/release/tarballs/ports/_resources/port1.0/variant_descriptions.conf
92:debug:main Running callback portconfigure::add_automatic_compiler_dependencies
93:debug:main Finished running callback portconfigure::add_automatic_compiler_dependencies
94:debug:main Running callback portbuild::add_automatic_buildsystem_dependencies
95:debug:main Finished running callback portbuild::add_automatic_buildsystem_dependencies
96:debug:main No need to upgrade! expat 2.2.0_0 >= expat 2.2.0_0
97:debug:main epoch: in tree: 0 installed: 0
98:debug:main bzip2 1.0.6_0 exists in the ports tree
99:debug:main bzip2 1.0.6_0  is the latest installed
100:debug:main bzip2 1.0.6_0  is active
101:debug:main Merging existing variants '' into variants
102:debug:main new fully merged portvariants:
103:debug:main Changing to port directory: /opt/local/var/macports/sources/rsync.macports.org/release/tarballs/ports/archivers/bzip2
104:debug:main OS darwin/16.1.0 (Mac OS X 10.12) arch i386
105:debug:main Reading variant descriptions from /opt/local/var/macports/sources/rsync.macports.org/release/tarballs/ports/_resources/port1.0/variant_descriptions.conf
106:debug:main universal variant already exists, so not adding the default one
107:debug:main Running callback portconfigure::add_automatic_compiler_dependencies
108:debug:main Finished running callback portconfigure::add_automatic_compiler_dependencies
109:debug:main Running callback portbuild::add_automatic_buildsystem_dependencies
110:debug:main Finished running callback portbuild::add_automatic_buildsystem_dependencies
111:debug:main No need to upgrade! bzip2 1.0.6_0 >= bzip2 1.0.6_0
112:debug:main epoch: in tree: 0 installed: 0
113:debug:main libarchive 3.2.1_0 exists in the ports tree
114:debug:main libarchive 3.2.1_0  is the latest installed
115:debug:main libarchive 3.2.1_0  is active
116:debug:main Merging existing variants '' into variants
117:debug:main new fully merged portvariants:
118:debug:main Changing to port directory: /opt/local/var/macports/sources/rsync.macports.org/release/tarballs/ports/archivers/libarchive
119:debug:main OS darwin/16.1.0 (Mac OS X 10.12) arch i386
120:debug:main adding the default universal variant
121:debug:main Reading variant descriptions from /opt/local/var/macports/sources/rsync.macports.org/release/tarballs/ports/_resources/port1.0/variant_descriptions.conf
122:debug:main Running callback portconfigure::add_automatic_compiler_dependencies
123:debug:main Finished running callback portconfigure::add_automatic_compiler_dependencies
124:debug:main Running callback portbuild::add_automatic_buildsystem_dependencies
125:debug:main Finished running callback portbuild::add_automatic_buildsystem_dependencies
126:debug:main No need to upgrade! libarchive 3.2.1_0 >= libarchive 3.2.1_0
127:debug:main epoch: in tree: 0 installed: 0
128:debug:main libxml2 2.9.4_0 exists in the ports tree
129:debug:main libxml2 2.9.4_0  is the latest installed
130:debug:main libxml2 2.9.4_0  is active
131:debug:main Merging existing variants '' into variants
132:debug:main new fully merged portvariants:
133:debug:main Changing to port directory: /opt/local/var/macports/sources/rsync.macports.org/release/tarballs/ports/textproc/libxml2
134:debug:main OS darwin/16.1.0 (Mac OS X 10.12) arch i386
135:debug:main adding the default universal variant
136:debug:main Reading variant descriptions from /opt/local/var/macports/sources/rsync.macports.org/release/tarballs/ports/_resources/port1.0/variant_descriptions.conf
137:debug:main Running callback portconfigure::add_automatic_compiler_dependencies
138:debug:main Finished running callback portconfigure::add_automatic_compiler_dependencies
139:debug:main Running callback portbuild::add_automatic_buildsystem_dependencies
140:debug:main Finished running callback portbuild::add_automatic_buildsystem_dependencies
141:debug:main No need to upgrade! libxml2 2.9.4_0 >= libxml2 2.9.4_0
142:debug:main epoch: in tree: 0 installed: 0
143:debug:main libiconv 1.14_0 exists in the ports tree
144:debug:main libiconv 1.14_0  is the latest installed
145:debug:main libiconv 1.14_0  is active
146:debug:main Merging existing variants '' into variants
147:debug:main new fully merged portvariants:
148:debug:main Changing to port directory: /opt/local/var/macports/sources/rsync.macports.org/release/tarballs/ports/textproc/libiconv
149:debug:main OS darwin/16.1.0 (Mac OS X 10.12) arch i386
150:debug:main Reading variant descriptions from /opt/local/var/macports/sources/rsync.macports.org/release/tarballs/ports/_resources/port1.0/variant_descriptions.conf
151:debug:main Sourcing PortGroup muniversal 1.0 from /opt/local/var/macports/sources/rsync.macports.org/release/tarballs/ports/_resources/port1.0/group/muniversal-1.0.tcl
152:debug:main universal variant already exists, so not adding the default one
153:debug:main Running callback portconfigure::add_automatic_compiler_dependencies
154:debug:main Finished running callback portconfigure::add_automatic_compiler_dependencies
155:debug:main Running callback portbuild::add_automatic_buildsystem_dependencies
156:debug:main Finished running callback portbuild::add_automatic_buildsystem_dependencies
157:debug:main No need to upgrade! libiconv 1.14_0 >= libiconv 1.14_0
158:debug:main epoch: in tree: 0 installed: 0
159:debug:main xz 5.2.2_0 exists in the ports tree
160:debug:main xz 5.2.2_0  is the latest installed
161:debug:main xz 5.2.2_0  is active
162:debug:main Merging existing variants '' into variants
163:debug:main new fully merged portvariants:
164:debug:main Changing to port directory: /opt/local/var/macports/sources/rsync.macports.org/release/tarballs/ports/archivers/xz
165:debug:main OS darwin/16.1.0 (Mac OS X 10.12) arch i386
166:debug:main adding the default universal variant
167:debug:main Reading variant descriptions from /opt/local/var/macports/sources/rsync.macports.org/release/tarballs/ports/_resources/port1.0/variant_descriptions.conf
168:debug:main Running callback portconfigure::add_automatic_compiler_dependencies
169:debug:main Finished running callback portconfigure::add_automatic_compiler_dependencies
170:debug:main Running callback portbuild::add_automatic_buildsystem_dependencies
171:debug:main Finished running callback portbuild::add_automatic_buildsystem_dependencies
172:debug:main No need to upgrade! xz 5.2.2_0 >= xz 5.2.2_0
173:debug:main epoch: in tree: 2 installed: 2
174:debug:main gettext 0.19.8.1_0 exists in the ports tree
175:debug:main gettext 0.19.8.1_0  is the latest installed
176:debug:main gettext 0.19.8.1_0  is active
177:debug:main Merging existing variants '' into variants
178:debug:main new fully merged portvariants:
179:debug:main Changing to port directory: /opt/local/var/macports/sources/rsync.macports.org/release/tarballs/ports/devel/gettext
180:debug:main OS darwin/16.1.0 (Mac OS X 10.12) arch i386
181:debug:main Sourcing PortGroup compiler_blacklist_versions 1.0 from /opt/local/var/macports/sources/rsync.macports.org/release/tarballs/ports/_resources/port1.0/group/compiler_blacklist_versions-1.0.tcl
182:debug:main Reading variant descriptions from /opt/local/var/macports/sources/rsync.macports.org/release/tarballs/ports/_resources/port1.0/variant_descriptions.conf
183:debug:main Sourcing PortGroup muniversal 1.0 from /opt/local/var/macports/sources/rsync.macports.org/release/tarballs/ports/_resources/port1.0/group/muniversal-1.0.tcl
184:debug:main compiler clang 800.0.42.1 not blacklisted because it doesn't match {clang < 211.10.1}
185:debug:main universal variant already exists, so not adding the default one
186:debug:main Running callback portconfigure::add_automatic_compiler_dependencies
187:debug:main Finished running callback portconfigure::add_automatic_compiler_dependencies
188:debug:main Running callback portbuild::add_automatic_buildsystem_dependencies
189:debug:main Finished running callback portbuild::add_automatic_buildsystem_dependencies
190:debug:main No need to upgrade! gettext 0.19.8.1_0 >= gettext 0.19.8.1_0
191:debug:main epoch: in tree: 0 installed: 0
192:debug:main ncurses 6.0_0 exists in the ports tree
193:debug:main ncurses 6.0_0  is the latest installed
194:debug:main ncurses 6.0_0  is active
195:debug:main Merging existing variants '' into variants
196:debug:main new fully merged portvariants:
197:debug:main Changing to port directory: /opt/local/var/macports/sources/rsync.macports.org/release/tarballs/ports/devel/ncurses
198:debug:main OS darwin/16.1.0 (Mac OS X 10.12) arch i386
199:debug:main adding the default universal variant
200:debug:main Reading variant descriptions from /opt/local/var/macports/sources/rsync.macports.org/release/tarballs/ports/_resources/port1.0/variant_descriptions.conf
201:debug:main Running callback portconfigure::add_automatic_compiler_dependencies
202:debug:main Finished running callback portconfigure::add_automatic_compiler_dependencies
203:debug:main Running callback portbuild::add_automatic_buildsystem_dependencies
204:debug:main Finished running callback portbuild::add_automatic_buildsystem_dependencies
205:debug:main No need to upgrade! ncurses 6.0_0 >= ncurses 6.0_0
206:debug:main epoch: in tree: 0 installed: 0
207:debug:main lzo2 2.09_0 exists in the ports tree
208:debug:main lzo2 2.09_0  is the latest installed
209:debug:main lzo2 2.09_0  is active
210:debug:main Merging existing variants '' into variants
211:debug:main new fully merged portvariants:
212:debug:main Changing to port directory: /opt/local/var/macports/sources/rsync.macports.org/release/tarballs/ports/archivers/lzo2
213:debug:main OS darwin/16.1.0 (Mac OS X 10.12) arch i386
214:debug:main Reading variant descriptions from /opt/local/var/macports/sources/rsync.macports.org/release/tarballs/ports/_resources/port1.0/variant_descriptions.conf
215:debug:main Sourcing PortGroup muniversal 1.0 from /opt/local/var/macports/sources/rsync.macports.org/release/tarballs/ports/_resources/port1.0/group/muniversal-1.0.tcl
216:debug:main universal variant already exists, so not adding the default one
217:debug:main Running callback portconfigure::add_automatic_compiler_dependencies
218:debug:main Finished running callback portconfigure::add_automatic_compiler_dependencies
219:debug:main Running callback portbuild::add_automatic_buildsystem_dependencies
220:debug:main Finished running callback portbuild::add_automatic_buildsystem_dependencies
221:debug:main No need to upgrade! lzo2 2.09_0 >= lzo2 2.09_0
222:debug:main epoch: in tree: 0 installed: 0
223:debug:main pkgconfig 0.29.1_0 exists in the ports tree
224:debug:main pkgconfig 0.29.1_0  is the latest installed
225:debug:main pkgconfig 0.29.1_0  is active
226:debug:main Merging existing variants '' into variants
227:debug:main new fully merged portvariants:
228:debug:main Changing to port directory: /opt/local/var/macports/sources/rsync.macports.org/release/tarballs/ports/devel/pkgconfig
229:debug:main OS darwin/16.1.0 (Mac OS X 10.12) arch i386
230:debug:main adding the default universal variant
231:debug:main Reading variant descriptions from /opt/local/var/macports/sources/rsync.macports.org/release/tarballs/ports/_resources/port1.0/variant_descriptions.conf
232:debug:main Running callback portconfigure::add_automatic_compiler_dependencies
233:debug:main Finished running callback portconfigure::add_automatic_compiler_dependencies
234:debug:main Running callback portbuild::add_automatic_buildsystem_dependencies
235:debug:main Finished running callback portbuild::add_automatic_buildsystem_dependencies
236:debug:main No need to upgrade! pkgconfig 0.29.1_0 >= pkgconfig 0.29.1_0
237:debug:main epoch: in tree: 0 installed: 0
238:debug:main libpng 1.6.26_0 exists in the ports tree
239:debug:main libpng 1.6.26_0  is the latest installed
240:debug:main libpng 1.6.26_0  is active
241:debug:main Merging existing variants '' into variants
242:debug:main new fully merged portvariants:
243:debug:main Changing to port directory: /opt/local/var/macports/sources/rsync.macports.org/release/tarballs/ports/graphics/libpng
244:debug:main OS darwin/16.1.0 (Mac OS X 10.12) arch i386
245:debug:main adding the default universal variant
246:debug:main Reading variant descriptions from /opt/local/var/macports/sources/rsync.macports.org/release/tarballs/ports/_resources/port1.0/variant_descriptions.conf
247:debug:main Running callback portconfigure::add_automatic_compiler_dependencies
248:debug:main Finished running callback portconfigure::add_automatic_compiler_dependencies
249:debug:main Running callback portbuild::add_automatic_buildsystem_dependencies
250:debug:main Finished running callback portbuild::add_automatic_buildsystem_dependencies
251:debug:main No need to upgrade! libpng 1.6.26_0 >= libpng 1.6.26_0
252:debug:main epoch: in tree: 0 installed: 0
253:debug:main jpeg 9b_0 exists in the ports tree
254:debug:main jpeg 9b_0  is the latest installed
255:debug:main jpeg 9b_0  is active
256:debug:main Merging existing variants '' into variants
257:debug:main new fully merged portvariants:
258:debug:main Changing to port directory: /opt/local/var/macports/sources/rsync.macports.org/release/tarballs/ports/graphics/jpeg
259:debug:main OS darwin/16.1.0 (Mac OS X 10.12) arch i386
260:debug:main adding the default universal variant
261:debug:main Reading variant descriptions from /opt/local/var/macports/sources/rsync.macports.org/release/tarballs/ports/_resources/port1.0/variant_descriptions.conf
262:debug:main Running callback portconfigure::add_automatic_compiler_dependencies
263:debug:main Finished running callback portconfigure::add_automatic_compiler_dependencies
264:debug:main Running callback portbuild::add_automatic_buildsystem_dependencies
265:debug:main Finished running callback portbuild::add_automatic_buildsystem_dependencies
266:debug:main No need to upgrade! jpeg 9b_0 >= jpeg 9b_0
267:debug:main epoch: in tree: 0 installed: 0
268:debug:main jasper 1.900.16_1 exists in the ports tree
269:debug:main jasper 1.900.16_1  is the latest installed
270:debug:main jasper 1.900.16_1  is active
271:debug:main Merging existing variants '' into variants
272:debug:main new fully merged portvariants:
273:debug:main Changing to port directory: /opt/local/var/macports/sources/rsync.macports.org/release/tarballs/ports/graphics/jasper
274:debug:main OS darwin/16.1.0 (Mac OS X 10.12) arch i386
275:debug:main adding the default universal variant
276:debug:main Reading variant descriptions from /opt/local/var/macports/sources/rsync.macports.org/release/tarballs/ports/_resources/port1.0/variant_descriptions.conf
277:debug:main Running callback portconfigure::add_automatic_compiler_dependencies
278:debug:main Finished running callback portconfigure::add_automatic_compiler_dependencies
279:debug:main Running callback portbuild::add_automatic_buildsystem_dependencies
280:debug:main Finished running callback portbuild::add_automatic_buildsystem_dependencies
281:debug:main No need to upgrade! jasper 1.900.16_1 >= jasper 1.900.16_1
282:debug:main epoch: in tree: 0 installed: 0
283:debug:main tiff 4.0.6_1 exists in the ports tree
284:debug:main tiff 4.0.6_1  is the latest installed
285:debug:main tiff 4.0.6_1  is active
286:debug:main Merging existing variants '' into variants
287:debug:main new fully merged portvariants:
288:debug:main Changing to port directory: /opt/local/var/macports/sources/rsync.macports.org/release/tarballs/ports/graphics/tiff
289:debug:main OS darwin/16.1.0 (Mac OS X 10.12) arch i386
290:debug:main Sourcing PortGroup xcodeversion 1.0 from /opt/local/var/macports/sources/rsync.macports.org/release/tarballs/ports/_resources/port1.0/group/xcodeversion-1.0.tcl
291:debug:main Reading variant descriptions from /opt/local/var/macports/sources/rsync.macports.org/release/tarballs/ports/_resources/port1.0/variant_descriptions.conf
292:debug:main Sourcing PortGroup muniversal 1.0 from /opt/local/var/macports/sources/rsync.macports.org/release/tarballs/ports/_resources/port1.0/group/muniversal-1.0.tcl
293:debug:main universal variant already exists, so not adding the default one
294:debug:main Running callback portconfigure::add_automatic_compiler_dependencies
295:debug:main Finished running callback portconfigure::add_automatic_compiler_dependencies
296:debug:main Running callback portbuild::add_automatic_buildsystem_dependencies
297:debug:main Finished running callback portbuild::add_automatic_buildsystem_dependencies
298:debug:main No need to upgrade! tiff 4.0.6_1 >= tiff 4.0.6_1
299:debug:main epoch: in tree: 0 installed: 0
300:debug:main webp 0.5.1_0 exists in the ports tree
301:debug:main webp 0.5.1_0  is the latest installed
302:debug:main webp 0.5.1_0  is active
303:debug:main Merging existing variants '' into variants
304:debug:main new fully merged portvariants:
305:debug:main Changing to port directory: /opt/local/var/macports/sources/rsync.macports.org/release/tarballs/ports/graphics/webp
306:debug:main OS darwin/16.1.0 (Mac OS X 10.12) arch i386
307:debug:main adding the default universal variant
308:debug:main Reading variant descriptions from /opt/local/var/macports/sources/rsync.macports.org/release/tarballs/ports/_resources/port1.0/variant_descriptions.conf
309:debug:main Running callback portconfigure::add_automatic_compiler_dependencies
310:debug:main Finished running callback portconfigure::add_automatic_compiler_dependencies
311:debug:main Running callback portbuild::add_automatic_buildsystem_dependencies
312:debug:main Finished running callback portbuild::add_automatic_buildsystem_dependencies
313:debug:main No need to upgrade! webp 0.5.1_0 >= webp 0.5.1_0
314:debug:main epoch: in tree: 0 installed: 0
315:debug:main ilmbase 2.2.0_0 exists in the ports tree
316:debug:main ilmbase 2.2.0_0  is the latest installed
317:debug:main ilmbase 2.2.0_0  is active
318:debug:main Merging existing variants '' into variants
319:debug:main new fully merged portvariants:
320:debug:main Changing to port directory: /opt/local/var/macports/sources/rsync.macports.org/release/tarballs/ports/graphics/openexr
321:debug:main OS darwin/16.1.0 (Mac OS X 10.12) arch i386
322:debug:main adding the default universal variant
323:debug:main Reading variant descriptions from /opt/local/var/macports/sources/rsync.macports.org/release/tarballs/ports/_resources/port1.0/variant_descriptions.conf
324:debug:main Running callback portconfigure::add_automatic_compiler_dependencies
325:debug:main Finished running callback portconfigure::add_automatic_compiler_dependencies
326:debug:main Running callback portbuild::add_automatic_buildsystem_dependencies
327:debug:main Finished running callback portbuild::add_automatic_buildsystem_dependencies
328:debug:main No need to upgrade! ilmbase 2.2.0_0 >= ilmbase 2.2.0_0
329:debug:main epoch: in tree: 0 installed: 0
330:debug:main openexr 2.2.0_1 exists in the ports tree
331:debug:main openexr 2.2.0_1  is the latest installed
332:debug:main openexr 2.2.0_1  is active
333:debug:main Merging existing variants '' into variants
334:debug:main new fully merged portvariants:
335:debug:main Changing to port directory: /opt/local/var/macports/sources/rsync.macports.org/release/tarballs/ports/graphics/openexr
336:debug:main OS darwin/16.1.0 (Mac OS X 10.12) arch i386
337:debug:main adding the default universal variant
338:debug:main Reading variant descriptions from /opt/local/var/macports/sources/rsync.macports.org/release/tarballs/ports/_resources/port1.0/variant_descriptions.conf
339:debug:main Running callback portconfigure::add_automatic_compiler_dependencies
340:debug:main Finished running callback portconfigure::add_automatic_compiler_dependencies
341:debug:main Running callback portbuild::add_automatic_buildsystem_dependencies
342:debug:main Finished running callback portbuild::add_automatic_buildsystem_dependencies
343:debug:main No need to upgrade! openexr 2.2.0_1 >= openexr 2.2.0_1
344:debug:main epoch: in tree: 1 installed: 1
345:debug:main ffmpeg 3.2_0 exists in the ports tree
346:debug:main ffmpeg 3.2_0 +gpl2 is the latest installed
347:debug:main ffmpeg 3.2_0 +gpl2 is active
348:debug:main Merging existing variants '+gpl2' into variants
349:debug:main new fully merged portvariants: gpl2 +
350:debug:main Changing to port directory: /opt/local/var/macports/sources/rsync.macports.org/release/tarballs/ports/multimedia/ffmpeg
351:debug:main OS darwin/16.1.0 (Mac OS X 10.12) arch i386
352:debug:main Sourcing PortGroup xcodeversion 1.0 from /opt/local/var/macports/sources/rsync.macports.org/release/tarballs/ports/_resources/port1.0/group/xcodeversion-1.0.tcl
353:debug:main Reading variant descriptions from /opt/local/var/macports/sources/rsync.macports.org/release/tarballs/ports/_resources/port1.0/variant_descriptions.conf
354:debug:main Sourcing PortGroup muniversal 1.0 from /opt/local/var/macports/sources/rsync.macports.org/release/tarballs/ports/_resources/port1.0/group/muniversal-1.0.tcl
355:debug:main Sourcing PortGroup compiler_blacklist_versions 1.0 from /opt/local/var/macports/sources/rsync.macports.org/release/tarballs/ports/_resources/port1.0/group/compiler_blacklist_versions-1.0.tcl
356:debug:main Sourcing PortGroup active_variants 1.1 from /opt/local/var/macports/sources/rsync.macports.org/release/tarballs/ports/_resources/port1.0/group/active_variants-1.1.tcl
357:debug:main universal variant already exists, so not adding the default one
358:debug:main Executing variant gpl2 provides gpl2
359:debug:main Running callback portconfigure::add_automatic_compiler_dependencies
360:debug:main Finished running callback portconfigure::add_automatic_compiler_dependencies
361:debug:main Running callback portbuild::add_automatic_buildsystem_dependencies
362:debug:main Finished running callback portbuild::add_automatic_buildsystem_dependencies
363:debug:main No need to upgrade! ffmpeg 3.2_0 >= ffmpeg 3.2_0
364:debug:main epoch: in tree: 0 installed: 0
365:debug:main lame 3.99.5_1 exists in the ports tree
366:debug:main lame 3.99.5_1  is the latest installed
367:debug:main lame 3.99.5_1  is active
368:debug:main Merging existing variants '' into variants
369:debug:main new fully merged portvariants:
370:debug:main Changing to port directory: /opt/local/var/macports/sources/rsync.macports.org/release/tarballs/ports/audio/lame
371:debug:main OS darwin/16.1.0 (Mac OS X 10.12) arch i386
372:debug:main adding the default universal variant
373:debug:main Reading variant descriptions from /opt/local/var/macports/sources/rsync.macports.org/release/tarballs/ports/_resources/port1.0/variant_descriptions.conf
374:debug:main Running callback portconfigure::add_automatic_compiler_dependencies
375:debug:main Finished running callback portconfigure::add_automatic_compiler_dependencies
376:debug:main Running callback portbuild::add_automatic_buildsystem_dependencies
377:debug:main Finished running callback portbuild::add_automatic_buildsystem_dependencies
378:debug:main No need to upgrade! lame 3.99.5_1 >= lame 3.99.5_1
379:debug:main epoch: in tree: 0 installed: 0
380:debug:main libvorbis 1.3.5_0 exists in the ports tree
381:debug:main libvorbis 1.3.5_0  is the latest installed
382:debug:main libvorbis 1.3.5_0  is active
383:debug:main Merging existing variants '' into variants
384:debug:main new fully merged portvariants:
385:debug:main Changing to port directory: /opt/local/var/macports/sources/rsync.macports.org/release/tarballs/ports/audio/libvorbis
386:debug:main OS darwin/16.1.0 (Mac OS X 10.12) arch i386
387:debug:main Reading variant descriptions from /opt/local/var/macports/sources/rsync.macports.org/release/tarballs/ports/_resources/port1.0/variant_descriptions.conf
388:debug:main Sourcing PortGroup muniversal 1.0 from /opt/local/var/macports/sources/rsync.macports.org/release/tarballs/ports/_resources/port1.0/group/muniversal-1.0.tcl
389:debug:main universal variant already exists, so not adding the default one
390:debug:main Running callback portconfigure::add_automatic_compiler_dependencies
391:debug:main Finished running callback portconfigure::add_automatic_compiler_dependencies
392:debug:main Running callback portbuild::add_automatic_buildsystem_dependencies
393:debug:main Finished running callback portbuild::add_automatic_buildsystem_dependencies
394:debug:main No need to upgrade! libvorbis 1.3.5_0 >= libvorbis 1.3.5_0
395:debug:main epoch: in tree: 0 installed: 0
396:debug:main libogg 1.3.2_1 exists in the ports tree
397:debug:main libogg 1.3.2_1  is the latest installed
398:debug:main libogg 1.3.2_1  is active
399:debug:main Merging existing variants '' into variants
400:debug:main new fully merged portvariants:
401:debug:main Changing to port directory: /opt/local/var/macports/sources/rsync.macports.org/release/tarballs/ports/multimedia/libogg
402:debug:main OS darwin/16.1.0 (Mac OS X 10.12) arch i386
403:debug:main adding the default universal variant
404:debug:main Reading variant descriptions from /opt/local/var/macports/sources/rsync.macports.org/release/tarballs/ports/_resources/port1.0/variant_descriptions.conf
405:debug:main Running callback portconfigure::add_automatic_compiler_dependencies
406:debug:main Finished running callback portconfigure::add_automatic_compiler_dependencies
407:debug:main Running callback portbuild::add_automatic_buildsystem_dependencies
408:debug:main Finished running callback portbuild::add_automatic_buildsystem_dependencies
409:debug:main No need to upgrade! libogg 1.3.2_1 >= libogg 1.3.2_1
410:debug:main epoch: in tree: 0 installed: 0
411:debug:main libopus 1.1.3_0 exists in the ports tree
412:debug:main libopus 1.1.3_0  is the latest installed
413:debug:main libopus 1.1.3_0  is active
414:debug:main Merging existing variants '' into variants
415:debug:main new fully merged portvariants:
416:debug:main Changing to port directory: /opt/local/var/macports/sources/rsync.macports.org/release/tarballs/ports/audio/libopus
417:debug:main OS darwin/16.1.0 (Mac OS X 10.12) arch i386
418:debug:main Reading variant descriptions from /opt/local/var/macports/sources/rsync.macports.org/release/tarballs/ports/_resources/port1.0/variant_descriptions.conf
419:debug:main Sourcing PortGroup muniversal 1.0 from /opt/local/var/macports/sources/rsync.macports.org/release/tarballs/ports/_resources/port1.0/group/muniversal-1.0.tcl
420:debug:main Sourcing PortGroup compiler_blacklist_versions 1.0 from /opt/local/var/macports/sources/rsync.macports.org/release/tarballs/ports/_resources/port1.0/group/compiler_blacklist_versions-1.0.tcl
421:debug:main compiler clang 800.0.42.1 not blacklisted because it doesn't match {clang < 500}
422:debug:main universal variant already exists, so not adding the default one
423:debug:main Running callback portconfigure::add_automatic_compiler_dependencies
424:debug:main Finished running callback portconfigure::add_automatic_compiler_dependencies
425:debug:main Running callback portbuild::add_automatic_buildsystem_dependencies
426:debug:main Finished running callback portbuild::add_automatic_buildsystem_dependencies
427:debug:main No need to upgrade! libopus 1.1.3_0 >= libopus 1.1.3_0
428:debug:main epoch: in tree: 1 installed: 1
429:debug:main libtheora 1.1.1_2 exists in the ports tree
430:debug:main libtheora 1.1.1_2  is the latest installed
431:debug:main libtheora 1.1.1_2  is active
432:debug:main Merging existing variants '' into variants
433:debug:main new fully merged portvariants:
434:debug:main Changing to port directory: /opt/local/var/macports/sources/rsync.macports.org/release/tarballs/ports/multimedia/libtheora
435:debug:main OS darwin/16.1.0 (Mac OS X 10.12) arch i386
436:debug:main Sourcing PortGroup xcodeversion 1.0 from /opt/local/var/macports/sources/rsync.macports.org/release/tarballs/ports/_resources/port1.0/group/xcodeversion-1.0.tcl
437:debug:main adding the default universal variant
438:debug:main Reading variant descriptions from /opt/local/var/macports/sources/rsync.macports.org/release/tarballs/ports/_resources/port1.0/variant_descriptions.conf
439:debug:main Running callback portconfigure::add_automatic_compiler_dependencies
440:debug:main Finished running callback portconfigure::add_automatic_compiler_dependencies
441:debug:main Running callback portbuild::add_automatic_buildsystem_dependencies
442:debug:main Finished running callback portbuild::add_automatic_buildsystem_dependencies
443:debug:main No need to upgrade! libtheora 1.1.1_2 >= libtheora 1.1.1_2
444:debug:main epoch: in tree: 0 installed: 0
445:debug:main libmodplug 0.8.8.5_0 exists in the ports tree
446:debug:main libmodplug 0.8.8.5_0  is the latest installed
447:debug:main libmodplug 0.8.8.5_0  is active
448:debug:main Merging existing variants '' into variants
449:debug:main new fully merged portvariants:
450:debug:main Changing to port directory: /opt/local/var/macports/sources/rsync.macports.org/release/tarballs/ports/audio/libmodplug
451:debug:main OS darwin/16.1.0 (Mac OS X 10.12) arch i386
452:debug:main adding the default universal variant
453:debug:main Reading variant descriptions from /opt/local/var/macports/sources/rsync.macports.org/release/tarballs/ports/_resources/port1.0/variant_descriptions.conf
454:debug:main Running callback portconfigure::add_automatic_compiler_dependencies
455:debug:main Finished running callback portconfigure::add_automatic_compiler_dependencies
456:debug:main Running callback portbuild::add_automatic_buildsystem_dependencies
457:debug:main Finished running callback portbuild::add_automatic_buildsystem_dependencies
458:debug:main No need to upgrade! libmodplug 0.8.8.5_0 >= libmodplug 0.8.8.5_0
459:debug:main epoch: in tree: 0 installed: 0
460:debug:main schroedinger 1.0.11_0 exists in the ports tree
461:debug:main schroedinger 1.0.11_0  is the latest installed
462:debug:main schroedinger 1.0.11_0  is active
463:debug:main Merging existing variants '' into variants
464:debug:main new fully merged portvariants:
465:debug:main Changing to port directory: /opt/local/var/macports/sources/rsync.macports.org/release/tarballs/ports/multimedia/schroedinger
466:debug:main OS darwin/16.1.0 (Mac OS X 10.12) arch i386
467:debug:main adding the default universal variant
468:debug:main Reading variant descriptions from /opt/local/var/macports/sources/rsync.macports.org/release/tarballs/ports/_resources/port1.0/variant_descriptions.conf
469:debug:main Running callback portconfigure::add_automatic_compiler_dependencies
470:debug:main Finished running callback portconfigure::add_automatic_compiler_dependencies
471:debug:main Running callback portbuild::add_automatic_buildsystem_dependencies
472:debug:main Finished running callback portbuild::add_automatic_buildsystem_dependencies
473:debug:main No need to upgrade! schroedinger 1.0.11_0 >= schroedinger 1.0.11_0
474:debug:main epoch: in tree: 0 installed: 0
475:debug:main orc 0.4.26_0 exists in the ports tree
476:debug:main orc 0.4.26_0  is the latest installed
477:debug:main orc 0.4.26_0  is active
478:debug:main Merging existing variants '' into variants
479:debug:main new fully merged portvariants:
480:debug:main Changing to port directory: /opt/local/var/macports/sources/rsync.macports.org/release/tarballs/ports/devel/orc
481:debug:main OS darwin/16.1.0 (Mac OS X 10.12) arch i386
482:debug:main Reading variant descriptions from /opt/local/var/macports/sources/rsync.macports.org/release/tarballs/ports/_resources/port1.0/variant_descriptions.conf
483:debug:main Sourcing PortGroup muniversal 1.0 from /opt/local/var/macports/sources/rsync.macports.org/release/tarballs/ports/_resources/port1.0/group/muniversal-1.0.tcl
484:debug:main universal variant already exists, so not adding the default one
485:debug:main Running callback portconfigure::add_automatic_compiler_dependencies
486:debug:main Finished running callback portconfigure::add_automatic_compiler_dependencies
487:debug:main Running callback portbuild::add_automatic_buildsystem_dependencies
488:debug:main Finished running callback portbuild::add_automatic_buildsystem_dependencies
489:debug:main No need to upgrade! orc 0.4.26_0 >= orc 0.4.26_0
490:debug:main epoch: in tree: 0 installed: 0
491:debug:main libass 0.13.4_0 exists in the ports tree
492:debug:main libass 0.13.4_0  is the latest installed
493:debug:main libass 0.13.4_0  is active
494:debug:main Merging existing variants '' into variants
495:debug:main new fully merged portvariants:
496:debug:main Changing to port directory: /opt/local/var/macports/sources/rsync.macports.org/release/tarballs/ports/multimedia/libass
497:debug:main OS darwin/16.1.0 (Mac OS X 10.12) arch i386
498:debug:main Sourcing PortGroup github 1.0 from /opt/local/var/macports/sources/rsync.macports.org/release/tarballs/ports/_resources/port1.0/group/github-1.0.tcl
499:debug:main Reading variant descriptions from /opt/local/var/macports/sources/rsync.macports.org/release/tarballs/ports/_resources/port1.0/variant_descriptions.conf
500:debug:main Sourcing PortGroup muniversal 1.0 from /opt/local/var/macports/sources/rsync.macports.org/release/tarballs/ports/_resources/port1.0/group/muniversal-1.0.tcl
501:debug:main universal variant already exists, so not adding the default one
502:debug:main Running callback portconfigure::add_automatic_compiler_dependencies
503:debug:main Finished running callback portconfigure::add_automatic_compiler_dependencies
504:debug:main Running callback portbuild::add_automatic_buildsystem_dependencies
505:debug:main Finished running callback portbuild::add_automatic_buildsystem_dependencies
506:debug:main No need to upgrade! libass 0.13.4_0 >= libass 0.13.4_0
507:debug:main epoch: in tree: 0 installed: 0
508:debug:main fribidi 0.19.7_0 exists in the ports tree
509:debug:main fribidi 0.19.7_0  is the latest installed
510:debug:main fribidi 0.19.7_0  is active
511:debug:main Merging existing variants '' into variants
512:debug:main new fully merged portvariants:
513:debug:main Changing to port directory: /opt/local/var/macports/sources/rsync.macports.org/release/tarballs/ports/textproc/fribidi
514:debug:main OS darwin/16.1.0 (Mac OS X 10.12) arch i386
515:debug:main adding the default universal variant
516:debug:main Reading variant descriptions from /opt/local/var/macports/sources/rsync.macports.org/release/tarballs/ports/_resources/port1.0/variant_descriptions.conf
517:debug:main Running callback portconfigure::add_automatic_compiler_dependencies
518:debug:main Finished running callback portconfigure::add_automatic_compiler_dependencies
519:debug:main Running callback portbuild::add_automatic_buildsystem_dependencies
520:debug:main Finished running callback portbuild::add_automatic_buildsystem_dependencies
521:debug:main No need to upgrade! fribidi 0.19.7_0 >= fribidi 0.19.7_0
522:debug:main epoch: in tree: 0 installed: 0
523:debug:main glib2 2.50.1_0 exists in the ports tree
524:debug:main glib2 2.50.1_0  is the latest installed
525:debug:main glib2 2.50.1_0  is active
526:debug:main Merging existing variants '' into variants
527:debug:main new fully merged portvariants:
528:debug:main Changing to port directory: /opt/local/var/macports/sources/rsync.macports.org/release/tarballs/ports/devel/glib2
529:debug:main OS darwin/16.1.0 (Mac OS X 10.12) arch i386
530:debug:main Sourcing PortGroup compiler_blacklist_versions 1.0 from /opt/local/var/macports/sources/rsync.macports.org/release/tarballs/ports/_resources/port1.0/group/compiler_blacklist_versions-1.0.tcl
531:debug:main compiler clang 800.0.42.1 not blacklisted because it doesn't match {clang < 600}
532:debug:main compiler clang 800.0.42.1 not blacklisted because it doesn't match {clang < 318}
533:debug:main adding the default universal variant
534:debug:main Reading variant descriptions from /opt/local/var/macports/sources/rsync.macports.org/release/tarballs/ports/_resources/port1.0/variant_descriptions.conf
535:debug:main Running callback portconfigure::add_automatic_compiler_dependencies
536:debug:main Finished running callback portconfigure::add_automatic_compiler_dependencies
537:debug:main Running callback portbuild::add_automatic_buildsystem_dependencies
538:debug:main Finished running callback portbuild::add_automatic_buildsystem_dependencies
539:debug:main No need to upgrade! glib2 2.50.1_0 >= glib2 2.50.1_0
540:debug:main epoch: in tree: 0 installed: 0
541:debug:main libffi 3.2.1_0 exists in the ports tree
542:debug:main libffi 3.2.1_0  is the latest installed
543:debug:main libffi 3.2.1_0  is active
544:debug:main Merging existing variants '' into variants
545:debug:main new fully merged portvariants:
546:debug:main Changing to port directory: /opt/local/var/macports/sources/rsync.macports.org/release/tarballs/ports/devel/libffi
547:debug:main OS darwin/16.1.0 (Mac OS X 10.12) arch i386
548:debug:main Reading variant descriptions from /opt/local/var/macports/sources/rsync.macports.org/release/tarballs/ports/_resources/port1.0/variant_descriptions.conf
549:debug:main Sourcing PortGroup muniversal 1.0 from /opt/local/var/macports/sources/rsync.macports.org/release/tarballs/ports/_resources/port1.0/group/muniversal-1.0.tcl
550:debug:main universal variant already exists, so not adding the default one
551:debug:main Running callback portconfigure::add_automatic_compiler_dependencies
552:debug:main Finished running callback portconfigure::add_automatic_compiler_dependencies
553:debug:main Running callback portbuild::add_automatic_buildsystem_dependencies
554:debug:main Finished running callback portbuild::add_automatic_buildsystem_dependencies
555:debug:main No need to upgrade! libffi 3.2.1_0 >= libffi 3.2.1_0
556:debug:main epoch: in tree: 0 installed: 0
557:debug:main pcre 8.39_0 exists in the ports tree
558:debug:main pcre 8.39_0  is the latest installed
559:debug:main pcre 8.39_0  is active
560:debug:main Merging existing variants '' into variants
561:debug:main new fully merged portvariants:
562:debug:main Changing to port directory: /opt/local/var/macports/sources/rsync.macports.org/release/tarballs/ports/devel/pcre
563:debug:main OS darwin/16.1.0 (Mac OS X 10.12) arch i386
564:debug:main adding the default universal variant
565:debug:main Reading variant descriptions from /opt/local/var/macports/sources/rsync.macports.org/release/tarballs/ports/_resources/port1.0/variant_descriptions.conf
566:debug:main Running callback portconfigure::add_automatic_compiler_dependencies
567:debug:main Finished running callback portconfigure::add_automatic_compiler_dependencies
568:debug:main Running callback portbuild::add_automatic_buildsystem_dependencies
569:debug:main Finished running callback portbuild::add_automatic_buildsystem_dependencies
570:debug:main No need to upgrade! pcre 8.39_0 >= pcre 8.39_0
571:debug:main epoch: in tree: 20090923 installed: 20090923
572:debug:main libedit 20160618-3.1_1 exists in the ports tree
573:debug:main libedit 20160618-3.1_1  is the latest installed
574:debug:main libedit 20160618-3.1_1  is active
575:debug:main Merging existing variants '' into variants
576:debug:main new fully merged portvariants:
577:debug:main Changing to port directory: /opt/local/var/macports/sources/rsync.macports.org/release/tarballs/ports/devel/libedit
578:debug:main OS darwin/16.1.0 (Mac OS X 10.12) arch i386
579:debug:main Reading variant descriptions from /opt/local/var/macports/sources/rsync.macports.org/release/tarballs/ports/_resources/port1.0/variant_descriptions.conf
580:debug:main Sourcing PortGroup muniversal 1.0 from /opt/local/var/macports/sources/rsync.macports.org/release/tarballs/ports/_resources/port1.0/group/muniversal-1.0.tcl
581:debug:main universal variant already exists, so not adding the default one
582:debug:main Running callback portconfigure::add_automatic_compiler_dependencies
583:debug:main Finished running callback portconfigure::add_automatic_compiler_dependencies
584:debug:main Running callback portbuild::add_automatic_buildsystem_dependencies
585:debug:main Finished running callback portbuild::add_automatic_buildsystem_dependencies
586:debug:main No need to upgrade! libedit 20160618-3.1_1 >= libedit 20160618-3.1_1
587:debug:main epoch: in tree: 0 installed: 0
588:debug:main fontconfig 2.12.1_1 exists in the ports tree
589:debug:main fontconfig 2.12.1_1  is the latest installed
590:debug:main fontconfig 2.12.1_1  is active
591:debug:main Merging existing variants '' into variants
592:debug:main new fully merged portvariants:
593:debug:main Changing to port directory: /opt/local/var/macports/sources/rsync.macports.org/release/tarballs/ports/graphics/fontconfig
594:debug:main OS darwin/16.1.0 (Mac OS X 10.12) arch i386
595:debug:main Reading variant descriptions from /opt/local/var/macports/sources/rsync.macports.org/release/tarballs/ports/_resources/port1.0/variant_descriptions.conf
596:debug:main Sourcing PortGroup muniversal 1.0 from /opt/local/var/macports/sources/rsync.macports.org/release/tarballs/ports/_resources/port1.0/group/muniversal-1.0.tcl
597:debug:main universal variant already exists, so not adding the default one
598:debug:main Running callback portconfigure::add_automatic_compiler_dependencies
599:debug:main Finished running callback portconfigure::add_automatic_compiler_dependencies
600:debug:main Running callback portbuild::add_automatic_buildsystem_dependencies
601:debug:main Finished running callback portbuild::add_automatic_buildsystem_dependencies
602:debug:main No need to upgrade! fontconfig 2.12.1_1 >= fontconfig 2.12.1_1
603:debug:main epoch: in tree: 0 installed: 0
604:debug:main freetype 2.7_0 exists in the ports tree
605:debug:main freetype 2.7_0  is the latest installed
606:debug:main freetype 2.7_0  is active
607:debug:main Merging existing variants '' into variants
608:debug:main new fully merged portvariants:
609:debug:main Changing to port directory: /opt/local/var/macports/sources/rsync.macports.org/release/tarballs/ports/print/freetype
610:debug:main OS darwin/16.1.0 (Mac OS X 10.12) arch i386
611:debug:main Reading variant descriptions from /opt/local/var/macports/sources/rsync.macports.org/release/tarballs/ports/_resources/port1.0/variant_descriptions.conf
612:debug:main Sourcing PortGroup muniversal 1.0 from /opt/local/var/macports/sources/rsync.macports.org/release/tarballs/ports/_resources/port1.0/group/muniversal-1.0.tcl
613:debug:main universal variant already exists, so not adding the default one
614:debug:main Running callback portconfigure::add_automatic_compiler_dependencies
615:debug:main Finished running callback portconfigure::add_automatic_compiler_dependencies
616:debug:main Running callback portbuild::add_automatic_buildsystem_dependencies
617:debug:main Finished running callback portbuild::add_automatic_buildsystem_dependencies
618:debug:main No need to upgrade! freetype 2.7_0 >= freetype 2.7_0
619:debug:main epoch: in tree: 0 installed: 0
620:debug:main libbluray 0.9.2_0 exists in the ports tree
621:debug:main libbluray 0.9.2_0  is the latest installed
622:debug:main libbluray 0.9.2_0  is active
623:debug:main Merging existing variants '' into variants
624:debug:main new fully merged portvariants:
625:debug:main Changing to port directory: /opt/local/var/macports/sources/rsync.macports.org/release/tarballs/ports/multimedia/libbluray
626:debug:main OS darwin/16.1.0 (Mac OS X 10.12) arch i386
627:debug:main adding the default universal variant
628:debug:main Reading variant descriptions from /opt/local/var/macports/sources/rsync.macports.org/release/tarballs/ports/_resources/port1.0/variant_descriptions.conf
629:debug:main Running callback portconfigure::add_automatic_compiler_dependencies
630:debug:main Finished running callback portconfigure::add_automatic_compiler_dependencies
631:debug:main Running callback portbuild::add_automatic_buildsystem_dependencies
632:debug:main Finished running callback portbuild::add_automatic_buildsystem_dependencies
633:debug:main No need to upgrade! libbluray 0.9.2_0 >= libbluray 0.9.2_0
634:debug:main epoch: in tree: 0 installed: 0
635:debug:main gnutls 3.4.16_1 exists in the ports tree
636:debug:main gnutls 3.4.16_1  is the latest installed
637:debug:main gnutls 3.4.16_1  is active
638:debug:main Merging existing variants '' into variants
639:debug:main new fully merged portvariants:
640:debug:main Changing to port directory: /opt/local/var/macports/sources/rsync.macports.org/release/tarballs/ports/devel/gnutls
641:debug:main OS darwin/16.1.0 (Mac OS X 10.12) arch i386
642:debug:main Reading variant descriptions from /opt/local/var/macports/sources/rsync.macports.org/release/tarballs/ports/_resources/port1.0/variant_descriptions.conf
643:debug:main Sourcing PortGroup muniversal 1.0 from /opt/local/var/macports/sources/rsync.macports.org/release/tarballs/ports/_resources/port1.0/group/muniversal-1.0.tcl
644:debug:main universal variant already exists, so not adding the default one
645:debug:main Running callback portconfigure::add_automatic_compiler_dependencies
646:debug:main Finished running callback portconfigure::add_automatic_compiler_dependencies
647:debug:main Running callback portbuild::add_automatic_buildsystem_dependencies
648:debug:main Finished running callback portbuild::add_automatic_buildsystem_dependencies
649:debug:main No need to upgrade! gnutls 3.4.16_1 >= gnutls 3.4.16_1
650:debug:main epoch: in tree: 0 installed: 0
651:debug:main gmp 6.1.1_0 exists in the ports tree
652:debug:main gmp 6.1.1_0  is the latest installed
653:debug:main gmp 6.1.1_0  is active
654:debug:main Merging existing variants '' into variants
655:debug:main new fully merged portvariants:
656:debug:main Changing to port directory: /opt/local/var/macports/sources/rsync.macports.org/release/tarballs/ports/devel/gmp
657:debug:main OS darwin/16.1.0 (Mac OS X 10.12) arch i386
658:debug:main Reading variant descriptions from /opt/local/var/macports/sources/rsync.macports.org/release/tarballs/ports/_resources/port1.0/variant_descriptions.conf
659:debug:main Sourcing PortGroup muniversal 1.0 from /opt/local/var/macports/sources/rsync.macports.org/release/tarballs/ports/_resources/port1.0/group/muniversal-1.0.tcl
660:debug:main universal variant already exists, so not adding the default one
661:debug:main Running callback portconfigure::add_automatic_compiler_dependencies
662:debug:main Finished running callback portconfigure::add_automatic_compiler_dependencies
663:debug:main Running callback portbuild::add_automatic_buildsystem_dependencies
664:debug:main Finished running callback portbuild::add_automatic_buildsystem_dependencies
665:debug:main No need to upgrade! gmp 6.1.1_0 >= gmp 6.1.1_0
666:debug:main epoch: in tree: 0 installed: 0
667:debug:main libidn 1.33_0 exists in the ports tree
668:debug:main libidn 1.33_0  is the latest installed
669:debug:main libidn 1.33_0  is active
670:debug:main Merging existing variants '' into variants
671:debug:main new fully merged portvariants:
672:debug:main Changing to port directory: /opt/local/var/macports/sources/rsync.macports.org/release/tarballs/ports/mail/libidn
673:debug:main OS darwin/16.1.0 (Mac OS X 10.12) arch i386
674:debug:main adding the default universal variant
675:debug:main Reading variant descriptions from /opt/local/var/macports/sources/rsync.macports.org/release/tarballs/ports/_resources/port1.0/variant_descriptions.conf
676:debug:main Running callback portconfigure::add_automatic_compiler_dependencies
677:debug:main Finished running callback portconfigure::add_automatic_compiler_dependencies
678:debug:main Running callback portbuild::add_automatic_buildsystem_dependencies
679:debug:main Finished running callback portbuild::add_automatic_buildsystem_dependencies
680:debug:main No need to upgrade! libidn 1.33_0 >= libidn 1.33_0
681:debug:main epoch: in tree: 0 installed: 0
682:debug:main libtasn1 4.9_0 exists in the ports tree
683:debug:main libtasn1 4.9_0  is the latest installed
684:debug:main libtasn1 4.9_0  is active
685:debug:main Merging existing variants '' into variants
686:debug:main new fully merged portvariants:
687:debug:main Changing to port directory: /opt/local/var/macports/sources/rsync.macports.org/release/tarballs/ports/devel/libtasn1
688:debug:main OS darwin/16.1.0 (Mac OS X 10.12) arch i386
689:debug:main adding the default universal variant
690:debug:main Reading variant descriptions from /opt/local/var/macports/sources/rsync.macports.org/release/tarballs/ports/_resources/port1.0/variant_descriptions.conf
691:debug:main Running callback portconfigure::add_automatic_compiler_dependencies
692:debug:main Finished running callback portconfigure::add_automatic_compiler_dependencies
693:debug:main Running callback portbuild::add_automatic_buildsystem_dependencies
694:debug:main Finished running callback portbuild::add_automatic_buildsystem_dependencies
695:debug:main No need to upgrade! libtasn1 4.9_0 >= libtasn1 4.9_0
696:debug:main epoch: in tree: 0 installed: 0
697:debug:main p11-kit 0.23.2_1 exists in the ports tree
698:debug:main p11-kit 0.23.2_1  is the latest installed
699:debug:main p11-kit 0.23.2_1  is active
700:debug:main Merging existing variants '' into variants
701:debug:main new fully merged portvariants:
702:debug:main Changing to port directory: /opt/local/var/macports/sources/rsync.macports.org/release/tarballs/ports/security/p11-kit
703:debug:main OS darwin/16.1.0 (Mac OS X 10.12) arch i386
704:debug:main adding the default universal variant
705:debug:main Reading variant descriptions from /opt/local/var/macports/sources/rsync.macports.org/release/tarballs/ports/_resources/port1.0/variant_descriptions.conf
706:debug:main Running callback portconfigure::add_automatic_compiler_dependencies
707:debug:main Finished running callback portconfigure::add_automatic_compiler_dependencies
708:debug:main Running callback portbuild::add_automatic_buildsystem_dependencies
709:debug:main Finished running callback portbuild::add_automatic_buildsystem_dependencies
710:debug:main No need to upgrade! p11-kit 0.23.2_1 >= p11-kit 0.23.2_1
711:debug:main epoch: in tree: 0 installed: 0
712:debug:main desktop-file-utils 0.23_0 exists in the ports tree
713:debug:main desktop-file-utils 0.23_0  is the latest installed
714:debug:main desktop-file-utils 0.23_0  is active
715:debug:main Merging existing variants '' into variants
716:debug:main new fully merged portvariants:
717:debug:main Changing to port directory: /opt/local/var/macports/sources/rsync.macports.org/release/tarballs/ports/gnome/desktop-file-utils
718:debug:main OS darwin/16.1.0 (Mac OS X 10.12) arch i386
719:debug:main adding the default universal variant
720:debug:main Reading variant descriptions from /opt/local/var/macports/sources/rsync.macports.org/release/tarballs/ports/_resources/port1.0/variant_descriptions.conf
721:debug:main Running callback portconfigure::add_automatic_compiler_dependencies
722:debug:main Finished running callback portconfigure::add_automatic_compiler_dependencies
723:debug:main Running callback portbuild::add_automatic_buildsystem_dependencies
724:debug:main Finished running callback portbuild::add_automatic_buildsystem_dependencies
725:debug:main No need to upgrade! desktop-file-utils 0.23_0 >= desktop-file-utils 0.23_0
726:debug:main epoch: in tree: 0 installed: 0
727:debug:main popt 1.16_0 exists in the ports tree
728:debug:main popt 1.16_0  is the latest installed
729:debug:main popt 1.16_0  is active
730:debug:main Merging existing variants '' into variants
731:debug:main new fully merged portvariants:
732:debug:main Changing to port directory: /opt/local/var/macports/sources/rsync.macports.org/release/tarballs/ports/devel/popt
733:debug:main OS darwin/16.1.0 (Mac OS X 10.12) arch i386
734:debug:main adding the default universal variant
735:debug:main Reading variant descriptions from /opt/local/var/macports/sources/rsync.macports.org/release/tarballs/ports/_resources/port1.0/variant_descriptions.conf
736:debug:main Running callback portconfigure::add_automatic_compiler_dependencies
737:debug:main Finished running callback portconfigure::add_automatic_compiler_dependencies
738:debug:main Running callback portbuild::add_automatic_buildsystem_dependencies
739:debug:main Finished running callback portbuild::add_automatic_buildsystem_dependencies
740:debug:main No need to upgrade! popt 1.16_0 >= popt 1.16_0
741:debug:main epoch: in tree: 0 installed: 0
742:debug:main libxslt 1.1.29_1 exists in the ports tree
743:debug:main libxslt 1.1.29_1  is the latest installed
744:debug:main libxslt 1.1.29_1  is active
745:debug:main Merging existing variants '' into variants
746:debug:main new fully merged portvariants:
747:debug:main Changing to port directory: /opt/local/var/macports/sources/rsync.macports.org/release/tarballs/ports/textproc/libxslt
748:debug:main OS darwin/16.1.0 (Mac OS X 10.12) arch i386
749:debug:main adding the default universal variant
750:debug:main Reading variant descriptions from /opt/local/var/macports/sources/rsync.macports.org/release/tarballs/ports/_resources/port1.0/variant_descriptions.conf
751:debug:main Running callback portconfigure::add_automatic_compiler_dependencies
752:debug:main Finished running callback portconfigure::add_automatic_compiler_dependencies
753:debug:main Running callback portbuild::add_automatic_buildsystem_dependencies
754:debug:main Finished running callback portbuild::add_automatic_buildsystem_dependencies
755:debug:main No need to upgrade! libxslt 1.1.29_1 >= libxslt 1.1.29_1
756:debug:main epoch: in tree: 0 installed: 0
757:debug:main nettle 3.1.1_0 exists in the ports tree
758:debug:main nettle 3.1.1_0  is the latest installed
759:debug:main nettle 3.1.1_0  is active
760:debug:main Merging existing variants '' into variants
761:debug:main new fully merged portvariants:
762:debug:main Changing to port directory: /opt/local/var/macports/sources/rsync.macports.org/release/tarballs/ports/devel/nettle
763:debug:main OS darwin/16.1.0 (Mac OS X 10.12) arch i386
764:debug:main Reading variant descriptions from /opt/local/var/macports/sources/rsync.macports.org/release/tarballs/ports/_resources/port1.0/variant_descriptions.conf
765:debug:main Sourcing PortGroup muniversal 1.0 from /opt/local/var/macports/sources/rsync.macports.org/release/tarballs/ports/_resources/port1.0/group/muniversal-1.0.tcl
766:debug:main universal variant already exists, so not adding the default one
767:debug:main Running callback portconfigure::add_automatic_compiler_dependencies
768:debug:main Finished running callback portconfigure::add_automatic_compiler_dependencies
769:debug:main Running callback portbuild::add_automatic_buildsystem_dependencies
770:debug:main Finished running callback portbuild::add_automatic_buildsystem_dependencies
771:debug:main No need to upgrade! nettle 3.1.1_0 >= nettle 3.1.1_0
772:debug:main epoch: in tree: 0 installed: 0
773:debug:main openjpeg 2.1.0_0 exists in the ports tree
774:debug:main openjpeg 2.1.0_0  is the latest installed
775:debug:main openjpeg 2.1.0_0  is active
776:debug:main Merging existing variants '' into variants
777:debug:main new fully merged portvariants:
778:debug:main Changing to port directory: /opt/local/var/macports/sources/rsync.macports.org/release/tarballs/ports/graphics/openjpeg
779:debug:main OS darwin/16.1.0 (Mac OS X 10.12) arch i386
780:debug:main Re-registering default for configure.dir
781:debug:main Re-registering default for build.dir
782:debug:main Sourcing PortGroup cmake 1.0 from /opt/local/var/macports/sources/rsync.macports.org/release/tarballs/ports/_resources/port1.0/group/cmake-1.0.tcl
783:debug:main adding the default universal variant
784:debug:main Reading variant descriptions from /opt/local/var/macports/sources/rsync.macports.org/release/tarballs/ports/_resources/port1.0/variant_descriptions.conf
785:debug:main Running callback portconfigure::add_automatic_compiler_dependencies
786:debug:main Finished running callback portconfigure::add_automatic_compiler_dependencies
787:debug:main Running callback portbuild::add_automatic_buildsystem_dependencies
788:debug:main Finished running callback portbuild::add_automatic_buildsystem_dependencies
789:debug:main No need to upgrade! openjpeg 2.1.0_0 >= openjpeg 2.1.0_0
790:debug:main epoch: in tree: 0 installed: 0
791:debug:main lcms2 2.8_0 exists in the ports tree
792:debug:main lcms2 2.8_0  is the latest installed
793:debug:main lcms2 2.8_0  is active
794:debug:main Merging existing variants '' into variants
795:debug:main new fully merged portvariants:
796:debug:main Changing to port directory: /opt/local/var/macports/sources/rsync.macports.org/release/tarballs/ports/graphics/lcms2
797:debug:main OS darwin/16.1.0 (Mac OS X 10.12) arch i386
798:debug:main Reading variant descriptions from /opt/local/var/macports/sources/rsync.macports.org/release/tarballs/ports/_resources/port1.0/variant_descriptions.conf
799:debug:main Sourcing PortGroup muniversal 1.0 from /opt/local/var/macports/sources/rsync.macports.org/release/tarballs/ports/_resources/port1.0/group/muniversal-1.0.tcl
800:debug:main universal variant already exists, so not adding the default one
801:debug:main Running callback portconfigure::add_automatic_compiler_dependencies
802:debug:main Finished running callback portconfigure::add_automatic_compiler_dependencies
803:debug:main Running callback portbuild::add_automatic_buildsystem_dependencies
804:debug:main Finished running callback portbuild::add_automatic_buildsystem_dependencies
805:debug:main No need to upgrade! lcms2 2.8_0 >= lcms2 2.8_0
806:debug:main epoch: in tree: 0 installed: 0
807:debug:main jbigkit 2.1_0 exists in the ports tree
808:debug:main jbigkit 2.1_0  is the latest installed
809:debug:main jbigkit 2.1_0  is active
810:debug:main Merging existing variants '' into variants
811:debug:main new fully merged portvariants:
812:debug:main Changing to port directory: /opt/local/var/macports/sources/rsync.macports.org/release/tarballs/ports/graphics/jbigkit
813:debug:main OS darwin/16.1.0 (Mac OS X 10.12) arch i386
814:debug:main Reading variant descriptions from /opt/local/var/macports/sources/rsync.macports.org/release/tarballs/ports/_resources/port1.0/variant_descriptions.conf
815:debug:main universal variant already exists, so not adding the default one
816:debug:main Running callback portconfigure::add_automatic_compiler_dependencies
817:debug:main Finished running callback portconfigure::add_automatic_compiler_dependencies
818:debug:main Running callback portbuild::add_automatic_buildsystem_dependencies
819:debug:main Finished running callback portbuild::add_automatic_buildsystem_dependencies
820:debug:main No need to upgrade! jbigkit 2.1_0 >= jbigkit 2.1_0
821:debug:main epoch: in tree: 0 installed: 0
822:debug:main speex 1.2rc1_0 exists in the ports tree
823:debug:main speex 1.2rc1_0  is the latest installed
824:debug:main speex 1.2rc1_0  is active
825:debug:main Merging existing variants '' into variants
826:debug:main new fully merged portvariants:
827:debug:main Changing to port directory: /opt/local/var/macports/sources/rsync.macports.org/release/tarballs/ports/audio/speex
828:debug:main OS darwin/16.1.0 (Mac OS X 10.12) arch i386
829:debug:main adding the default universal variant
830:debug:main Reading variant descriptions from /opt/local/var/macports/sources/rsync.macports.org/release/tarballs/ports/_resources/port1.0/variant_descriptions.conf
831:debug:main Running callback portconfigure::add_automatic_compiler_dependencies
832:debug:main Finished running callback portconfigure::add_automatic_compiler_dependencies
833:debug:main Running callback portbuild::add_automatic_buildsystem_dependencies
834:debug:main Finished running callback portbuild::add_automatic_buildsystem_dependencies
835:debug:main No need to upgrade! speex 1.2rc1_0 >= speex 1.2rc1_0
836:debug:main epoch: in tree: 0 installed: 0
837:debug:main libsdl2 2.0.5_0 exists in the ports tree
838:debug:main libsdl2 2.0.5_0  is the latest installed
839:debug:main libsdl2 2.0.5_0  is active
840:debug:main Merging existing variants '' into variants
841:debug:main new fully merged portvariants:
842:debug:main Changing to port directory: /opt/local/var/macports/sources/rsync.macports.org/release/tarballs/ports/devel/libsdl2
843:debug:main OS darwin/16.1.0 (Mac OS X 10.12) arch i386
844:debug:main Sourcing PortGroup compiler_blacklist_versions 1.0 from /opt/local/var/macports/sources/rsync.macports.org/release/tarballs/ports/_resources/port1.0/group/compiler_blacklist_versions-1.0.tcl
845:debug:main compiler clang 800.0.42.1 not blacklisted because it doesn't match { clang < 211 }
846:debug:main Reading variant descriptions from /opt/local/var/macports/sources/rsync.macports.org/release/tarballs/ports/_resources/port1.0/variant_descriptions.conf
847:debug:main adding the default universal variant
848:debug:main Running callback portconfigure::add_automatic_compiler_dependencies
849:debug:main Finished running callback portconfigure::add_automatic_compiler_dependencies
850:debug:main Running callback portbuild::add_automatic_buildsystem_dependencies
851:debug:main Finished running callback portbuild::add_automatic_buildsystem_dependencies
852:debug:main No need to upgrade! libsdl2 2.0.5_0 >= libsdl2 2.0.5_0
853:debug:main epoch: in tree: 0 installed: 0
854:debug:main soxr 0.1.2_0 exists in the ports tree
855:debug:main soxr 0.1.2_0  is the latest installed
856:debug:main soxr 0.1.2_0  is active
857:debug:main Merging existing variants '' into variants
858:debug:main new fully merged portvariants:
859:debug:main Changing to port directory: /opt/local/var/macports/sources/rsync.macports.org/release/tarballs/ports/audio/soxr
860:debug:main OS darwin/16.1.0 (Mac OS X 10.12) arch i386
861:debug:main Re-registering default for configure.dir
862:debug:main Re-registering default for build.dir
863:debug:main Sourcing PortGroup cmake 1.0 from /opt/local/var/macports/sources/rsync.macports.org/release/tarballs/ports/_resources/port1.0/group/cmake-1.0.tcl
864:debug:main adding the default universal variant
865:debug:main Reading variant descriptions from /opt/local/var/macports/sources/rsync.macports.org/release/tarballs/ports/_resources/port1.0/variant_descriptions.conf
866:debug:main Running callback portconfigure::add_automatic_compiler_dependencies
867:debug:main Finished running callback portconfigure::add_automatic_compiler_dependencies
868:debug:main Running callback portbuild::add_automatic_buildsystem_dependencies
869:debug:main Finished running callback portbuild::add_automatic_buildsystem_dependencies
870:debug:main No need to upgrade! soxr 0.1.2_0 >= soxr 0.1.2_0
871:debug:main epoch: in tree: 0 installed: 0
872:debug:main XviD 1.3.4_0 exists in the ports tree
873:debug:main XviD 1.3.4_0  is the latest installed
874:debug:main XviD 1.3.4_0  is active
875:debug:main Merging existing variants '' into variants
876:debug:main new fully merged portvariants:
877:debug:main Changing to port directory: /opt/local/var/macports/sources/rsync.macports.org/release/tarballs/ports/multimedia/XviD
878:debug:main OS darwin/16.1.0 (Mac OS X 10.12) arch i386
879:debug:main Reading variant descriptions from /opt/local/var/macports/sources/rsync.macports.org/release/tarballs/ports/_resources/port1.0/variant_descriptions.conf
880:debug:main Sourcing PortGroup muniversal 1.0 from /opt/local/var/macports/sources/rsync.macports.org/release/tarballs/ports/_resources/port1.0/group/muniversal-1.0.tcl
881:debug:main universal variant already exists, so not adding the default one
882:debug:main Running callback portconfigure::add_automatic_compiler_dependencies
883:debug:main Finished running callback portconfigure::add_automatic_compiler_dependencies
884:debug:main Running callback portbuild::add_automatic_buildsystem_dependencies
885:debug:main Finished running callback portbuild::add_automatic_buildsystem_dependencies
886:debug:main No need to upgrade! XviD 1.3.4_0 >= XviD 1.3.4_0
887:debug:main epoch: in tree: 0 installed: 0
888:debug:main x264 20160119_0 exists in the ports tree
889:debug:main x264 20160119_0  is the latest installed
890:debug:main x264 20160119_0  is active
891:debug:main Merging existing variants '' into variants
892:debug:main new fully merged portvariants:
893:debug:main Changing to port directory: /opt/local/var/macports/sources/rsync.macports.org/release/tarballs/ports/multimedia/x264
894:debug:main OS darwin/16.1.0 (Mac OS X 10.12) arch i386
895:debug:main Reading variant descriptions from /opt/local/var/macports/sources/rsync.macports.org/release/tarballs/ports/_resources/port1.0/variant_descriptions.conf
896:debug:main Sourcing PortGroup muniversal 1.0 from /opt/local/var/macports/sources/rsync.macports.org/release/tarballs/ports/_resources/port1.0/group/muniversal-1.0.tcl
897:debug:main Sourcing PortGroup xcodeversion 1.0 from /opt/local/var/macports/sources/rsync.macports.org/release/tarballs/ports/_resources/port1.0/group/xcodeversion-1.0.tcl
898:debug:main universal variant already exists, so not adding the default one
899:debug:main Running callback portconfigure::add_automatic_compiler_dependencies
900:debug:main Finished running callback portconfigure::add_automatic_compiler_dependencies
901:debug:main Running callback portbuild::add_automatic_buildsystem_dependencies
902:debug:main Finished running callback portbuild::add_automatic_buildsystem_dependencies
903:debug:main No need to upgrade! x264 20160119_0 >= x264 20160119_0
904:msg:main --->  Computing dependencies for opencv:info:main .:debug:main opencv has no conflicts
905:debug:main Found Dependency: path: /usr/bin filename: unzip regex: ^unzip$
906:debug:main Searching for dependency: unzip
907:debug:main Didn't find receipt, going to depspec regex for: unzip
908:debug:main Found Dependency: path: /usr/bin filename: unzip regex: ^unzip$
909:debug:main Searching for dependency: cmake
910:debug:main Found Dependency: receipt exists for cmake
911:debug:main Searching for dependency: pkgconfig
912:debug:main Found Dependency: receipt exists for pkgconfig
913:debug:main Searching for dependency: zlib
914:debug:main Found Dependency: receipt exists for zlib
915:debug:main Searching for dependency: bzip2
916:debug:main Found Dependency: receipt exists for bzip2
917:debug:main Searching for dependency: libpng
918:debug:main Found Dependency: receipt exists for libpng
919:debug:main Searching for dependency: jpeg
920:debug:main Found Dependency: receipt exists for jpeg
921:debug:main Searching for dependency: jasper
922:debug:main Found Dependency: receipt exists for jasper
923:debug:main Searching for dependency: tiff
924:debug:main Found Dependency: receipt exists for tiff
925:debug:main Searching for dependency: webp
926:debug:main Found Dependency: receipt exists for webp
927:debug:main Searching for dependency: ilmbase
928:debug:main Found Dependency: receipt exists for ilmbase
929:debug:main Searching for dependency: openexr
930:debug:main Found Dependency: receipt exists for openexr
931:debug:main Searching for dependency: ffmpeg
932:debug:main Found Dependency: receipt exists for ffmpeg
933:msg:main
934:debug:main Executing org.macports.main (opencv)
935:debug:main changing euid/egid - current euid: 0 - current egid: 0
936:debug:main egid changed to: 501
937:debug:main euid changed to: 502
938:debug:main Skipping completed org.macports.archivefetch (opencv)
939:debug:main Privilege de-escalation not attempted as not running as root.
940:debug:main Skipping completed org.macports.fetch (opencv)
941:debug:main Privilege de-escalation not attempted as not running as root.
942:debug:main Skipping completed org.macports.checksum (opencv)
943:debug:main Privilege de-escalation not attempted as not running as root.
944:debug:main Skipping completed org.macports.extract (opencv)
945:debug:main Privilege de-escalation not attempted as not running as root.
946:debug:main Skipping completed org.macports.patch (opencv)
947:debug:main Privilege de-escalation not attempted as not running as root.
948:debug:main Skipping completed org.macports.configure (opencv)
949:debug:main Privilege de-escalation not attempted as not running as root.
950:debug:build build phase started at Fri Nov  4 22:31:30 CET 2016
951:notice:build --->  Building opencv
952:debug:build Executing org.macports.build (opencv)
953:debug:build Environment:
954CC_PRINT_OPTIONS='YES'
955CC_PRINT_OPTIONS_FILE='/opt/local/var/macports/build/_opt_local_var_macports_sources_rsync.macports.org_release_tarballs_ports_graphics_opencv/opencv/work/.CC_PRINT_OPTIONS'
956CPATH='/opt/local/include'
957LIBRARY_PATH='/opt/local/lib'
958MACOSX_DEPLOYMENT_TARGET='10.12'
959:debug:build Assembled command: 'cd "/opt/local/var/macports/build/_opt_local_var_macports_sources_rsync.macports.org_release_tarballs_ports_graphics_opencv/opencv/work/build" && /usr/bin/make -j4 -w all VERBOSE=ON'
960:debug:build Executing command line:  cd "/opt/local/var/macports/build/_opt_local_var_macports_sources_rsync.macports.org_release_tarballs_ports_graphics_opencv/opencv/work/build" && /usr/bin/make -j4 -w all VERBOSE=ON
961:info:build make: Entering directory `/opt/local/var/macports/build/_opt_local_var_macports_sources_rsync.macports.org_release_tarballs_ports_graphics_opencv/opencv/work/build'
962:info:build /opt/local/bin/cmake -H/opt/local/var/macports/build/_opt_local_var_macports_sources_rsync.macports.org_release_tarballs_ports_graphics_opencv/opencv/work/opencv-3.1.0 -B/opt/local/var/macports/build/_opt_local_var_macports_sources_rsync.macports.org_release_tarballs_ports_graphics_opencv/opencv/work/build --check-build-system CMakeFiles/Makefile.cmake 0
963:info:build /opt/local/bin/cmake -E cmake_progress_start /opt/local/var/macports/build/_opt_local_var_macports_sources_rsync.macports.org_release_tarballs_ports_graphics_opencv/opencv/work/build/CMakeFiles /opt/local/var/macports/build/_opt_local_var_macports_sources_rsync.macports.org_release_tarballs_ports_graphics_opencv/opencv/work/build/CMakeFiles/progress.marks
964:info:build /Applications/Xcode.app/Contents/Developer/usr/bin/make -f CMakeFiles/Makefile2 all
965:info:build make[1]: Entering directory `/opt/local/var/macports/build/_opt_local_var_macports_sources_rsync.macports.org_release_tarballs_ports_graphics_opencv/opencv/work/build'
966:info:build /Applications/Xcode.app/Contents/Developer/usr/bin/make -f modules/core/CMakeFiles/opencv_core.dir/build.make modules/core/CMakeFiles/opencv_core.dir/depend
967:info:build make[2]: Entering directory `/opt/local/var/macports/build/_opt_local_var_macports_sources_rsync.macports.org_release_tarballs_ports_graphics_opencv/opencv/work/build'
968:info:build cd /opt/local/var/macports/build/_opt_local_var_macports_sources_rsync.macports.org_release_tarballs_ports_graphics_opencv/opencv/work/build && /opt/local/bin/cmake -E cmake_depends "Unix Makefiles" /opt/local/var/macports/build/_opt_local_var_macports_sources_rsync.macports.org_release_tarballs_ports_graphics_opencv/opencv/work/opencv-3.1.0 /opt/local/var/macports/build/_opt_local_var_macports_sources_rsync.macports.org_release_tarballs_ports_graphics_opencv/opencv/work/opencv-3.1.0/modules/core /opt/local/var/macports/build/_opt_local_var_macports_sources_rsync.macports.org_release_tarballs_ports_graphics_opencv/opencv/work/build /opt/local/var/macports/build/_opt_local_var_macports_sources_rsync.macports.org_release_tarballs_ports_graphics_opencv/opencv/work/build/modules/core /opt/local/var/macports/build/_opt_local_var_macports_sources_rsync.macports.org_release_tarballs_ports_graphics_opencv/opencv/work/build/modules/core/CMakeFiles/opencv_core.dir/DependInfo.cmake --color=
969:info:build make[2]: Leaving directory `/opt/local/var/macports/build/_opt_local_var_macports_sources_rsync.macports.org_release_tarballs_ports_graphics_opencv/opencv/work/build'
970:info:build /Applications/Xcode.app/Contents/Developer/usr/bin/make -f modules/core/CMakeFiles/opencv_core.dir/build.make modules/core/CMakeFiles/opencv_core.dir/build
971:info:build make[2]: Entering directory `/opt/local/var/macports/build/_opt_local_var_macports_sources_rsync.macports.org_release_tarballs_ports_graphics_opencv/opencv/work/build'
972:info:build make[2]: Nothing to be done for `modules/core/CMakeFiles/opencv_core.dir/build'.
973:info:build make[2]: Leaving directory `/opt/local/var/macports/build/_opt_local_var_macports_sources_rsync.macports.org_release_tarballs_ports_graphics_opencv/opencv/work/build'
974:info:build [ 15%] Built target opencv_core
975:info:build /Applications/Xcode.app/Contents/Developer/usr/bin/make -f modules/flann/CMakeFiles/opencv_flann.dir/build.make modules/flann/CMakeFiles/opencv_flann.dir/depend
976:info:build /Applications/Xcode.app/Contents/Developer/usr/bin/make -f modules/imgproc/CMakeFiles/opencv_imgproc.dir/build.make modules/imgproc/CMakeFiles/opencv_imgproc.dir/depend
977:info:build /Applications/Xcode.app/Contents/Developer/usr/bin/make -f modules/ml/CMakeFiles/opencv_ml.dir/build.make modules/ml/CMakeFiles/opencv_ml.dir/depend
978:info:build make[2]: Entering directory `/opt/local/var/macports/build/_opt_local_var_macports_sources_rsync.macports.org_release_tarballs_ports_graphics_opencv/opencv/work/build'
979:info:build cd /opt/local/var/macports/build/_opt_local_var_macports_sources_rsync.macports.org_release_tarballs_ports_graphics_opencv/opencv/work/build && /opt/local/bin/cmake -E cmake_depends "Unix Makefiles" /opt/local/var/macports/build/_opt_local_var_macports_sources_rsync.macports.org_release_tarballs_ports_graphics_opencv/opencv/work/opencv-3.1.0 /opt/local/var/macports/build/_opt_local_var_macports_sources_rsync.macports.org_release_tarballs_ports_graphics_opencv/opencv/work/opencv-3.1.0/modules/flann /opt/local/var/macports/build/_opt_local_var_macports_sources_rsync.macports.org_release_tarballs_ports_graphics_opencv/opencv/work/build /opt/local/var/macports/build/_opt_local_var_macports_sources_rsync.macports.org_release_tarballs_ports_graphics_opencv/opencv/work/build/modules/flann /opt/local/var/macports/build/_opt_local_var_macports_sources_rsync.macports.org_release_tarballs_ports_graphics_opencv/opencv/work/build/modules/flann/CMakeFiles/opencv_flann.dir/DependInfo.cmake --color=
980:info:build make[2]: Entering directory `/opt/local/var/macports/build/_opt_local_var_macports_sources_rsync.macports.org_release_tarballs_ports_graphics_opencv/opencv/work/build'
981:info:build cd /opt/local/var/macports/build/_opt_local_var_macports_sources_rsync.macports.org_release_tarballs_ports_graphics_opencv/opencv/work/build && /opt/local/bin/cmake -E cmake_depends "Unix Makefiles" /opt/local/var/macports/build/_opt_local_var_macports_sources_rsync.macports.org_release_tarballs_ports_graphics_opencv/opencv/work/opencv-3.1.0 /opt/local/var/macports/build/_opt_local_var_macports_sources_rsync.macports.org_release_tarballs_ports_graphics_opencv/opencv/work/opencv-3.1.0/modules/ml /opt/local/var/macports/build/_opt_local_var_macports_sources_rsync.macports.org_release_tarballs_ports_graphics_opencv/opencv/work/build /opt/local/var/macports/build/_opt_local_var_macports_sources_rsync.macports.org_release_tarballs_ports_graphics_opencv/opencv/work/build/modules/ml /opt/local/var/macports/build/_opt_local_var_macports_sources_rsync.macports.org_release_tarballs_ports_graphics_opencv/opencv/work/build/modules/ml/CMakeFiles/opencv_ml.dir/DependInfo.cmake --color=
982:info:build make[2]: Leaving directory `/opt/local/var/macports/build/_opt_local_var_macports_sources_rsync.macports.org_release_tarballs_ports_graphics_opencv/opencv/work/build'
983:info:build /Applications/Xcode.app/Contents/Developer/usr/bin/make -f modules/flann/CMakeFiles/opencv_flann.dir/build.make modules/flann/CMakeFiles/opencv_flann.dir/build
984:info:build make[2]: Entering directory `/opt/local/var/macports/build/_opt_local_var_macports_sources_rsync.macports.org_release_tarballs_ports_graphics_opencv/opencv/work/build'
985:info:build make[2]: Nothing to be done for `modules/flann/CMakeFiles/opencv_flann.dir/build'.
986:info:build make[2]: Leaving directory `/opt/local/var/macports/build/_opt_local_var_macports_sources_rsync.macports.org_release_tarballs_ports_graphics_opencv/opencv/work/build'
987:info:build [ 17%] Built target opencv_flann
988:info:build make[2]: Entering directory `/opt/local/var/macports/build/_opt_local_var_macports_sources_rsync.macports.org_release_tarballs_ports_graphics_opencv/opencv/work/build'
989:info:build cd /opt/local/var/macports/build/_opt_local_var_macports_sources_rsync.macports.org_release_tarballs_ports_graphics_opencv/opencv/work/build && /opt/local/bin/cmake -E cmake_depends "Unix Makefiles" /opt/local/var/macports/build/_opt_local_var_macports_sources_rsync.macports.org_release_tarballs_ports_graphics_opencv/opencv/work/opencv-3.1.0 /opt/local/var/macports/build/_opt_local_var_macports_sources_rsync.macports.org_release_tarballs_ports_graphics_opencv/opencv/work/opencv-3.1.0/modules/imgproc /opt/local/var/macports/build/_opt_local_var_macports_sources_rsync.macports.org_release_tarballs_ports_graphics_opencv/opencv/work/build /opt/local/var/macports/build/_opt_local_var_macports_sources_rsync.macports.org_release_tarballs_ports_graphics_opencv/opencv/work/build/modules/imgproc /opt/local/var/macports/build/_opt_local_var_macports_sources_rsync.macports.org_release_tarballs_ports_graphics_opencv/opencv/work/build/modules/imgproc/CMakeFiles/opencv_imgproc.dir/DependInfo.cmake --color=
990:info:build make[2]: Leaving directory `/opt/local/var/macports/build/_opt_local_var_macports_sources_rsync.macports.org_release_tarballs_ports_graphics_opencv/opencv/work/build'
991:info:build /Applications/Xcode.app/Contents/Developer/usr/bin/make -f modules/ml/CMakeFiles/opencv_ml.dir/build.make modules/ml/CMakeFiles/opencv_ml.dir/build
992:info:build make[2]: Entering directory `/opt/local/var/macports/build/_opt_local_var_macports_sources_rsync.macports.org_release_tarballs_ports_graphics_opencv/opencv/work/build'
993:info:build make[2]: Nothing to be done for `modules/ml/CMakeFiles/opencv_ml.dir/build'.
994:info:build make[2]: Leaving directory `/opt/local/var/macports/build/_opt_local_var_macports_sources_rsync.macports.org_release_tarballs_ports_graphics_opencv/opencv/work/build'
995:info:build [ 22%] Built target opencv_ml
996:info:build make[2]: Leaving directory `/opt/local/var/macports/build/_opt_local_var_macports_sources_rsync.macports.org_release_tarballs_ports_graphics_opencv/opencv/work/build'
997:info:build /Applications/Xcode.app/Contents/Developer/usr/bin/make -f modules/imgproc/CMakeFiles/opencv_imgproc.dir/build.make modules/imgproc/CMakeFiles/opencv_imgproc.dir/build
998:info:build make[2]: Entering directory `/opt/local/var/macports/build/_opt_local_var_macports_sources_rsync.macports.org_release_tarballs_ports_graphics_opencv/opencv/work/build'
999:info:build make[2]: Nothing to be done for `modules/imgproc/CMakeFiles/opencv_imgproc.dir/build'.
1000:info:build make[2]: Leaving directory `/opt/local/var/macports/build/_opt_local_var_macports_sources_rsync.macports.org_release_tarballs_ports_graphics_opencv/opencv/work/build'
1001:info:build [ 40%] Built target opencv_imgproc
1002:info:build /Applications/Xcode.app/Contents/Developer/usr/bin/make -f modules/photo/CMakeFiles/opencv_photo.dir/build.make modules/photo/CMakeFiles/opencv_photo.dir/depend
1003:info:build /Applications/Xcode.app/Contents/Developer/usr/bin/make -f modules/video/CMakeFiles/opencv_video.dir/build.make modules/video/CMakeFiles/opencv_video.dir/depend
1004:info:build /Applications/Xcode.app/Contents/Developer/usr/bin/make -f modules/imgcodecs/CMakeFiles/opencv_imgcodecs.dir/build.make modules/imgcodecs/CMakeFiles/opencv_imgcodecs.dir/depend
1005:info:build make[2]: Entering directory `/opt/local/var/macports/build/_opt_local_var_macports_sources_rsync.macports.org_release_tarballs_ports_graphics_opencv/opencv/work/build'
1006:info:build cd /opt/local/var/macports/build/_opt_local_var_macports_sources_rsync.macports.org_release_tarballs_ports_graphics_opencv/opencv/work/build && /opt/local/bin/cmake -E cmake_depends "Unix Makefiles" /opt/local/var/macports/build/_opt_local_var_macports_sources_rsync.macports.org_release_tarballs_ports_graphics_opencv/opencv/work/opencv-3.1.0 /opt/local/var/macports/build/_opt_local_var_macports_sources_rsync.macports.org_release_tarballs_ports_graphics_opencv/opencv/work/opencv-3.1.0/modules/photo /opt/local/var/macports/build/_opt_local_var_macports_sources_rsync.macports.org_release_tarballs_ports_graphics_opencv/opencv/work/build /opt/local/var/macports/build/_opt_local_var_macports_sources_rsync.macports.org_release_tarballs_ports_graphics_opencv/opencv/work/build/modules/photo /opt/local/var/macports/build/_opt_local_var_macports_sources_rsync.macports.org_release_tarballs_ports_graphics_opencv/opencv/work/build/modules/photo/CMakeFiles/opencv_photo.dir/DependInfo.cmake --color=
1007:info:build make[2]: Entering directory `/opt/local/var/macports/build/_opt_local_var_macports_sources_rsync.macports.org_release_tarballs_ports_graphics_opencv/opencv/work/build'
1008:info:build cd /opt/local/var/macports/build/_opt_local_var_macports_sources_rsync.macports.org_release_tarballs_ports_graphics_opencv/opencv/work/build && /opt/local/bin/cmake -E cmake_depends "Unix Makefiles" /opt/local/var/macports/build/_opt_local_var_macports_sources_rsync.macports.org_release_tarballs_ports_graphics_opencv/opencv/work/opencv-3.1.0 /opt/local/var/macports/build/_opt_local_var_macports_sources_rsync.macports.org_release_tarballs_ports_graphics_opencv/opencv/work/opencv-3.1.0/modules/video /opt/local/var/macports/build/_opt_local_var_macports_sources_rsync.macports.org_release_tarballs_ports_graphics_opencv/opencv/work/build /opt/local/var/macports/build/_opt_local_var_macports_sources_rsync.macports.org_release_tarballs_ports_graphics_opencv/opencv/work/build/modules/video /opt/local/var/macports/build/_opt_local_var_macports_sources_rsync.macports.org_release_tarballs_ports_graphics_opencv/opencv/work/build/modules/video/CMakeFiles/opencv_video.dir/DependInfo.cmake --color=
1009:info:build make[2]: Entering directory `/opt/local/var/macports/build/_opt_local_var_macports_sources_rsync.macports.org_release_tarballs_ports_graphics_opencv/opencv/work/build'
1010:info:build cd /opt/local/var/macports/build/_opt_local_var_macports_sources_rsync.macports.org_release_tarballs_ports_graphics_opencv/opencv/work/build && /opt/local/bin/cmake -E cmake_depends "Unix Makefiles" /opt/local/var/macports/build/_opt_local_var_macports_sources_rsync.macports.org_release_tarballs_ports_graphics_opencv/opencv/work/opencv-3.1.0 /opt/local/var/macports/build/_opt_local_var_macports_sources_rsync.macports.org_release_tarballs_ports_graphics_opencv/opencv/work/opencv-3.1.0/modules/imgcodecs /opt/local/var/macports/build/_opt_local_var_macports_sources_rsync.macports.org_release_tarballs_ports_graphics_opencv/opencv/work/build /opt/local/var/macports/build/_opt_local_var_macports_sources_rsync.macports.org_release_tarballs_ports_graphics_opencv/opencv/work/build/modules/imgcodecs /opt/local/var/macports/build/_opt_local_var_macports_sources_rsync.macports.org_release_tarballs_ports_graphics_opencv/opencv/work/build/modules/imgcodecs/CMakeFiles/opencv_imgcodecs.dir/DependInfo.cmake --color=
1011:info:build make[2]: Leaving directory `/opt/local/var/macports/build/_opt_local_var_macports_sources_rsync.macports.org_release_tarballs_ports_graphics_opencv/opencv/work/build'
1012:info:build /Applications/Xcode.app/Contents/Developer/usr/bin/make -f modules/photo/CMakeFiles/opencv_photo.dir/build.make modules/photo/CMakeFiles/opencv_photo.dir/build
1013:info:build make[2]: Leaving directory `/opt/local/var/macports/build/_opt_local_var_macports_sources_rsync.macports.org_release_tarballs_ports_graphics_opencv/opencv/work/build'
1014:info:build /Applications/Xcode.app/Contents/Developer/usr/bin/make -f modules/video/CMakeFiles/opencv_video.dir/build.make modules/video/CMakeFiles/opencv_video.dir/build
1015:info:build make[2]: Entering directory `/opt/local/var/macports/build/_opt_local_var_macports_sources_rsync.macports.org_release_tarballs_ports_graphics_opencv/opencv/work/build'
1016:info:build make[2]: Nothing to be done for `modules/photo/CMakeFiles/opencv_photo.dir/build'.
1017:info:build make[2]: Leaving directory `/opt/local/var/macports/build/_opt_local_var_macports_sources_rsync.macports.org_release_tarballs_ports_graphics_opencv/opencv/work/build'
1018:info:build make[2]: Entering directory `/opt/local/var/macports/build/_opt_local_var_macports_sources_rsync.macports.org_release_tarballs_ports_graphics_opencv/opencv/work/build'
1019:info:build make[2]: Nothing to be done for `modules/video/CMakeFiles/opencv_video.dir/build'.
1020:info:build make[2]: Leaving directory `/opt/local/var/macports/build/_opt_local_var_macports_sources_rsync.macports.org_release_tarballs_ports_graphics_opencv/opencv/work/build'
1021:info:build [ 49%] Built target opencv_photo
1022:info:build [ 49%] Built target opencv_video
1023:info:build /Applications/Xcode.app/Contents/Developer/usr/bin/make -f modules/shape/CMakeFiles/opencv_shape.dir/build.make modules/shape/CMakeFiles/opencv_shape.dir/depend
1024:info:build make[2]: Leaving directory `/opt/local/var/macports/build/_opt_local_var_macports_sources_rsync.macports.org_release_tarballs_ports_graphics_opencv/opencv/work/build'
1025:info:build /Applications/Xcode.app/Contents/Developer/usr/bin/make -f modules/imgcodecs/CMakeFiles/opencv_imgcodecs.dir/build.make modules/imgcodecs/CMakeFiles/opencv_imgcodecs.dir/build
1026:info:build make[2]: Entering directory `/opt/local/var/macports/build/_opt_local_var_macports_sources_rsync.macports.org_release_tarballs_ports_graphics_opencv/opencv/work/build'
1027:info:build cd /opt/local/var/macports/build/_opt_local_var_macports_sources_rsync.macports.org_release_tarballs_ports_graphics_opencv/opencv/work/build && /opt/local/bin/cmake -E cmake_depends "Unix Makefiles" /opt/local/var/macports/build/_opt_local_var_macports_sources_rsync.macports.org_release_tarballs_ports_graphics_opencv/opencv/work/opencv-3.1.0 /opt/local/var/macports/build/_opt_local_var_macports_sources_rsync.macports.org_release_tarballs_ports_graphics_opencv/opencv/work/opencv-3.1.0/modules/shape /opt/local/var/macports/build/_opt_local_var_macports_sources_rsync.macports.org_release_tarballs_ports_graphics_opencv/opencv/work/build /opt/local/var/macports/build/_opt_local_var_macports_sources_rsync.macports.org_release_tarballs_ports_graphics_opencv/opencv/work/build/modules/shape /opt/local/var/macports/build/_opt_local_var_macports_sources_rsync.macports.org_release_tarballs_ports_graphics_opencv/opencv/work/build/modules/shape/CMakeFiles/opencv_shape.dir/DependInfo.cmake --color=
1028:info:build make[2]: Leaving directory `/opt/local/var/macports/build/_opt_local_var_macports_sources_rsync.macports.org_release_tarballs_ports_graphics_opencv/opencv/work/build'
1029:info:build /Applications/Xcode.app/Contents/Developer/usr/bin/make -f modules/shape/CMakeFiles/opencv_shape.dir/build.make modules/shape/CMakeFiles/opencv_shape.dir/build
1030:info:build make[2]: Entering directory `/opt/local/var/macports/build/_opt_local_var_macports_sources_rsync.macports.org_release_tarballs_ports_graphics_opencv/opencv/work/build'
1031:info:build make[2]: Nothing to be done for `modules/imgcodecs/CMakeFiles/opencv_imgcodecs.dir/build'.
1032:info:build make[2]: Leaving directory `/opt/local/var/macports/build/_opt_local_var_macports_sources_rsync.macports.org_release_tarballs_ports_graphics_opencv/opencv/work/build'
1033:info:build make[2]: Entering directory `/opt/local/var/macports/build/_opt_local_var_macports_sources_rsync.macports.org_release_tarballs_ports_graphics_opencv/opencv/work/build'
1034:info:build make[2]: Nothing to be done for `modules/shape/CMakeFiles/opencv_shape.dir/build'.
1035:info:build make[2]: Leaving directory `/opt/local/var/macports/build/_opt_local_var_macports_sources_rsync.macports.org_release_tarballs_ports_graphics_opencv/opencv/work/build'
1036:info:build [ 57%] Built target opencv_imgcodecs
1037:info:build [ 57%] Built target opencv_shape
1038:info:build /Applications/Xcode.app/Contents/Developer/usr/bin/make -f modules/videoio/CMakeFiles/opencv_videoio.dir/build.make modules/videoio/CMakeFiles/opencv_videoio.dir/depend
1039:info:build make[2]: Entering directory `/opt/local/var/macports/build/_opt_local_var_macports_sources_rsync.macports.org_release_tarballs_ports_graphics_opencv/opencv/work/build'
1040:info:build cd /opt/local/var/macports/build/_opt_local_var_macports_sources_rsync.macports.org_release_tarballs_ports_graphics_opencv/opencv/work/build && /opt/local/bin/cmake -E cmake_depends "Unix Makefiles" /opt/local/var/macports/build/_opt_local_var_macports_sources_rsync.macports.org_release_tarballs_ports_graphics_opencv/opencv/work/opencv-3.1.0 /opt/local/var/macports/build/_opt_local_var_macports_sources_rsync.macports.org_release_tarballs_ports_graphics_opencv/opencv/work/opencv-3.1.0/modules/videoio /opt/local/var/macports/build/_opt_local_var_macports_sources_rsync.macports.org_release_tarballs_ports_graphics_opencv/opencv/work/build /opt/local/var/macports/build/_opt_local_var_macports_sources_rsync.macports.org_release_tarballs_ports_graphics_opencv/opencv/work/build/modules/videoio /opt/local/var/macports/build/_opt_local_var_macports_sources_rsync.macports.org_release_tarballs_ports_graphics_opencv/opencv/work/build/modules/videoio/CMakeFiles/opencv_videoio.dir/DependInfo.cmake --color=
1041:info:build make[2]: Leaving directory `/opt/local/var/macports/build/_opt_local_var_macports_sources_rsync.macports.org_release_tarballs_ports_graphics_opencv/opencv/work/build'
1042:info:build /Applications/Xcode.app/Contents/Developer/usr/bin/make -f modules/videoio/CMakeFiles/opencv_videoio.dir/build.make modules/videoio/CMakeFiles/opencv_videoio.dir/build
1043:info:build make[2]: Entering directory `/opt/local/var/macports/build/_opt_local_var_macports_sources_rsync.macports.org_release_tarballs_ports_graphics_opencv/opencv/work/build'
1044:info:build [ 57%] Building CXX object modules/videoio/CMakeFiles/opencv_videoio.dir/src/cap_qtkit.mm.o
1045:info:build cd /opt/local/var/macports/build/_opt_local_var_macports_sources_rsync.macports.org_release_tarballs_ports_graphics_opencv/opencv/work/build/modules/videoio && /Applications/Xcode.app/Contents/Developer/Toolchains/XcodeDefault.xctoolchain/usr/bin/clang++   -DCVAPI_EXPORTS -DVIDEOIO_EXPORTS -D__OPENCV_BUILD=1 -I/opt/local/var/macports/build/_opt_local_var_macports_sources_rsync.macports.org_release_tarballs_ports_graphics_opencv/opencv/work/build -isystem /opt/local/include -I/opt/local/var/macports/build/_opt_local_var_macports_sources_rsync.macports.org_release_tarballs_ports_graphics_opencv/opencv/work/opencv-3.1.0/modules/videoio/include -I/opt/local/var/macports/build/_opt_local_var_macports_sources_rsync.macports.org_release_tarballs_ports_graphics_opencv/opencv/work/opencv-3.1.0/modules/videoio/src -I/opt/local/var/macports/build/_opt_local_var_macports_sources_rsync.macports.org_release_tarballs_ports_graphics_opencv/opencv/work/build/modules/videoio -I/opt/local/var/macports/build/_opt_local_var_macports_sources_rsync.macports.org_release_tarballs_ports_graphics_opencv/opencv/work/opencv-3.1.0/modules/core/include -I/opt/local/var/macports/build/_opt_local_var_macports_sources_rsync.macports.org_release_tarballs_ports_graphics_opencv/opencv/work/opencv-3.1.0/modules/imgproc/include -I/opt/local/var/macports/build/_opt_local_var_macports_sources_rsync.macports.org_release_tarballs_ports_graphics_opencv/opencv/work/opencv-3.1.0/modules/imgcodecs/include  -pipe -Os -stdlib=libc++    -fsigned-char -W -Werror=return-type -Werror=non-virtual-dtor -Werror=address -Wformat -Werror=format-security -Wmissing-declarations -Wmissing-prototypes -Wstrict-prototypes -Wundef -Winit-self -Wpointer-arith -Wshadow -Wsign-promo -Wno-narrowing -Wno-delete-non-virtual-dtor -Wno-unnamed-type-template-args -fdiagnostics-show-option -Wno-long-long -Qunused-arguments -Wno-semicolon-before-method-body -fno-omit-frame-pointer -msse -msse2 -mno-avx -msse3 -mno-ssse3 -mno-sse4.1 -mno-sse4.2 -fvisibility=hidden -fvisibility-inlines-hidden -Wno-deprecated-declarations -DNDEBUG  -DNDEBUG -arch x86_64 -mmacosx-version-min=10.12 -fPIC   -o CMakeFiles/opencv_videoio.dir/src/cap_qtkit.mm.o -c /opt/local/var/macports/build/_opt_local_var_macports_sources_rsync.macports.org_release_tarballs_ports_graphics_opencv/opencv/work/opencv-3.1.0/modules/videoio/src/cap_qtkit.mm
1046:info:build /opt/local/var/macports/build/_opt_local_var_macports_sources_rsync.macports.org_release_tarballs_ports_graphics_opencv/opencv/work/opencv-3.1.0/modules/videoio/src/cap_qtkit.mm:46:9: fatal error: 'QTKit/QTKit.h' file not found
1047:info:build #import <QTKit/QTKit.h>
1048:info:build         ^
1049:info:build 1 error generated.
1050:info:build make[2]: *** [modules/videoio/CMakeFiles/opencv_videoio.dir/src/cap_qtkit.mm.o] Error 1
1051:info:build make[2]: Leaving directory `/opt/local/var/macports/build/_opt_local_var_macports_sources_rsync.macports.org_release_tarballs_ports_graphics_opencv/opencv/work/build'
1052:info:build make[1]: *** [modules/videoio/CMakeFiles/opencv_videoio.dir/all] Error 2
1053:info:build make[1]: Leaving directory `/opt/local/var/macports/build/_opt_local_var_macports_sources_rsync.macports.org_release_tarballs_ports_graphics_opencv/opencv/work/build'
1054:info:build make: *** [all] Error 2
1055:info:build make: Leaving directory `/opt/local/var/macports/build/_opt_local_var_macports_sources_rsync.macports.org_release_tarballs_ports_graphics_opencv/opencv/work/build'
1056:info:build Command failed:  cd "/opt/local/var/macports/build/_opt_local_var_macports_sources_rsync.macports.org_release_tarballs_ports_graphics_opencv/opencv/work/build" && /usr/bin/make -j4 -w all VERBOSE=ON
1057:info:build Exit code: 2
1058:error:build org.macports.build for port opencv returned: command execution failed
1059:debug:build Error code: CHILDSTATUS 67279 2
1060:debug:build Backtrace: command execution failed
1061    while executing
1062"system -nice 0 $fullcmdstring"
1063    ("eval" body line 1)
1064    invoked from within
1065"eval system $notty $nice \$fullcmdstring"
1066    invoked from within
1067"command_exec build"
1068    (procedure "portbuild::build_main" line 8)
1069    invoked from within
1070"portbuild::build_main org.macports.build"
1071    ("eval" body line 1)
1072    invoked from within
1073"eval $procedure $targetname"
1074:info:build Warning: targets not executed for opencv: org.macports.activate org.macports.build org.macports.destroot org.macports.install
1075:notice:build Please see the log file for port opencv for details:
1076    /opt/local/var/macports/logs/_opt_local_var_macports_sources_rsync.macports.org_release_tarballs_ports_graphics_opencv/opencv/main.log