Ticket #53338: port-install-ogre.log

File port-install-ogre.log, 149.8 KB (added by starthal (Stephen Albert), 4 years ago)

Full build log

Line 
1version:1
2:debug:main epoch: in tree: 0 installed: 0
3:debug:main cmake 3.7.1_0 exists in the ports tree
4:debug:main cmake 3.7.1_0  is the latest installed
5:debug:main cmake 3.7.1_0  is active
6:debug:main Merging existing variants '' into variants
7:debug:main new fully merged portvariants:
8:debug:main Changing to port directory: /opt/local/var/macports/sources/rsync.macports.org/release/tarballs/ports/devel/cmake
9:debug:main OS darwin/16.3.0 (Mac OS X 10.12) arch i386
10:debug:main Reading variant descriptions from /opt/local/var/macports/sources/rsync.macports.org/release/tarballs/ports/_resources/port1.0/variant_descriptions.conf
11:debug:main Sourcing PortGroup muniversal 1.0 from /opt/local/var/macports/sources/rsync.macports.org/release/tarballs/ports/_resources/port1.0/group/muniversal-1.0.tcl
12:debug:main universal variant already exists, so not adding the default one
13:debug:main Running callback portconfigure::add_automatic_compiler_dependencies
14:debug:main Preferred compilers: clang macports-clang-3.8 macports-clang-3.7
15:debug:main Finished running callback portconfigure::add_automatic_compiler_dependencies
16:debug:main Running callback portbuild::add_automatic_buildsystem_dependencies
17:debug:main Finished running callback portbuild::add_automatic_buildsystem_dependencies
18:debug:main No need to upgrade! cmake 3.7.1_0 >= cmake 3.7.1_0
19:debug:main epoch: in tree: 0 installed: 0
20:debug:main curl 7.52.1_0 exists in the ports tree
21:debug:main curl 7.52.1_0 +ssl is the latest installed
22:debug:main curl 7.52.1_0 +ssl is active
23:debug:main Merging existing variants '+ssl' into variants
24:debug:main new fully merged portvariants: ssl +
25:debug:main Changing to port directory: /opt/local/var/macports/sources/rsync.macports.org/release/tarballs/ports/net/curl
26:debug:main OS darwin/16.3.0 (Mac OS X 10.12) arch i386
27:debug:main Reading variant descriptions from /opt/local/var/macports/sources/rsync.macports.org/release/tarballs/ports/_resources/port1.0/variant_descriptions.conf
28:debug:main Sourcing PortGroup muniversal 1.0 from /opt/local/var/macports/sources/rsync.macports.org/release/tarballs/ports/_resources/port1.0/group/muniversal-1.0.tcl
29:debug:main universal variant already exists, so not adding the default one
30:debug:main Executing variant ssl provides ssl
31:debug:main Running callback portconfigure::add_automatic_compiler_dependencies
32:debug:main Preferred compilers: clang macports-clang-3.8 macports-clang-3.7
33:debug:main Finished running callback portconfigure::add_automatic_compiler_dependencies
34:debug:main Running callback portbuild::add_automatic_buildsystem_dependencies
35:debug:main Finished running callback portbuild::add_automatic_buildsystem_dependencies
36:debug:main No need to upgrade! curl 7.52.1_0 >= curl 7.52.1_0
37:debug:main epoch: in tree: 0 installed: 0
38:debug:main zlib 1.2.10_0 exists in the ports tree
39:debug:main zlib 1.2.10_0  is the latest installed
40:debug:main zlib 1.2.10_0  is active
41:debug:main Merging existing variants '' into variants
42:debug:main new fully merged portvariants:
43:debug:main Changing to port directory: /opt/local/var/macports/sources/rsync.macports.org/release/tarballs/ports/archivers/zlib
44:debug:main OS darwin/16.3.0 (Mac OS X 10.12) arch i386
45:debug:main Sourcing PortGroup xcodeversion 1.0 from /opt/local/var/macports/sources/rsync.macports.org/release/tarballs/ports/_resources/port1.0/group/xcodeversion-1.0.tcl
46:debug:main adding the default universal variant
47:debug:main Reading variant descriptions from /opt/local/var/macports/sources/rsync.macports.org/release/tarballs/ports/_resources/port1.0/variant_descriptions.conf
48:debug:main Running callback portconfigure::add_automatic_compiler_dependencies
49:debug:main Preferred compilers: clang macports-clang-3.8 macports-clang-3.7
50:debug:main Finished running callback portconfigure::add_automatic_compiler_dependencies
51:debug:main Running callback portbuild::add_automatic_buildsystem_dependencies
52:debug:main Finished running callback portbuild::add_automatic_buildsystem_dependencies
53:debug:main No need to upgrade! zlib 1.2.10_0 >= zlib 1.2.10_0
54:debug:main epoch: in tree: 1 installed: 1
55:debug:main openssl 1.0.2j_0 exists in the ports tree
56:debug:main openssl 1.0.2j_0  is the latest installed
57:debug:main openssl 1.0.2j_0  is active
58:debug:main Merging existing variants '' into variants
59:debug:main new fully merged portvariants:
60:debug:main Changing to port directory: /opt/local/var/macports/sources/rsync.macports.org/release/tarballs/ports/devel/openssl
61:debug:main OS darwin/16.3.0 (Mac OS X 10.12) arch i386
62:debug:main Reading variant descriptions from /opt/local/var/macports/sources/rsync.macports.org/release/tarballs/ports/_resources/port1.0/variant_descriptions.conf
63:debug:main Sourcing PortGroup muniversal 1.0 from /opt/local/var/macports/sources/rsync.macports.org/release/tarballs/ports/_resources/port1.0/group/muniversal-1.0.tcl
64:debug:main universal variant already exists, so not adding the default one
65:debug:main Running callback portconfigure::add_automatic_compiler_dependencies
66:debug:main Preferred compilers: clang macports-clang-3.8 macports-clang-3.7
67:debug:main Finished running callback portconfigure::add_automatic_compiler_dependencies
68:debug:main Running callback portbuild::add_automatic_buildsystem_dependencies
69:debug:main Finished running callback portbuild::add_automatic_buildsystem_dependencies
70:debug:main No need to upgrade! openssl 1.0.2j_0 >= openssl 1.0.2j_0
71:debug:main epoch: in tree: 0 installed: 0
72:debug:main curl-ca-bundle 7.52.1_0 exists in the ports tree
73:debug:main curl-ca-bundle 7.52.1_0  is the latest installed
74:debug:main curl-ca-bundle 7.52.1_0  is active
75:debug:main Merging existing variants '' into variants
76:debug:main new fully merged portvariants:
77:debug:main Changing to port directory: /opt/local/var/macports/sources/rsync.macports.org/release/tarballs/ports/net/curl
78:debug:main OS darwin/16.3.0 (Mac OS X 10.12) arch i386
79:debug:main universal_variant is false, so not adding the default universal variant
80:debug:main Running callback portconfigure::add_automatic_compiler_dependencies
81:debug:main Preferred compilers: clang macports-clang-3.8 macports-clang-3.7
82:debug:main Finished running callback portconfigure::add_automatic_compiler_dependencies
83:debug:main Running callback portbuild::add_automatic_buildsystem_dependencies
84:debug:main Finished running callback portbuild::add_automatic_buildsystem_dependencies
85:debug:main No need to upgrade! curl-ca-bundle 7.52.1_0 >= curl-ca-bundle 7.52.1_0
86:debug:main epoch: in tree: 0 installed: 0
87:debug:main expat 2.2.0_0 exists in the ports tree
88:debug:main expat 2.2.0_0  is the latest installed
89:debug:main expat 2.2.0_0  is active
90:debug:main Merging existing variants '' into variants
91:debug:main new fully merged portvariants:
92:debug:main Changing to port directory: /opt/local/var/macports/sources/rsync.macports.org/release/tarballs/ports/textproc/expat
93:debug:main OS darwin/16.3.0 (Mac OS X 10.12) arch i386
94:debug:main adding the default universal variant
95:debug:main Reading variant descriptions from /opt/local/var/macports/sources/rsync.macports.org/release/tarballs/ports/_resources/port1.0/variant_descriptions.conf
96:debug:main Running callback portconfigure::add_automatic_compiler_dependencies
97:debug:main Preferred compilers: clang macports-clang-3.8 macports-clang-3.7
98:debug:main Finished running callback portconfigure::add_automatic_compiler_dependencies
99:debug:main Running callback portbuild::add_automatic_buildsystem_dependencies
100:debug:main Finished running callback portbuild::add_automatic_buildsystem_dependencies
101:debug:main No need to upgrade! expat 2.2.0_0 >= expat 2.2.0_0
102:debug:main epoch: in tree: 0 installed: 0
103:debug:main bzip2 1.0.6_0 exists in the ports tree
104:debug:main bzip2 1.0.6_0  is the latest installed
105:debug:main bzip2 1.0.6_0  is active
106:debug:main Merging existing variants '' into variants
107:debug:main new fully merged portvariants:
108:debug:main Changing to port directory: /opt/local/var/macports/sources/rsync.macports.org/release/tarballs/ports/archivers/bzip2
109:debug:main OS darwin/16.3.0 (Mac OS X 10.12) arch i386
110:debug:main Reading variant descriptions from /opt/local/var/macports/sources/rsync.macports.org/release/tarballs/ports/_resources/port1.0/variant_descriptions.conf
111:debug:main Preferred compilers: clang macports-clang-3.8 macports-clang-3.7
112:debug:main Preferred compilers: clang macports-clang-3.8 macports-clang-3.7
113:debug:main universal variant already exists, so not adding the default one
114:debug:main Running callback portconfigure::add_automatic_compiler_dependencies
115:debug:main Preferred compilers: clang macports-clang-3.8 macports-clang-3.7
116:debug:main Finished running callback portconfigure::add_automatic_compiler_dependencies
117:debug:main Running callback portbuild::add_automatic_buildsystem_dependencies
118:debug:main Finished running callback portbuild::add_automatic_buildsystem_dependencies
119:debug:main No need to upgrade! bzip2 1.0.6_0 >= bzip2 1.0.6_0
120:debug:main epoch: in tree: 0 installed: 0
121:debug:main libarchive 3.2.2_0 exists in the ports tree
122:debug:main libarchive 3.2.2_0  is the latest installed
123:debug:main libarchive 3.2.2_0  is active
124:debug:main Merging existing variants '' into variants
125:debug:main new fully merged portvariants:
126:debug:main Changing to port directory: /opt/local/var/macports/sources/rsync.macports.org/release/tarballs/ports/archivers/libarchive
127:debug:main OS darwin/16.3.0 (Mac OS X 10.12) arch i386
128:debug:main adding the default universal variant
129:debug:main Reading variant descriptions from /opt/local/var/macports/sources/rsync.macports.org/release/tarballs/ports/_resources/port1.0/variant_descriptions.conf
130:debug:main Running callback portconfigure::add_automatic_compiler_dependencies
131:debug:main Preferred compilers: clang macports-clang-3.8 macports-clang-3.7
132:debug:main Finished running callback portconfigure::add_automatic_compiler_dependencies
133:debug:main Running callback portbuild::add_automatic_buildsystem_dependencies
134:debug:main Finished running callback portbuild::add_automatic_buildsystem_dependencies
135:debug:main No need to upgrade! libarchive 3.2.2_0 >= libarchive 3.2.2_0
136:debug:main epoch: in tree: 0 installed: 0
137:debug:main libxml2 2.9.4_0 exists in the ports tree
138:debug:main libxml2 2.9.4_0  is the latest installed
139:debug:main libxml2 2.9.4_0  is active
140:debug:main Merging existing variants '' into variants
141:debug:main new fully merged portvariants:
142:debug:main Changing to port directory: /opt/local/var/macports/sources/rsync.macports.org/release/tarballs/ports/textproc/libxml2
143:debug:main OS darwin/16.3.0 (Mac OS X 10.12) arch i386
144:debug:main adding the default universal variant
145:debug:main Reading variant descriptions from /opt/local/var/macports/sources/rsync.macports.org/release/tarballs/ports/_resources/port1.0/variant_descriptions.conf
146:debug:main Running callback portconfigure::add_automatic_compiler_dependencies
147:debug:main Preferred compilers: clang macports-clang-3.8 macports-clang-3.7
148:debug:main Finished running callback portconfigure::add_automatic_compiler_dependencies
149:debug:main Running callback portbuild::add_automatic_buildsystem_dependencies
150:debug:main Finished running callback portbuild::add_automatic_buildsystem_dependencies
151:debug:main No need to upgrade! libxml2 2.9.4_0 >= libxml2 2.9.4_0
152:debug:main epoch: in tree: 0 installed: 0
153:debug:main libiconv 1.14_0 exists in the ports tree
154:debug:main libiconv 1.14_0  is the latest installed
155:debug:main libiconv 1.14_0  is active
156:debug:main Merging existing variants '' into variants
157:debug:main new fully merged portvariants:
158:debug:main Changing to port directory: /opt/local/var/macports/sources/rsync.macports.org/release/tarballs/ports/textproc/libiconv
159:debug:main OS darwin/16.3.0 (Mac OS X 10.12) arch i386
160:debug:main Reading variant descriptions from /opt/local/var/macports/sources/rsync.macports.org/release/tarballs/ports/_resources/port1.0/variant_descriptions.conf
161:debug:main Sourcing PortGroup muniversal 1.0 from /opt/local/var/macports/sources/rsync.macports.org/release/tarballs/ports/_resources/port1.0/group/muniversal-1.0.tcl
162:debug:main Preferred compilers: clang macports-clang-3.8 macports-clang-3.7
163:debug:main universal variant already exists, so not adding the default one
164:debug:main Running callback portconfigure::add_automatic_compiler_dependencies
165:debug:main Preferred compilers: clang macports-clang-3.8 macports-clang-3.7
166:debug:main Finished running callback portconfigure::add_automatic_compiler_dependencies
167:debug:main Running callback portbuild::add_automatic_buildsystem_dependencies
168:debug:main Finished running callback portbuild::add_automatic_buildsystem_dependencies
169:debug:main No need to upgrade! libiconv 1.14_0 >= libiconv 1.14_0
170:debug:main epoch: in tree: 0 installed: 0
171:debug:main xz 5.2.3_0 exists in the ports tree
172:debug:main xz 5.2.3_0  is the latest installed
173:debug:main xz 5.2.3_0  is active
174:debug:main Merging existing variants '' into variants
175:debug:main new fully merged portvariants:
176:debug:main Changing to port directory: /opt/local/var/macports/sources/rsync.macports.org/release/tarballs/ports/archivers/xz
177:debug:main OS darwin/16.3.0 (Mac OS X 10.12) arch i386
178:debug:main adding the default universal variant
179:debug:main Reading variant descriptions from /opt/local/var/macports/sources/rsync.macports.org/release/tarballs/ports/_resources/port1.0/variant_descriptions.conf
180:debug:main Running callback portconfigure::add_automatic_compiler_dependencies
181:debug:main Preferred compilers: clang macports-clang-3.8 macports-clang-3.7
182:debug:main Finished running callback portconfigure::add_automatic_compiler_dependencies
183:debug:main Running callback portbuild::add_automatic_buildsystem_dependencies
184:debug:main Finished running callback portbuild::add_automatic_buildsystem_dependencies
185:debug:main No need to upgrade! xz 5.2.3_0 >= xz 5.2.3_0
186:debug:main epoch: in tree: 2 installed: 2
187:debug:main gettext 0.19.8.1_0 exists in the ports tree
188:debug:main gettext 0.19.8.1_0  is the latest installed
189:debug:main gettext 0.19.8.1_0  is active
190:debug:main Merging existing variants '' into variants
191:debug:main new fully merged portvariants:
192:debug:main Changing to port directory: /opt/local/var/macports/sources/rsync.macports.org/release/tarballs/ports/devel/gettext
193:debug:main OS darwin/16.3.0 (Mac OS X 10.12) arch i386
194:debug:main Sourcing PortGroup compiler_blacklist_versions 1.0 from /opt/local/var/macports/sources/rsync.macports.org/release/tarballs/ports/_resources/port1.0/group/compiler_blacklist_versions-1.0.tcl
195:debug:main Reading variant descriptions from /opt/local/var/macports/sources/rsync.macports.org/release/tarballs/ports/_resources/port1.0/variant_descriptions.conf
196:debug:main Sourcing PortGroup muniversal 1.0 from /opt/local/var/macports/sources/rsync.macports.org/release/tarballs/ports/_resources/port1.0/group/muniversal-1.0.tcl
197:debug:main compiler clang 800.0.42.1 not blacklisted because it doesn't match {clang < 211.10.1}
198:debug:main universal variant already exists, so not adding the default one
199:debug:main Running callback portconfigure::add_automatic_compiler_dependencies
200:debug:main Preferred compilers: clang macports-clang-3.8 macports-clang-3.7
201:debug:main Finished running callback portconfigure::add_automatic_compiler_dependencies
202:debug:main Running callback portbuild::add_automatic_buildsystem_dependencies
203:debug:main Finished running callback portbuild::add_automatic_buildsystem_dependencies
204:debug:main No need to upgrade! gettext 0.19.8.1_0 >= gettext 0.19.8.1_0
205:debug:main epoch: in tree: 0 installed: 0
206:debug:main ncurses 6.0_0 exists in the ports tree
207:debug:main ncurses 6.0_0  is the latest installed
208:debug:main ncurses 6.0_0  is active
209:debug:main Merging existing variants '' into variants
210:debug:main new fully merged portvariants:
211:debug:main Changing to port directory: /opt/local/var/macports/sources/rsync.macports.org/release/tarballs/ports/devel/ncurses
212:debug:main OS darwin/16.3.0 (Mac OS X 10.12) arch i386
213:debug:main Preferred compilers: clang macports-clang-3.8 macports-clang-3.7
214:debug:main adding the default universal variant
215:debug:main Reading variant descriptions from /opt/local/var/macports/sources/rsync.macports.org/release/tarballs/ports/_resources/port1.0/variant_descriptions.conf
216:debug:main Running callback portconfigure::add_automatic_compiler_dependencies
217:debug:main Preferred compilers: clang macports-clang-3.8 macports-clang-3.7
218:debug:main Finished running callback portconfigure::add_automatic_compiler_dependencies
219:debug:main Running callback portbuild::add_automatic_buildsystem_dependencies
220:debug:main Finished running callback portbuild::add_automatic_buildsystem_dependencies
221:debug:main No need to upgrade! ncurses 6.0_0 >= ncurses 6.0_0
222:debug:main epoch: in tree: 0 installed: 0
223:debug:main lzo2 2.09_0 exists in the ports tree
224:debug:main lzo2 2.09_0  is the latest installed
225:debug:main lzo2 2.09_0  is active
226:debug:main Merging existing variants '' into variants
227:debug:main new fully merged portvariants:
228:debug:main Changing to port directory: /opt/local/var/macports/sources/rsync.macports.org/release/tarballs/ports/archivers/lzo2
229:debug:main OS darwin/16.3.0 (Mac OS X 10.12) arch i386
230:debug:main Reading variant descriptions from /opt/local/var/macports/sources/rsync.macports.org/release/tarballs/ports/_resources/port1.0/variant_descriptions.conf
231:debug:main Sourcing PortGroup muniversal 1.0 from /opt/local/var/macports/sources/rsync.macports.org/release/tarballs/ports/_resources/port1.0/group/muniversal-1.0.tcl
232:debug:main universal variant already exists, so not adding the default one
233:debug:main Running callback portconfigure::add_automatic_compiler_dependencies
234:debug:main Preferred compilers: clang macports-clang-3.8 macports-clang-3.7
235:debug:main Finished running callback portconfigure::add_automatic_compiler_dependencies
236:debug:main Running callback portbuild::add_automatic_buildsystem_dependencies
237:debug:main Finished running callback portbuild::add_automatic_buildsystem_dependencies
238:debug:main No need to upgrade! lzo2 2.09_0 >= lzo2 2.09_0
239:debug:main epoch: in tree: 0 installed: 0
240:debug:main libuv 1.10.1_0 exists in the ports tree
241:debug:main libuv 1.10.1_0  is the latest installed
242:debug:main libuv 1.10.1_0  is active
243:debug:main Merging existing variants '' into variants
244:debug:main new fully merged portvariants:
245:debug:main Changing to port directory: /opt/local/var/macports/sources/rsync.macports.org/release/tarballs/ports/devel/libuv
246:debug:main OS darwin/16.3.0 (Mac OS X 10.12) arch i386
247:debug:main Sourcing PortGroup github 1.0 from /opt/local/var/macports/sources/rsync.macports.org/release/tarballs/ports/_resources/port1.0/group/github-1.0.tcl
248:debug:main adding the default universal variant
249:debug:main Reading variant descriptions from /opt/local/var/macports/sources/rsync.macports.org/release/tarballs/ports/_resources/port1.0/variant_descriptions.conf
250:debug:main Running callback portconfigure::add_automatic_compiler_dependencies
251:debug:main Preferred compilers: clang macports-clang-3.8 macports-clang-3.7
252:debug:main Finished running callback portconfigure::add_automatic_compiler_dependencies
253:debug:main Running callback portbuild::add_automatic_buildsystem_dependencies
254:debug:main Finished running callback portbuild::add_automatic_buildsystem_dependencies
255:debug:main No need to upgrade! libuv 1.10.1_0 >= libuv 1.10.1_0
256:debug:main epoch: in tree: 0 installed: 0
257:debug:main doxygen 1.8.13_1 exists in the ports tree
258:debug:main doxygen 1.8.13_1  is the latest installed
259:debug:main doxygen 1.8.13_1  is active
260:debug:main Merging existing variants '' into variants
261:debug:main new fully merged portvariants:
262:debug:main Changing to port directory: /opt/local/var/macports/sources/rsync.macports.org/release/tarballs/ports/textproc/doxygen
263:debug:main OS darwin/16.3.0 (Mac OS X 10.12) arch i386
264:debug:main Re-registering default for configure.dir
265:debug:main Re-registering default for configure.pre_args
266:debug:main Re-registering default for build.dir
267:debug:main Re-registering default for destroot.target
268:debug:main Sourcing PortGroup cmake 1.0 from /opt/local/var/macports/sources/rsync.macports.org/release/tarballs/ports/_resources/port1.0/group/cmake-1.0.tcl
269:debug:main Preferred compilers: clang macports-clang-3.8 macports-clang-3.7
270:debug:main adding the default universal variant
271:debug:main Reading variant descriptions from /opt/local/var/macports/sources/rsync.macports.org/release/tarballs/ports/_resources/port1.0/variant_descriptions.conf
272:debug:main Running callback portconfigure::add_automatic_compiler_dependencies
273:debug:main Preferred compilers: clang macports-clang-3.8 macports-clang-3.7
274:debug:main Finished running callback portconfigure::add_automatic_compiler_dependencies
275:debug:main Running callback portbuild::add_automatic_buildsystem_dependencies
276:debug:main Finished running callback portbuild::add_automatic_buildsystem_dependencies
277:debug:main No need to upgrade! doxygen 1.8.13_1 >= doxygen 1.8.13_1
278:debug:main epoch: in tree: 0 installed: 0
279:debug:main libpng 1.6.28_0 exists in the ports tree
280:debug:main libpng 1.6.28_0  is the latest installed
281:debug:main libpng 1.6.28_0  is active
282:debug:main Merging existing variants '' into variants
283:debug:main new fully merged portvariants:
284:debug:main Changing to port directory: /opt/local/var/macports/sources/rsync.macports.org/release/tarballs/ports/graphics/libpng
285:debug:main OS darwin/16.3.0 (Mac OS X 10.12) arch i386
286:debug:main adding the default universal variant
287:debug:main Reading variant descriptions from /opt/local/var/macports/sources/rsync.macports.org/release/tarballs/ports/_resources/port1.0/variant_descriptions.conf
288:debug:main Running callback portconfigure::add_automatic_compiler_dependencies
289:debug:main Preferred compilers: clang macports-clang-3.8 macports-clang-3.7
290:debug:main Finished running callback portconfigure::add_automatic_compiler_dependencies
291:debug:main Running callback portbuild::add_automatic_buildsystem_dependencies
292:debug:main Finished running callback portbuild::add_automatic_buildsystem_dependencies
293:debug:main No need to upgrade! libpng 1.6.28_0 >= libpng 1.6.28_0
294:debug:main epoch: in tree: 0 installed: 0
295:debug:main boost 1.59.0_2 exists in the ports tree
296:debug:main boost 1.59.0_2 +no_single+no_static+python27 is the latest installed
297:debug:main boost 1.59.0_2 +no_single+no_static+python27 is active
298:debug:main Merging existing variants '+no_single+no_static+python27' into variants
299:debug:main new fully merged portvariants: no_static + no_single + python27 +
300:debug:main Changing to port directory: /opt/local/var/macports/sources/rsync.macports.org/release/tarballs/ports/devel/boost
301:debug:main OS darwin/16.3.0 (Mac OS X 10.12) arch i386
302:debug:main Sourcing PortGroup compiler_blacklist_versions 1.0 from /opt/local/var/macports/sources/rsync.macports.org/release/tarballs/ports/_resources/port1.0/group/compiler_blacklist_versions-1.0.tcl
303:debug:main Sourcing PortGroup active_variants 1.1 from /opt/local/var/macports/sources/rsync.macports.org/release/tarballs/ports/_resources/port1.0/group/active_variants-1.1.tcl
304:debug:main Sourcing PortGroup compilers 1.0 from /opt/local/var/macports/sources/rsync.macports.org/release/tarballs/ports/_resources/port1.0/group/compilers-1.0.tcl
305:debug:main Sourcing PortGroup mpi 1.0 from /opt/local/var/macports/sources/rsync.macports.org/release/tarballs/ports/_resources/port1.0/group/mpi-1.0.tcl
306:debug:main compiler clang 800.0.42.1 not blacklisted because it doesn't match {clang < 421}
307:debug:main Unmatched blacklisted compiler: *gcc-4.0
308:debug:main Unmatched blacklisted compiler: gcc-3.3
309:debug:main Reading variant descriptions from /opt/local/var/macports/sources/rsync.macports.org/release/tarballs/ports/_resources/port1.0/variant_descriptions.conf
310:debug:main universal variant already exists, so not adding the default one
311:debug:main Executing variant python27 provides python27
312:debug:main Executing variant no_static provides no_static
313:debug:main Executing variant no_single provides no_single
314:debug:main Running callback portconfigure::add_automatic_compiler_dependencies
315:debug:main Preferred compilers: clang macports-clang-3.8 macports-clang-3.7
316:debug:main Finished running callback portconfigure::add_automatic_compiler_dependencies
317:debug:main Running callback portbuild::add_automatic_buildsystem_dependencies
318:debug:main Finished running callback portbuild::add_automatic_buildsystem_dependencies
319:debug:main No need to upgrade! boost 1.59.0_2 >= boost 1.59.0_2
320:debug:main epoch: in tree: 0 installed: 0
321:debug:main icu 55.1_0 exists in the ports tree
322:debug:main icu 55.1_0  is the latest installed
323:debug:main icu 55.1_0  is active
324:debug:main Merging existing variants '' into variants
325:debug:main new fully merged portvariants:
326:debug:main Changing to port directory: /opt/local/var/macports/sources/rsync.macports.org/release/tarballs/ports/devel/icu
327:debug:main OS darwin/16.3.0 (Mac OS X 10.12) arch i386
328:debug:main Reading variant descriptions from /opt/local/var/macports/sources/rsync.macports.org/release/tarballs/ports/_resources/port1.0/variant_descriptions.conf
329:debug:main Sourcing PortGroup muniversal 1.0 from /opt/local/var/macports/sources/rsync.macports.org/release/tarballs/ports/_resources/port1.0/group/muniversal-1.0.tcl
330:debug:main universal variant already exists, so not adding the default one
331:debug:main Running callback portconfigure::add_automatic_compiler_dependencies
332:debug:main Preferred compilers: clang macports-clang-3.8 macports-clang-3.7
333:debug:main Finished running callback portconfigure::add_automatic_compiler_dependencies
334:debug:main Running callback portbuild::add_automatic_buildsystem_dependencies
335:debug:main Finished running callback portbuild::add_automatic_buildsystem_dependencies
336:debug:main No need to upgrade! icu 55.1_0 >= icu 55.1_0
337:debug:main epoch: in tree: 2 installed: 2
338:debug:main python27 2.7.13_0 exists in the ports tree
339:debug:main python27 2.7.13_0  is the latest installed
340:debug:main python27 2.7.13_0  is active
341:debug:main Merging existing variants '' into variants
342:debug:main new fully merged portvariants:
343:debug:main Changing to port directory: /opt/local/var/macports/sources/rsync.macports.org/release/tarballs/ports/lang/python27
344:debug:main OS darwin/16.3.0 (Mac OS X 10.12) arch i386
345:debug:main Sourcing PortGroup select 1.0 from /opt/local/var/macports/sources/rsync.macports.org/release/tarballs/ports/_resources/port1.0/group/select-1.0.tcl
346:debug:main Preferred compilers: clang macports-clang-3.8 macports-clang-3.7
347:debug:main Preferred compilers: clang macports-clang-3.8 macports-clang-3.7
348:debug:main Reading variant descriptions from /opt/local/var/macports/sources/rsync.macports.org/release/tarballs/ports/_resources/port1.0/variant_descriptions.conf
349:debug:main universal variant already exists, so not adding the default one
350:debug:main Running callback portconfigure::add_automatic_compiler_dependencies
351:debug:main Preferred compilers: clang macports-clang-3.8 macports-clang-3.7
352:debug:main Finished running callback portconfigure::add_automatic_compiler_dependencies
353:debug:main Running callback portbuild::add_automatic_buildsystem_dependencies
354:debug:main Finished running callback portbuild::add_automatic_buildsystem_dependencies
355:debug:main No need to upgrade! python27 2.7.13_0 >= python27 2.7.13_0
356:debug:main epoch: in tree: 0 installed: 0
357:debug:main sqlite3 3.16.2_0 exists in the ports tree
358:debug:main sqlite3 3.16.2_0  is the latest installed
359:debug:main sqlite3 3.16.2_0  is active
360:debug:main Merging existing variants '' into variants
361:debug:main new fully merged portvariants:
362:debug:main Changing to port directory: /opt/local/var/macports/sources/rsync.macports.org/release/tarballs/ports/databases/sqlite3
363:debug:main OS darwin/16.3.0 (Mac OS X 10.12) arch i386
364:debug:main adding the default universal variant
365:debug:main Reading variant descriptions from /opt/local/var/macports/sources/rsync.macports.org/release/tarballs/ports/_resources/port1.0/variant_descriptions.conf
366:debug:main Running callback portconfigure::add_automatic_compiler_dependencies
367:debug:main Preferred compilers: clang macports-clang-3.8 macports-clang-3.7
368:debug:main Finished running callback portconfigure::add_automatic_compiler_dependencies
369:debug:main Running callback portbuild::add_automatic_buildsystem_dependencies
370:debug:main Finished running callback portbuild::add_automatic_buildsystem_dependencies
371:debug:main No need to upgrade! sqlite3 3.16.2_0 >= sqlite3 3.16.2_0
372:debug:main epoch: in tree: 20090923 installed: 20090923
373:debug:main libedit 20160903-3.1_1 exists in the ports tree
374:debug:main libedit 20160903-3.1_1  is the latest installed
375:debug:main libedit 20160903-3.1_1  is active
376:debug:main Merging existing variants '' into variants
377:debug:main new fully merged portvariants:
378:debug:main Changing to port directory: /opt/local/var/macports/sources/rsync.macports.org/release/tarballs/ports/devel/libedit
379:debug:main OS darwin/16.3.0 (Mac OS X 10.12) arch i386
380:debug:main Reading variant descriptions from /opt/local/var/macports/sources/rsync.macports.org/release/tarballs/ports/_resources/port1.0/variant_descriptions.conf
381:debug:main Sourcing PortGroup muniversal 1.0 from /opt/local/var/macports/sources/rsync.macports.org/release/tarballs/ports/_resources/port1.0/group/muniversal-1.0.tcl
382:debug:main universal variant already exists, so not adding the default one
383:debug:main Running callback portconfigure::add_automatic_compiler_dependencies
384:debug:main Preferred compilers: clang macports-clang-3.8 macports-clang-3.7
385:debug:main Finished running callback portconfigure::add_automatic_compiler_dependencies
386:debug:main Running callback portbuild::add_automatic_buildsystem_dependencies
387:debug:main Finished running callback portbuild::add_automatic_buildsystem_dependencies
388:debug:main No need to upgrade! libedit 20160903-3.1_1 >= libedit 20160903-3.1_1
389:debug:main epoch: in tree: 0 installed: 0
390:debug:main db48 4.8.30_4 exists in the ports tree
391:debug:main db48 4.8.30_4  is the latest installed
392:debug:main db48 4.8.30_4  is active
393:debug:main Merging existing variants '' into variants
394:debug:main new fully merged portvariants:
395:debug:main Changing to port directory: /opt/local/var/macports/sources/rsync.macports.org/release/tarballs/ports/databases/db48
396:debug:main OS darwin/16.3.0 (Mac OS X 10.12) arch i386
397:debug:main Reading variant descriptions from /opt/local/var/macports/sources/rsync.macports.org/release/tarballs/ports/_resources/port1.0/variant_descriptions.conf
398:debug:main Sourcing PortGroup muniversal 1.0 from /opt/local/var/macports/sources/rsync.macports.org/release/tarballs/ports/_resources/port1.0/group/muniversal-1.0.tcl
399:debug:main Preferred compilers: clang macports-clang-3.8 macports-clang-3.7
400:debug:main Preferred compilers: clang macports-clang-3.8 macports-clang-3.7
401:debug:main universal variant already exists, so not adding the default one
402:debug:main Running callback portconfigure::add_automatic_compiler_dependencies
403:debug:main Preferred compilers: clang macports-clang-3.8 macports-clang-3.7
404:debug:main Finished running callback portconfigure::add_automatic_compiler_dependencies
405:debug:main Running callback portbuild::add_automatic_buildsystem_dependencies
406:debug:main Finished running callback portbuild::add_automatic_buildsystem_dependencies
407:debug:main No need to upgrade! db48 4.8.30_4 >= db48 4.8.30_4
408:debug:main epoch: in tree: 0 installed: 0
409:debug:main python_select 0.3_7 exists in the ports tree
410:debug:main python_select 0.3_7  is the latest installed
411:debug:main python_select 0.3_7  is active
412:debug:main Merging existing variants '' into variants
413:debug:main new fully merged portvariants:
414:debug:main Changing to port directory: /opt/local/var/macports/sources/rsync.macports.org/release/tarballs/ports/sysutils/python_select
415:debug:main OS darwin/16.3.0 (Mac OS X 10.12) arch i386
416:debug:main Sourcing PortGroup select 1.0 from /opt/local/var/macports/sources/rsync.macports.org/release/tarballs/ports/_resources/port1.0/group/select-1.0.tcl
417:debug:main universal_variant is false, so not adding the default universal variant
418:debug:main Running callback portconfigure::add_automatic_compiler_dependencies
419:debug:main Preferred compilers: clang macports-clang-3.8 macports-clang-3.7
420:debug:main Finished running callback portconfigure::add_automatic_compiler_dependencies
421:debug:main Running callback portbuild::add_automatic_buildsystem_dependencies
422:debug:main Finished running callback portbuild::add_automatic_buildsystem_dependencies
423:debug:main No need to upgrade! python_select 0.3_7 >= python_select 0.3_7
424:debug:main epoch: in tree: 0 installed: 0
425:debug:main python2_select 0.0_2 exists in the ports tree
426:debug:main python2_select 0.0_2  is the latest installed
427:debug:main python2_select 0.0_2  is active
428:debug:main Merging existing variants '' into variants
429:debug:main new fully merged portvariants:
430:debug:main Changing to port directory: /opt/local/var/macports/sources/rsync.macports.org/release/tarballs/ports/sysutils/python2_select
431:debug:main OS darwin/16.3.0 (Mac OS X 10.12) arch i386
432:debug:main Sourcing PortGroup select 1.0 from /opt/local/var/macports/sources/rsync.macports.org/release/tarballs/ports/_resources/port1.0/group/select-1.0.tcl
433:debug:main universal_variant is false, so not adding the default universal variant
434:debug:main Running callback portconfigure::add_automatic_compiler_dependencies
435:debug:main Preferred compilers: clang macports-clang-3.8 macports-clang-3.7
436:debug:main Finished running callback portconfigure::add_automatic_compiler_dependencies
437:debug:main Running callback portbuild::add_automatic_buildsystem_dependencies
438:debug:main Finished running callback portbuild::add_automatic_buildsystem_dependencies
439:debug:main No need to upgrade! python2_select 0.0_2 >= python2_select 0.0_2
440:msg:main --->  Computing dependencies for ogre:info:main .:debug:main ogre has no conflicts
441:debug:main Searching for dependency: cmake
442:debug:main Found Dependency: receipt exists for cmake
443:debug:main Searching for dependency: doxygen
444:debug:main Found Dependency: receipt exists for doxygen
445:debug:main Searching for dependency: graphviz
446:debug:main Didn't find receipt, going to depspec regex for: graphviz
447:debug:main Changing to port directory: /opt/local/var/macports/sources/rsync.macports.org/release/tarballs/ports/graphics/graphviz
448:debug:main OS darwin/16.3.0 (Mac OS X 10.12) arch i386
449:debug:main Sourcing PortGroup xcodeversion 1.0 from /opt/local/var/macports/sources/rsync.macports.org/release/tarballs/ports/_resources/port1.0/group/xcodeversion-1.0.tcl
450:debug:main Reading variant descriptions from /opt/local/var/macports/sources/rsync.macports.org/release/tarballs/ports/_resources/port1.0/variant_descriptions.conf
451:debug:main adding the default universal variant
452:debug:main Executing variant pangocairo provides pangocairo
453:debug:main Executing variant x11 provides x11
454:debug:main Running callback portconfigure::add_automatic_compiler_dependencies
455:debug:main Preferred compilers: clang macports-clang-3.8 macports-clang-3.7
456:debug:main Finished running callback portconfigure::add_automatic_compiler_dependencies
457:debug:main Running callback portbuild::add_automatic_buildsystem_dependencies
458:debug:main Finished running callback portbuild::add_automatic_buildsystem_dependencies
459:debug:main Searching for dependency: libzzip
460:debug:main Didn't find receipt, going to depspec regex for: libzzip
461:debug:main Changing to port directory: /opt/local/var/macports/sources/rsync.macports.org/release/tarballs/ports/archivers/libzzip
462:debug:main OS darwin/16.3.0 (Mac OS X 10.12) arch i386
463:debug:main Reading variant descriptions from /opt/local/var/macports/sources/rsync.macports.org/release/tarballs/ports/_resources/port1.0/variant_descriptions.conf
464:debug:main universal variant already exists, so not adding the default one
465:debug:main Running callback portconfigure::add_automatic_compiler_dependencies
466:debug:main Preferred compilers: clang macports-clang-3.8 macports-clang-3.7
467:debug:main Finished running callback portconfigure::add_automatic_compiler_dependencies
468:debug:main Running callback portbuild::add_automatic_buildsystem_dependencies
469:debug:main Finished running callback portbuild::add_automatic_buildsystem_dependencies
470:debug:main Searching for dependency: zlib
471:debug:main Found Dependency: receipt exists for zlib
472:debug:main Searching for dependency: bzip2
473:debug:main Found Dependency: receipt exists for bzip2
474:debug:main Searching for dependency: freeimage
475:debug:main Didn't find receipt, going to depspec regex for: freeimage
476:debug:main Changing to port directory: /opt/local/var/macports/sources/rsync.macports.org/release/tarballs/ports/graphics/freeimage
477:debug:main OS darwin/16.3.0 (Mac OS X 10.12) arch i386
478:debug:main Reading variant descriptions from /opt/local/var/macports/sources/rsync.macports.org/release/tarballs/ports/_resources/port1.0/variant_descriptions.conf
479:debug:main Preferred compilers: clang macports-clang-3.8 macports-clang-3.7
480:debug:main Preferred compilers: clang macports-clang-3.8 macports-clang-3.7
481:debug:main Preferred compilers: clang macports-clang-3.8 macports-clang-3.7
482:debug:main universal variant already exists, so not adding the default one
483:debug:main Running callback portconfigure::add_automatic_compiler_dependencies
484:debug:main Preferred compilers: clang macports-clang-3.8 macports-clang-3.7
485:debug:main Finished running callback portconfigure::add_automatic_compiler_dependencies
486:debug:main Running callback portbuild::add_automatic_buildsystem_dependencies
487:debug:main Finished running callback portbuild::add_automatic_buildsystem_dependencies
488:debug:main Searching for dependency: freetype
489:debug:main Didn't find receipt, going to depspec regex for: freetype
490:debug:main Changing to port directory: /opt/local/var/macports/sources/rsync.macports.org/release/tarballs/ports/print/freetype
491:debug:main OS darwin/16.3.0 (Mac OS X 10.12) arch i386
492:debug:main Reading variant descriptions from /opt/local/var/macports/sources/rsync.macports.org/release/tarballs/ports/_resources/port1.0/variant_descriptions.conf
493:debug:main Sourcing PortGroup muniversal 1.0 from /opt/local/var/macports/sources/rsync.macports.org/release/tarballs/ports/_resources/port1.0/group/muniversal-1.0.tcl
494:debug:main Preferred compilers: clang macports-clang-3.8 macports-clang-3.7
495:debug:main Preferred compilers: clang macports-clang-3.8 macports-clang-3.7
496:debug:main universal variant already exists, so not adding the default one
497:debug:main Running callback portconfigure::add_automatic_compiler_dependencies
498:debug:main Preferred compilers: clang macports-clang-3.8 macports-clang-3.7
499:debug:main Finished running callback portconfigure::add_automatic_compiler_dependencies
500:debug:main Running callback portbuild::add_automatic_buildsystem_dependencies
501:debug:main Finished running callback portbuild::add_automatic_buildsystem_dependencies
502:debug:main Searching for dependency: boost
503:debug:main Found Dependency: receipt exists for boost
504:debug:main Searching for dependency: ois
505:debug:main Didn't find receipt, going to depspec regex for: ois
506:debug:main Changing to port directory: /opt/local/var/macports/sources/rsync.macports.org/release/tarballs/ports/devel/ois
507:debug:main OS darwin/16.3.0 (Mac OS X 10.12) arch i386
508:debug:main Re-registering default for use_configure
509:debug:main Re-registering default for universal_variant
510:debug:main Re-registering default for build.type
511:debug:main Re-registering default for build.pre_args
512:debug:main Re-registering default for build.target
513:debug:main Re-registering default for destroot.pre_args
514:debug:main Re-registering default for destroot.target
515:debug:main Re-registering default for destroot.destdir
516:debug:main Sourcing PortGroup xcode 1.0 from /opt/local/var/macports/sources/rsync.macports.org/release/tarballs/ports/_resources/port1.0/group/xcode-1.0.tcl
517:debug:main adding the default universal variant
518:debug:main Reading variant descriptions from /opt/local/var/macports/sources/rsync.macports.org/release/tarballs/ports/_resources/port1.0/variant_descriptions.conf
519:debug:main Running callback portconfigure::add_automatic_compiler_dependencies
520:debug:main Preferred compilers: clang macports-clang-3.8 macports-clang-3.7
521:debug:main Finished running callback portconfigure::add_automatic_compiler_dependencies
522:debug:main Running callback portbuild::add_automatic_buildsystem_dependencies
523:debug:main Finished running callback portbuild::add_automatic_buildsystem_dependencies
524:info:main .:debug:main Checking for conflicts against graphviz
525:debug:main Searching for dependency: graphviz-devel
526:debug:main Didn't find receipt, going to depspec regex for: graphviz-devel
527:debug:main Searching for dependency: jpeg
528:debug:main Didn't find receipt, going to depspec regex for: jpeg
529:debug:main Changing to port directory: /opt/local/var/macports/sources/rsync.macports.org/release/tarballs/ports/graphics/jpeg
530:debug:main OS darwin/16.3.0 (Mac OS X 10.12) arch i386
531:debug:main adding the default universal variant
532:debug:main Reading variant descriptions from /opt/local/var/macports/sources/rsync.macports.org/release/tarballs/ports/_resources/port1.0/variant_descriptions.conf
533:debug:main Running callback portconfigure::add_automatic_compiler_dependencies
534:debug:main Preferred compilers: clang macports-clang-3.8 macports-clang-3.7
535:debug:main Finished running callback portconfigure::add_automatic_compiler_dependencies
536:debug:main Running callback portbuild::add_automatic_buildsystem_dependencies
537:debug:main Finished running callback portbuild::add_automatic_buildsystem_dependencies
538:debug:main Searching for dependency: libpng
539:debug:main Found Dependency: receipt exists for libpng
540:debug:main Searching for dependency: webp
541:debug:main Didn't find receipt, going to depspec regex for: webp
542:debug:main Changing to port directory: /opt/local/var/macports/sources/rsync.macports.org/release/tarballs/ports/graphics/webp
543:debug:main OS darwin/16.3.0 (Mac OS X 10.12) arch i386
544:debug:main adding the default universal variant
545:debug:main Reading variant descriptions from /opt/local/var/macports/sources/rsync.macports.org/release/tarballs/ports/_resources/port1.0/variant_descriptions.conf
546:debug:main Running callback portconfigure::add_automatic_compiler_dependencies
547:debug:main Preferred compilers: clang macports-clang-3.8 macports-clang-3.7
548:debug:main Finished running callback portconfigure::add_automatic_compiler_dependencies
549:debug:main Running callback portbuild::add_automatic_buildsystem_dependencies
550:debug:main Finished running callback portbuild::add_automatic_buildsystem_dependencies
551:debug:main Searching for dependency: fontconfig
552:debug:main Didn't find receipt, going to depspec regex for: fontconfig
553:debug:main Changing to port directory: /opt/local/var/macports/sources/rsync.macports.org/release/tarballs/ports/graphics/fontconfig
554:debug:main OS darwin/16.3.0 (Mac OS X 10.12) arch i386
555:debug:main Reading variant descriptions from /opt/local/var/macports/sources/rsync.macports.org/release/tarballs/ports/_resources/port1.0/variant_descriptions.conf
556:debug:main Sourcing PortGroup muniversal 1.0 from /opt/local/var/macports/sources/rsync.macports.org/release/tarballs/ports/_resources/port1.0/group/muniversal-1.0.tcl
557:debug:main Preferred compilers: clang macports-clang-3.8 macports-clang-3.7
558:debug:main Preferred compilers: clang macports-clang-3.8 macports-clang-3.7
559:debug:main universal variant already exists, so not adding the default one
560:debug:main Running callback portconfigure::add_automatic_compiler_dependencies
561:debug:main Preferred compilers: clang macports-clang-3.8 macports-clang-3.7
562:debug:main Finished running callback portconfigure::add_automatic_compiler_dependencies
563:debug:main Running callback portbuild::add_automatic_buildsystem_dependencies
564:debug:main Finished running callback portbuild::add_automatic_buildsystem_dependencies
565:debug:main Searching for dependency: expat
566:debug:main Found Dependency: receipt exists for expat
567:debug:main Searching for dependency: gd2
568:debug:main Didn't find receipt, going to depspec regex for: gd2
569:debug:main Changing to port directory: /opt/local/var/macports/sources/rsync.macports.org/release/tarballs/ports/graphics/gd2
570:debug:main OS darwin/16.3.0 (Mac OS X 10.12) arch i386
571:debug:main Sourcing PortGroup github 1.0 from /opt/local/var/macports/sources/rsync.macports.org/release/tarballs/ports/_resources/port1.0/group/github-1.0.tcl
572:debug:main Reading variant descriptions from /opt/local/var/macports/sources/rsync.macports.org/release/tarballs/ports/_resources/port1.0/variant_descriptions.conf
573:debug:main Sourcing PortGroup muniversal 1.0 from /opt/local/var/macports/sources/rsync.macports.org/release/tarballs/ports/_resources/port1.0/group/muniversal-1.0.tcl
574:debug:main universal variant already exists, so not adding the default one
575:debug:main Executing variant x11 provides x11
576:debug:main Running callback portconfigure::add_automatic_compiler_dependencies
577:debug:main Preferred compilers: clang macports-clang-3.8 macports-clang-3.7
578:debug:main Finished running callback portconfigure::add_automatic_compiler_dependencies
579:debug:main Running callback portbuild::add_automatic_buildsystem_dependencies
580:debug:main Finished running callback portbuild::add_automatic_buildsystem_dependencies
581:debug:main Searching for dependency: gts
582:debug:main Didn't find receipt, going to depspec regex for: gts
583:debug:main Changing to port directory: /opt/local/var/macports/sources/rsync.macports.org/release/tarballs/ports/math/gts
584:debug:main OS darwin/16.3.0 (Mac OS X 10.12) arch i386
585:debug:main Reading variant descriptions from /opt/local/var/macports/sources/rsync.macports.org/release/tarballs/ports/_resources/port1.0/variant_descriptions.conf
586:debug:main Sourcing PortGroup muniversal 1.0 from /opt/local/var/macports/sources/rsync.macports.org/release/tarballs/ports/_resources/port1.0/group/muniversal-1.0.tcl
587:debug:main universal variant already exists, so not adding the default one
588:debug:main Running callback portconfigure::add_automatic_compiler_dependencies
589:debug:main Preferred compilers: clang macports-clang-3.8 macports-clang-3.7
590:debug:main Finished running callback portconfigure::add_automatic_compiler_dependencies
591:debug:main Running callback portbuild::add_automatic_buildsystem_dependencies
592:debug:main Finished running callback portbuild::add_automatic_buildsystem_dependencies
593:debug:main Searching for dependency: libtool
594:debug:main Found Dependency: receipt exists for libtool
595:debug:main Searching for dependency: gettext
596:debug:main Found Dependency: receipt exists for gettext
597:debug:main Searching for dependency: pango
598:debug:main Didn't find receipt, going to depspec regex for: pango
599:debug:main Changing to port directory: /opt/local/var/macports/sources/rsync.macports.org/release/tarballs/ports/x11/pango
600:debug:main OS darwin/16.3.0 (Mac OS X 10.12) arch i386
601:debug:main Sourcing PortGroup active_variants 1.1 from /opt/local/var/macports/sources/rsync.macports.org/release/tarballs/ports/_resources/port1.0/group/active_variants-1.1.tcl
602:debug:main Sourcing PortGroup gobject_introspection 1.0 from /opt/local/var/macports/sources/rsync.macports.org/release/tarballs/ports/_resources/port1.0/group/gobject_introspection-1.0.tcl
603:debug:main Reading variant descriptions from /opt/local/var/macports/sources/rsync.macports.org/release/tarballs/ports/_resources/port1.0/variant_descriptions.conf
604:debug:main adding the default universal variant
605:debug:main Executing variant quartz provides quartz
606:debug:main Executing variant x11 provides x11
607:debug:main Running callback portconfigure::add_automatic_compiler_dependencies
608:debug:main Preferred compilers: clang macports-clang-3.8 macports-clang-3.7
609:debug:main Finished running callback portconfigure::add_automatic_compiler_dependencies
610:debug:main Running callback portbuild::add_automatic_buildsystem_dependencies
611:debug:main Finished running callback portbuild::add_automatic_buildsystem_dependencies
612:debug:main Searching for dependency: libLASi
613:debug:main Didn't find receipt, going to depspec regex for: libLASi
614:debug:main Changing to port directory: /opt/local/var/macports/sources/rsync.macports.org/release/tarballs/ports/print/libLASi
615:debug:main OS darwin/16.3.0 (Mac OS X 10.12) arch i386
616:debug:main Re-registering default for configure.dir
617:debug:main Re-registering default for configure.pre_args
618:debug:main Re-registering default for build.dir
619:debug:main Re-registering default for destroot.target
620:debug:main Sourcing PortGroup cmake 1.0 from /opt/local/var/macports/sources/rsync.macports.org/release/tarballs/ports/_resources/port1.0/group/cmake-1.0.tcl
621:debug:main adding the default universal variant
622:debug:main Reading variant descriptions from /opt/local/var/macports/sources/rsync.macports.org/release/tarballs/ports/_resources/port1.0/variant_descriptions.conf
623:debug:main Running callback portconfigure::add_automatic_compiler_dependencies
624:debug:main Preferred compilers: clang macports-clang-3.8 macports-clang-3.7
625:debug:main Finished running callback portconfigure::add_automatic_compiler_dependencies
626:debug:main Running callback portbuild::add_automatic_buildsystem_dependencies
627:debug:main Finished running callback portbuild::add_automatic_buildsystem_dependencies
628:debug:main Searching for dependency: xorg-libXaw
629:debug:main Didn't find receipt, going to depspec regex for: xorg-libXaw
630:debug:main Changing to port directory: /opt/local/var/macports/sources/rsync.macports.org/release/tarballs/ports/x11/xorg-libXaw
631:debug:main OS darwin/16.3.0 (Mac OS X 10.12) arch i386
632:debug:main adding the default universal variant
633:debug:main Reading variant descriptions from /opt/local/var/macports/sources/rsync.macports.org/release/tarballs/ports/_resources/port1.0/variant_descriptions.conf
634:debug:main Running callback portconfigure::add_automatic_compiler_dependencies
635:debug:main Preferred compilers: clang macports-clang-3.8 macports-clang-3.7
636:debug:main Finished running callback portconfigure::add_automatic_compiler_dependencies
637:debug:main Running callback portbuild::add_automatic_buildsystem_dependencies
638:debug:main Finished running callback portbuild::add_automatic_buildsystem_dependencies
639:debug:main Searching for dependency: urw-fonts
640:debug:main Didn't find receipt, going to depspec regex for: urw-fonts
641:debug:main Changing to port directory: /opt/local/var/macports/sources/rsync.macports.org/release/tarballs/ports/x11/urw-fonts
642:debug:main OS darwin/16.3.0 (Mac OS X 10.12) arch i386
643:debug:main universal_variant is false, so not adding the default universal variant
644:debug:main Running callback portconfigure::add_automatic_compiler_dependencies
645:debug:main Preferred compilers: clang macports-clang-3.8 macports-clang-3.7
646:debug:main Finished running callback portconfigure::add_automatic_compiler_dependencies
647:debug:main Running callback portbuild::add_automatic_buildsystem_dependencies
648:debug:main Finished running callback portbuild::add_automatic_buildsystem_dependencies
649:info:main .:debug:main Checking for conflicts against jpeg
650:debug:main Searching for dependency: libjpeg-turbo
651:debug:main Didn't find receipt, going to depspec regex for: libjpeg-turbo
652:debug:main Searching for dependency: mozjpeg
653:debug:main Didn't find receipt, going to depspec regex for: mozjpeg
654:info:main .:debug:main webp has no conflicts
655:debug:main Searching for dependency: giflib
656:debug:main Didn't find receipt, going to depspec regex for: giflib
657:debug:main Changing to port directory: /opt/local/var/macports/sources/rsync.macports.org/release/tarballs/ports/graphics/giflib
658:debug:main OS darwin/16.3.0 (Mac OS X 10.12) arch i386
659:debug:main Reading variant descriptions from /opt/local/var/macports/sources/rsync.macports.org/release/tarballs/ports/_resources/port1.0/variant_descriptions.conf
660:debug:main adding the default universal variant
661:debug:main Executing variant x11 provides x11
662:debug:main Running callback portconfigure::add_automatic_compiler_dependencies
663:debug:main Preferred compilers: clang macports-clang-3.8 macports-clang-3.7
664:debug:main Finished running callback portconfigure::add_automatic_compiler_dependencies
665:debug:main Running callback portbuild::add_automatic_buildsystem_dependencies
666:debug:main Finished running callback portbuild::add_automatic_buildsystem_dependencies
667:debug:main Searching for dependency: tiff
668:debug:main Didn't find receipt, going to depspec regex for: tiff
669:debug:main Changing to port directory: /opt/local/var/macports/sources/rsync.macports.org/release/tarballs/ports/graphics/tiff
670:debug:main OS darwin/16.3.0 (Mac OS X 10.12) arch i386
671:debug:main Sourcing PortGroup xcodeversion 1.0 from /opt/local/var/macports/sources/rsync.macports.org/release/tarballs/ports/_resources/port1.0/group/xcodeversion-1.0.tcl
672:debug:main Reading variant descriptions from /opt/local/var/macports/sources/rsync.macports.org/release/tarballs/ports/_resources/port1.0/variant_descriptions.conf
673:debug:main Sourcing PortGroup muniversal 1.0 from /opt/local/var/macports/sources/rsync.macports.org/release/tarballs/ports/_resources/port1.0/group/muniversal-1.0.tcl
674:debug:main universal variant already exists, so not adding the default one
675:debug:main Running callback portconfigure::add_automatic_compiler_dependencies
676:debug:main Preferred compilers: clang macports-clang-3.8 macports-clang-3.7
677:debug:main Finished running callback portconfigure::add_automatic_compiler_dependencies
678:debug:main Running callback portbuild::add_automatic_buildsystem_dependencies
679:debug:main Finished running callback portbuild::add_automatic_buildsystem_dependencies
680:info:main .:debug:main giflib has no conflicts
681:debug:main Searching for dependency: xorg-libsm
682:debug:main Didn't find receipt, going to depspec regex for: xorg-libsm
683:debug:main Changing to port directory: /opt/local/var/macports/sources/rsync.macports.org/release/tarballs/ports/x11/xorg-libsm
684:debug:main OS darwin/16.3.0 (Mac OS X 10.12) arch i386
685:debug:main adding the default universal variant
686:debug:main Reading variant descriptions from /opt/local/var/macports/sources/rsync.macports.org/release/tarballs/ports/_resources/port1.0/variant_descriptions.conf
687:debug:main Running callback portconfigure::add_automatic_compiler_dependencies
688:debug:main Preferred compilers: clang macports-clang-3.8 macports-clang-3.7
689:debug:main Finished running callback portconfigure::add_automatic_compiler_dependencies
690:debug:main Running callback portbuild::add_automatic_buildsystem_dependencies
691:debug:main Finished running callback portbuild::add_automatic_buildsystem_dependencies
692:debug:main Searching for dependency: xorg-libX11
693:debug:main Didn't find receipt, going to depspec regex for: xorg-libX11
694:debug:main Changing to port directory: /opt/local/var/macports/sources/rsync.macports.org/release/tarballs/ports/x11/xorg-libX11
695:debug:main OS darwin/16.3.0 (Mac OS X 10.12) arch i386
696:debug:main Preferred compilers: clang macports-clang-3.8 macports-clang-3.7
697:debug:main adding the default universal variant
698:debug:main Reading variant descriptions from /opt/local/var/macports/sources/rsync.macports.org/release/tarballs/ports/_resources/port1.0/variant_descriptions.conf
699:debug:main Running callback portconfigure::add_automatic_compiler_dependencies
700:debug:main Preferred compilers: clang macports-clang-3.8 macports-clang-3.7
701:debug:main Finished running callback portconfigure::add_automatic_compiler_dependencies
702:debug:main Running callback portbuild::add_automatic_buildsystem_dependencies
703:debug:main Finished running callback portbuild::add_automatic_buildsystem_dependencies
704:info:main .:debug:main xorg-libsm has no conflicts
705:debug:main Searching for dependency: xorg-libice
706:debug:main Didn't find receipt, going to depspec regex for: xorg-libice
707:debug:main Changing to port directory: /opt/local/var/macports/sources/rsync.macports.org/release/tarballs/ports/x11/xorg-libice
708:debug:main OS darwin/16.3.0 (Mac OS X 10.12) arch i386
709:debug:main adding the default universal variant
710:debug:main Reading variant descriptions from /opt/local/var/macports/sources/rsync.macports.org/release/tarballs/ports/_resources/port1.0/variant_descriptions.conf
711:debug:main Running callback portconfigure::add_automatic_compiler_dependencies
712:debug:main Preferred compilers: clang macports-clang-3.8 macports-clang-3.7
713:debug:main Finished running callback portconfigure::add_automatic_compiler_dependencies
714:debug:main Running callback portbuild::add_automatic_buildsystem_dependencies
715:debug:main Finished running callback portbuild::add_automatic_buildsystem_dependencies
716:info:main .:debug:main xorg-libice has no conflicts
717:debug:main Searching for dependency: xorg-xproto
718:debug:main Didn't find receipt, going to depspec regex for: xorg-xproto
719:debug:main Changing to port directory: /opt/local/var/macports/sources/rsync.macports.org/release/tarballs/ports/x11/xorg-xproto
720:debug:main OS darwin/16.3.0 (Mac OS X 10.12) arch i386
721:debug:main only one arch supported, so not adding the default universal variant
722:debug:main Running callback portconfigure::add_automatic_compiler_dependencies
723:debug:main Preferred compilers: clang macports-clang-3.8 macports-clang-3.7
724:debug:main Finished running callback portconfigure::add_automatic_compiler_dependencies
725:debug:main Running callback portbuild::add_automatic_buildsystem_dependencies
726:debug:main Finished running callback portbuild::add_automatic_buildsystem_dependencies
727:info:main .:debug:main xorg-xproto has no conflicts
728:info:main .:debug:main xorg-libX11 has no conflicts
729:debug:main Searching for dependency: xorg-libXdmcp
730:debug:main Didn't find receipt, going to depspec regex for: xorg-libXdmcp
731:debug:main Changing to port directory: /opt/local/var/macports/sources/rsync.macports.org/release/tarballs/ports/x11/xorg-libXdmcp
732:debug:main OS darwin/16.3.0 (Mac OS X 10.12) arch i386
733:debug:main adding the default universal variant
734:debug:main Reading variant descriptions from /opt/local/var/macports/sources/rsync.macports.org/release/tarballs/ports/_resources/port1.0/variant_descriptions.conf
735:debug:main Running callback portconfigure::add_automatic_compiler_dependencies
736:debug:main Preferred compilers: clang macports-clang-3.8 macports-clang-3.7
737:debug:main Finished running callback portconfigure::add_automatic_compiler_dependencies
738:debug:main Running callback portbuild::add_automatic_buildsystem_dependencies
739:debug:main Finished running callback portbuild::add_automatic_buildsystem_dependencies
740:debug:main Searching for dependency: xorg-libXau
741:debug:main Didn't find receipt, going to depspec regex for: xorg-libXau
742:debug:main Changing to port directory: /opt/local/var/macports/sources/rsync.macports.org/release/tarballs/ports/x11/xorg-libXau
743:debug:main OS darwin/16.3.0 (Mac OS X 10.12) arch i386
744:debug:main adding the default universal variant
745:debug:main Reading variant descriptions from /opt/local/var/macports/sources/rsync.macports.org/release/tarballs/ports/_resources/port1.0/variant_descriptions.conf
746:debug:main Running callback portconfigure::add_automatic_compiler_dependencies
747:debug:main Preferred compilers: clang macports-clang-3.8 macports-clang-3.7
748:debug:main Finished running callback portconfigure::add_automatic_compiler_dependencies
749:debug:main Running callback portbuild::add_automatic_buildsystem_dependencies
750:debug:main Finished running callback portbuild::add_automatic_buildsystem_dependencies
751:debug:main Searching for dependency: xorg-libxcb
752:debug:main Didn't find receipt, going to depspec regex for: xorg-libxcb
753:debug:main Changing to port directory: /opt/local/var/macports/sources/rsync.macports.org/release/tarballs/ports/x11/xorg-libxcb
754:debug:main OS darwin/16.3.0 (Mac OS X 10.12) arch i386
755:debug:main adding the default universal variant
756:debug:main Reading variant descriptions from /opt/local/var/macports/sources/rsync.macports.org/release/tarballs/ports/_resources/port1.0/variant_descriptions.conf
757:debug:main Executing variant python27 provides python27
758:debug:main Running callback portconfigure::add_automatic_compiler_dependencies
759:debug:main Preferred compilers: clang macports-clang-3.8 macports-clang-3.7
760:debug:main Finished running callback portconfigure::add_automatic_compiler_dependencies
761:debug:main Running callback portbuild::add_automatic_buildsystem_dependencies
762:debug:main Finished running callback portbuild::add_automatic_buildsystem_dependencies
763:debug:main Searching for dependency: xorg-kbproto
764:debug:main Didn't find receipt, going to depspec regex for: xorg-kbproto
765:debug:main Changing to port directory: /opt/local/var/macports/sources/rsync.macports.org/release/tarballs/ports/x11/xorg-kbproto
766:debug:main OS darwin/16.3.0 (Mac OS X 10.12) arch i386
767:debug:main only one arch supported, so not adding the default universal variant
768:debug:main Running callback portconfigure::add_automatic_compiler_dependencies
769:debug:main Preferred compilers: clang macports-clang-3.8 macports-clang-3.7
770:debug:main Finished running callback portconfigure::add_automatic_compiler_dependencies
771:debug:main Running callback portbuild::add_automatic_buildsystem_dependencies
772:debug:main Finished running callback portbuild::add_automatic_buildsystem_dependencies
773:info:main .:debug:main xorg-libXdmcp has no conflicts
774:info:main .:debug:main xorg-libXau has no conflicts
775:info:main .:debug:main xorg-libxcb has no conflicts
776:debug:main Searching for dependency: xorg-xcb-proto
777:debug:main Didn't find receipt, going to depspec regex for: xorg-xcb-proto
778:debug:main Changing to port directory: /opt/local/var/macports/sources/rsync.macports.org/release/tarballs/ports/x11/xorg-xcb-proto
779:debug:main OS darwin/16.3.0 (Mac OS X 10.12) arch i386
780:debug:main only one arch supported, so not adding the default universal variant
781:debug:main Executing variant python27 provides python27
782:debug:main Running callback portconfigure::add_automatic_compiler_dependencies
783:debug:main Preferred compilers: clang macports-clang-3.8 macports-clang-3.7
784:debug:main Finished running callback portconfigure::add_automatic_compiler_dependencies
785:debug:main Running callback portbuild::add_automatic_buildsystem_dependencies
786:debug:main Finished running callback portbuild::add_automatic_buildsystem_dependencies
787:debug:main Searching for dependency: xorg-libpthread-stubs
788:debug:main Didn't find receipt, going to depspec regex for: xorg-libpthread-stubs
789:debug:main Changing to port directory: /opt/local/var/macports/sources/rsync.macports.org/release/tarballs/ports/x11/xorg-libpthread-stubs
790:debug:main OS darwin/16.3.0 (Mac OS X 10.12) arch i386
791:debug:main only one arch supported, so not adding the default universal variant
792:debug:main Running callback portconfigure::add_automatic_compiler_dependencies
793:debug:main Preferred compilers: clang macports-clang-3.8 macports-clang-3.7
794:debug:main Finished running callback portconfigure::add_automatic_compiler_dependencies
795:debug:main Running callback portbuild::add_automatic_buildsystem_dependencies
796:debug:main Finished running callback portbuild::add_automatic_buildsystem_dependencies
797:debug:main Searching for dependency: python27
798:debug:main Found Dependency: receipt exists for python27
799:info:main .:debug:main xorg-xcb-proto has no conflicts
800:debug:main Searching for dependency: libxml2
801:debug:main Found Dependency: receipt exists for libxml2
802:info:main .:debug:main xorg-libpthread-stubs has no conflicts
803:info:main .:debug:main xorg-kbproto has no conflicts
804:info:main .:debug:main tiff has no conflicts
805:debug:main Searching for dependency: xz
806:debug:main Found Dependency: receipt exists for xz
807:info:main .:debug:main fontconfig has no conflicts
808:debug:main Searching for dependency: libiconv
809:debug:main Found Dependency: receipt exists for libiconv
810:info:main .:debug:main gd2 has no conflicts
811:debug:main Searching for dependency: xpm
812:debug:main Didn't find receipt, going to depspec regex for: xpm
813:debug:main Changing to port directory: /opt/local/var/macports/sources/rsync.macports.org/release/tarballs/ports/x11/xpm
814:debug:main OS darwin/16.3.0 (Mac OS X 10.12) arch i386
815:debug:main adding the default universal variant
816:debug:main Reading variant descriptions from /opt/local/var/macports/sources/rsync.macports.org/release/tarballs/ports/_resources/port1.0/variant_descriptions.conf
817:debug:main Running callback portconfigure::add_automatic_compiler_dependencies
818:debug:main Preferred compilers: clang macports-clang-3.8 macports-clang-3.7
819:debug:main Finished running callback portconfigure::add_automatic_compiler_dependencies
820:debug:main Running callback portbuild::add_automatic_buildsystem_dependencies
821:debug:main Finished running callback portbuild::add_automatic_buildsystem_dependencies
822:info:main .:debug:main xpm has no conflicts
823:debug:main Searching for dependency: xorg-libXt
824:debug:main Didn't find receipt, going to depspec regex for: xorg-libXt
825:debug:main Changing to port directory: /opt/local/var/macports/sources/rsync.macports.org/release/tarballs/ports/x11/xorg-libXt
826:debug:main OS darwin/16.3.0 (Mac OS X 10.12) arch i386
827:debug:main Preferred compilers: clang macports-clang-3.8 macports-clang-3.7
828:debug:main adding the default universal variant
829:debug:main Reading variant descriptions from /opt/local/var/macports/sources/rsync.macports.org/release/tarballs/ports/_resources/port1.0/variant_descriptions.conf
830:debug:main Running callback portconfigure::add_automatic_compiler_dependencies
831:debug:main Preferred compilers: clang macports-clang-3.8 macports-clang-3.7
832:debug:main Finished running callback portconfigure::add_automatic_compiler_dependencies
833:debug:main Running callback portbuild::add_automatic_buildsystem_dependencies
834:debug:main Finished running callback portbuild::add_automatic_buildsystem_dependencies
835:debug:main Searching for dependency: xorg-libXext
836:debug:main Didn't find receipt, going to depspec regex for: xorg-libXext
837:debug:main Changing to port directory: /opt/local/var/macports/sources/rsync.macports.org/release/tarballs/ports/x11/xorg-libXext
838:debug:main OS darwin/16.3.0 (Mac OS X 10.12) arch i386
839:debug:main Preferred compilers: clang macports-clang-3.8 macports-clang-3.7
840:debug:main adding the default universal variant
841:debug:main Reading variant descriptions from /opt/local/var/macports/sources/rsync.macports.org/release/tarballs/ports/_resources/port1.0/variant_descriptions.conf
842:debug:main Running callback portconfigure::add_automatic_compiler_dependencies
843:debug:main Preferred compilers: clang macports-clang-3.8 macports-clang-3.7
844:debug:main Finished running callback portconfigure::add_automatic_compiler_dependencies
845:debug:main Running callback portbuild::add_automatic_buildsystem_dependencies
846:debug:main Finished running callback portbuild::add_automatic_buildsystem_dependencies
847:info:main .:debug:main xorg-libXt has no conflicts
848:info:main .:debug:main xorg-libXext has no conflicts
849:debug:main Searching for dependency: xorg-xextproto
850:debug:main Didn't find receipt, going to depspec regex for: xorg-xextproto
851:debug:main Changing to port directory: /opt/local/var/macports/sources/rsync.macports.org/release/tarballs/ports/x11/xorg-xextproto
852:debug:main OS darwin/16.3.0 (Mac OS X 10.12) arch i386
853:debug:main only one arch supported, so not adding the default universal variant
854:debug:main Running callback portconfigure::add_automatic_compiler_dependencies
855:debug:main Preferred compilers: clang macports-clang-3.8 macports-clang-3.7
856:debug:main Finished running callback portconfigure::add_automatic_compiler_dependencies
857:debug:main Running callback portbuild::add_automatic_buildsystem_dependencies
858:debug:main Finished running callback portbuild::add_automatic_buildsystem_dependencies
859:info:main .:debug:main xorg-xextproto has no conflicts
860:info:main .:debug:main gts has no conflicts
861:debug:main Searching for dependency: glib2
862:debug:main Found Dependency: receipt exists for glib2
863:debug:main Searching for dependency: libnetpbm
864:debug:main Didn't find receipt, going to depspec regex for: libnetpbm
865:debug:main Changing to port directory: /opt/local/var/macports/sources/rsync.macports.org/release/tarballs/ports/graphics/netpbm
866:debug:main OS darwin/16.3.0 (Mac OS X 10.12) arch i386
867:debug:main Reading variant descriptions from /opt/local/var/macports/sources/rsync.macports.org/release/tarballs/ports/_resources/port1.0/variant_descriptions.conf
868:debug:main universal variant already exists, so not adding the default one
869:debug:main Running callback portconfigure::add_automatic_compiler_dependencies
870:debug:main Preferred compilers: clang macports-clang-3.8 macports-clang-3.7
871:debug:main Finished running callback portconfigure::add_automatic_compiler_dependencies
872:debug:main Running callback portbuild::add_automatic_buildsystem_dependencies
873:debug:main Finished running callback portbuild::add_automatic_buildsystem_dependencies
874:info:main .:debug:main libnetpbm has no conflicts
875:info:main .:debug:main Checking for conflicts against pango
876:debug:main Searching for dependency: pango-devel
877:debug:main Didn't find receipt, going to depspec regex for: pango-devel
878:debug:main Searching for dependency: cairo
879:debug:main Didn't find receipt, going to depspec regex for: cairo
880:debug:main Changing to port directory: /opt/local/var/macports/sources/rsync.macports.org/release/tarballs/ports/graphics/cairo
881:debug:main OS darwin/16.3.0 (Mac OS X 10.12) arch i386
882:debug:main Sourcing PortGroup compiler_blacklist_versions 1.0 from /opt/local/var/macports/sources/rsync.macports.org/release/tarballs/ports/_resources/port1.0/group/compiler_blacklist_versions-1.0.tcl
883:debug:main Reading variant descriptions from /opt/local/var/macports/sources/rsync.macports.org/release/tarballs/ports/_resources/port1.0/variant_descriptions.conf
884:debug:main Sourcing PortGroup muniversal 1.0 from /opt/local/var/macports/sources/rsync.macports.org/release/tarballs/ports/_resources/port1.0/group/muniversal-1.0.tcl
885:debug:main Sourcing PortGroup xcodeversion 1.0 from /opt/local/var/macports/sources/rsync.macports.org/release/tarballs/ports/_resources/port1.0/group/xcodeversion-1.0.tcl
886:debug:main compiler clang 800.0.42.1 not blacklisted because it doesn't match {clang < 318.0.61}
887:debug:main universal variant already exists, so not adding the default one
888:debug:main Executing variant quartz provides quartz
889:debug:main Executing variant x11 provides x11
890:debug:main Running callback portconfigure::add_automatic_compiler_dependencies
891:debug:main Preferred compilers: clang macports-clang-3.8 macports-clang-3.7
892:debug:main Finished running callback portconfigure::add_automatic_compiler_dependencies
893:debug:main Running callback portbuild::add_automatic_buildsystem_dependencies
894:debug:main Finished running callback portbuild::add_automatic_buildsystem_dependencies
895:debug:main Searching for dependency: harfbuzz
896:debug:main Didn't find receipt, going to depspec regex for: harfbuzz
897:debug:main Changing to port directory: /opt/local/var/macports/sources/rsync.macports.org/release/tarballs/ports/graphics/harfbuzz
898:debug:main OS darwin/16.3.0 (Mac OS X 10.12) arch i386
899:debug:main adding the default universal variant
900:debug:main Reading variant descriptions from /opt/local/var/macports/sources/rsync.macports.org/release/tarballs/ports/_resources/port1.0/variant_descriptions.conf
901:debug:main Running callback portconfigure::add_automatic_compiler_dependencies
902:debug:main Preferred compilers: clang macports-clang-3.8 macports-clang-3.7
903:debug:main Finished running callback portconfigure::add_automatic_compiler_dependencies
904:debug:main Running callback portbuild::add_automatic_buildsystem_dependencies
905:debug:main Finished running callback portbuild::add_automatic_buildsystem_dependencies
906:debug:main Searching for dependency: gobject-introspection
907:debug:main Didn't find receipt, going to depspec regex for: gobject-introspection
908:debug:main Changing to port directory: /opt/local/var/macports/sources/rsync.macports.org/release/tarballs/ports/gnome/gobject-introspection
909:debug:main OS darwin/16.3.0 (Mac OS X 10.12) arch i386
910:debug:main Sourcing PortGroup active_variants 1.1 from /opt/local/var/macports/sources/rsync.macports.org/release/tarballs/ports/_resources/port1.0/group/active_variants-1.1.tcl
911:debug:main Preferred compilers: clang macports-clang-3.8 macports-clang-3.7
912:debug:main Preferred compilers: clang macports-clang-3.8 macports-clang-3.7
913:debug:main python27 is installed with the following variants:
914:debug:main   required: ucs4, forbidden:
915:debug:main   rejected, because required variant ucs4 is missing
916:debug:main adding the default universal variant
917:debug:main Reading variant descriptions from /opt/local/var/macports/sources/rsync.macports.org/release/tarballs/ports/_resources/port1.0/variant_descriptions.conf
918:debug:main Running callback portconfigure::add_automatic_compiler_dependencies
919:debug:main Preferred compilers: clang macports-clang-3.8 macports-clang-3.7
920:debug:main Finished running callback portconfigure::add_automatic_compiler_dependencies
921:debug:main Running callback portbuild::add_automatic_buildsystem_dependencies
922:debug:main Finished running callback portbuild::add_automatic_buildsystem_dependencies
923:debug:main Searching for dependency: Xft2
924:debug:main Didn't find receipt, going to depspec regex for: Xft2
925:debug:main Changing to port directory: /opt/local/var/macports/sources/rsync.macports.org/release/tarballs/ports/x11/Xft2
926:debug:main OS darwin/16.3.0 (Mac OS X 10.12) arch i386
927:debug:main adding the default universal variant
928:debug:main Reading variant descriptions from /opt/local/var/macports/sources/rsync.macports.org/release/tarballs/ports/_resources/port1.0/variant_descriptions.conf
929:debug:main Running callback portconfigure::add_automatic_compiler_dependencies
930:debug:main Preferred compilers: clang macports-clang-3.8 macports-clang-3.7
931:debug:main Finished running callback portconfigure::add_automatic_compiler_dependencies
932:debug:main Running callback portbuild::add_automatic_buildsystem_dependencies
933:debug:main Finished running callback portbuild::add_automatic_buildsystem_dependencies
934:info:main .:debug:main Checking for conflicts against cairo
935:debug:main Searching for dependency: cairo-devel
936:debug:main Didn't find receipt, going to depspec regex for: cairo-devel
937:debug:main Searching for dependency: libpixman
938:debug:main Didn't find receipt, going to depspec regex for: libpixman
939:debug:main Changing to port directory: /opt/local/var/macports/sources/rsync.macports.org/release/tarballs/ports/graphics/libpixman
940:debug:main OS darwin/16.3.0 (Mac OS X 10.12) arch i386
941:debug:main Sourcing PortGroup compiler_blacklist_versions 1.0 from /opt/local/var/macports/sources/rsync.macports.org/release/tarballs/ports/_resources/port1.0/group/compiler_blacklist_versions-1.0.tcl
942:debug:main Reading variant descriptions from /opt/local/var/macports/sources/rsync.macports.org/release/tarballs/ports/_resources/port1.0/variant_descriptions.conf
943:debug:main Sourcing PortGroup muniversal 1.0 from /opt/local/var/macports/sources/rsync.macports.org/release/tarballs/ports/_resources/port1.0/group/muniversal-1.0.tcl
944:debug:main compiler clang 800.0.42.1 not blacklisted because it doesn't match {clang < 211.10.1}
945:debug:main universal variant already exists, so not adding the default one
946:debug:main Running callback portconfigure::add_automatic_compiler_dependencies
947:debug:main Preferred compilers: clang macports-clang-3.8 macports-clang-3.7
948:debug:main Finished running callback portconfigure::add_automatic_compiler_dependencies
949:debug:main Running callback portbuild::add_automatic_buildsystem_dependencies
950:debug:main Finished running callback portbuild::add_automatic_buildsystem_dependencies
951:debug:main Searching for dependency: xrender
952:debug:main Didn't find receipt, going to depspec regex for: xrender
953:debug:main Changing to port directory: /opt/local/var/macports/sources/rsync.macports.org/release/tarballs/ports/x11/xrender
954:debug:main OS darwin/16.3.0 (Mac OS X 10.12) arch i386
955:debug:main adding the default universal variant
956:debug:main Reading variant descriptions from /opt/local/var/macports/sources/rsync.macports.org/release/tarballs/ports/_resources/port1.0/variant_descriptions.conf
957:debug:main Running callback portconfigure::add_automatic_compiler_dependencies
958:debug:main Preferred compilers: clang macports-clang-3.8 macports-clang-3.7
959:debug:main Finished running callback portconfigure::add_automatic_compiler_dependencies
960:debug:main Running callback portbuild::add_automatic_buildsystem_dependencies
961:debug:main Finished running callback portbuild::add_automatic_buildsystem_dependencies
962:debug:main Searching for dependency: xorg-xcb-util
963:debug:main Didn't find receipt, going to depspec regex for: xorg-xcb-util
964:debug:main Changing to port directory: /opt/local/var/macports/sources/rsync.macports.org/release/tarballs/ports/x11/xorg-xcb-util
965:debug:main OS darwin/16.3.0 (Mac OS X 10.12) arch i386
966:debug:main adding the default universal variant
967:debug:main Reading variant descriptions from /opt/local/var/macports/sources/rsync.macports.org/release/tarballs/ports/_resources/port1.0/variant_descriptions.conf
968:debug:main Running callback portconfigure::add_automatic_compiler_dependencies
969:debug:main Preferred compilers: clang macports-clang-3.8 macports-clang-3.7
970:debug:main Finished running callback portconfigure::add_automatic_compiler_dependencies
971:debug:main Running callback portbuild::add_automatic_buildsystem_dependencies
972:debug:main Finished running callback portbuild::add_automatic_buildsystem_dependencies
973:info:main .:debug:main Checking for conflicts against libpixman
974:debug:main Searching for dependency: libpixman-devel
975:debug:main Didn't find receipt, going to depspec regex for: libpixman-devel
976:info:main .:debug:main xrender has no conflicts
977:debug:main Searching for dependency: xorg-renderproto
978:debug:main Didn't find receipt, going to depspec regex for: xorg-renderproto
979:debug:main Changing to port directory: /opt/local/var/macports/sources/rsync.macports.org/release/tarballs/ports/x11/xorg-renderproto
980:debug:main OS darwin/16.3.0 (Mac OS X 10.12) arch i386
981:debug:main only one arch supported, so not adding the default universal variant
982:debug:main Running callback portconfigure::add_automatic_compiler_dependencies
983:debug:main Preferred compilers: clang macports-clang-3.8 macports-clang-3.7
984:debug:main Finished running callback portconfigure::add_automatic_compiler_dependencies
985:debug:main Running callback portbuild::add_automatic_buildsystem_dependencies
986:debug:main Finished running callback portbuild::add_automatic_buildsystem_dependencies
987:info:main .:debug:main xorg-renderproto has no conflicts
988:info:main .:debug:main xorg-xcb-util has no conflicts
989:info:main .:debug:main harfbuzz has no conflicts
990:debug:main Searching for dependency: graphite2
991:debug:main Didn't find receipt, going to depspec regex for: graphite2
992:debug:main Changing to port directory: /opt/local/var/macports/sources/rsync.macports.org/release/tarballs/ports/graphics/graphite2
993:debug:main OS darwin/16.3.0 (Mac OS X 10.12) arch i386
994:debug:main Re-registering default for configure.dir
995:debug:main Re-registering default for configure.pre_args
996:debug:main Re-registering default for build.dir
997:debug:main Re-registering default for destroot.target
998:debug:main Sourcing PortGroup cmake 1.0 from /opt/local/var/macports/sources/rsync.macports.org/release/tarballs/ports/_resources/port1.0/group/cmake-1.0.tcl
999:debug:main Reading variant descriptions from /opt/local/var/macports/sources/rsync.macports.org/release/tarballs/ports/_resources/port1.0/variant_descriptions.conf
1000:debug:main Sourcing PortGroup muniversal 1.0 from /opt/local/var/macports/sources/rsync.macports.org/release/tarballs/ports/_resources/port1.0/group/muniversal-1.0.tcl
1001:debug:main universal variant already exists, so not adding the default one
1002:debug:main Running callback portconfigure::add_automatic_compiler_dependencies
1003:debug:main Preferred compilers: clang macports-clang-3.8 macports-clang-3.7
1004:debug:main Finished running callback portconfigure::add_automatic_compiler_dependencies
1005:debug:main Running callback portbuild::add_automatic_buildsystem_dependencies
1006:debug:main Finished running callback portbuild::add_automatic_buildsystem_dependencies
1007:info:main .:debug:main graphite2 has no conflicts
1008:info:main .:debug:main gobject-introspection has no conflicts
1009:debug:main Searching for dependency: libffi
1010:debug:main Found Dependency: receipt exists for libffi
1011:debug:main Searching for dependency: py27-mako
1012:debug:main Didn't find receipt, going to depspec regex for: py27-mako
1013:debug:main Changing to port directory: /opt/local/var/macports/sources/rsync.macports.org/release/tarballs/ports/python/py-mako
1014:debug:main OS darwin/16.3.0 (Mac OS X 10.12) arch i386
1015:debug:main Re-registering default for build.cmd
1016:debug:main Re-registering default for destroot.cmd
1017:debug:main Re-registering default for destroot.destdir
1018:debug:main Sourcing PortGroup python 1.0 from /opt/local/var/macports/sources/rsync.macports.org/release/tarballs/ports/_resources/port1.0/group/python-1.0.tcl
1019:debug:main only one arch supported, so not adding the default universal variant
1020:debug:main Running callback portconfigure::add_automatic_compiler_dependencies
1021:debug:main Preferred compilers: clang macports-clang-3.8 macports-clang-3.7
1022:debug:main Finished running callback portconfigure::add_automatic_compiler_dependencies
1023:debug:main Running callback portbuild::add_automatic_buildsystem_dependencies
1024:debug:main Finished running callback portbuild::add_automatic_buildsystem_dependencies
1025:info:main .:debug:main py27-mako has no conflicts
1026:debug:main Searching for dependency: py27-setuptools
1027:debug:main Didn't find receipt, going to depspec regex for: py27-setuptools
1028:debug:main Changing to port directory: /opt/local/var/macports/sources/rsync.macports.org/release/tarballs/ports/python/py-setuptools
1029:debug:main OS darwin/16.3.0 (Mac OS X 10.12) arch i386
1030:debug:main Re-registering default for build.cmd
1031:debug:main Re-registering default for destroot.cmd
1032:debug:main Re-registering default for destroot.destdir
1033:debug:main Sourcing PortGroup python 1.0 from /opt/local/var/macports/sources/rsync.macports.org/release/tarballs/ports/_resources/port1.0/group/python-1.0.tcl
1034:debug:main only one arch supported, so not adding the default universal variant
1035:debug:main Running callback portconfigure::add_automatic_compiler_dependencies
1036:debug:main Preferred compilers: clang macports-clang-3.8 macports-clang-3.7
1037:debug:main Finished running callback portconfigure::add_automatic_compiler_dependencies
1038:debug:main Running callback portbuild::add_automatic_buildsystem_dependencies
1039:debug:main Finished running callback portbuild::add_automatic_buildsystem_dependencies
1040:debug:main Searching for dependency: py27-beaker
1041:debug:main Didn't find receipt, going to depspec regex for: py27-beaker
1042:debug:main Changing to port directory: /opt/local/var/macports/sources/rsync.macports.org/release/tarballs/ports/python/py-beaker
1043:debug:main OS darwin/16.3.0 (Mac OS X 10.12) arch i386
1044:debug:main Re-registering default for build.cmd
1045:debug:main Re-registering default for destroot.cmd
1046:debug:main Re-registering default for destroot.destdir
1047:debug:main Sourcing PortGroup python 1.0 from /opt/local/var/macports/sources/rsync.macports.org/release/tarballs/ports/_resources/port1.0/group/python-1.0.tcl
1048:debug:main only one arch supported, so not adding the default universal variant
1049:debug:main Running callback portconfigure::add_automatic_compiler_dependencies
1050:debug:main Preferred compilers: clang macports-clang-3.8 macports-clang-3.7
1051:debug:main Finished running callback portconfigure::add_automatic_compiler_dependencies
1052:debug:main Running callback portbuild::add_automatic_buildsystem_dependencies
1053:debug:main Finished running callback portbuild::add_automatic_buildsystem_dependencies
1054:debug:main Searching for dependency: py27-markupsafe
1055:debug:main Didn't find receipt, going to depspec regex for: py27-markupsafe
1056:debug:main Changing to port directory: /opt/local/var/macports/sources/rsync.macports.org/release/tarballs/ports/python/py-markupsafe
1057:debug:main OS darwin/16.3.0 (Mac OS X 10.12) arch i386
1058:debug:main Re-registering default for build.cmd
1059:debug:main Re-registering default for destroot.cmd
1060:debug:main Re-registering default for destroot.destdir
1061:debug:main Sourcing PortGroup python 1.0 from /opt/local/var/macports/sources/rsync.macports.org/release/tarballs/ports/_resources/port1.0/group/python-1.0.tcl
1062:debug:main adding the default universal variant
1063:debug:main Reading variant descriptions from /opt/local/var/macports/sources/rsync.macports.org/release/tarballs/ports/_resources/port1.0/variant_descriptions.conf
1064:debug:main Running callback portconfigure::add_automatic_compiler_dependencies
1065:debug:main Preferred compilers: clang macports-clang-3.8 macports-clang-3.7
1066:debug:main Finished running callback portconfigure::add_automatic_compiler_dependencies
1067:debug:main Running callback portbuild::add_automatic_buildsystem_dependencies
1068:debug:main Finished running callback portbuild::add_automatic_buildsystem_dependencies
1069:info:main .:debug:main py27-setuptools has no conflicts
1070:info:main .:debug:main py27-beaker has no conflicts
1071:info:main .:debug:main py27-markupsafe has no conflicts
1072:info:main .:debug:main Xft2 has no conflicts
1073:info:main .:debug:main libLASi has no conflicts
1074:info:main .:debug:main xorg-libXaw has no conflicts
1075:debug:main Searching for dependency: xorg-libXmu
1076:debug:main Didn't find receipt, going to depspec regex for: xorg-libXmu
1077:debug:main Changing to port directory: /opt/local/var/macports/sources/rsync.macports.org/release/tarballs/ports/x11/xorg-libXmu
1078:debug:main OS darwin/16.3.0 (Mac OS X 10.12) arch i386
1079:debug:main adding the default universal variant
1080:debug:main Reading variant descriptions from /opt/local/var/macports/sources/rsync.macports.org/release/tarballs/ports/_resources/port1.0/variant_descriptions.conf
1081:debug:main Running callback portconfigure::add_automatic_compiler_dependencies
1082:debug:main Preferred compilers: clang macports-clang-3.8 macports-clang-3.7
1083:debug:main Finished running callback portconfigure::add_automatic_compiler_dependencies
1084:debug:main Running callback portbuild::add_automatic_buildsystem_dependencies
1085:debug:main Finished running callback portbuild::add_automatic_buildsystem_dependencies
1086:info:main .:debug:main xorg-libXmu has no conflicts
1087:info:main .:debug:main urw-fonts has no conflicts
1088:info:main .:debug:main libzzip has no conflicts
1089:info:main .:debug:main freeimage has no conflicts
1090:info:main .:debug:main freetype has no conflicts
1091:info:main .:debug:main ois has no conflicts
1092:msg:main
1093:msg:main --->  Dependencies to be installed: freeimage freetype graphviz fontconfig gd2 jpeg tiff webp giflib xorg-libX11 xorg-kbproto xorg-libXau xorg-xproto xorg-libXdmcp xorg-libxcb xorg-libpthread-stubs xorg-xcb-proto xorg-libsm xorg-libice xpm xorg-libXext xorg-xextproto xorg-libXt gts libnetpbm libLASi pango Xft2 xrender xorg-renderproto cairo libpixman xorg-xcb-util gobject-introspection py27-mako py27-beaker py27-setuptools py27-markupsafe harfbuzz graphite2 urw-fonts xorg-libXaw xorg-libXmu libzzip ois
1094:debug:main Starting logging for freeimage
1095:debug:clean Starting logging for freetype
1096:debug:clean Starting logging for fontconfig
1097:debug:clean Starting logging for jpeg
1098:debug:clean Starting logging for tiff
1099:debug:clean Starting logging for xorg-kbproto
1100:debug:clean Starting logging for xorg-xproto
1101:debug:clean Starting logging for xorg-libXau
1102:debug:clean Starting logging for xorg-libXdmcp
1103:debug:clean Starting logging for xorg-libpthread-stubs
1104:debug:clean Starting logging for xorg-xcb-proto
1105:debug:clean Starting logging for xorg-libxcb
1106:debug:clean Starting logging for xorg-libX11
1107:debug:clean Starting logging for xorg-libice
1108:debug:clean Starting logging for xorg-libsm
1109:debug:clean Starting logging for giflib
1110:debug:clean Starting logging for webp
1111:debug:clean Starting logging for xorg-xextproto
1112:debug:clean Starting logging for xorg-libXext
1113:debug:clean Starting logging for xorg-libXt
1114:debug:clean Starting logging for xpm
1115:debug:clean Starting logging for gd2
1116:debug:clean Starting logging for libnetpbm
1117:debug:clean Starting logging for gts
1118:debug:clean Starting logging for xorg-renderproto
1119:debug:clean Starting logging for xrender
1120:debug:clean Starting logging for Xft2
1121:debug:clean Starting logging for libpixman
1122:debug:clean Starting logging for xorg-xcb-util
1123:debug:clean Starting logging for cairo
1124:debug:clean Starting logging for py27-setuptools
1125:debug:clean Starting logging for py27-beaker
1126:debug:clean Starting logging for py27-markupsafe
1127:debug:clean Starting logging for py27-mako
1128:debug:clean Starting logging for gobject-introspection
1129:debug:clean Starting logging for graphite2
1130:debug:clean Starting logging for harfbuzz
1131:debug:clean Starting logging for pango
1132:debug:clean Starting logging for libLASi
1133:debug:clean Starting logging for urw-fonts
1134:debug:clean Starting logging for xorg-libXmu
1135:debug:clean Starting logging for xorg-libXaw
1136:debug:clean Starting logging for graphviz
1137:debug:clean Starting logging for libzzip
1138:debug:clean Starting logging for ois
1139:debug:main Executing org.macports.main (ogre)
1140:debug:main changing euid/egid - current euid: 0 - current egid: 0
1141:debug:main egid changed to: 501
1142:debug:main euid changed to: 502
1143:debug:archivefetch archivefetch phase started at Tue Jan 17 09:12:44 EST 2017
1144:msg:archivefetch --->  Fetching archive for ogre
1145:debug:archivefetch Executing org.macports.archivefetch (ogre)
1146:debug:archivefetch euid/egid changed to: 0/0
1147:debug:archivefetch chowned /opt/local/var/macports/incoming to macports
1148:debug:archivefetch euid/egid changed to: 502/501
1149:info:archivefetch --->  ogre-1.7.3_4.darwin_16.x86_64.tbz2 doesn't seem to exist in /opt/local/var/macports/incoming/verified
1150:msg:archivefetch --->  Attempting to fetch ogre-1.7.3_4.darwin_16.x86_64.tbz2 from https://packages.macports.org/ogre
1151:debug:archivefetch Fetching archive failed:: The requested URL returned error: 404 Not Found
1152:msg:archivefetch --->  Attempting to fetch ogre-1.7.3_4.darwin_16.x86_64.tbz2 from http://mse.uk.packages.macports.org/sites/packages.macports.org/ogre
1153:debug:archivefetch Fetching archive failed:: The requested URL returned error: 404 Not Found
1154:msg:archivefetch --->  Attempting to fetch ogre-1.7.3_4.darwin_16.x86_64.tbz2 from http://lil.fr.packages.macports.org/ogre
1155:debug:archivefetch Fetching archive failed:: The requested URL returned error: 404 Not Found
1156:debug:archivefetch Privilege de-escalation not attempted as not running as root.
1157:debug:fetch fetch phase started at Tue Jan 17 09:12:45 EST 2017
1158:notice:fetch --->  Fetching distfiles for ogre
1159:debug:fetch Can't run fetch on this port without elevated privileges. Escalating privileges back to root.
1160:debug:fetch euid changed to: 0. egid changed to: 0.
1161:debug:fetch changing euid/egid - current euid: 0 - current egid: 0
1162:debug:fetch egid changed to: 501
1163:debug:fetch euid changed to: 502
1164:debug:fetch Executing org.macports.fetch (ogre)
1165:info:fetch --->  ogre_src_v1-7-3.tar.bz2 does not exist in /opt/local/var/macports/distfiles/ogre
1166:notice:fetch --->  Attempting to fetch ogre_src_v1-7-3.tar.bz2 from https://distfiles.macports.org/ogre
1167:debug:fetch Privilege de-escalation not attempted as not running as root.
1168:debug:checksum checksum phase started at Tue Jan 17 09:13:23 EST 2017
1169:notice:checksum --->  Verifying checksums for ogre
1170:debug:checksum Executing org.macports.checksum (ogre)
1171:info:checksum --->  Checksumming ogre_src_v1-7-3.tar.bz2
1172:debug:checksum Calculated (rmd160) is fea467f35aaf0fd5926573de4f0348ed44191893
1173:debug:checksum Correct (rmd160) checksum for ogre_src_v1-7-3.tar.bz2
1174:debug:checksum Calculated (sha1) is 41acccfbbf7297c91cda78a0ce8a053e56505f04
1175:debug:checksum Correct (sha1) checksum for ogre_src_v1-7-3.tar.bz2
1176:debug:checksum Privilege de-escalation not attempted as not running as root.
1177:debug:extract extract phase started at Tue Jan 17 09:13:23 EST 2017
1178:notice:extract --->  Extracting ogre
1179:debug:extract setting option extract.cmd to /usr/bin/bzip2
1180:debug:extract Executing org.macports.extract (ogre)
1181:info:extract --->  Extracting ogre_src_v1-7-3.tar.bz2
1182:debug:extract setting option extract.args to '/opt/local/var/macports/distfiles/ogre/ogre_src_v1-7-3.tar.bz2'
1183:debug:extract Environment:
1184CC_PRINT_OPTIONS='YES'
1185CC_PRINT_OPTIONS_FILE='/opt/local/var/macports/build/_opt_local_var_macports_sources_rsync.macports.org_release_tarballs_ports_graphics_ogre/ogre/work/.CC_PRINT_OPTIONS'
1186CPATH='/opt/local/include'
1187LIBRARY_PATH='/opt/local/lib'
1188MACOSX_DEPLOYMENT_TARGET='10.12'
1189:debug:extract Assembled command: 'cd "/opt/local/var/macports/build/_opt_local_var_macports_sources_rsync.macports.org_release_tarballs_ports_graphics_ogre/ogre/work" && /usr/bin/bzip2 -dc '/opt/local/var/macports/distfiles/ogre/ogre_src_v1-7-3.tar.bz2' | /usr/bin/tar -xf -'
1190:debug:extract Executing command line:  cd "/opt/local/var/macports/build/_opt_local_var_macports_sources_rsync.macports.org_release_tarballs_ports_graphics_ogre/ogre/work" && /usr/bin/bzip2 -dc '/opt/local/var/macports/distfiles/ogre/ogre_src_v1-7-3.tar.bz2' | /usr/bin/tar -xf -
1191:debug:extract euid/egid changed to: 0/0
1192:debug:extract chowned /opt/local/var/macports/build/_opt_local_var_macports_sources_rsync.macports.org_release_tarballs_ports_graphics_ogre/ogre/work to macports
1193:debug:extract euid/egid changed to: 502/501
1194:debug:extract Privilege de-escalation not attempted as not running as root.
1195:debug:patch patch phase started at Tue Jan 17 09:13:33 EST 2017
1196:debug:patch Executing org.macports.patch (ogre)
1197:notice:patch --->  Applying patches to ogre
1198:info:patch --->  Applying patch-Tools_XMLConverter_CMakeLists.txt.diff
1199:debug:patch Environment:
1200CC_PRINT_OPTIONS='YES'
1201CC_PRINT_OPTIONS_FILE='/opt/local/var/macports/build/_opt_local_var_macports_sources_rsync.macports.org_release_tarballs_ports_graphics_ogre/ogre/work/.CC_PRINT_OPTIONS'
1202CPATH='/opt/local/include'
1203LIBRARY_PATH='/opt/local/lib'
1204MACOSX_DEPLOYMENT_TARGET='10.12'
1205:debug:patch Assembled command: 'cd "/opt/local/var/macports/build/_opt_local_var_macports_sources_rsync.macports.org_release_tarballs_ports_graphics_ogre/ogre/work/ogre_src_v1-7-3" && /usr/bin/patch -p0'
1206:debug:patch Executing command line:  cd "/opt/local/var/macports/build/_opt_local_var_macports_sources_rsync.macports.org_release_tarballs_ports_graphics_ogre/ogre/work/ogre_src_v1-7-3" && /usr/bin/patch -p0 < '/opt/local/var/macports/sources/rsync.macports.org/release/tarballs/ports/graphics/ogre/files/patch-Tools_XMLConverter_CMakeLists.txt.diff'
1207:info:patch patching file Tools/XMLConverter/CMakeLists.txt
1208:info:patch --->  Applying patch-CMakeLists.txt.diff
1209:debug:patch Environment:
1210CC_PRINT_OPTIONS='YES'
1211CC_PRINT_OPTIONS_FILE='/opt/local/var/macports/build/_opt_local_var_macports_sources_rsync.macports.org_release_tarballs_ports_graphics_ogre/ogre/work/.CC_PRINT_OPTIONS'
1212CPATH='/opt/local/include'
1213LIBRARY_PATH='/opt/local/lib'
1214MACOSX_DEPLOYMENT_TARGET='10.12'
1215:debug:patch Assembled command: 'cd "/opt/local/var/macports/build/_opt_local_var_macports_sources_rsync.macports.org_release_tarballs_ports_graphics_ogre/ogre/work/ogre_src_v1-7-3" && /usr/bin/patch -p0'
1216:debug:patch Executing command line:  cd "/opt/local/var/macports/build/_opt_local_var_macports_sources_rsync.macports.org_release_tarballs_ports_graphics_ogre/ogre/work/ogre_src_v1-7-3" && /usr/bin/patch -p0 < '/opt/local/var/macports/sources/rsync.macports.org/release/tarballs/ports/graphics/ogre/files/patch-CMakeLists.txt.diff'
1217:info:patch patching file CMakeLists.txt
1218:info:patch --->  Applying patch-CMake_CMakeLists.txt.diff
1219:debug:patch Environment:
1220CC_PRINT_OPTIONS='YES'
1221CC_PRINT_OPTIONS_FILE='/opt/local/var/macports/build/_opt_local_var_macports_sources_rsync.macports.org_release_tarballs_ports_graphics_ogre/ogre/work/.CC_PRINT_OPTIONS'
1222CPATH='/opt/local/include'
1223LIBRARY_PATH='/opt/local/lib'
1224MACOSX_DEPLOYMENT_TARGET='10.12'
1225:debug:patch Assembled command: 'cd "/opt/local/var/macports/build/_opt_local_var_macports_sources_rsync.macports.org_release_tarballs_ports_graphics_ogre/ogre/work/ogre_src_v1-7-3" && /usr/bin/patch -p0'
1226:debug:patch Executing command line:  cd "/opt/local/var/macports/build/_opt_local_var_macports_sources_rsync.macports.org_release_tarballs_ports_graphics_ogre/ogre/work/ogre_src_v1-7-3" && /usr/bin/patch -p0 < '/opt/local/var/macports/sources/rsync.macports.org/release/tarballs/ports/graphics/ogre/files/patch-CMake_CMakeLists.txt.diff'
1227:info:patch patching file CMake/CMakeLists.txt
1228:info:patch --->  Applying patch-CMake_InstallResources.cmake
1229:debug:patch Environment:
1230CC_PRINT_OPTIONS='YES'
1231CC_PRINT_OPTIONS_FILE='/opt/local/var/macports/build/_opt_local_var_macports_sources_rsync.macports.org_release_tarballs_ports_graphics_ogre/ogre/work/.CC_PRINT_OPTIONS'
1232CPATH='/opt/local/include'
1233LIBRARY_PATH='/opt/local/lib'
1234MACOSX_DEPLOYMENT_TARGET='10.12'
1235:debug:patch Assembled command: 'cd "/opt/local/var/macports/build/_opt_local_var_macports_sources_rsync.macports.org_release_tarballs_ports_graphics_ogre/ogre/work/ogre_src_v1-7-3" && /usr/bin/patch -p0'
1236:debug:patch Executing command line:  cd "/opt/local/var/macports/build/_opt_local_var_macports_sources_rsync.macports.org_release_tarballs_ports_graphics_ogre/ogre/work/ogre_src_v1-7-3" && /usr/bin/patch -p0 < '/opt/local/var/macports/sources/rsync.macports.org/release/tarballs/ports/graphics/ogre/files/patch-CMake_InstallResources.cmake'
1237:info:patch patching file CMake/InstallResources.cmake
1238:info:patch --->  Applying patch-CMake_Packages_FindOGRE.cmake.diff
1239:debug:patch Environment:
1240CC_PRINT_OPTIONS='YES'
1241CC_PRINT_OPTIONS_FILE='/opt/local/var/macports/build/_opt_local_var_macports_sources_rsync.macports.org_release_tarballs_ports_graphics_ogre/ogre/work/.CC_PRINT_OPTIONS'
1242CPATH='/opt/local/include'
1243LIBRARY_PATH='/opt/local/lib'
1244MACOSX_DEPLOYMENT_TARGET='10.12'
1245:debug:patch Assembled command: 'cd "/opt/local/var/macports/build/_opt_local_var_macports_sources_rsync.macports.org_release_tarballs_ports_graphics_ogre/ogre/work/ogre_src_v1-7-3" && /usr/bin/patch -p0'
1246:debug:patch Executing command line:  cd "/opt/local/var/macports/build/_opt_local_var_macports_sources_rsync.macports.org_release_tarballs_ports_graphics_ogre/ogre/work/ogre_src_v1-7-3" && /usr/bin/patch -p0 < '/opt/local/var/macports/sources/rsync.macports.org/release/tarballs/ports/graphics/ogre/files/patch-CMake_Packages_FindOGRE.cmake.diff'
1247:info:patch patching file CMake/Packages/FindOGRE.cmake
1248:info:patch --->  Applying patch-CMake_Packages_FindOIS.cmake.diff
1249:debug:patch Environment:
1250CC_PRINT_OPTIONS='YES'
1251CC_PRINT_OPTIONS_FILE='/opt/local/var/macports/build/_opt_local_var_macports_sources_rsync.macports.org_release_tarballs_ports_graphics_ogre/ogre/work/.CC_PRINT_OPTIONS'
1252CPATH='/opt/local/include'
1253LIBRARY_PATH='/opt/local/lib'
1254MACOSX_DEPLOYMENT_TARGET='10.12'
1255:debug:patch Assembled command: 'cd "/opt/local/var/macports/build/_opt_local_var_macports_sources_rsync.macports.org_release_tarballs_ports_graphics_ogre/ogre/work/ogre_src_v1-7-3" && /usr/bin/patch -p0'
1256:debug:patch Executing command line:  cd "/opt/local/var/macports/build/_opt_local_var_macports_sources_rsync.macports.org_release_tarballs_ports_graphics_ogre/ogre/work/ogre_src_v1-7-3" && /usr/bin/patch -p0 < '/opt/local/var/macports/sources/rsync.macports.org/release/tarballs/ports/graphics/ogre/files/patch-CMake_Packages_FindOIS.cmake.diff'
1257:info:patch patching file CMake/Packages/FindOIS.cmake
1258:info:patch --->  Applying patch-CMake_Templates_SDK_CMakeLists.txt.in.diff
1259:debug:patch Environment:
1260CC_PRINT_OPTIONS='YES'
1261CC_PRINT_OPTIONS_FILE='/opt/local/var/macports/build/_opt_local_var_macports_sources_rsync.macports.org_release_tarballs_ports_graphics_ogre/ogre/work/.CC_PRINT_OPTIONS'
1262CPATH='/opt/local/include'
1263LIBRARY_PATH='/opt/local/lib'
1264MACOSX_DEPLOYMENT_TARGET='10.12'
1265:debug:patch Assembled command: 'cd "/opt/local/var/macports/build/_opt_local_var_macports_sources_rsync.macports.org_release_tarballs_ports_graphics_ogre/ogre/work/ogre_src_v1-7-3" && /usr/bin/patch -p0'
1266:debug:patch Executing command line:  cd "/opt/local/var/macports/build/_opt_local_var_macports_sources_rsync.macports.org_release_tarballs_ports_graphics_ogre/ogre/work/ogre_src_v1-7-3" && /usr/bin/patch -p0 < '/opt/local/var/macports/sources/rsync.macports.org/release/tarballs/ports/graphics/ogre/files/patch-CMake_Templates_SDK_CMakeLists.txt.in.diff'
1267:info:patch patching file CMake/Templates/SDK_CMakeLists.txt.in
1268:info:patch --->  Applying patch-CMake_Utils_FindPkgMacros.cmake.diff
1269:debug:patch Environment:
1270CC_PRINT_OPTIONS='YES'
1271CC_PRINT_OPTIONS_FILE='/opt/local/var/macports/build/_opt_local_var_macports_sources_rsync.macports.org_release_tarballs_ports_graphics_ogre/ogre/work/.CC_PRINT_OPTIONS'
1272CPATH='/opt/local/include'
1273LIBRARY_PATH='/opt/local/lib'
1274MACOSX_DEPLOYMENT_TARGET='10.12'
1275:debug:patch Assembled command: 'cd "/opt/local/var/macports/build/_opt_local_var_macports_sources_rsync.macports.org_release_tarballs_ports_graphics_ogre/ogre/work/ogre_src_v1-7-3" && /usr/bin/patch -p0'
1276:debug:patch Executing command line:  cd "/opt/local/var/macports/build/_opt_local_var_macports_sources_rsync.macports.org_release_tarballs_ports_graphics_ogre/ogre/work/ogre_src_v1-7-3" && /usr/bin/patch -p0 < '/opt/local/var/macports/sources/rsync.macports.org/release/tarballs/ports/graphics/ogre/files/patch-CMake_Utils_FindPkgMacros.cmake.diff'
1277:info:patch patching file CMake/Utils/FindPkgMacros.cmake
1278:info:patch --->  Applying patch-Docs_CMakeLists.txt.diff
1279:debug:patch Environment:
1280CC_PRINT_OPTIONS='YES'
1281CC_PRINT_OPTIONS_FILE='/opt/local/var/macports/build/_opt_local_var_macports_sources_rsync.macports.org_release_tarballs_ports_graphics_ogre/ogre/work/.CC_PRINT_OPTIONS'
1282CPATH='/opt/local/include'
1283LIBRARY_PATH='/opt/local/lib'
1284MACOSX_DEPLOYMENT_TARGET='10.12'
1285:debug:patch Assembled command: 'cd "/opt/local/var/macports/build/_opt_local_var_macports_sources_rsync.macports.org_release_tarballs_ports_graphics_ogre/ogre/work/ogre_src_v1-7-3" && /usr/bin/patch -p0'
1286:debug:patch Executing command line:  cd "/opt/local/var/macports/build/_opt_local_var_macports_sources_rsync.macports.org_release_tarballs_ports_graphics_ogre/ogre/work/ogre_src_v1-7-3" && /usr/bin/patch -p0 < '/opt/local/var/macports/sources/rsync.macports.org/release/tarballs/ports/graphics/ogre/files/patch-Docs_CMakeLists.txt.diff'
1287:info:patch patching file Docs/CMakeLists.txt
1288:info:patch --->  Applying patch-OgreMain_CMakeLists.txt.diff
1289:debug:patch Environment:
1290CC_PRINT_OPTIONS='YES'
1291CC_PRINT_OPTIONS_FILE='/opt/local/var/macports/build/_opt_local_var_macports_sources_rsync.macports.org_release_tarballs_ports_graphics_ogre/ogre/work/.CC_PRINT_OPTIONS'
1292CPATH='/opt/local/include'
1293LIBRARY_PATH='/opt/local/lib'
1294MACOSX_DEPLOYMENT_TARGET='10.12'
1295:debug:patch Assembled command: 'cd "/opt/local/var/macports/build/_opt_local_var_macports_sources_rsync.macports.org_release_tarballs_ports_graphics_ogre/ogre/work/ogre_src_v1-7-3" && /usr/bin/patch -p0'
1296:debug:patch Executing command line:  cd "/opt/local/var/macports/build/_opt_local_var_macports_sources_rsync.macports.org_release_tarballs_ports_graphics_ogre/ogre/work/ogre_src_v1-7-3" && /usr/bin/patch -p0 < '/opt/local/var/macports/sources/rsync.macports.org/release/tarballs/ports/graphics/ogre/files/patch-OgreMain_CMakeLists.txt.diff'
1297:info:patch patching file OgreMain/CMakeLists.txt
1298:info:patch --->  Applying patch-README_and_Tutorials_files.diff
1299:debug:patch Environment:
1300CC_PRINT_OPTIONS='YES'
1301CC_PRINT_OPTIONS_FILE='/opt/local/var/macports/build/_opt_local_var_macports_sources_rsync.macports.org_release_tarballs_ports_graphics_ogre/ogre/work/.CC_PRINT_OPTIONS'
1302CPATH='/opt/local/include'
1303LIBRARY_PATH='/opt/local/lib'
1304MACOSX_DEPLOYMENT_TARGET='10.12'
1305:debug:patch Assembled command: 'cd "/opt/local/var/macports/build/_opt_local_var_macports_sources_rsync.macports.org_release_tarballs_ports_graphics_ogre/ogre/work/ogre_src_v1-7-3" && /usr/bin/patch -p0'
1306:debug:patch Executing command line:  cd "/opt/local/var/macports/build/_opt_local_var_macports_sources_rsync.macports.org_release_tarballs_ports_graphics_ogre/ogre/work/ogre_src_v1-7-3" && /usr/bin/patch -p0 < '/opt/local/var/macports/sources/rsync.macports.org/release/tarballs/ports/graphics/ogre/files/patch-README_and_Tutorials_files.diff'
1307:info:patch patching file READ_ME_FIRST_OGRE_MACPORTS.txt
1308:info:patch patching file Tutorials/BaseApplication.cpp
1309:info:patch patching file Tutorials/BaseApplication.h
1310:info:patch patching file Tutorials/CMakeLists.txt
1311:info:patch patching file Tutorials/README.txt
1312:info:patch patching file Tutorials/TutorialApplication.cpp
1313:info:patch patching file Tutorials/TutorialApplication.h
1314:info:patch patching file Tutorials/mac_app_loop.h
1315:info:patch patching file Tutorials/mac_app_loop.mm
1316:info:patch --->  Applying patch-Samples_CMakeLists.txt.diff
1317:debug:patch Environment:
1318CC_PRINT_OPTIONS='YES'
1319CC_PRINT_OPTIONS_FILE='/opt/local/var/macports/build/_opt_local_var_macports_sources_rsync.macports.org_release_tarballs_ports_graphics_ogre/ogre/work/.CC_PRINT_OPTIONS'
1320CPATH='/opt/local/include'
1321LIBRARY_PATH='/opt/local/lib'
1322MACOSX_DEPLOYMENT_TARGET='10.12'
1323:debug:patch Assembled command: 'cd "/opt/local/var/macports/build/_opt_local_var_macports_sources_rsync.macports.org_release_tarballs_ports_graphics_ogre/ogre/work/ogre_src_v1-7-3" && /usr/bin/patch -p0'
1324:debug:patch Executing command line:  cd "/opt/local/var/macports/build/_opt_local_var_macports_sources_rsync.macports.org_release_tarballs_ports_graphics_ogre/ogre/work/ogre_src_v1-7-3" && /usr/bin/patch -p0 < '/opt/local/var/macports/sources/rsync.macports.org/release/tarballs/ports/graphics/ogre/files/patch-Samples_CMakeLists.txt.diff'
1325:info:patch patching file Samples/CMakeLists.txt
1326:info:patch --->  Applying patch-Samples_Browser_CMakeLists.txt.diff
1327:debug:patch Environment:
1328CC_PRINT_OPTIONS='YES'
1329CC_PRINT_OPTIONS_FILE='/opt/local/var/macports/build/_opt_local_var_macports_sources_rsync.macports.org_release_tarballs_ports_graphics_ogre/ogre/work/.CC_PRINT_OPTIONS'
1330CPATH='/opt/local/include'
1331LIBRARY_PATH='/opt/local/lib'
1332MACOSX_DEPLOYMENT_TARGET='10.12'
1333:debug:patch Assembled command: 'cd "/opt/local/var/macports/build/_opt_local_var_macports_sources_rsync.macports.org_release_tarballs_ports_graphics_ogre/ogre/work/ogre_src_v1-7-3" && /usr/bin/patch -p0'
1334:debug:patch Executing command line:  cd "/opt/local/var/macports/build/_opt_local_var_macports_sources_rsync.macports.org_release_tarballs_ports_graphics_ogre/ogre/work/ogre_src_v1-7-3" && /usr/bin/patch -p0 < '/opt/local/var/macports/sources/rsync.macports.org/release/tarballs/ports/graphics/ogre/files/patch-Samples_Browser_CMakeLists.txt.diff'
1335:info:patch patching file Samples/Browser/CMakeLists.txt
1336:info:patch --->  Applying patch-Samples_Browser_include_SampleBrowser_OSX.h.diff
1337:debug:patch Environment:
1338CC_PRINT_OPTIONS='YES'
1339CC_PRINT_OPTIONS_FILE='/opt/local/var/macports/build/_opt_local_var_macports_sources_rsync.macports.org_release_tarballs_ports_graphics_ogre/ogre/work/.CC_PRINT_OPTIONS'
1340CPATH='/opt/local/include'
1341LIBRARY_PATH='/opt/local/lib'
1342MACOSX_DEPLOYMENT_TARGET='10.12'
1343:debug:patch Assembled command: 'cd "/opt/local/var/macports/build/_opt_local_var_macports_sources_rsync.macports.org_release_tarballs_ports_graphics_ogre/ogre/work/ogre_src_v1-7-3" && /usr/bin/patch -p0'
1344:debug:patch Executing command line:  cd "/opt/local/var/macports/build/_opt_local_var_macports_sources_rsync.macports.org_release_tarballs_ports_graphics_ogre/ogre/work/ogre_src_v1-7-3" && /usr/bin/patch -p0 < '/opt/local/var/macports/sources/rsync.macports.org/release/tarballs/ports/graphics/ogre/files/patch-Samples_Browser_include_SampleBrowser_OSX.h.diff'
1345:info:patch patching file Samples/Browser/include/SampleBrowser_OSX.h
1346:info:patch --->  Applying patch-Samples_Media_CMakeLists.txt.diff
1347:debug:patch Environment:
1348CC_PRINT_OPTIONS='YES'
1349CC_PRINT_OPTIONS_FILE='/opt/local/var/macports/build/_opt_local_var_macports_sources_rsync.macports.org_release_tarballs_ports_graphics_ogre/ogre/work/.CC_PRINT_OPTIONS'
1350CPATH='/opt/local/include'
1351LIBRARY_PATH='/opt/local/lib'
1352MACOSX_DEPLOYMENT_TARGET='10.12'
1353:debug:patch Assembled command: 'cd "/opt/local/var/macports/build/_opt_local_var_macports_sources_rsync.macports.org_release_tarballs_ports_graphics_ogre/ogre/work/ogre_src_v1-7-3" && /usr/bin/patch -p0'
1354:debug:patch Executing command line:  cd "/opt/local/var/macports/build/_opt_local_var_macports_sources_rsync.macports.org_release_tarballs_ports_graphics_ogre/ogre/work/ogre_src_v1-7-3" && /usr/bin/patch -p0 < '/opt/local/var/macports/sources/rsync.macports.org/release/tarballs/ports/graphics/ogre/files/patch-Samples_Media_CMakeLists.txt.diff'
1355:info:patch patching file Samples/Media/CMakeLists.txt
1356:info:patch --->  Applying patch-Tools_CMakeLists.txt.diff
1357:debug:patch Environment:
1358CC_PRINT_OPTIONS='YES'
1359CC_PRINT_OPTIONS_FILE='/opt/local/var/macports/build/_opt_local_var_macports_sources_rsync.macports.org_release_tarballs_ports_graphics_ogre/ogre/work/.CC_PRINT_OPTIONS'
1360CPATH='/opt/local/include'
1361LIBRARY_PATH='/opt/local/lib'
1362MACOSX_DEPLOYMENT_TARGET='10.12'
1363:debug:patch Assembled command: 'cd "/opt/local/var/macports/build/_opt_local_var_macports_sources_rsync.macports.org_release_tarballs_ports_graphics_ogre/ogre/work/ogre_src_v1-7-3" && /usr/bin/patch -p0'
1364:debug:patch Executing command line:  cd "/opt/local/var/macports/build/_opt_local_var_macports_sources_rsync.macports.org_release_tarballs_ports_graphics_ogre/ogre/work/ogre_src_v1-7-3" && /usr/bin/patch -p0 < '/opt/local/var/macports/sources/rsync.macports.org/release/tarballs/ports/graphics/ogre/files/patch-Tools_CMakeLists.txt.diff'
1365:info:patch patching file Tools/CMakeLists.txt
1366:debug:patch Executing proc-post-org.macports.patch-patch-0
1367:info:patch --->  Patching CMakeLists.txt: s|@PREFIX@|/opt/local|g
1368:debug:patch Executing reinplace: /usr/bin/sed s|@PREFIX@|/opt/local|g < /opt/local/var/macports/build/_opt_local_var_macports_sources_rsync.macports.org_release_tarballs_ports_graphics_ogre/ogre/work/ogre_src_v1-7-3/CMakeLists.txt >@ file54 2>@stderr
1369:debug:patch euid/egid changed to: 0/0
1370:debug:patch chowned /opt/local/var/macports/build/_opt_local_var_macports_sources_rsync.macports.org_release_tarballs_ports_graphics_ogre/ogre/work/ogre_src_v1-7-3/CMakeLists.txt to macports
1371:debug:patch euid/egid changed to: 502/501
1372:debug:patch euid/egid changed to: 0/0
1373:debug:patch setting attributes on /opt/local/var/macports/build/_opt_local_var_macports_sources_rsync.macports.org_release_tarballs_ports_graphics_ogre/ogre/work/ogre_src_v1-7-3/CMakeLists.txt
1374:debug:patch euid/egid changed to: 502/501
1375:info:patch --->  Patching CMakeLists.txt: s|@PREFIX@|/opt/local|g
1376:debug:patch Executing reinplace: /usr/bin/sed s|@PREFIX@|/opt/local|g < /opt/local/var/macports/build/_opt_local_var_macports_sources_rsync.macports.org_release_tarballs_ports_graphics_ogre/ogre/work/ogre_src_v1-7-3/Tutorials/CMakeLists.txt >@ file54 2>@stderr
1377:debug:patch euid/egid changed to: 0/0
1378:debug:patch chowned /opt/local/var/macports/build/_opt_local_var_macports_sources_rsync.macports.org_release_tarballs_ports_graphics_ogre/ogre/work/ogre_src_v1-7-3/Tutorials/CMakeLists.txt to macports
1379:debug:patch euid/egid changed to: 502/501
1380:debug:patch euid/egid changed to: 0/0
1381:debug:patch setting attributes on /opt/local/var/macports/build/_opt_local_var_macports_sources_rsync.macports.org_release_tarballs_ports_graphics_ogre/ogre/work/ogre_src_v1-7-3/Tutorials/CMakeLists.txt
1382:debug:patch euid/egid changed to: 502/501
1383:info:patch --->  Patching CMakeLists.txt: s|@FRAMEWORKS_DIR@|/opt/local/Library/Frameworks|g
1384:debug:patch Executing reinplace: /usr/bin/sed s|@FRAMEWORKS_DIR@|/opt/local/Library/Frameworks|g < /opt/local/var/macports/build/_opt_local_var_macports_sources_rsync.macports.org_release_tarballs_ports_graphics_ogre/ogre/work/ogre_src_v1-7-3/Tutorials/CMakeLists.txt >@ file54 2>@stderr
1385:debug:patch euid/egid changed to: 0/0
1386:debug:patch chowned /opt/local/var/macports/build/_opt_local_var_macports_sources_rsync.macports.org_release_tarballs_ports_graphics_ogre/ogre/work/ogre_src_v1-7-3/Tutorials/CMakeLists.txt to macports
1387:debug:patch euid/egid changed to: 502/501
1388:debug:patch euid/egid changed to: 0/0
1389:debug:patch setting attributes on /opt/local/var/macports/build/_opt_local_var_macports_sources_rsync.macports.org_release_tarballs_ports_graphics_ogre/ogre/work/ogre_src_v1-7-3/Tutorials/CMakeLists.txt
1390:debug:patch euid/egid changed to: 502/501
1391:debug:patch Privilege de-escalation not attempted as not running as root.
1392:debug:configure configure phase started at Tue Jan 17 09:13:33 EST 2017
1393:notice:configure --->  Configuring ogre
1394:debug:configure Preferred compilers: clang macports-clang-3.8 macports-clang-3.7
1395:debug:configure Using compiler 'Xcode Clang'
1396:debug:configure Executing proc-pre-org.macports.configure-configure-0
1397:debug:configure Executing proc-pre-org.macports.configure-configure-1
1398:debug:configure Executing proc-pre-org.macports.configure-configure-2
1399:debug:configure Preferred compilers: clang macports-clang-3.8 macports-clang-3.7
1400:debug:configure Preferred compilers: clang macports-clang-3.8 macports-clang-3.7
1401:debug:configure Preferred compilers: clang macports-clang-3.8 macports-clang-3.7
1402:debug:configure Preferred compilers: clang macports-clang-3.8 macports-clang-3.7
1403:debug:configure Preferred compilers: clang macports-clang-3.8 macports-clang-3.7
1404:debug:configure Executing org.macports.configure (ogre)
1405:debug:configure Preferred compilers: clang macports-clang-3.8 macports-clang-3.7
1406:debug:configure Preferred compilers: clang macports-clang-3.8 macports-clang-3.7
1407:debug:configure Preferred compilers: clang macports-clang-3.8 macports-clang-3.7
1408:debug:configure Preferred compilers: clang macports-clang-3.8 macports-clang-3.7
1409:debug:configure Preferred compilers: clang macports-clang-3.8 macports-clang-3.7
1410:debug:configure Preferred compilers: clang macports-clang-3.8 macports-clang-3.7
1411:debug:configure Preferred compilers: clang macports-clang-3.8 macports-clang-3.7
1412:debug:configure Preferred compilers: clang macports-clang-3.8 macports-clang-3.7
1413:debug:configure Preferred compilers: clang macports-clang-3.8 macports-clang-3.7
1414:debug:configure Preferred compilers: clang macports-clang-3.8 macports-clang-3.7
1415:debug:configure Preferred compilers: clang macports-clang-3.8 macports-clang-3.7
1416:debug:configure Preferred compilers: clang macports-clang-3.8 macports-clang-3.7
1417:debug:configure Environment:
1418CC='/usr/bin/clang'
1419CC_PRINT_OPTIONS='YES'
1420CC_PRINT_OPTIONS_FILE='/opt/local/var/macports/build/_opt_local_var_macports_sources_rsync.macports.org_release_tarballs_ports_graphics_ogre/ogre/work/.CC_PRINT_OPTIONS'
1421CFLAGS='-pipe -Os'
1422CPATH='/opt/local/include'
1423CPPFLAGS='-I/opt/local/include'
1424CXX='/usr/bin/clang++'
1425CXXFLAGS='-pipe -Os -stdlib=libc++'
1426F77FLAGS='-m64'
1427F90FLAGS='-pipe -Os -m64'
1428FCFLAGS='-pipe -Os -m64'
1429FFLAGS='-pipe -Os'
1430INSTALL='/usr/bin/install -c'
1431LDFLAGS='-L/opt/local/lib -Wl,-headerpad_max_install_names'
1432LIBRARY_PATH='/opt/local/lib'
1433MACOSX_DEPLOYMENT_TARGET='10.12'
1434OBJC='/usr/bin/clang'
1435OBJCFLAGS='-pipe -Os'
1436OBJCXX='/usr/bin/clang++'
1437OBJCXXFLAGS='-pipe -Os -stdlib=libc++'
1438:debug:configure Assembled command: 'cd "/opt/local/var/macports/build/_opt_local_var_macports_sources_rsync.macports.org_release_tarballs_ports_graphics_ogre/ogre/work/ogre_src_v1-7-3" && /opt/local/bin/cmake -DCMAKE_INSTALL_PREFIX='/opt/local' -DCMAKE_BUILD_TYPE=Release -DCMAKE_BUILD_WITH_INSTALL_RPATH=ON -DCMAKE_C_COMPILER="$CC" -DCMAKE_COLOR_MAKEFILE=ON -DCMAKE_CXX_COMPILER="$CXX" -DCMAKE_FIND_FRAMEWORK=LAST -DCMAKE_INSTALL_NAME_DIR=/opt/local/lib -DCMAKE_INSTALL_RPATH=/opt/local/lib -DCMAKE_MODULE_PATH=/opt/local/share/cmake/Modules -DCMAKE_SYSTEM_PREFIX_PATH="/opt/local;/usr" -DCMAKE_VERBOSE_MAKEFILE=ON -Wno-dev -DMACPORTS=TRUE -DOGRE_BUILD_TOOLS=TRUE -DOGRE_COPY_DEPENDENICES=FALSE -DOGRE_INSTALL_DEPENDENCIES=FALSE -DOGRE_BUILD_SAMPLES=TRUE -DOGRE_INSTALL_DOCS=TRUE -DOGRE_INSTALL_SAMPLES=TRUE -DOGRE_INSTALL_SAMPLES_SOURCE=TRUE -DOGRE_INSTALL_TOOLS=TRUE -DOGRE_STATIC=TRUE -DCMAKE_C_FLAGS_RELEASE="-DNDEBUG" -DCMAKE_CXX_FLAGS_RELEASE="-DNDEBUG" -DCMAKE_OSX_ARCHITECTURES="x86_64" -DCMAKE_OSX_DEPLOYMENT_TARGET="10.12" -DCMAKE_OSX_SYSROOT="/" /opt/local/var/macports/build/_opt_local_var_macports_sources_rsync.macports.org_release_tarballs_ports_graphics_ogre/ogre/work/ogre_src_v1-7-3'
1439:debug:configure Executing command line:  cd "/opt/local/var/macports/build/_opt_local_var_macports_sources_rsync.macports.org_release_tarballs_ports_graphics_ogre/ogre/work/ogre_src_v1-7-3" && /opt/local/bin/cmake -DCMAKE_INSTALL_PREFIX='/opt/local' -DCMAKE_BUILD_TYPE=Release -DCMAKE_BUILD_WITH_INSTALL_RPATH=ON -DCMAKE_C_COMPILER="$CC" -DCMAKE_COLOR_MAKEFILE=ON -DCMAKE_CXX_COMPILER="$CXX" -DCMAKE_FIND_FRAMEWORK=LAST -DCMAKE_INSTALL_NAME_DIR=/opt/local/lib -DCMAKE_INSTALL_RPATH=/opt/local/lib -DCMAKE_MODULE_PATH=/opt/local/share/cmake/Modules -DCMAKE_SYSTEM_PREFIX_PATH="/opt/local;/usr" -DCMAKE_VERBOSE_MAKEFILE=ON -Wno-dev -DMACPORTS=TRUE -DOGRE_BUILD_TOOLS=TRUE -DOGRE_COPY_DEPENDENICES=FALSE -DOGRE_INSTALL_DEPENDENCIES=FALSE -DOGRE_BUILD_SAMPLES=TRUE -DOGRE_INSTALL_DOCS=TRUE -DOGRE_INSTALL_SAMPLES=TRUE -DOGRE_INSTALL_SAMPLES_SOURCE=TRUE -DOGRE_INSTALL_TOOLS=TRUE -DOGRE_STATIC=TRUE -DCMAKE_C_FLAGS_RELEASE="-DNDEBUG" -DCMAKE_CXX_FLAGS_RELEASE="-DNDEBUG" -DCMAKE_OSX_ARCHITECTURES="x86_64" -DCMAKE_OSX_DEPLOYMENT_TARGET="10.12" -DCMAKE_OSX_SYSROOT="/" /opt/local/var/macports/build/_opt_local_var_macports_sources_rsync.macports.org_release_tarballs_ports_graphics_ogre/ogre/work/ogre_src_v1-7-3
1440:info:configure -- The C compiler identification is AppleClang 8.0.0.8000042
1441:info:configure -- The CXX compiler identification is AppleClang 8.0.0.8000042
1442:info:configure -- Check for working C compiler: /usr/bin/clang
1443:info:configure -- Check for working C compiler: /usr/bin/clang -- works
1444:info:configure -- Detecting C compiler ABI info
1445:info:configure -- Detecting C compiler ABI info - done
1446:info:configure -- Detecting C compile features
1447:info:configure -- Detecting C compile features - done
1448:info:configure -- Check for working CXX compiler: /usr/bin/clang++
1449:info:configure -- Check for working CXX compiler: /usr/bin/clang++ -- works
1450:info:configure -- Detecting CXX compiler ABI info
1451:info:configure -- Detecting CXX compiler ABI info - done
1452:info:configure -- Detecting CXX compile features
1453:info:configure -- Detecting CXX compile features - done
1454:info:configure -- Configuring OGRE 1.7.3
1455:info:configure -- Check size of void*
1456:info:configure -- Check size of void* - done
1457:info:configure -- Check if the system is big endian
1458:info:configure -- Searching 16 bit integer
1459:info:configure -- Looking for sys/types.h
1460:info:configure -- Looking for sys/types.h - found
1461:info:configure -- Looking for stdint.h
1462:info:configure -- Looking for stdint.h - found
1463:info:configure -- Looking for stddef.h
1464:info:configure -- Looking for stddef.h - found
1465:info:configure -- Check size of unsigned short
1466:info:configure -- Check size of unsigned short - done
1467:info:configure -- Using unsigned short
1468:info:configure -- Check if the system is big endian - little endian
1469:info:configure -- Search path: /opt/local/var/macports/build/_opt_local_var_macports_sources_rsync.macports.org_release_tarballs_ports_graphics_ogre/ogre/work/ogre_src_v1-7-3/Dependencies;/opt/local/var/macports/build/_opt_local_var_macports_sources_rsync.macports.org_release_tarballs_ports_graphics_ogre/ogre/work/ogre_src_v1-7-3/Dependencies;/opt/local/var/macports/build/_opt_local_var_macports_sources_rsync.macports.org_release_tarballs_ports_graphics_ogre/ogre/work/ogre_src_v1-7-3/../Dependencies;/opt/local/var/macports/build/_opt_local_var_macports_sources_rsync.macports.org_release_tarballs_ports_graphics_ogre/ogre/work/ogre_src_v1-7-3/../Dependencies
1470:info:configure -- Looking for ZLIB...
1471:info:configure -- Found PkgConfig: /usr/local/bin/pkg-config (found version "0.29.1")
1472:info:configure -- Checking for module 'zzip-zlib-config'
1473:info:configure --   Found zzip-zlib-config, version 1.2.8
1474:info:configure -- Found ZLIB: optimized;/opt/local/lib/libz.a;debug;/opt/local/lib/libz.a
1475:info:configure -- Looking for ZZip...
1476:info:configure -- Checking for module 'zziplib'
1477:info:configure --   Found zziplib, version 0.13.62
1478:info:configure -- Found ZZip: optimized;/usr/local/lib/libzzip.a;debug;/usr/local/lib/libzzip.a
1479:info:configure -- Looking for FreeImage...
1480:info:configure -- Checking for module 'freeimage'
1481:info:configure --   No package 'freeimage' found
1482:info:configure -- Found FreeImage: optimized;/usr/local/lib/libfreeimage.a;debug;/usr/local/lib/libfreeimage.a
1483:info:configure -- Looking for FREETYPE...
1484:info:configure -- Checking for module 'freetype2'
1485:info:configure --   Found freetype2, version 19.0.13
1486:info:configure -- CMAKE_PREFIX_PATH: /opt/local/var/macports/build/_opt_local_var_macports_sources_rsync.macports.org_release_tarballs_ports_graphics_ogre/ogre/work/ogre_src_v1-7-3/Dependencies;/opt/local/var/macports/build/_opt_local_var_macports_sources_rsync.macports.org_release_tarballs_ports_graphics_ogre/ogre/work/ogre_src_v1-7-3/Dependencies;/opt/local/var/macports/build/_opt_local_var_macports_sources_rsync.macports.org_release_tarballs_ports_graphics_ogre/ogre/work/ogre_src_v1-7-3/../Dependencies;/opt/local/var/macports/build/_opt_local_var_macports_sources_rsync.macports.org_release_tarballs_ports_graphics_ogre/ogre/work/ogre_src_v1-7-3/../Dependencies;/usr/local
1487:info:configure -- Found FREETYPE: optimized;/usr/local/lib/libfreetype.a;debug;/usr/local/lib/libfreetype.a
1488:info:configure -- Looking for XOpenDisplay in /opt/local/lib/libX11.a;/opt/local/lib/libXext.a
1489:info:configure -- Looking for XOpenDisplay in /opt/local/lib/libX11.a;/opt/local/lib/libXext.a - not found
1490:info:configure -- Looking for dnet_ntoa in dnet
1491:info:configure -- Looking for dnet_ntoa in dnet - not found
1492:info:configure -- Looking for dnet_ntoa in dnet_stub
1493:info:configure -- Looking for dnet_ntoa in dnet_stub - not found
1494:info:configure -- Looking for gethostbyname
1495:info:configure -- Looking for gethostbyname - found
1496:info:configure -- Looking for connect
1497:info:configure -- Looking for connect - found
1498:info:configure -- Looking for remove
1499:info:configure -- Looking for remove - found
1500:info:configure -- Looking for shmat
1501:info:configure -- Looking for shmat - found
1502:info:configure -- Looking for IceConnectionNumber in ICE
1503:info:configure -- Looking for IceConnectionNumber in ICE - found
1504:info:configure -- Found X11: /opt/local/lib/libX11.a
1505:info:configure -- Found OpenGL: //System/Library/Frameworks/OpenGL.framework 
1506:info:configure -- Looking for Cg...
1507:info:configure -- Cg_PREFIX_PATH changed.
1508:info:configure -- Checking for module 'Cg'
1509:info:configure --   No package 'Cg' found
1510:info:configure -- Could not locate Cg
1511:info:configure CMake Warning at /opt/local/share/cmake-3.7/Modules/FindBoost.cmake:744 (message):
1512:info:configure   Imported targets not available for Boost version 106300
1513:info:configure Call Stack (most recent call first):
1514:info:configure   /opt/local/share/cmake-3.7/Modules/FindBoost.cmake:848 (_Boost_COMPONENT_DEPENDENCIES)
1515:info:configure   /opt/local/share/cmake-3.7/Modules/FindBoost.cmake:1435 (_Boost_MISSING_DEPENDENCIES)
1516:info:configure   CMake/Dependencies.cmake:127 (find_package)
1517:info:configure   CMakeLists.txt:200 (include)
1518:info:configure
1519:info:configure
1520:info:configure CMake Warning at /opt/local/share/cmake-3.7/Modules/FindBoost.cmake:744 (message):
1521:info:configure   Imported targets not available for Boost version 106300
1522:info:configure Call Stack (most recent call first):
1523:info:configure   /opt/local/share/cmake-3.7/Modules/FindBoost.cmake:848 (_Boost_COMPONENT_DEPENDENCIES)
1524:info:configure   /opt/local/share/cmake-3.7/Modules/FindBoost.cmake:1435 (_Boost_MISSING_DEPENDENCIES)
1525:info:configure   CMake/Dependencies.cmake:127 (find_package)
1526:info:configure   CMakeLists.txt:200 (include)
1527:info:configure
1528:info:configure
1529:info:configure -- Looking for POCO...
1530:info:configure -- Checking for module 'POCO'
1531:info:configure --   No package 'POCO' found
1532:info:configure -- Could not locate POCO
1533:info:configure -- Looking for TBB...
1534:info:configure -- Could not locate TBB
1535:info:configure -- Looking for OIS...
1536:info:configure -- OIS_PREFIX_PATH changed.
1537:info:configure -- Checking for module 'OIS'
1538:info:configure --   No package 'OIS' found
1539:info:configure -- Found OIS: optimized;/opt/local/lib/libOIS.a;debug;/opt/local/lib/libOIS.a
1540:info:configure -- Found Doxygen: /usr/local/bin/doxygen 
1541:info:configure -- Looking for CppUnit...
1542:info:configure -- Checking for module 'cppunit'
1543:info:configure --   No package 'cppunit' found
1544:info:configure -- Could not locate CppUnit
1545:info:configure -- Looking for Carbon...
1546:info:configure -- Checking for module 'Carbon'
1547:info:configure --   No package 'Carbon' found
1548:info:configure -- Found Carbon: -framework Carbon
1549:info:configure -- Looking for Cocoa...
1550:info:configure -- Checking for module 'Cocoa'
1551:info:configure --   No package 'Cocoa' found
1552:info:configure -- Found Cocoa: -framework Cocoa
1553:info:configure -- Looking for IOKit...
1554:info:configure -- Checking for module 'IOKit'
1555:info:configure --   No package 'IOKit' found
1556:info:configure -- Found IOKit: -framework IOKit
1557:info:configure --
1558:info:configure -----------------------------------------------------------------------------
1559:info:configure -- The following external packages were located on your system.
1560:info:configure -- This installation will have the extra features provided by these packages.
1561:info:configure + zlib
1562:info:configure + zziplib
1563:info:configure + freeimage
1564:info:configure + freetype
1565:info:configure + X11
1566:info:configure + Xt
1567:info:configure + Xaw
1568:info:configure + OpenGL
1569:info:configure + OpenGL ES
1570:info:configure + boost
1571:info:configure + boost-thread
1572:info:configure + boost-date_time
1573:info:configure + OIS
1574:info:configure + Doxygen
1575:info:configure + Carbon
1576:info:configure + Cocoa
1577:info:configure + IOKit
1578:info:configure -----------------------------------------------------------------------------
1579:info:configure -- The following OPTIONAL packages could NOT be located on your system.
1580:info:configure -- Consider installing them to enable more features from this software.
1581:info:configure + cg: C for graphics shader language <http://developer.nvidia.com/object/cg_toolkit.html>
1582:info:configure + POCO: POCO framework <http://pocoproject.org/>
1583:info:configure + tbb: Threading Building Blocks <http://www.threadingbuildingblocks.org/>
1584:info:configure + CppUnit: Library for performing unit tests <http://cppunit.sourceforge.net>
1585:info:configure -----------------------------------------------------------------------------
1586:info:configure
1587:info:configure -- Found BZip2: /opt/local/lib/libbz2.a (found version "1.0.6")
1588:info:configure -- Looking for BZ2_bzCompressInit
1589:info:configure -- Looking for BZ2_bzCompressInit - found
1590:info:configure INSTALL TARGETS - target OgreMain has PUBLIC_HEADER files but no PUBLIC_HEADER DESTINATION.
1591:info:configure INSTALL TARGETS - target OgreMain has RESOURCE files but no RESOURCE DESTINATION.
1592:info:configure INSTALL TARGETS - target OgreMain has PUBLIC_HEADER files but no PUBLIC_HEADER DESTINATION.
1593:info:configure INSTALL TARGETS - target OgreMain has RESOURCE files but no RESOURCE DESTINATION.
1594:info:configure INSTALL TARGETS - target OgreMain has PUBLIC_HEADER files but no PUBLIC_HEADER DESTINATION.
1595:info:configure INSTALL TARGETS - target OgreMain has RESOURCE files but no RESOURCE DESTINATION.
1596:info:configure INSTALL TARGETS - target OgreMain has PUBLIC_HEADER files but no PUBLIC_HEADER DESTINATION.
1597:info:configure INSTALL TARGETS - target OgreMain has RESOURCE files but no RESOURCE DESTINATION.
1598:info:configure --
1599:info:configure ----------------------------------------------------------------------------
1600:info:configure   FEATURE SUMMARY
1601:info:configure ----------------------------------------------------------------------------
1602:info:configure
1603:info:configure Building components:
1604:info:configure   + Paging
1605:info:configure   + Property
1606:info:configure   + Terrain
1607:info:configure   + RTShader System
1608:info:configure   + RTShader System Core Shaders
1609:info:configure   + RTShader System Extensions Shaders
1610:info:configure Building plugins:
1611:info:configure   + BSP scene manager
1612:info:configure   + Octree scene manager
1613:info:configure   + Portal connected zone scene manager
1614:info:configure   + Particle FX
1615:info:configure Building rendersystems:
1616:info:configure   + OpenGL
1617:info:configure Building executables:
1618:info:configure   + Samples
1619:info:configure   + Tools
1620:info:configure Building core features:
1621:info:configure   + DDS image codec
1622:info:configure   + FreeImage codec
1623:info:configure   + ZIP archives
1624:info:configure
1625:info:configure Build type:                      static
1626:info:configure Threading support:               background (boost)
1627:info:configure Use double precision:            disabled
1628:info:configure Allocator type:                  nedmalloc (pooling)
1629:info:configure STL containers use allocator:    enabled
1630:info:configure Strings use allocator:           disabled
1631:info:configure Memory tracker (debug):          disabled
1632:info:configure Memory tracker (release):        disabled
1633:info:configure Use new script compilers:        enabled
1634:info:configure Use Boost:                       enabled
1635:info:configure
1636:info:configure ----------------------------------------------------------------------------
1637:info:configure
1638:info:configure -- Configuring done
1639:info:configure -- Generating done
1640:info:configure CMake Warning:
1641:info:configure   Manually-specified variables were not used by the project:
1642:info:configure
1643:info:configure     OGRE_COPY_DEPENDENICES
1644:info:configure
1645:info:configure
1646:info:configure -- Build files have been written to: /opt/local/var/macports/build/_opt_local_var_macports_sources_rsync.macports.org_release_tarballs_ports_graphics_ogre/ogre/work/ogre_src_v1-7-3
1647:debug:configure Executing proc-post-org.macports.configure-configure-0
1648:debug:configure Privilege de-escalation not attempted as not running as root.
1649:debug:build build phase started at Tue Jan 17 09:13:40 EST 2017
1650:notice:build --->  Building ogre
1651:debug:build Executing org.macports.build (ogre)
1652:debug:build Environment:
1653CC_PRINT_OPTIONS='YES'
1654CC_PRINT_OPTIONS_FILE='/opt/local/var/macports/build/_opt_local_var_macports_sources_rsync.macports.org_release_tarballs_ports_graphics_ogre/ogre/work/.CC_PRINT_OPTIONS'
1655CPATH='/opt/local/include'
1656LIBRARY_PATH='/opt/local/lib'
1657MACOSX_DEPLOYMENT_TARGET='10.12'
1658:debug:build Assembled command: 'cd "/opt/local/var/macports/build/_opt_local_var_macports_sources_rsync.macports.org_release_tarballs_ports_graphics_ogre/ogre/work/ogre_src_v1-7-3" && /usr/bin/make -j8 -w all VERBOSE=ON'
1659:debug:build Executing command line:  cd "/opt/local/var/macports/build/_opt_local_var_macports_sources_rsync.macports.org_release_tarballs_ports_graphics_ogre/ogre/work/ogre_src_v1-7-3" && /usr/bin/make -j8 -w all VERBOSE=ON
1660:info:build make: Entering directory `/opt/local/var/macports/build/_opt_local_var_macports_sources_rsync.macports.org_release_tarballs_ports_graphics_ogre/ogre/work/ogre_src_v1-7-3'
1661:info:build /opt/local/bin/cmake -H/opt/local/var/macports/build/_opt_local_var_macports_sources_rsync.macports.org_release_tarballs_ports_graphics_ogre/ogre/work/ogre_src_v1-7-3 -B/opt/local/var/macports/build/_opt_local_var_macports_sources_rsync.macports.org_release_tarballs_ports_graphics_ogre/ogre/work/ogre_src_v1-7-3 --check-build-system CMakeFiles/Makefile.cmake 0
1662:info:build /opt/local/bin/cmake -E cmake_progress_start /opt/local/var/macports/build/_opt_local_var_macports_sources_rsync.macports.org_release_tarballs_ports_graphics_ogre/ogre/work/ogre_src_v1-7-3/CMakeFiles /opt/local/var/macports/build/_opt_local_var_macports_sources_rsync.macports.org_release_tarballs_ports_graphics_ogre/ogre/work/ogre_src_v1-7-3/CMakeFiles/progress.marks
1663:info:build /Applications/Xcode.app/Contents/Developer/usr/bin/make -f CMakeFiles/Makefile2 all
1664:info:build make[1]: Entering directory `/opt/local/var/macports/build/_opt_local_var_macports_sources_rsync.macports.org_release_tarballs_ports_graphics_ogre/ogre/work/ogre_src_v1-7-3'
1665:info:build /Applications/Xcode.app/Contents/Developer/usr/bin/make -f OgreMain/CMakeFiles/OgreMain.dir/build.make OgreMain/CMakeFiles/OgreMain.dir/depend
1666:info:build make[2]: Entering directory `/opt/local/var/macports/build/_opt_local_var_macports_sources_rsync.macports.org_release_tarballs_ports_graphics_ogre/ogre/work/ogre_src_v1-7-3'
1667:info:build cd /opt/local/var/macports/build/_opt_local_var_macports_sources_rsync.macports.org_release_tarballs_ports_graphics_ogre/ogre/work/ogre_src_v1-7-3 && /opt/local/bin/cmake -E cmake_depends "Unix Makefiles" /opt/local/var/macports/build/_opt_local_var_macports_sources_rsync.macports.org_release_tarballs_ports_graphics_ogre/ogre/work/ogre_src_v1-7-3 /opt/local/var/macports/build/_opt_local_var_macports_sources_rsync.macports.org_release_tarballs_ports_graphics_ogre/ogre/work/ogre_src_v1-7-3/OgreMain /opt/local/var/macports/build/_opt_local_var_macports_sources_rsync.macports.org_release_tarballs_ports_graphics_ogre/ogre/work/ogre_src_v1-7-3 /opt/local/var/macports/build/_opt_local_var_macports_sources_rsync.macports.org_release_tarballs_ports_graphics_ogre/ogre/work/ogre_src_v1-7-3/OgreMain /opt/local/var/macports/build/_opt_local_var_macports_sources_rsync.macports.org_release_tarballs_ports_graphics_ogre/ogre/work/ogre_src_v1-7-3/OgreMain/CMakeFiles/OgreMain.dir/DependInfo.cmake --color=
1668:info:build Dependee "/opt/local/var/macports/build/_opt_local_var_macports_sources_rsync.macports.org_release_tarballs_ports_graphics_ogre/ogre/work/ogre_src_v1-7-3/OgreMain/CMakeFiles/OgreMain.dir/DependInfo.cmake" is newer than depender "/opt/local/var/macports/build/_opt_local_var_macports_sources_rsync.macports.org_release_tarballs_ports_graphics_ogre/ogre/work/ogre_src_v1-7-3/OgreMain/CMakeFiles/OgreMain.dir/depend.internal".
1669:info:build Dependee "/opt/local/var/macports/build/_opt_local_var_macports_sources_rsync.macports.org_release_tarballs_ports_graphics_ogre/ogre/work/ogre_src_v1-7-3/OgreMain/CMakeFiles/CMakeDirectoryInformation.cmake" is newer than depender "/opt/local/var/macports/build/_opt_local_var_macports_sources_rsync.macports.org_release_tarballs_ports_graphics_ogre/ogre/work/ogre_src_v1-7-3/OgreMain/CMakeFiles/OgreMain.dir/depend.internal".
1670:info:build Scanning dependencies of target OgreMain
1671:info:build make[2]: Leaving directory `/opt/local/var/macports/build/_opt_local_var_macports_sources_rsync.macports.org_release_tarballs_ports_graphics_ogre/ogre/work/ogre_src_v1-7-3'
1672:info:build /Applications/Xcode.app/Contents/Developer/usr/bin/make -f OgreMain/CMakeFiles/OgreMain.dir/build.make OgreMain/CMakeFiles/OgreMain.dir/build
1673:info:build make[2]: Entering directory `/opt/local/var/macports/build/_opt_local_var_macports_sources_rsync.macports.org_release_tarballs_ports_graphics_ogre/ogre/work/ogre_src_v1-7-3'
1674:info:build [  0%] Building CXX object OgreMain/CMakeFiles/OgreMain.dir/src/OgreAlignedAllocator.cpp.o
1675:info:build [  0%] Building CXX object OgreMain/CMakeFiles/OgreMain.dir/src/OgreAnimable.cpp.o
1676:info:build [  0%] Building CXX object OgreMain/CMakeFiles/OgreMain.dir/src/OgreAnimation.cpp.o
1677:info:build cd /opt/local/var/macports/build/_opt_local_var_macports_sources_rsync.macports.org_release_tarballs_ports_graphics_ogre/ogre/work/ogre_src_v1-7-3/OgreMain && /usr/bin/clang++   -DBOOST_ALL_NO_LIB -DFREEIMAGE_LIB -DOGRE_NONCLIENT_BUILD -D_MT -D_USRDLL -I/opt/local/var/macports/build/_opt_local_var_macports_sources_rsync.macports.org_release_tarballs_ports_graphics_ogre/ogre/work/ogre_src_v1-7-3/OgreMain/include -I/opt/local/var/macports/build/_opt_local_var_macports_sources_rsync.macports.org_release_tarballs_ports_graphics_ogre/ogre/work/ogre_src_v1-7-3/include -I/opt/local/var/macports/build/_opt_local_var_macports_sources_rsync.macports.org_release_tarballs_ports_graphics_ogre/ogre/work/ogre_src_v1-7-3/OgreMain/include/OSX -I/opt/local/include -I/usr/local/include -I/usr/local/include/freetype2 -I/usr/local/opt/freetype/include/freetype2 -I/opt/local/include/OIS -I/opt/local/var/macports/build/_opt_local_var_macports_sources_rsync.macports.org_release_tarballs_ports_graphics_ogre/ogre/work/ogre_src_v1-7-3 -I//System/Library/Frameworks/Carbon.framework/Headers -F//System/Library/Frameworks -I//System/Library/Frameworks/Cocoa.framework/Headers -I/opt/local/var/macports/build/_opt_local_var_macports_sources_rsync.macports.org_release_tarballs_ports_graphics_ogre/ogre/work/ogre_src_v1-7-3/OgreMain/src/nedmalloc  -pipe -Os -stdlib=libc++ -DNDEBUG -arch x86_64 -mmacosx-version-min=10.5   -pthread -o CMakeFiles/OgreMain.dir/src/OgreAnimable.cpp.o -c /opt/local/var/macports/build/_opt_local_var_macports_sources_rsync.macports.org_release_tarballs_ports_graphics_ogre/ogre/work/ogre_src_v1-7-3/OgreMain/src/OgreAnimable.cpp
1678:info:build cd /opt/local/var/macports/build/_opt_local_var_macports_sources_rsync.macports.org_release_tarballs_ports_graphics_ogre/ogre/work/ogre_src_v1-7-3/OgreMain && /usr/bin/clang++   -DBOOST_ALL_NO_LIB -DFREEIMAGE_LIB -DOGRE_NONCLIENT_BUILD -D_MT -D_USRDLL -I/opt/local/var/macports/build/_opt_local_var_macports_sources_rsync.macports.org_release_tarballs_ports_graphics_ogre/ogre/work/ogre_src_v1-7-3/OgreMain/include -I/opt/local/var/macports/build/_opt_local_var_macports_sources_rsync.macports.org_release_tarballs_ports_graphics_ogre/ogre/work/ogre_src_v1-7-3/include -I/opt/local/var/macports/build/_opt_local_var_macports_sources_rsync.macports.org_release_tarballs_ports_graphics_ogre/ogre/work/ogre_src_v1-7-3/OgreMain/include/OSX -I/opt/local/include -I/usr/local/include -I/usr/local/include/freetype2 -I/usr/local/opt/freetype/include/freetype2 -I/opt/local/include/OIS -I/opt/local/var/macports/build/_opt_local_var_macports_sources_rsync.macports.org_release_tarballs_ports_graphics_ogre/ogre/work/ogre_src_v1-7-3 -I//System/Library/Frameworks/Carbon.framework/Headers -F//System/Library/Frameworks -I//System/Library/Frameworks/Cocoa.framework/Headers -I/opt/local/var/macports/build/_opt_local_var_macports_sources_rsync.macports.org_release_tarballs_ports_graphics_ogre/ogre/work/ogre_src_v1-7-3/OgreMain/src/nedmalloc  -pipe -Os -stdlib=libc++ -DNDEBUG -arch x86_64 -mmacosx-version-min=10.5   -pthread -o CMakeFiles/OgreMain.dir/src/OgreAnimation.cpp.o -c /opt/local/var/macports/build/_opt_local_var_macports_sources_rsync.macports.org_release_tarballs_ports_graphics_ogre/ogre/work/ogre_src_v1-7-3/OgreMain/src/OgreAnimation.cpp
1679:info:build cd /opt/local/var/macports/build/_opt_local_var_macports_sources_rsync.macports.org_release_tarballs_ports_graphics_ogre/ogre/work/ogre_src_v1-7-3/OgreMain && /usr/bin/clang++   -DBOOST_ALL_NO_LIB -DFREEIMAGE_LIB -DOGRE_NONCLIENT_BUILD -D_MT -D_USRDLL -I/opt/local/var/macports/build/_opt_local_var_macports_sources_rsync.macports.org_release_tarballs_ports_graphics_ogre/ogre/work/ogre_src_v1-7-3/OgreMain/include -I/opt/local/var/macports/build/_opt_local_var_macports_sources_rsync.macports.org_release_tarballs_ports_graphics_ogre/ogre/work/ogre_src_v1-7-3/include -I/opt/local/var/macports/build/_opt_local_var_macports_sources_rsync.macports.org_release_tarballs_ports_graphics_ogre/ogre/work/ogre_src_v1-7-3/OgreMain/include/OSX -I/opt/local/include -I/usr/local/include -I/usr/local/include/freetype2 -I/usr/local/opt/freetype/include/freetype2 -I/opt/local/include/OIS -I/opt/local/var/macports/build/_opt_local_var_macports_sources_rsync.macports.org_release_tarballs_ports_graphics_ogre/ogre/work/ogre_src_v1-7-3 -I//System/Library/Frameworks/Carbon.framework/Headers -F//System/Library/Frameworks -I//System/Library/Frameworks/Cocoa.framework/Headers -I/opt/local/var/macports/build/_opt_local_var_macports_sources_rsync.macports.org_release_tarballs_ports_graphics_ogre/ogre/work/ogre_src_v1-7-3/OgreMain/src/nedmalloc  -pipe -Os -stdlib=libc++ -DNDEBUG -arch x86_64 -mmacosx-version-min=10.5   -pthread -o CMakeFiles/OgreMain.dir/src/OgreAlignedAllocator.cpp.o -c /opt/local/var/macports/build/_opt_local_var_macports_sources_rsync.macports.org_release_tarballs_ports_graphics_ogre/ogre/work/ogre_src_v1-7-3/OgreMain/src/OgreAlignedAllocator.cpp
1680:info:build [  0%] Building CXX object OgreMain/CMakeFiles/OgreMain.dir/src/OgreAnimationState.cpp.o
1681:info:build [  1%] Building CXX object OgreMain/CMakeFiles/OgreMain.dir/src/OgreAnimationTrack.cpp.o
1682:info:build cd /opt/local/var/macports/build/_opt_local_var_macports_sources_rsync.macports.org_release_tarballs_ports_graphics_ogre/ogre/work/ogre_src_v1-7-3/OgreMain && /usr/bin/clang++   -DBOOST_ALL_NO_LIB -DFREEIMAGE_LIB -DOGRE_NONCLIENT_BUILD -D_MT -D_USRDLL -I/opt/local/var/macports/build/_opt_local_var_macports_sources_rsync.macports.org_release_tarballs_ports_graphics_ogre/ogre/work/ogre_src_v1-7-3/OgreMain/include -I/opt/local/var/macports/build/_opt_local_var_macports_sources_rsync.macports.org_release_tarballs_ports_graphics_ogre/ogre/work/ogre_src_v1-7-3/include -I/opt/local/var/macports/build/_opt_local_var_macports_sources_rsync.macports.org_release_tarballs_ports_graphics_ogre/ogre/work/ogre_src_v1-7-3/OgreMain/include/OSX -I/opt/local/include -I/usr/local/include -I/usr/local/include/freetype2 -I/usr/local/opt/freetype/include/freetype2 -I/opt/local/include/OIS -I/opt/local/var/macports/build/_opt_local_var_macports_sources_rsync.macports.org_release_tarballs_ports_graphics_ogre/ogre/work/ogre_src_v1-7-3 -I//System/Library/Frameworks/Carbon.framework/Headers -F//System/Library/Frameworks -I//System/Library/Frameworks/Cocoa.framework/Headers -I/opt/local/var/macports/build/_opt_local_var_macports_sources_rsync.macports.org_release_tarballs_ports_graphics_ogre/ogre/work/ogre_src_v1-7-3/OgreMain/src/nedmalloc  -pipe -Os -stdlib=libc++ -DNDEBUG -arch x86_64 -mmacosx-version-min=10.5   -pthread -o CMakeFiles/OgreMain.dir/src/OgreAnimationState.cpp.o -c /opt/local/var/macports/build/_opt_local_var_macports_sources_rsync.macports.org_release_tarballs_ports_graphics_ogre/ogre/work/ogre_src_v1-7-3/OgreMain/src/OgreAnimationState.cpp
1683:info:build cd /opt/local/var/macports/build/_opt_local_var_macports_sources_rsync.macports.org_release_tarballs_ports_graphics_ogre/ogre/work/ogre_src_v1-7-3/OgreMain && /usr/bin/clang++   -DBOOST_ALL_NO_LIB -DFREEIMAGE_LIB -DOGRE_NONCLIENT_BUILD -D_MT -D_USRDLL -I/opt/local/var/macports/build/_opt_local_var_macports_sources_rsync.macports.org_release_tarballs_ports_graphics_ogre/ogre/work/ogre_src_v1-7-3/OgreMain/include -I/opt/local/var/macports/build/_opt_local_var_macports_sources_rsync.macports.org_release_tarballs_ports_graphics_ogre/ogre/work/ogre_src_v1-7-3/include -I/opt/local/var/macports/build/_opt_local_var_macports_sources_rsync.macports.org_release_tarballs_ports_graphics_ogre/ogre/work/ogre_src_v1-7-3/OgreMain/include/OSX -I/opt/local/include -I/usr/local/include -I/usr/local/include/freetype2 -I/usr/local/opt/freetype/include/freetype2 -I/opt/local/include/OIS -I/opt/local/var/macports/build/_opt_local_var_macports_sources_rsync.macports.org_release_tarballs_ports_graphics_ogre/ogre/work/ogre_src_v1-7-3 -I//System/Library/Frameworks/Carbon.framework/Headers -F//System/Library/Frameworks -I//System/Library/Frameworks/Cocoa.framework/Headers -I/opt/local/var/macports/build/_opt_local_var_macports_sources_rsync.macports.org_release_tarballs_ports_graphics_ogre/ogre/work/ogre_src_v1-7-3/OgreMain/src/nedmalloc  -pipe -Os -stdlib=libc++ -DNDEBUG -arch x86_64 -mmacosx-version-min=10.5   -pthread -o CMakeFiles/OgreMain.dir/src/OgreAnimationTrack.cpp.o -c /opt/local/var/macports/build/_opt_local_var_macports_sources_rsync.macports.org_release_tarballs_ports_graphics_ogre/ogre/work/ogre_src_v1-7-3/OgreMain/src/OgreAnimationTrack.cpp
1684:info:build [  1%] Building CXX object OgreMain/CMakeFiles/OgreMain.dir/src/OgreArchiveManager.cpp.o
1685:info:build [  1%] Building CXX object OgreMain/CMakeFiles/OgreMain.dir/src/OgreAutoParamDataSource.cpp.o
1686:info:build cd /opt/local/var/macports/build/_opt_local_var_macports_sources_rsync.macports.org_release_tarballs_ports_graphics_ogre/ogre/work/ogre_src_v1-7-3/OgreMain && /usr/bin/clang++   -DBOOST_ALL_NO_LIB -DFREEIMAGE_LIB -DOGRE_NONCLIENT_BUILD -D_MT -D_USRDLL -I/opt/local/var/macports/build/_opt_local_var_macports_sources_rsync.macports.org_release_tarballs_ports_graphics_ogre/ogre/work/ogre_src_v1-7-3/OgreMain/include -I/opt/local/var/macports/build/_opt_local_var_macports_sources_rsync.macports.org_release_tarballs_ports_graphics_ogre/ogre/work/ogre_src_v1-7-3/include -I/opt/local/var/macports/build/_opt_local_var_macports_sources_rsync.macports.org_release_tarballs_ports_graphics_ogre/ogre/work/ogre_src_v1-7-3/OgreMain/include/OSX -I/opt/local/include -I/usr/local/include -I/usr/local/include/freetype2 -I/usr/local/opt/freetype/include/freetype2 -I/opt/local/include/OIS -I/opt/local/var/macports/build/_opt_local_var_macports_sources_rsync.macports.org_release_tarballs_ports_graphics_ogre/ogre/work/ogre_src_v1-7-3 -I//System/Library/Frameworks/Carbon.framework/Headers -F//System/Library/Frameworks -I//System/Library/Frameworks/Cocoa.framework/Headers -I/opt/local/var/macports/build/_opt_local_var_macports_sources_rsync.macports.org_release_tarballs_ports_graphics_ogre/ogre/work/ogre_src_v1-7-3/OgreMain/src/nedmalloc  -pipe -Os -stdlib=libc++ -DNDEBUG -arch x86_64 -mmacosx-version-min=10.5   -pthread -o CMakeFiles/OgreMain.dir/src/OgreArchiveManager.cpp.o -c /opt/local/var/macports/build/_opt_local_var_macports_sources_rsync.macports.org_release_tarballs_ports_graphics_ogre/ogre/work/ogre_src_v1-7-3/OgreMain/src/OgreArchiveManager.cpp
1687:info:build [  1%] Building CXX object OgreMain/CMakeFiles/OgreMain.dir/src/OgreAxisAlignedBox.cpp.o
1688:info:build cd /opt/local/var/macports/build/_opt_local_var_macports_sources_rsync.macports.org_release_tarballs_ports_graphics_ogre/ogre/work/ogre_src_v1-7-3/OgreMain && /usr/bin/clang++   -DBOOST_ALL_NO_LIB -DFREEIMAGE_LIB -DOGRE_NONCLIENT_BUILD -D_MT -D_USRDLL -I/opt/local/var/macports/build/_opt_local_var_macports_sources_rsync.macports.org_release_tarballs_ports_graphics_ogre/ogre/work/ogre_src_v1-7-3/OgreMain/include -I/opt/local/var/macports/build/_opt_local_var_macports_sources_rsync.macports.org_release_tarballs_ports_graphics_ogre/ogre/work/ogre_src_v1-7-3/include -I/opt/local/var/macports/build/_opt_local_var_macports_sources_rsync.macports.org_release_tarballs_ports_graphics_ogre/ogre/work/ogre_src_v1-7-3/OgreMain/include/OSX -I/opt/local/include -I/usr/local/include -I/usr/local/include/freetype2 -I/usr/local/opt/freetype/include/freetype2 -I/opt/local/include/OIS -I/opt/local/var/macports/build/_opt_local_var_macports_sources_rsync.macports.org_release_tarballs_ports_graphics_ogre/ogre/work/ogre_src_v1-7-3 -I//System/Library/Frameworks/Carbon.framework/Headers -F//System/Library/Frameworks -I//System/Library/Frameworks/Cocoa.framework/Headers -I/opt/local/var/macports/build/_opt_local_var_macports_sources_rsync.macports.org_release_tarballs_ports_graphics_ogre/ogre/work/ogre_src_v1-7-3/OgreMain/src/nedmalloc  -pipe -Os -stdlib=libc++ -DNDEBUG -arch x86_64 -mmacosx-version-min=10.5   -pthread -o CMakeFiles/OgreMain.dir/src/OgreAutoParamDataSource.cpp.o -c /opt/local/var/macports/build/_opt_local_var_macports_sources_rsync.macports.org_release_tarballs_ports_graphics_ogre/ogre/work/ogre_src_v1-7-3/OgreMain/src/OgreAutoParamDataSource.cpp
1689:info:build cd /opt/local/var/macports/build/_opt_local_var_macports_sources_rsync.macports.org_release_tarballs_ports_graphics_ogre/ogre/work/ogre_src_v1-7-3/OgreMain && /usr/bin/clang++   -DBOOST_ALL_NO_LIB -DFREEIMAGE_LIB -DOGRE_NONCLIENT_BUILD -D_MT -D_USRDLL -I/opt/local/var/macports/build/_opt_local_var_macports_sources_rsync.macports.org_release_tarballs_ports_graphics_ogre/ogre/work/ogre_src_v1-7-3/OgreMain/include -I/opt/local/var/macports/build/_opt_local_var_macports_sources_rsync.macports.org_release_tarballs_ports_graphics_ogre/ogre/work/ogre_src_v1-7-3/include -I/opt/local/var/macports/build/_opt_local_var_macports_sources_rsync.macports.org_release_tarballs_ports_graphics_ogre/ogre/work/ogre_src_v1-7-3/OgreMain/include/OSX -I/opt/local/include -I/usr/local/include -I/usr/local/include/freetype2 -I/usr/local/opt/freetype/include/freetype2 -I/opt/local/include/OIS -I/opt/local/var/macports/build/_opt_local_var_macports_sources_rsync.macports.org_release_tarballs_ports_graphics_ogre/ogre/work/ogre_src_v1-7-3 -I//System/Library/Frameworks/Carbon.framework/Headers -F//System/Library/Frameworks -I//System/Library/Frameworks/Cocoa.framework/Headers -I/opt/local/var/macports/build/_opt_local_var_macports_sources_rsync.macports.org_release_tarballs_ports_graphics_ogre/ogre/work/ogre_src_v1-7-3/OgreMain/src/nedmalloc  -pipe -Os -stdlib=libc++ -DNDEBUG -arch x86_64 -mmacosx-version-min=10.5   -pthread -o CMakeFiles/OgreMain.dir/src/OgreAxisAlignedBox.cpp.o -c /opt/local/var/macports/build/_opt_local_var_macports_sources_rsync.macports.org_release_tarballs_ports_graphics_ogre/ogre/work/ogre_src_v1-7-3/OgreMain/src/OgreAxisAlignedBox.cpp
1690:info:build clangclang: error: invalid deployment target for -stdlib=libc++ (requires OS X 10.7 or later)
1691:info:build clang: error: invalid deployment target for -stdlib=libc++ (requires OS X 10.7 or later)
1692:info:build clang: error: invalid deployment target for -stdlib=libc++ (requires OS X 10.7 or later)
1693:info:build clang: error: invalid deployment target for -stdlib=libc++ (requires OS X 10.7 or later)
1694:info:build clang: error: invalid deployment target for -stdlib=libc++ (requires OS X 10.7 or later)
1695:info:build : error: invalid deployment target for -stdlib=libc++ (requires OS X 10.7 or later)
1696:info:build make[2]: *** [OgreMain/CMakeFiles/OgreMain.dir/src/OgreArchiveManager.cpp.o] Error 1
1697:info:build make[2]: *** Waiting for unfinished jobs....
1698:info:build make[2]: *** [OgreMain/CMakeFiles/OgreMain.dir/src/OgreAnimationTrack.cpp.o] Error 1
1699:info:build make[2]: *** [OgreMain/CMakeFiles/OgreMain.dir/src/OgreAlignedAllocator.cpp.o] Error 1
1700:info:build clang: error: invalid deployment target for -stdlib=libc++ (requires OS X 10.7 or later)
1701:info:build make[2]: *** [OgreMain/CMakeFiles/OgreMain.dir/src/OgreAnimation.cpp.o] Error 1
1702:info:build make[2]: *** [OgreMain/CMakeFiles/OgreMain.dir/src/OgreAnimationState.cpp.o] Error 1
1703:info:build make[2]: *** [OgreMain/CMakeFiles/OgreMain.dir/src/OgreAnimable.cpp.o] Error 1
1704:info:build make[2]: *** [OgreMain/CMakeFiles/OgreMain.dir/src/OgreAutoParamDataSource.cpp.o] Error 1
1705:info:build clang: error: invalid deployment target for -stdlib=libc++ (requires OS X 10.7 or later)
1706:info:build make[2]: *** [OgreMain/CMakeFiles/OgreMain.dir/src/OgreAxisAlignedBox.cpp.o] Error 1
1707:info:build make[2]: Leaving directory `/opt/local/var/macports/build/_opt_local_var_macports_sources_rsync.macports.org_release_tarballs_ports_graphics_ogre/ogre/work/ogre_src_v1-7-3'
1708:info:build make[1]: *** [OgreMain/CMakeFiles/OgreMain.dir/all] Error 2
1709:info:build make[1]: Leaving directory `/opt/local/var/macports/build/_opt_local_var_macports_sources_rsync.macports.org_release_tarballs_ports_graphics_ogre/ogre/work/ogre_src_v1-7-3'
1710:info:build make: *** [all] Error 2
1711:info:build make: Leaving directory `/opt/local/var/macports/build/_opt_local_var_macports_sources_rsync.macports.org_release_tarballs_ports_graphics_ogre/ogre/work/ogre_src_v1-7-3'
1712:info:build Command failed:  cd "/opt/local/var/macports/build/_opt_local_var_macports_sources_rsync.macports.org_release_tarballs_ports_graphics_ogre/ogre/work/ogre_src_v1-7-3" && /usr/bin/make -j8 -w all VERBOSE=ON
1713:info:build Exit code: 2
1714:error:build org.macports.build for port ogre returned: command execution failed
1715:debug:build Error code: CHILDSTATUS 81658 2
1716:debug:build Backtrace: command execution failed
1717    while executing
1718"system -nice 0 $fullcmdstring"
1719    ("eval" body line 1)
1720    invoked from within
1721"eval system $notty $nice \$fullcmdstring"
1722    invoked from within
1723"command_exec build"
1724    (procedure "portbuild::build_main" line 8)
1725    invoked from within
1726"portbuild::build_main org.macports.build"
1727    ("eval" body line 1)
1728    invoked from within
1729"eval $procedure $targetname"
1730:info:build Warning: targets not executed for ogre: org.macports.activate org.macports.build org.macports.destroot org.macports.install
1731:notice:build Please see the log file for port ogre for details:
1732    /opt/local/var/macports/logs/_opt_local_var_macports_sources_rsync.macports.org_release_tarballs_ports_graphics_ogre/ogre/main.log