Ticket #54189: config.log

File config.log, 180.7 KB (added by laestudillowong, 2 years ago)

config.log

Line 
1This file contains any messages produced by compilers while
2running configure, to aid debugging if configure makes a mistake.
3
4It was created by gnuplot configure 5.0.6, which was
5generated by GNU Autoconf 2.69.  Invocation command line was
6
7  $ ./configure --prefix=/opt/local --with-caca=/opt/local --with-gd=/opt/local --with-readline=/opt/local --with-aquaterm --with-x --infodir=${prefix}/share/info --mandir=${prefix}/share/man --with-wx=/opt/local/Library/Frameworks/wxWidgets.framework/Versions/wxWidgets/3.0/bin --without-bitmap-terminals --without-latex --with-lua --without-pdf --without-qt --without-tutorial --with-cwdrc
8
9## --------- ##
10## Platform. ##
11## --------- ##
12
13hostname = Luiss-MacBook-Pro.local
14uname -m = x86_64
15uname -r = 16.6.0
16uname -s = Darwin
17uname -v = Darwin Kernel Version 16.6.0: Fri Apr 14 16:21:16 PDT 2017; root:xnu-3789.60.24~6/RELEASE_X86_64
18
19/usr/bin/uname -p = i386
20/bin/uname -X     = unknown
21
22/bin/arch              = unknown
23/usr/bin/arch -k       = unknown
24/usr/convex/getsysinfo = unknown
25/usr/bin/hostinfo      = Mach kernel version:
26         Darwin Kernel Version 16.6.0: Fri Apr 14 16:21:16 PDT 2017; root:xnu-3789.60.24~6/RELEASE_X86_64
27Kernel configured for up to 8 processors.
284 processors are physically available.
298 processors are logically available.
30Processor type: x86_64h (Intel x86-64h Haswell)
31Processors active: 0 1 2 3 4 5 6 7
32Primary memory available: 16.00 gigabytes
33Default processor set: 297 tasks, 1040 threads, 8 processors
34Load average: 3.36, Mach factor: 4.90
35/bin/machine           = unknown
36/usr/bin/oslevel       = unknown
37/bin/universe          = unknown
38
39PATH: /opt/local/bin
40PATH: /opt/local/sbin
41PATH: /bin
42PATH: /sbin
43PATH: /usr/bin
44PATH: /usr/sbin
45
46
47## ----------- ##
48## Core tests. ##
49## ----------- ##
50
51configure:2701: checking for a BSD-compatible install
52configure:2769: result: /usr/bin/install -c
53configure:2780: checking whether build environment is sane
54configure:2835: result: yes
55configure:2873: WARNING: 'missing' script is too old or missing
56configure:2986: checking for a thread-safe mkdir -p
57configure:3025: result: ./install-sh -c -d
58configure:3032: checking for gawk
59configure:3048: found /opt/local/bin/gawk
60configure:3059: result: gawk
61configure:3070: checking whether make sets $(MAKE)
62configure:3092: result: yes
63configure:3121: checking whether make supports nested variables
64configure:3138: result: yes
65configure:3265: checking whether to enable maintainer-specific portions of Makefiles
66configure:3274: result: no
67configure:3307: checking for style of include used by make
68configure:3335: result: GNU
69configure:3406: checking for gcc
70configure:3433: result: /usr/bin/clang
71configure:3662: checking for C compiler version
72configure:3671: /usr/bin/clang --version >&5
73Apple LLVM version 8.1.0 (clang-802.0.38)
74Target: x86_64-apple-darwin16.6.0
75Thread model: posix
76InstalledDir: /Applications/Xcode.app/Contents/Developer/Toolchains/XcodeDefault.xctoolchain/usr/bin
77configure:3682: $? = 0
78configure:3671: /usr/bin/clang -v >&5
79Apple LLVM version 8.1.0 (clang-802.0.38)
80Target: x86_64-apple-darwin16.6.0
81Thread model: posix
82InstalledDir: /Applications/Xcode.app/Contents/Developer/Toolchains/XcodeDefault.xctoolchain/usr/bin
83configure:3682: $? = 0
84configure:3671: /usr/bin/clang -V >&5
85clang: error: argument to '-V' is missing (expected 1 value)
86clang: error: no input files
87configure:3682: $? = 1
88configure:3671: /usr/bin/clang -qversion >&5
89clang: error: unknown argument: '-qversion'
90clang: error: no input files
91configure:3682: $? = 1
92configure:3702: checking whether the C compiler works
93configure:3724: /usr/bin/clang -pipe -Os -F/opt/local/Library/Frameworks -arch x86_64 -I/opt/local/include -L/opt/local/lib -Wl,-headerpad_max_install_names -F/opt/local/Library/Frameworks -arch x86_64 conftest.c  >&5
94configure:3728: $? = 0
95configure:3776: result: yes
96configure:3779: checking for C compiler default output file name
97configure:3781: result: a.out
98configure:3787: checking for suffix of executables
99configure:3794: /usr/bin/clang -o conftest -pipe -Os -F/opt/local/Library/Frameworks -arch x86_64 -I/opt/local/include -L/opt/local/lib -Wl,-headerpad_max_install_names -F/opt/local/Library/Frameworks -arch x86_64 conftest.c  >&5
100configure:3798: $? = 0
101configure:3820: result:
102configure:3842: checking whether we are cross compiling
103configure:3850: /usr/bin/clang -o conftest -pipe -Os -F/opt/local/Library/Frameworks -arch x86_64 -I/opt/local/include -L/opt/local/lib -Wl,-headerpad_max_install_names -F/opt/local/Library/Frameworks -arch x86_64 conftest.c  >&5
104configure:3854: $? = 0
105configure:3861: ./conftest
106configure:3865: $? = 0
107configure:3880: result: no
108configure:3885: checking for suffix of object files
109configure:3907: /usr/bin/clang -c -pipe -Os -F/opt/local/Library/Frameworks -arch x86_64 -I/opt/local/include conftest.c >&5
110configure:3911: $? = 0
111configure:3932: result: o
112configure:3936: checking whether we are using the GNU C compiler
113configure:3955: /usr/bin/clang -c -pipe -Os -F/opt/local/Library/Frameworks -arch x86_64 -I/opt/local/include conftest.c >&5
114configure:3955: $? = 0
115configure:3964: result: yes
116configure:3973: checking whether /usr/bin/clang accepts -g
117configure:3993: /usr/bin/clang -c -g -I/opt/local/include conftest.c >&5
118configure:3993: $? = 0
119configure:4034: result: yes
120configure:4051: checking for /usr/bin/clang option to accept ISO C89
121configure:4114: /usr/bin/clang  -c -pipe -Os -F/opt/local/Library/Frameworks -arch x86_64 -I/opt/local/include conftest.c >&5
122configure:4114: $? = 0
123configure:4127: result: none needed
124configure:4152: checking whether /usr/bin/clang understands -c and -o together
125configure:4174: /usr/bin/clang -c conftest.c -o conftest2.o
126configure:4177: $? = 0
127configure:4174: /usr/bin/clang -c conftest.c -o conftest2.o
128configure:4177: $? = 0
129configure:4189: result: yes
130configure:4208: checking dependency style of /usr/bin/clang
131configure:4319: result: gcc3
132configure:4340: checking how to run the C preprocessor
133configure:4371: /usr/bin/clang -E -I/opt/local/include conftest.c
134configure:4371: $? = 0
135configure:4385: /usr/bin/clang -E -I/opt/local/include conftest.c
136conftest.c:12:10: fatal error: 'ac_nonexistent.h' file not found
137#include <ac_nonexistent.h>
138         ^
1391 error generated.
140configure:4385: $? = 1
141configure: failed program was:
142| /* confdefs.h */
143| #define PACKAGE_NAME "gnuplot"
144| #define PACKAGE_TARNAME "gnuplot"
145| #define PACKAGE_VERSION "5.0.6"
146| #define PACKAGE_STRING "gnuplot 5.0.6"
147| #define PACKAGE_BUGREPORT ""
148| #define PACKAGE_URL ""
149| #define PACKAGE "gnuplot"
150| #define VERSION "5.0.6"
151| #define PROTOTYPES 1
152| /* end confdefs.h.  */
153| #include <ac_nonexistent.h>
154configure:4410: result: /usr/bin/clang -E
155configure:4430: /usr/bin/clang -E -I/opt/local/include conftest.c
156configure:4430: $? = 0
157configure:4444: /usr/bin/clang -E -I/opt/local/include conftest.c
158conftest.c:12:10: fatal error: 'ac_nonexistent.h' file not found
159#include <ac_nonexistent.h>
160         ^
1611 error generated.
162configure:4444: $? = 1
163configure: failed program was:
164| /* confdefs.h */
165| #define PACKAGE_NAME "gnuplot"
166| #define PACKAGE_TARNAME "gnuplot"
167| #define PACKAGE_VERSION "5.0.6"
168| #define PACKAGE_STRING "gnuplot 5.0.6"
169| #define PACKAGE_BUGREPORT ""
170| #define PACKAGE_URL ""
171| #define PACKAGE "gnuplot"
172| #define VERSION "5.0.6"
173| #define PROTOTYPES 1
174| /* end confdefs.h.  */
175| #include <ac_nonexistent.h>
176configure:4473: checking for grep that handles long lines and -e
177configure:4531: result: /usr/bin/grep
178configure:4536: checking for egrep
179configure:4598: result: /usr/bin/grep -E
180configure:4603: checking for ANSI C header files
181configure:4623: /usr/bin/clang -c -pipe -Os -F/opt/local/Library/Frameworks -arch x86_64 -I/opt/local/include conftest.c >&5
182configure:4623: $? = 0
183configure:4696: /usr/bin/clang -o conftest -pipe -Os -F/opt/local/Library/Frameworks -arch x86_64 -I/opt/local/include -L/opt/local/lib -Wl,-headerpad_max_install_names -F/opt/local/Library/Frameworks -arch x86_64 conftest.c  >&5
184configure:4696: $? = 0
185configure:4696: ./conftest
186configure:4696: $? = 0
187configure:4707: result: yes
188configure:4720: checking for sys/types.h
189configure:4720: /usr/bin/clang -c -pipe -Os -F/opt/local/Library/Frameworks -arch x86_64 -I/opt/local/include conftest.c >&5
190configure:4720: $? = 0
191configure:4720: result: yes
192configure:4720: checking for sys/stat.h
193configure:4720: /usr/bin/clang -c -pipe -Os -F/opt/local/Library/Frameworks -arch x86_64 -I/opt/local/include conftest.c >&5
194configure:4720: $? = 0
195configure:4720: result: yes
196configure:4720: checking for stdlib.h
197configure:4720: /usr/bin/clang -c -pipe -Os -F/opt/local/Library/Frameworks -arch x86_64 -I/opt/local/include conftest.c >&5
198configure:4720: $? = 0
199configure:4720: result: yes
200configure:4720: checking for string.h
201configure:4720: /usr/bin/clang -c -pipe -Os -F/opt/local/Library/Frameworks -arch x86_64 -I/opt/local/include conftest.c >&5
202configure:4720: $? = 0
203configure:4720: result: yes
204configure:4720: checking for memory.h
205configure:4720: /usr/bin/clang -c -pipe -Os -F/opt/local/Library/Frameworks -arch x86_64 -I/opt/local/include conftest.c >&5
206configure:4720: $? = 0
207configure:4720: result: yes
208configure:4720: checking for strings.h
209configure:4720: /usr/bin/clang -c -pipe -Os -F/opt/local/Library/Frameworks -arch x86_64 -I/opt/local/include conftest.c >&5
210configure:4720: $? = 0
211configure:4720: result: yes
212configure:4720: checking for inttypes.h
213configure:4720: /usr/bin/clang -c -pipe -Os -F/opt/local/Library/Frameworks -arch x86_64 -I/opt/local/include conftest.c >&5
214configure:4720: $? = 0
215configure:4720: result: yes
216configure:4720: checking for stdint.h
217configure:4720: /usr/bin/clang -c -pipe -Os -F/opt/local/Library/Frameworks -arch x86_64 -I/opt/local/include conftest.c >&5
218configure:4720: $? = 0
219configure:4720: result: yes
220configure:4720: checking for unistd.h
221configure:4720: /usr/bin/clang -c -pipe -Os -F/opt/local/Library/Frameworks -arch x86_64 -I/opt/local/include conftest.c >&5
222configure:4720: $? = 0
223configure:4720: result: yes
224configure:4733: checking minix/config.h usability
225configure:4733: /usr/bin/clang -c -pipe -Os -F/opt/local/Library/Frameworks -arch x86_64 -I/opt/local/include conftest.c >&5
226conftest.c:55:10: fatal error: 'minix/config.h' file not found
227#include <minix/config.h>
228         ^
2291 error generated.
230configure:4733: $? = 1
231configure: failed program was:
232| /* confdefs.h */
233| #define PACKAGE_NAME "gnuplot"
234| #define PACKAGE_TARNAME "gnuplot"
235| #define PACKAGE_VERSION "5.0.6"
236| #define PACKAGE_STRING "gnuplot 5.0.6"
237| #define PACKAGE_BUGREPORT ""
238| #define PACKAGE_URL ""
239| #define PACKAGE "gnuplot"
240| #define VERSION "5.0.6"
241| #define PROTOTYPES 1
242| #define STDC_HEADERS 1
243| #define HAVE_SYS_TYPES_H 1
244| #define HAVE_SYS_STAT_H 1
245| #define HAVE_STDLIB_H 1
246| #define HAVE_STRING_H 1
247| #define HAVE_MEMORY_H 1
248| #define HAVE_STRINGS_H 1
249| #define HAVE_INTTYPES_H 1
250| #define HAVE_STDINT_H 1
251| #define HAVE_UNISTD_H 1
252| /* end confdefs.h.  */
253| #include <stdio.h>
254| #ifdef HAVE_SYS_TYPES_H
255| # include <sys/types.h>
256| #endif
257| #ifdef HAVE_SYS_STAT_H
258| # include <sys/stat.h>
259| #endif
260| #ifdef STDC_HEADERS
261| # include <stdlib.h>
262| # include <stddef.h>
263| #else
264| # ifdef HAVE_STDLIB_H
265| #  include <stdlib.h>
266| # endif
267| #endif
268| #ifdef HAVE_STRING_H
269| # if !defined STDC_HEADERS && defined HAVE_MEMORY_H
270| #  include <memory.h>
271| # endif
272| # include <string.h>
273| #endif
274| #ifdef HAVE_STRINGS_H
275| # include <strings.h>
276| #endif
277| #ifdef HAVE_INTTYPES_H
278| # include <inttypes.h>
279| #endif
280| #ifdef HAVE_STDINT_H
281| # include <stdint.h>
282| #endif
283| #ifdef HAVE_UNISTD_H
284| # include <unistd.h>
285| #endif
286| #include <minix/config.h>
287configure:4733: result: no
288configure:4733: checking minix/config.h presence
289configure:4733: /usr/bin/clang -E -I/opt/local/include conftest.c
290conftest.c:22:10: fatal error: 'minix/config.h' file not found
291#include <minix/config.h>
292         ^
2931 error generated.
294configure:4733: $? = 1
295configure: failed program was:
296| /* confdefs.h */
297| #define PACKAGE_NAME "gnuplot"
298| #define PACKAGE_TARNAME "gnuplot"
299| #define PACKAGE_VERSION "5.0.6"
300| #define PACKAGE_STRING "gnuplot 5.0.6"
301| #define PACKAGE_BUGREPORT ""
302| #define PACKAGE_URL ""
303| #define PACKAGE "gnuplot"
304| #define VERSION "5.0.6"
305| #define PROTOTYPES 1
306| #define STDC_HEADERS 1
307| #define HAVE_SYS_TYPES_H 1
308| #define HAVE_SYS_STAT_H 1
309| #define HAVE_STDLIB_H 1
310| #define HAVE_STRING_H 1
311| #define HAVE_MEMORY_H 1
312| #define HAVE_STRINGS_H 1
313| #define HAVE_INTTYPES_H 1
314| #define HAVE_STDINT_H 1
315| #define HAVE_UNISTD_H 1
316| /* end confdefs.h.  */
317| #include <minix/config.h>
318configure:4733: result: no
319configure:4733: checking for minix/config.h
320configure:4733: result: no
321configure:4754: checking whether it is safe to define __EXTENSIONS__
322configure:4772: /usr/bin/clang -c -pipe -Os -F/opt/local/Library/Frameworks -arch x86_64 -I/opt/local/include conftest.c >&5
323configure:4772: $? = 0
324configure:4779: result: yes
325configure:4842: checking for gcc
326configure:4869: result: /usr/bin/clang
327configure:5098: checking for C compiler version
328configure:5107: /usr/bin/clang --version >&5
329Apple LLVM version 8.1.0 (clang-802.0.38)
330Target: x86_64-apple-darwin16.6.0
331Thread model: posix
332InstalledDir: /Applications/Xcode.app/Contents/Developer/Toolchains/XcodeDefault.xctoolchain/usr/bin
333configure:5118: $? = 0
334configure:5107: /usr/bin/clang -v >&5
335Apple LLVM version 8.1.0 (clang-802.0.38)
336Target: x86_64-apple-darwin16.6.0
337Thread model: posix
338InstalledDir: /Applications/Xcode.app/Contents/Developer/Toolchains/XcodeDefault.xctoolchain/usr/bin
339configure:5118: $? = 0
340configure:5107: /usr/bin/clang -V >&5
341clang: error: argument to '-V' is missing (expected 1 value)
342clang: error: no input files
343configure:5118: $? = 1
344configure:5107: /usr/bin/clang -qversion >&5
345clang: error: unknown argument: '-qversion'
346clang: error: no input files
347configure:5118: $? = 1
348configure:5122: checking whether we are using the GNU C compiler
349configure:5150: result: yes
350configure:5159: checking whether /usr/bin/clang accepts -g
351configure:5220: result: yes
352configure:5237: checking for /usr/bin/clang option to accept ISO C89
353configure:5313: result: none needed
354configure:5338: checking whether /usr/bin/clang understands -c and -o together
355configure:5375: result: yes
356configure:5394: checking dependency style of /usr/bin/clang
357configure:5505: result: gcc3
358configure:5525: checking how to run the C preprocessor
359configure:5595: result: /usr/bin/clang -E
360configure:5615: /usr/bin/clang -E -I/opt/local/include conftest.c
361configure:5615: $? = 0
362configure:5629: /usr/bin/clang -E -I/opt/local/include conftest.c
363conftest.c:27:10: fatal error: 'ac_nonexistent.h' file not found
364#include <ac_nonexistent.h>
365         ^
3661 error generated.
367configure:5629: $? = 1
368configure: failed program was:
369| /* confdefs.h */
370| #define PACKAGE_NAME "gnuplot"
371| #define PACKAGE_TARNAME "gnuplot"
372| #define PACKAGE_VERSION "5.0.6"
373| #define PACKAGE_STRING "gnuplot 5.0.6"
374| #define PACKAGE_BUGREPORT ""
375| #define PACKAGE_URL ""
376| #define PACKAGE "gnuplot"
377| #define VERSION "5.0.6"
378| #define PROTOTYPES 1
379| #define STDC_HEADERS 1
380| #define HAVE_SYS_TYPES_H 1
381| #define HAVE_SYS_STAT_H 1
382| #define HAVE_STDLIB_H 1
383| #define HAVE_STRING_H 1
384| #define HAVE_MEMORY_H 1
385| #define HAVE_STRINGS_H 1
386| #define HAVE_INTTYPES_H 1
387| #define HAVE_STDINT_H 1
388| #define HAVE_UNISTD_H 1
389| #define __EXTENSIONS__ 1
390| #define _ALL_SOURCE 1
391| #define _GNU_SOURCE 1
392| #define _POSIX_PTHREAD_SEMANTICS 1
393| #define _TANDEM_SOURCE 1
394| /* end confdefs.h.  */
395| #include <ac_nonexistent.h>
396configure:5763: checking for Objective C compiler version
397configure:5772: /usr/bin/clang --version >&5
398Apple LLVM version 8.1.0 (clang-802.0.38)
399Target: x86_64-apple-darwin16.6.0
400Thread model: posix
401InstalledDir: /Applications/Xcode.app/Contents/Developer/Toolchains/XcodeDefault.xctoolchain/usr/bin
402configure:5783: $? = 0
403configure:5772: /usr/bin/clang -v >&5
404Apple LLVM version 8.1.0 (clang-802.0.38)
405Target: x86_64-apple-darwin16.6.0
406Thread model: posix
407InstalledDir: /Applications/Xcode.app/Contents/Developer/Toolchains/XcodeDefault.xctoolchain/usr/bin
408configure:5783: $? = 0
409configure:5772: /usr/bin/clang -V >&5
410clang: error: argument to '-V' is missing (expected 1 value)
411clang: error: no input files
412configure:5783: $? = 1
413configure:5772: /usr/bin/clang -qversion >&5
414clang: error: unknown argument: '-qversion'
415clang: error: no input files
416configure:5783: $? = 1
417configure:5787: checking whether we are using the GNU Objective C compiler
418configure:5806: /usr/bin/clang -c -pipe -Os -arch x86_64 -I/opt/local/include conftest.m >&5
419configure:5806: $? = 0
420configure:5815: result: yes
421configure:5824: checking whether /usr/bin/clang accepts -g
422configure:5844: /usr/bin/clang -c -g -I/opt/local/include conftest.m >&5
423configure:5844: $? = 0
424configure:5885: result: yes
425configure:5910: checking dependency style of /usr/bin/clang
426configure:6019: result: gcc3
427configure:6034: checking for an ANSI C-conforming const
428configure:6100: /usr/bin/clang -c -pipe -Os -F/opt/local/Library/Frameworks -arch x86_64 -I/opt/local/include conftest.c >&5
429configure:6100: $? = 0
430configure:6107: result: yes
431configure:6115: checking for inline
432configure:6131: /usr/bin/clang -c -pipe -Os -F/opt/local/Library/Frameworks -arch x86_64 -I/opt/local/include conftest.c >&5
433configure:6131: $? = 0
434configure:6139: result: inline
435configure:6157: checking for preprocessor stringizing operator
436configure:6177: result: yes
437configure:6185: checking whether ln -s works
438configure:6189: result: yes
439configure:6256: checking for gcc
440configure:6283: result: /usr/bin/clang
441configure:6512: checking for C compiler version
442configure:6521: /usr/bin/clang --version >&5
443Apple LLVM version 8.1.0 (clang-802.0.38)
444Target: x86_64-apple-darwin16.6.0
445Thread model: posix
446InstalledDir: /Applications/Xcode.app/Contents/Developer/Toolchains/XcodeDefault.xctoolchain/usr/bin
447configure:6532: $? = 0
448configure:6521: /usr/bin/clang -v >&5
449Apple LLVM version 8.1.0 (clang-802.0.38)
450Target: x86_64-apple-darwin16.6.0
451Thread model: posix
452InstalledDir: /Applications/Xcode.app/Contents/Developer/Toolchains/XcodeDefault.xctoolchain/usr/bin
453configure:6532: $? = 0
454configure:6521: /usr/bin/clang -V >&5
455clang: error: argument to '-V' is missing (expected 1 value)
456clang: error: no input files
457configure:6532: $? = 1
458configure:6521: /usr/bin/clang -qversion >&5
459clang: error: unknown argument: '-qversion'
460clang: error: no input files
461configure:6532: $? = 1
462configure:6536: checking whether we are using the GNU C compiler
463configure:6564: result: yes
464configure:6573: checking whether /usr/bin/clang accepts -g
465configure:6634: result: yes
466configure:6651: checking for /usr/bin/clang option to accept ISO C89
467configure:6727: result: none needed
468configure:6752: checking whether /usr/bin/clang understands -c and -o together
469configure:6789: result: yes
470configure:6808: checking dependency style of /usr/bin/clang
471configure:6919: result: gcc3
472configure:6963: checking for off_t
473configure:6963: /usr/bin/clang -c -pipe -Os -F/opt/local/Library/Frameworks -arch x86_64 -I/opt/local/include conftest.c >&5
474configure:6963: $? = 0
475configure:6963: /usr/bin/clang -c -pipe -Os -F/opt/local/Library/Frameworks -arch x86_64 -I/opt/local/include conftest.c >&5
476conftest.c:64:20: error: expected expression
477if (sizeof ((off_t)))
478                   ^
4791 error generated.
480configure:6963: $? = 1
481configure: failed program was:
482| /* confdefs.h */
483| #define PACKAGE_NAME "gnuplot"
484| #define PACKAGE_TARNAME "gnuplot"
485| #define PACKAGE_VERSION "5.0.6"
486| #define PACKAGE_STRING "gnuplot 5.0.6"
487| #define PACKAGE_BUGREPORT ""
488| #define PACKAGE_URL ""
489| #define PACKAGE "gnuplot"
490| #define VERSION "5.0.6"
491| #define PROTOTYPES 1
492| #define STDC_HEADERS 1
493| #define HAVE_SYS_TYPES_H 1
494| #define HAVE_SYS_STAT_H 1
495| #define HAVE_STDLIB_H 1
496| #define HAVE_STRING_H 1
497| #define HAVE_MEMORY_H 1
498| #define HAVE_STRINGS_H 1
499| #define HAVE_INTTYPES_H 1
500| #define HAVE_STDINT_H 1
501| #define HAVE_UNISTD_H 1
502| #define __EXTENSIONS__ 1
503| #define _ALL_SOURCE 1
504| #define _GNU_SOURCE 1
505| #define _POSIX_PTHREAD_SEMANTICS 1
506| #define _TANDEM_SOURCE 1
507| #define HAVE_STRINGIZE 1
508| /* end confdefs.h.  */
509| #include <stdio.h>
510| #ifdef HAVE_SYS_TYPES_H
511| # include <sys/types.h>
512| #endif
513| #ifdef HAVE_SYS_STAT_H
514| # include <sys/stat.h>
515| #endif
516| #ifdef STDC_HEADERS
517| # include <stdlib.h>
518| # include <stddef.h>
519| #else
520| # ifdef HAVE_STDLIB_H
521| #  include <stdlib.h>
522| # endif
523| #endif
524| #ifdef HAVE_STRING_H
525| # if !defined STDC_HEADERS && defined HAVE_MEMORY_H
526| #  include <memory.h>
527| # endif
528| # include <string.h>
529| #endif
530| #ifdef HAVE_STRINGS_H
531| # include <strings.h>
532| #endif
533| #ifdef HAVE_INTTYPES_H
534| # include <inttypes.h>
535| #endif
536| #ifdef HAVE_STDINT_H
537| # include <stdint.h>
538| #endif
539| #ifdef HAVE_UNISTD_H
540| # include <unistd.h>
541| #endif
542| int
543| main ()
544| {
545| if (sizeof ((off_t)))
546|           return 0;
547|   ;
548|   return 0;
549| }
550configure:6963: result: yes
551configure:6973: checking for _LARGEFILE_SOURCE value needed for large files
552configure:6992: /usr/bin/clang -o conftest -pipe -Os -F/opt/local/Library/Frameworks -arch x86_64 -I/opt/local/include -L/opt/local/lib -Wl,-headerpad_max_install_names -F/opt/local/Library/Frameworks -arch x86_64 conftest.c  >&5
553configure:6992: $? = 0
554configure:7020: result: no
555configure:7048: checking for special C compiler options needed for large files
556configure:7093: result: no
557configure:7099: checking for _FILE_OFFSET_BITS value needed for large files
558configure:7124: /usr/bin/clang -c -pipe -Os -F/opt/local/Library/Frameworks -arch x86_64 -I/opt/local/include conftest.c >&5
559configure:7124: $? = 0
560configure:7156: result: no
561configure:7301: checking for pkg-config
562configure:7319: found /opt/local/bin/pkg-config
563configure:7331: result: /opt/local/bin/pkg-config
564configure:7356: checking pkg-config is at least version 0.9.0
565configure:7359: result: yes
566configure:7370: checking for LIBCERF
567configure:7378: $PKG_CONFIG --exists --print-errors "libcerf"
568configure:7381: $? = 0
569configure:7396: $PKG_CONFIG --exists --print-errors "libcerf"
570configure:7399: $? = 0
571configure:7475: result: yes
572configure:7482: checking for library containing cdawson
573configure:7513: /usr/bin/clang -o conftest -pipe -Os -F/opt/local/Library/Frameworks -arch x86_64 -I/opt/local/include  -L/opt/local/lib -Wl,-headerpad_max_install_names -F/opt/local/Library/Frameworks -arch x86_64 -L/opt/local/lib -lcerf conftest.c  >&5
574configure:7513: $? = 0
575configure:7530: result: none required
576configure:7549: checking for emacs
577configure:7565: found /usr/bin/emacs
578configure:7576: result: emacs
579configure:7788: checking for dvips
580configure:7818: result: no
581configure:7831: checking for troff
582configure:7847: found /usr/bin/troff
583configure:7858: result: troff
584configure:7883: checking for kpsexpand
585configure:7913: result: no
586configure:7926: checking for texhash
587configure:7956: result: no
588configure:7993: checking for X
589configure:8101: /usr/bin/clang -E -I/opt/local/include  conftest.c
590configure:8101: $? = 0
591configure:8132: /usr/bin/clang -o conftest -pipe -Os -F/opt/local/Library/Frameworks -arch x86_64 -I/opt/local/include  -L/opt/local/lib -Wl,-headerpad_max_install_names -F/opt/local/Library/Frameworks -arch x86_64 -L/opt/local/lib -lcerf conftest.c -lX11  >&5
592configure:8132: $? = 0
593configure:8182: result: libraries , headers
594configure:8281: /usr/bin/clang -o conftest -pipe -Os -F/opt/local/Library/Frameworks -arch x86_64 -I/opt/local/include  -L/opt/local/lib -Wl,-headerpad_max_install_names -F/opt/local/Library/Frameworks -arch x86_64 -L/opt/local/lib -lcerf conftest.c   -lX11 >&5
595configure:8281: $? = 0
596configure:8379: checking for gethostbyname
597configure:8379: /usr/bin/clang -o conftest -pipe -Os -F/opt/local/Library/Frameworks -arch x86_64 -I/opt/local/include  -L/opt/local/lib -Wl,-headerpad_max_install_names -F/opt/local/Library/Frameworks -arch x86_64 -L/opt/local/lib -lcerf conftest.c  >&5
598configure:8379: $? = 0
599configure:8379: result: yes
600configure:8476: checking for connect
601configure:8476: /usr/bin/clang -o conftest -pipe -Os -F/opt/local/Library/Frameworks -arch x86_64 -I/opt/local/include  -L/opt/local/lib -Wl,-headerpad_max_install_names -F/opt/local/Library/Frameworks -arch x86_64 -L/opt/local/lib -lcerf conftest.c  >&5
602configure:8476: $? = 0
603configure:8476: result: yes
604configure:8525: checking for remove
605configure:8525: /usr/bin/clang -o conftest -pipe -Os -F/opt/local/Library/Frameworks -arch x86_64 -I/opt/local/include  -L/opt/local/lib -Wl,-headerpad_max_install_names -F/opt/local/Library/Frameworks -arch x86_64 -L/opt/local/lib -lcerf conftest.c  >&5
606configure:8525: $? = 0
607configure:8525: result: yes
608configure:8574: checking for shmat
609configure:8574: /usr/bin/clang -o conftest -pipe -Os -F/opt/local/Library/Frameworks -arch x86_64 -I/opt/local/include  -L/opt/local/lib -Wl,-headerpad_max_install_names -F/opt/local/Library/Frameworks -arch x86_64 -L/opt/local/lib -lcerf conftest.c  >&5
610configure:8574: $? = 0
611configure:8574: result: yes
612configure:8632: checking for IceConnectionNumber in -lICE
613configure:8657: /usr/bin/clang -o conftest -pipe -Os -F/opt/local/Library/Frameworks -arch x86_64 -I/opt/local/include  -L/opt/local/lib -Wl,-headerpad_max_install_names -F/opt/local/Library/Frameworks -arch x86_64 -L/opt/local/lib -lcerf conftest.c -lICE   >&5
614configure:8657: $? = 0
615configure:8666: result: yes
616configure:8747: checking for MS-DOS/djgpp/libGRX
617configure:8856: result: no
618configure:8863: checking for NeXT
619configure:8880: result: no
620configure:8889: checking for Mac OS X
621configure:8902: result: yes
622configure:8910: checking for AquaTerm framework presence
623configure:8931: /usr/bin/clang -o conftest -pipe -Os -arch x86_64 -I/opt/local/include   -L/opt/local/lib -Wl,-headerpad_max_install_names -F/opt/local/Library/Frameworks -arch x86_64 -L/opt/local/lib -lcerf -framework Foundation -framework AquaTerm conftest.m  >&5
624configure:8931: $? = 0
625configure:8949: result: yes
626configure:8971: checking for BeOS
627configure:8987: result: no
628configure:8993: checking for Alpha/AXP CPU
629configure:9012: result: no
630configure:9027: checking for sin
631configure:9027: /usr/bin/clang -o conftest -pipe -Os -F/opt/local/Library/Frameworks -arch x86_64 -ObjC -I/opt/local/include   -L/opt/local/lib -Wl,-headerpad_max_install_names -F/opt/local/Library/Frameworks -arch x86_64 -L/opt/local/lib -lcerf -framework Foundation -framework AquaTerm conftest.c  >&5
632conftest.c:56:6: warning: incompatible redeclaration of library function 'sin' [-Wincompatible-library-redeclaration]
633char sin ();
634     ^
635conftest.c:56:6: note: 'sin' is a builtin with type 'double (double)'
6361 warning generated.
637configure:9027: $? = 0
638configure:9027: result: yes
639configure:9079: checking for ANSI C header files
640configure:9183: result: yes
641configure:9201: checking dirent.h usability
642configure:9201: /usr/bin/clang -c -pipe -Os -F/opt/local/Library/Frameworks -arch x86_64 -ObjC -I/opt/local/include   conftest.c >&5
643configure:9201: $? = 0
644configure:9201: result: yes
645configure:9201: checking dirent.h presence
646configure:9201: /usr/bin/clang -E -I/opt/local/include   conftest.c
647configure:9201: $? = 0
648configure:9201: result: yes
649configure:9201: checking for dirent.h
650configure:9201: result: yes
651configure:9201: checking errno.h usability
652configure:9201: /usr/bin/clang -c -pipe -Os -F/opt/local/Library/Frameworks -arch x86_64 -ObjC -I/opt/local/include   conftest.c >&5
653configure:9201: $? = 0
654configure:9201: result: yes
655configure:9201: checking errno.h presence
656configure:9201: /usr/bin/clang -E -I/opt/local/include   conftest.c
657configure:9201: $? = 0
658configure:9201: result: yes
659configure:9201: checking for errno.h
660configure:9201: result: yes
661configure:9201: checking float.h usability
662configure:9201: /usr/bin/clang -c -pipe -Os -F/opt/local/Library/Frameworks -arch x86_64 -ObjC -I/opt/local/include   conftest.c >&5
663configure:9201: $? = 0
664configure:9201: result: yes
665configure:9201: checking float.h presence
666configure:9201: /usr/bin/clang -E -I/opt/local/include   conftest.c
667configure:9201: $? = 0
668configure:9201: result: yes
669configure:9201: checking for float.h
670configure:9201: result: yes
671configure:9201: checking langinfo.h usability
672configure:9201: /usr/bin/clang -c -pipe -Os -F/opt/local/Library/Frameworks -arch x86_64 -ObjC -I/opt/local/include   conftest.c >&5
673configure:9201: $? = 0
674configure:9201: result: yes
675configure:9201: checking langinfo.h presence
676configure:9201: /usr/bin/clang -E -I/opt/local/include   conftest.c
677configure:9201: $? = 0
678configure:9201: result: yes
679configure:9201: checking for langinfo.h
680configure:9201: result: yes
681configure:9201: checking limits.h usability
682configure:9201: /usr/bin/clang -c -pipe -Os -F/opt/local/Library/Frameworks -arch x86_64 -ObjC -I/opt/local/include   conftest.c >&5
683configure:9201: $? = 0
684configure:9201: result: yes
685configure:9201: checking limits.h presence
686configure:9201: /usr/bin/clang -E -I/opt/local/include   conftest.c
687configure:9201: $? = 0
688configure:9201: result: yes
689configure:9201: checking for limits.h
690configure:9201: result: yes
691configure:9201: checking locale.h usability
692configure:9201: /usr/bin/clang -c -pipe -Os -F/opt/local/Library/Frameworks -arch x86_64 -ObjC -I/opt/local/include   conftest.c >&5
693configure:9201: $? = 0
694configure:9201: result: yes
695configure:9201: checking locale.h presence
696configure:9201: /usr/bin/clang -E -I/opt/local/include   conftest.c
697configure:9201: $? = 0
698configure:9201: result: yes
699configure:9201: checking for locale.h
700configure:9201: result: yes
701configure:9201: checking math.h usability
702configure:9201: /usr/bin/clang -c -pipe -Os -F/opt/local/Library/Frameworks -arch x86_64 -ObjC -I/opt/local/include   conftest.c >&5
703configure:9201: $? = 0
704configure:9201: result: yes
705configure:9201: checking math.h presence
706configure:9201: /usr/bin/clang -E -I/opt/local/include   conftest.c
707configure:9201: $? = 0
708configure:9201: result: yes
709configure:9201: checking for math.h
710configure:9201: result: yes
711configure:9201: checking for stdlib.h
712configure:9201: result: yes
713configure:9201: checking for string.h
714configure:9201: result: yes
715configure:9201: checking time.h usability
716configure:9201: /usr/bin/clang -c -pipe -Os -F/opt/local/Library/Frameworks -arch x86_64 -ObjC -I/opt/local/include   conftest.c >&5
717configure:9201: $? = 0
718configure:9201: result: yes
719configure:9201: checking time.h presence
720configure:9201: /usr/bin/clang -E -I/opt/local/include   conftest.c
721configure:9201: $? = 0
722configure:9201: result: yes
723configure:9201: checking for time.h
724configure:9201: result: yes
725configure:9201: checking sys/time.h usability
726configure:9201: /usr/bin/clang -c -pipe -Os -F/opt/local/Library/Frameworks -arch x86_64 -ObjC -I/opt/local/include   conftest.c >&5
727configure:9201: $? = 0
728configure:9201: result: yes
729configure:9201: checking sys/time.h presence
730configure:9201: /usr/bin/clang -E -I/opt/local/include   conftest.c
731configure:9201: $? = 0
732configure:9201: result: yes
733configure:9201: checking for sys/time.h
734configure:9201: result: yes
735configure:9201: checking for sys/types.h
736configure:9201: result: yes
737configure:9201: checking sys/bsdtypes.h usability
738configure:9201: /usr/bin/clang -c -pipe -Os -F/opt/local/Library/Frameworks -arch x86_64 -ObjC -I/opt/local/include   conftest.c >&5
739conftest.c:79:10: fatal error: 'sys/bsdtypes.h' file not found
740#include <sys/bsdtypes.h>
741         ^
7421 error generated.
743configure:9201: $? = 1
744configure: failed program was:
745| /* confdefs.h */
746| #define PACKAGE_NAME "gnuplot"
747| #define PACKAGE_TARNAME "gnuplot"
748| #define PACKAGE_VERSION "5.0.6"
749| #define PACKAGE_STRING "gnuplot 5.0.6"
750| #define PACKAGE_BUGREPORT ""
751| #define PACKAGE_URL ""
752| #define PACKAGE "gnuplot"
753| #define VERSION "5.0.6"
754| #define PROTOTYPES 1
755| #define STDC_HEADERS 1
756| #define HAVE_SYS_TYPES_H 1
757| #define HAVE_SYS_STAT_H 1
758| #define HAVE_STDLIB_H 1
759| #define HAVE_STRING_H 1
760| #define HAVE_MEMORY_H 1
761| #define HAVE_STRINGS_H 1
762| #define HAVE_INTTYPES_H 1
763| #define HAVE_STDINT_H 1
764| #define HAVE_UNISTD_H 1
765| #define __EXTENSIONS__ 1
766| #define _ALL_SOURCE 1
767| #define _GNU_SOURCE 1
768| #define _POSIX_PTHREAD_SEMANTICS 1
769| #define _TANDEM_SOURCE 1
770| #define HAVE_STRINGIZE 1
771| #define HAVE_OFF_T 1
772| #define HAVE_FSEEKO 1
773| #define HAVE_LIBCERF 1
774| #define X11 1
775| #define HAVE_FRAMEWORK_AQUATERM 1
776| #define STDC_HEADERS 1
777| #define HAVE_DIRENT_H 1
778| #define HAVE_ERRNO_H 1
779| #define HAVE_FLOAT_H 1
780| #define HAVE_LANGINFO_H 1
781| #define HAVE_LIMITS_H 1
782| #define HAVE_LOCALE_H 1
783| #define HAVE_MATH_H 1
784| #define HAVE_STDLIB_H 1
785| #define HAVE_STRING_H 1
786| #define HAVE_TIME_H 1
787| #define HAVE_SYS_TIME_H 1
788| #define HAVE_SYS_TYPES_H 1
789| /* end confdefs.h.  */
790| #include <stdio.h>
791| #ifdef HAVE_SYS_TYPES_H
792| # include <sys/types.h>
793| #endif
794| #ifdef HAVE_SYS_STAT_H
795| # include <sys/stat.h>
796| #endif
797| #ifdef STDC_HEADERS
798| # include <stdlib.h>
799| # include <stddef.h>
800| #else
801| # ifdef HAVE_STDLIB_H
802| #  include <stdlib.h>
803| # endif
804| #endif
805| #ifdef HAVE_STRING_H
806| # if !defined STDC_HEADERS && defined HAVE_MEMORY_H
807| #  include <memory.h>
808| # endif
809| # include <string.h>
810| #endif
811| #ifdef HAVE_STRINGS_H
812| # include <strings.h>
813| #endif
814| #ifdef HAVE_INTTYPES_H
815| # include <inttypes.h>
816| #endif
817| #ifdef HAVE_STDINT_H
818| # include <stdint.h>
819| #endif
820| #ifdef HAVE_UNISTD_H
821| # include <unistd.h>
822| #endif
823| #include <sys/bsdtypes.h>
824configure:9201: result: no
825configure:9201: checking sys/bsdtypes.h presence
826configure:9201: /usr/bin/clang -E -I/opt/local/include   conftest.c
827conftest.c:46:10: fatal error: 'sys/bsdtypes.h' file not found
828#include <sys/bsdtypes.h>
829         ^
8301 error generated.
831configure:9201: $? = 1
832configure: failed program was:
833| /* confdefs.h */
834| #define PACKAGE_NAME "gnuplot"
835| #define PACKAGE_TARNAME "gnuplot"
836| #define PACKAGE_VERSION "5.0.6"
837| #define PACKAGE_STRING "gnuplot 5.0.6"
838| #define PACKAGE_BUGREPORT ""
839| #define PACKAGE_URL ""
840| #define PACKAGE "gnuplot"
841| #define VERSION "5.0.6"
842| #define PROTOTYPES 1
843| #define STDC_HEADERS 1
844| #define HAVE_SYS_TYPES_H 1
845| #define HAVE_SYS_STAT_H 1
846| #define HAVE_STDLIB_H 1
847| #define HAVE_STRING_H 1
848| #define HAVE_MEMORY_H 1
849| #define HAVE_STRINGS_H 1
850| #define HAVE_INTTYPES_H 1
851| #define HAVE_STDINT_H 1
852| #define HAVE_UNISTD_H 1
853| #define __EXTENSIONS__ 1
854| #define _ALL_SOURCE 1
855| #define _GNU_SOURCE 1
856| #define _POSIX_PTHREAD_SEMANTICS 1
857| #define _TANDEM_SOURCE 1
858| #define HAVE_STRINGIZE 1
859| #define HAVE_OFF_T 1
860| #define HAVE_FSEEKO 1
861| #define HAVE_LIBCERF 1
862| #define X11 1
863| #define HAVE_FRAMEWORK_AQUATERM 1
864| #define STDC_HEADERS 1
865| #define HAVE_DIRENT_H 1
866| #define HAVE_ERRNO_H 1
867| #define HAVE_FLOAT_H 1
868| #define HAVE_LANGINFO_H 1
869| #define HAVE_LIMITS_H 1
870| #define HAVE_LOCALE_H 1
871| #define HAVE_MATH_H 1
872| #define HAVE_STDLIB_H 1
873| #define HAVE_STRING_H 1
874| #define HAVE_TIME_H 1
875| #define HAVE_SYS_TIME_H 1
876| #define HAVE_SYS_TYPES_H 1
877| /* end confdefs.h.  */
878| #include <sys/bsdtypes.h>
879configure:9201: result: no
880configure:9201: checking for sys/bsdtypes.h
881configure:9201: result: no
882configure:9201: checking sys/ioctl.h usability
883configure:9201: /usr/bin/clang -c -pipe -Os -F/opt/local/Library/Frameworks -arch x86_64 -ObjC -I/opt/local/include   conftest.c >&5
884configure:9201: $? = 0
885configure:9201: result: yes
886configure:9201: checking sys/ioctl.h presence
887configure:9201: /usr/bin/clang -E -I/opt/local/include   conftest.c
888configure:9201: $? = 0
889configure:9201: result: yes
890configure:9201: checking for sys/ioctl.h
891configure:9201: result: yes
892configure:9201: checking sys/param.h usability
893configure:9201: /usr/bin/clang -c -pipe -Os -F/opt/local/Library/Frameworks -arch x86_64 -ObjC -I/opt/local/include   conftest.c >&5
894configure:9201: $? = 0
895configure:9201: result: yes
896configure:9201: checking sys/param.h presence
897configure:9201: /usr/bin/clang -E -I/opt/local/include   conftest.c
898configure:9201: $? = 0
899configure:9201: result: yes
900configure:9201: checking for sys/param.h
901configure:9201: result: yes
902configure:9201: checking sys/select.h usability
903configure:9201: /usr/bin/clang -c -pipe -Os -F/opt/local/Library/Frameworks -arch x86_64 -ObjC -I/opt/local/include   conftest.c >&5
904configure:9201: $? = 0
905configure:9201: result: yes
906configure:9201: checking sys/select.h presence
907configure:9201: /usr/bin/clang -E -I/opt/local/include   conftest.c
908configure:9201: $? = 0
909configure:9201: result: yes
910configure:9201: checking for sys/select.h
911configure:9201: result: yes
912configure:9201: checking sys/socket.h usability
913configure:9201: /usr/bin/clang -c -pipe -Os -F/opt/local/Library/Frameworks -arch x86_64 -ObjC -I/opt/local/include   conftest.c >&5
914configure:9201: $? = 0
915configure:9201: result: yes
916configure:9201: checking sys/socket.h presence
917configure:9201: /usr/bin/clang -E -I/opt/local/include   conftest.c
918configure:9201: $? = 0
919configure:9201: result: yes
920configure:9201: checking for sys/socket.h
921configure:9201: result: yes
922configure:9201: checking for sys/stat.h
923configure:9201: result: yes
924configure:9201: checking sys/systeminfo.h usability
925configure:9201: /usr/bin/clang -c -pipe -Os -F/opt/local/Library/Frameworks -arch x86_64 -ObjC -I/opt/local/include   conftest.c >&5
926conftest.c:84:10: fatal error: 'sys/systeminfo.h' file not found
927#include <sys/systeminfo.h>
928         ^
9291 error generated.
930configure:9201: $? = 1
931configure: failed program was:
932| /* confdefs.h */
933| #define PACKAGE_NAME "gnuplot"
934| #define PACKAGE_TARNAME "gnuplot"
935| #define PACKAGE_VERSION "5.0.6"
936| #define PACKAGE_STRING "gnuplot 5.0.6"
937| #define PACKAGE_BUGREPORT ""
938| #define PACKAGE_URL ""
939| #define PACKAGE "gnuplot"
940| #define VERSION "5.0.6"
941| #define PROTOTYPES 1
942| #define STDC_HEADERS 1
943| #define HAVE_SYS_TYPES_H 1
944| #define HAVE_SYS_STAT_H 1
945| #define HAVE_STDLIB_H 1
946| #define HAVE_STRING_H 1
947| #define HAVE_MEMORY_H 1
948| #define HAVE_STRINGS_H 1
949| #define HAVE_INTTYPES_H 1
950| #define HAVE_STDINT_H 1
951| #define HAVE_UNISTD_H 1
952| #define __EXTENSIONS__ 1
953| #define _ALL_SOURCE 1
954| #define _GNU_SOURCE 1
955| #define _POSIX_PTHREAD_SEMANTICS 1
956| #define _TANDEM_SOURCE 1
957| #define HAVE_STRINGIZE 1
958| #define HAVE_OFF_T 1
959| #define HAVE_FSEEKO 1
960| #define HAVE_LIBCERF 1
961| #define X11 1
962| #define HAVE_FRAMEWORK_AQUATERM 1
963| #define STDC_HEADERS 1
964| #define HAVE_DIRENT_H 1
965| #define HAVE_ERRNO_H 1
966| #define HAVE_FLOAT_H 1
967| #define HAVE_LANGINFO_H 1
968| #define HAVE_LIMITS_H 1
969| #define HAVE_LOCALE_H 1
970| #define HAVE_MATH_H 1
971| #define HAVE_STDLIB_H 1
972| #define HAVE_STRING_H 1
973| #define HAVE_TIME_H 1
974| #define HAVE_SYS_TIME_H 1
975| #define HAVE_SYS_TYPES_H 1
976| #define HAVE_SYS_IOCTL_H 1
977| #define HAVE_SYS_PARAM_H 1
978| #define HAVE_SYS_SELECT_H 1
979| #define HAVE_SYS_SOCKET_H 1
980| #define HAVE_SYS_STAT_H 1
981| /* end confdefs.h.  */
982| #include <stdio.h>
983| #ifdef HAVE_SYS_TYPES_H
984| # include <sys/types.h>
985| #endif
986| #ifdef HAVE_SYS_STAT_H
987| # include <sys/stat.h>
988| #endif
989| #ifdef STDC_HEADERS
990| # include <stdlib.h>
991| # include <stddef.h>
992| #else
993| # ifdef HAVE_STDLIB_H
994| #  include <stdlib.h>
995| # endif
996| #endif
997| #ifdef HAVE_STRING_H
998| # if !defined STDC_HEADERS && defined HAVE_MEMORY_H
999| #  include <memory.h>
1000| # endif
1001| # include <string.h>
1002| #endif
1003| #ifdef HAVE_STRINGS_H
1004| # include <strings.h>
1005| #endif
1006| #ifdef HAVE_INTTYPES_H
1007| # include <inttypes.h>
1008| #endif
1009| #ifdef HAVE_STDINT_H
1010| # include <stdint.h>
1011| #endif
1012| #ifdef HAVE_UNISTD_H
1013| # include <unistd.h>
1014| #endif
1015| #include <sys/systeminfo.h>
1016configure:9201: result: no
1017configure:9201: checking sys/systeminfo.h presence
1018configure:9201: /usr/bin/clang -E -I/opt/local/include   conftest.c
1019conftest.c:51:10: fatal error: 'sys/systeminfo.h' file not found
1020#include <sys/systeminfo.h>
1021         ^
10221 error generated.
1023configure:9201: $? = 1
1024configure: failed program was:
1025| /* confdefs.h */
1026| #define PACKAGE_NAME "gnuplot"
1027| #define PACKAGE_TARNAME "gnuplot"
1028| #define PACKAGE_VERSION "5.0.6"
1029| #define PACKAGE_STRING "gnuplot 5.0.6"
1030| #define PACKAGE_BUGREPORT ""
1031| #define PACKAGE_URL ""
1032| #define PACKAGE "gnuplot"
1033| #define VERSION "5.0.6"
1034| #define PROTOTYPES 1
1035| #define STDC_HEADERS 1
1036| #define HAVE_SYS_TYPES_H 1
1037| #define HAVE_SYS_STAT_H 1
1038| #define HAVE_STDLIB_H 1
1039| #define HAVE_STRING_H 1
1040| #define HAVE_MEMORY_H 1
1041| #define HAVE_STRINGS_H 1
1042| #define HAVE_INTTYPES_H 1
1043| #define HAVE_STDINT_H 1
1044| #define HAVE_UNISTD_H 1
1045| #define __EXTENSIONS__ 1
1046| #define _ALL_SOURCE 1
1047| #define _GNU_SOURCE 1
1048| #define _POSIX_PTHREAD_SEMANTICS 1
1049| #define _TANDEM_SOURCE 1
1050| #define HAVE_STRINGIZE 1
1051| #define HAVE_OFF_T 1
1052| #define HAVE_FSEEKO 1
1053| #define HAVE_LIBCERF 1
1054| #define X11 1
1055| #define HAVE_FRAMEWORK_AQUATERM 1
1056| #define STDC_HEADERS 1
1057| #define HAVE_DIRENT_H 1
1058| #define HAVE_ERRNO_H 1
1059| #define HAVE_FLOAT_H 1
1060| #define HAVE_LANGINFO_H 1
1061| #define HAVE_LIMITS_H 1
1062| #define HAVE_LOCALE_H 1
1063| #define HAVE_MATH_H 1
1064| #define HAVE_STDLIB_H 1
1065| #define HAVE_STRING_H 1
1066| #define HAVE_TIME_H 1
1067| #define HAVE_SYS_TIME_H 1
1068| #define HAVE_SYS_TYPES_H 1
1069| #define HAVE_SYS_IOCTL_H 1
1070| #define HAVE_SYS_PARAM_H 1
1071| #define HAVE_SYS_SELECT_H 1
1072| #define HAVE_SYS_SOCKET_H 1
1073| #define HAVE_SYS_STAT_H 1
1074| /* end confdefs.h.  */
1075| #include <sys/systeminfo.h>
1076configure:9201: result: no
1077configure:9201: checking for sys/systeminfo.h
1078configure:9201: result: no
1079configure:9201: checking sys/timeb.h usability
1080configure:9201: /usr/bin/clang -c -pipe -Os -F/opt/local/Library/Frameworks -arch x86_64 -ObjC -I/opt/local/include   conftest.c >&5
1081configure:9201: $? = 0
1082configure:9201: result: yes
1083configure:9201: checking sys/timeb.h presence
1084configure:9201: /usr/bin/clang -E -I/opt/local/include   conftest.c
1085configure:9201: $? = 0
1086configure:9201: result: yes
1087configure:9201: checking for sys/timeb.h
1088configure:9201: result: yes
1089configure:9201: checking sys/utsname.h usability
1090configure:9201: /usr/bin/clang -c -pipe -Os -F/opt/local/Library/Frameworks -arch x86_64 -ObjC -I/opt/local/include   conftest.c >&5
1091configure:9201: $? = 0
1092configure:9201: result: yes
1093configure:9201: checking sys/utsname.h presence
1094configure:9201: /usr/bin/clang -E -I/opt/local/include   conftest.c
1095configure:9201: $? = 0
1096configure:9201: result: yes
1097configure:9201: checking for sys/utsname.h
1098configure:9201: result: yes
1099configure:9201: checking libc.h usability
1100configure:9201: /usr/bin/clang -c -pipe -Os -F/opt/local/Library/Frameworks -arch x86_64 -ObjC -I/opt/local/include   conftest.c >&5
1101configure:9201: $? = 0
1102configure:9201: result: yes
1103configure:9201: checking libc.h presence
1104configure:9201: /usr/bin/clang -E -I/opt/local/include   conftest.c
1105configure:9201: $? = 0
1106configure:9201: result: yes
1107configure:9201: checking for libc.h
1108configure:9201: result: yes
1109configure:9201: checking malloc.h usability
1110configure:9201: /usr/bin/clang -c -pipe -Os -F/opt/local/Library/Frameworks -arch x86_64 -ObjC -I/opt/local/include   conftest.c >&5
1111conftest.c:87:10: fatal error: 'malloc.h' file not found
1112#include <malloc.h>
1113         ^
11141 error generated.
1115configure:9201: $? = 1
1116configure: failed program was:
1117| /* confdefs.h */
1118| #define PACKAGE_NAME "gnuplot"
1119| #define PACKAGE_TARNAME "gnuplot"
1120| #define PACKAGE_VERSION "5.0.6"
1121| #define PACKAGE_STRING "gnuplot 5.0.6"
1122| #define PACKAGE_BUGREPORT ""
1123| #define PACKAGE_URL ""
1124| #define PACKAGE "gnuplot"
1125| #define VERSION "5.0.6"
1126| #define PROTOTYPES 1
1127| #define STDC_HEADERS 1
1128| #define HAVE_SYS_TYPES_H 1
1129| #define HAVE_SYS_STAT_H 1
1130| #define HAVE_STDLIB_H 1
1131| #define HAVE_STRING_H 1
1132| #define HAVE_MEMORY_H 1
1133| #define HAVE_STRINGS_H 1
1134| #define HAVE_INTTYPES_H 1
1135| #define HAVE_STDINT_H 1
1136| #define HAVE_UNISTD_H 1
1137| #define __EXTENSIONS__ 1
1138| #define _ALL_SOURCE 1
1139| #define _GNU_SOURCE 1
1140| #define _POSIX_PTHREAD_SEMANTICS 1
1141| #define _TANDEM_SOURCE 1
1142| #define HAVE_STRINGIZE 1
1143| #define HAVE_OFF_T 1
1144| #define HAVE_FSEEKO 1
1145| #define HAVE_LIBCERF 1
1146| #define X11 1
1147| #define HAVE_FRAMEWORK_AQUATERM 1
1148| #define STDC_HEADERS 1
1149| #define HAVE_DIRENT_H 1
1150| #define HAVE_ERRNO_H 1
1151| #define HAVE_FLOAT_H 1
1152| #define HAVE_LANGINFO_H 1
1153| #define HAVE_LIMITS_H 1
1154| #define HAVE_LOCALE_H 1
1155| #define HAVE_MATH_H 1
1156| #define HAVE_STDLIB_H 1
1157| #define HAVE_STRING_H 1
1158| #define HAVE_TIME_H 1
1159| #define HAVE_SYS_TIME_H 1
1160| #define HAVE_SYS_TYPES_H 1
1161| #define HAVE_SYS_IOCTL_H 1
1162| #define HAVE_SYS_PARAM_H 1
1163| #define HAVE_SYS_SELECT_H 1
1164| #define HAVE_SYS_SOCKET_H 1
1165| #define HAVE_SYS_STAT_H 1
1166| #define HAVE_SYS_TIMEB_H 1
1167| #define HAVE_SYS_UTSNAME_H 1
1168| #define HAVE_LIBC_H 1
1169| /* end confdefs.h.  */
1170| #include <stdio.h>
1171| #ifdef HAVE_SYS_TYPES_H
1172| # include <sys/types.h>
1173| #endif
1174| #ifdef HAVE_SYS_STAT_H
1175| # include <sys/stat.h>
1176| #endif
1177| #ifdef STDC_HEADERS
1178| # include <stdlib.h>
1179| # include <stddef.h>
1180| #else
1181| # ifdef HAVE_STDLIB_H
1182| #  include <stdlib.h>
1183| # endif
1184| #endif
1185| #ifdef HAVE_STRING_H
1186| # if !defined STDC_HEADERS && defined HAVE_MEMORY_H
1187| #  include <memory.h>
1188| # endif
1189| # include <string.h>
1190| #endif
1191| #ifdef HAVE_STRINGS_H
1192| # include <strings.h>
1193| #endif
1194| #ifdef HAVE_INTTYPES_H
1195| # include <inttypes.h>
1196| #endif
1197| #ifdef HAVE_STDINT_H
1198| # include <stdint.h>
1199| #endif
1200| #ifdef HAVE_UNISTD_H
1201| # include <unistd.h>
1202| #endif
1203| #include <malloc.h>
1204configure:9201: result: no
1205configure:9201: checking malloc.h presence
1206configure:9201: /usr/bin/clang -E -I/opt/local/include   conftest.c
1207conftest.c:54:10: fatal error: 'malloc.h' file not found
1208#include <malloc.h>
1209         ^
12101 error generated.
1211configure:9201: $? = 1
1212configure: failed program was:
1213| /* confdefs.h */
1214| #define PACKAGE_NAME "gnuplot"
1215| #define PACKAGE_TARNAME "gnuplot"
1216| #define PACKAGE_VERSION "5.0.6"
1217| #define PACKAGE_STRING "gnuplot 5.0.6"
1218| #define PACKAGE_BUGREPORT ""
1219| #define PACKAGE_URL ""
1220| #define PACKAGE "gnuplot"
1221| #define VERSION "5.0.6"
1222| #define PROTOTYPES 1
1223| #define STDC_HEADERS 1
1224| #define HAVE_SYS_TYPES_H 1
1225| #define HAVE_SYS_STAT_H 1
1226| #define HAVE_STDLIB_H 1
1227| #define HAVE_STRING_H 1
1228| #define HAVE_MEMORY_H 1
1229| #define HAVE_STRINGS_H 1
1230| #define HAVE_INTTYPES_H 1
1231| #define HAVE_STDINT_H 1
1232| #define HAVE_UNISTD_H 1
1233| #define __EXTENSIONS__ 1
1234| #define _ALL_SOURCE 1
1235| #define _GNU_SOURCE 1
1236| #define _POSIX_PTHREAD_SEMANTICS 1
1237| #define _TANDEM_SOURCE 1
1238| #define HAVE_STRINGIZE 1
1239| #define HAVE_OFF_T 1
1240| #define HAVE_FSEEKO 1
1241| #define HAVE_LIBCERF 1
1242| #define X11 1
1243| #define HAVE_FRAMEWORK_AQUATERM 1
1244| #define STDC_HEADERS 1
1245| #define HAVE_DIRENT_H 1
1246| #define HAVE_ERRNO_H 1
1247| #define HAVE_FLOAT_H 1
1248| #define HAVE_LANGINFO_H 1
1249| #define HAVE_LIMITS_H 1
1250| #define HAVE_LOCALE_H 1
1251| #define HAVE_MATH_H 1
1252| #define HAVE_STDLIB_H 1
1253| #define HAVE_STRING_H 1
1254| #define HAVE_TIME_H 1
1255| #define HAVE_SYS_TIME_H 1
1256| #define HAVE_SYS_TYPES_H 1
1257| #define HAVE_SYS_IOCTL_H 1
1258| #define HAVE_SYS_PARAM_H 1
1259| #define HAVE_SYS_SELECT_H 1
1260| #define HAVE_SYS_SOCKET_H 1
1261| #define HAVE_SYS_STAT_H 1
1262| #define HAVE_SYS_TIMEB_H 1
1263| #define HAVE_SYS_UTSNAME_H 1
1264| #define HAVE_LIBC_H 1
1265| /* end confdefs.h.  */
1266| #include <malloc.h>
1267configure:9201: result: no
1268configure:9201: checking for malloc.h
1269configure:9201: result: no
1270configure:9201: checking poll.h usability
1271configure:9201: /usr/bin/clang -c -pipe -Os -F/opt/local/Library/Frameworks -arch x86_64 -ObjC -I/opt/local/include   conftest.c >&5
1272configure:9201: $? = 0
1273configure:9201: result: yes
1274configure:9201: checking poll.h presence
1275configure:9201: /usr/bin/clang -E -I/opt/local/include   conftest.c
1276configure:9201: $? = 0
1277configure:9201: result: yes
1278configure:9201: checking for poll.h
1279configure:9201: result: yes
1280configure:9201: checking sgtty.h usability
1281configure:9201: /usr/bin/clang -c -pipe -Os -F/opt/local/Library/Frameworks -arch x86_64 -ObjC -I/opt/local/include   conftest.c >&5
1282configure:9201: $? = 0
1283configure:9201: result: yes
1284configure:9201: checking sgtty.h presence
1285configure:9201: /usr/bin/clang -E -I/opt/local/include   conftest.c
1286configure:9201: $? = 0
1287configure:9201: result: yes
1288configure:9201: checking for sgtty.h
1289configure:9201: result: yes
1290configure:9201: checking termios.h usability
1291configure:9201: /usr/bin/clang -c -pipe -Os -F/opt/local/Library/Frameworks -arch x86_64 -ObjC -I/opt/local/include   conftest.c >&5
1292configure:9201: $? = 0
1293configure:9201: result: yes
1294configure:9201: checking termios.h presence
1295configure:9201: /usr/bin/clang -E -I/opt/local/include   conftest.c
1296configure:9201: $? = 0
1297configure:9201: result: yes
1298configure:9201: checking for termios.h
1299configure:9201: result: yes
1300configure:9201: checking values.h usability
1301configure:9201: /usr/bin/clang -c -pipe -Os -F/opt/local/Library/Frameworks -arch x86_64 -ObjC -I/opt/local/include   conftest.c >&5
1302conftest.c:90:10: fatal error: 'values.h' file not found
1303#include <values.h>
1304         ^
13051 error generated.
1306configure:9201: $? = 1
1307configure: failed program was:
1308| /* confdefs.h */
1309| #define PACKAGE_NAME "gnuplot"
1310| #define PACKAGE_TARNAME "gnuplot"
1311| #define PACKAGE_VERSION "5.0.6"
1312| #define PACKAGE_STRING "gnuplot 5.0.6"
1313| #define PACKAGE_BUGREPORT ""
1314| #define PACKAGE_URL ""
1315| #define PACKAGE "gnuplot"
1316| #define VERSION "5.0.6"
1317| #define PROTOTYPES 1
1318| #define STDC_HEADERS 1
1319| #define HAVE_SYS_TYPES_H 1
1320| #define HAVE_SYS_STAT_H 1
1321| #define HAVE_STDLIB_H 1
1322| #define HAVE_STRING_H 1
1323| #define HAVE_MEMORY_H 1
1324| #define HAVE_STRINGS_H 1
1325| #define HAVE_INTTYPES_H 1
1326| #define HAVE_STDINT_H 1
1327| #define HAVE_UNISTD_H 1
1328| #define __EXTENSIONS__ 1
1329| #define _ALL_SOURCE 1
1330| #define _GNU_SOURCE 1
1331| #define _POSIX_PTHREAD_SEMANTICS 1
1332| #define _TANDEM_SOURCE 1
1333| #define HAVE_STRINGIZE 1
1334| #define HAVE_OFF_T 1
1335| #define HAVE_FSEEKO 1
1336| #define HAVE_LIBCERF 1
1337| #define X11 1
1338| #define HAVE_FRAMEWORK_AQUATERM 1
1339| #define STDC_HEADERS 1
1340| #define HAVE_DIRENT_H 1
1341| #define HAVE_ERRNO_H 1
1342| #define HAVE_FLOAT_H 1
1343| #define HAVE_LANGINFO_H 1
1344| #define HAVE_LIMITS_H 1
1345| #define HAVE_LOCALE_H 1
1346| #define HAVE_MATH_H 1
1347| #define HAVE_STDLIB_H 1
1348| #define HAVE_STRING_H 1
1349| #define HAVE_TIME_H 1
1350| #define HAVE_SYS_TIME_H 1
1351| #define HAVE_SYS_TYPES_H 1
1352| #define HAVE_SYS_IOCTL_H 1
1353| #define HAVE_SYS_PARAM_H 1
1354| #define HAVE_SYS_SELECT_H 1
1355| #define HAVE_SYS_SOCKET_H 1
1356| #define HAVE_SYS_STAT_H 1
1357| #define HAVE_SYS_TIMEB_H 1
1358| #define HAVE_SYS_UTSNAME_H 1
1359| #define HAVE_LIBC_H 1
1360| #define HAVE_POLL_H 1
1361| #define HAVE_SGTTY_H 1
1362| #define HAVE_TERMIOS_H 1
1363| /* end confdefs.h.  */
1364| #include <stdio.h>
1365| #ifdef HAVE_SYS_TYPES_H
1366| # include <sys/types.h>
1367| #endif
1368| #ifdef HAVE_SYS_STAT_H
1369| # include <sys/stat.h>
1370| #endif
1371| #ifdef STDC_HEADERS
1372| # include <stdlib.h>
1373| # include <stddef.h>
1374| #else
1375| # ifdef HAVE_STDLIB_H
1376| #  include <stdlib.h>
1377| # endif
1378| #endif
1379| #ifdef HAVE_STRING_H
1380| # if !defined STDC_HEADERS && defined HAVE_MEMORY_H
1381| #  include <memory.h>
1382| # endif
1383| # include <string.h>
1384| #endif
1385| #ifdef HAVE_STRINGS_H
1386| # include <strings.h>
1387| #endif
1388| #ifdef HAVE_INTTYPES_H
1389| # include <inttypes.h>
1390| #endif
1391| #ifdef HAVE_STDINT_H
1392| # include <stdint.h>
1393| #endif
1394| #ifdef HAVE_UNISTD_H
1395| # include <unistd.h>
1396| #endif
1397| #include <values.h>
1398configure:9201: result: no
1399configure:9201: checking values.h presence
1400configure:9201: /usr/bin/clang -E -I/opt/local/include   conftest.c
1401conftest.c:57:10: fatal error: 'values.h' file not found
1402#include <values.h>
1403         ^
14041 error generated.
1405configure:9201: $? = 1
1406configure: failed program was:
1407| /* confdefs.h */
1408| #define PACKAGE_NAME "gnuplot"
1409| #define PACKAGE_TARNAME "gnuplot"
1410| #define PACKAGE_VERSION "5.0.6"
1411| #define PACKAGE_STRING "gnuplot 5.0.6"
1412| #define PACKAGE_BUGREPORT ""
1413| #define PACKAGE_URL ""
1414| #define PACKAGE "gnuplot"
1415| #define VERSION "5.0.6"
1416| #define PROTOTYPES 1
1417| #define STDC_HEADERS 1
1418| #define HAVE_SYS_TYPES_H 1
1419| #define HAVE_SYS_STAT_H 1
1420| #define HAVE_STDLIB_H 1
1421| #define HAVE_STRING_H 1
1422| #define HAVE_MEMORY_H 1
1423| #define HAVE_STRINGS_H 1
1424| #define HAVE_INTTYPES_H 1
1425| #define HAVE_STDINT_H 1
1426| #define HAVE_UNISTD_H 1
1427| #define __EXTENSIONS__ 1
1428| #define _ALL_SOURCE 1
1429| #define _GNU_SOURCE 1
1430| #define _POSIX_PTHREAD_SEMANTICS 1
1431| #define _TANDEM_SOURCE 1
1432| #define HAVE_STRINGIZE 1
1433| #define HAVE_OFF_T 1
1434| #define HAVE_FSEEKO 1
1435| #define HAVE_LIBCERF 1
1436| #define X11 1
1437| #define HAVE_FRAMEWORK_AQUATERM 1
1438| #define STDC_HEADERS 1
1439| #define HAVE_DIRENT_H 1
1440| #define HAVE_ERRNO_H 1
1441| #define HAVE_FLOAT_H 1
1442| #define HAVE_LANGINFO_H 1
1443| #define HAVE_LIMITS_H 1
1444| #define HAVE_LOCALE_H 1
1445| #define HAVE_MATH_H 1
1446| #define HAVE_STDLIB_H 1
1447| #define HAVE_STRING_H 1
1448| #define HAVE_TIME_H 1
1449| #define HAVE_SYS_TIME_H 1
1450| #define HAVE_SYS_TYPES_H 1
1451| #define HAVE_SYS_IOCTL_H 1
1452| #define HAVE_SYS_PARAM_H 1
1453| #define HAVE_SYS_SELECT_H 1
1454| #define HAVE_SYS_SOCKET_H 1
1455| #define HAVE_SYS_STAT_H 1
1456| #define HAVE_SYS_TIMEB_H 1
1457| #define HAVE_SYS_UTSNAME_H 1
1458| #define HAVE_LIBC_H 1
1459| #define HAVE_POLL_H 1
1460| #define HAVE_SGTTY_H 1
1461| #define HAVE_TERMIOS_H 1
1462| /* end confdefs.h.  */
1463| #include <values.h>
1464configure:9201: result: no
1465configure:9201: checking for values.h
1466configure:9201: result: no
1467configure:9201: checking for dirent.h
1468configure:9201: result: yes
1469configure:9201: checking dlfcn.h usability
1470configure:9201: /usr/bin/clang -c -pipe -Os -F/opt/local/Library/Frameworks -arch x86_64 -ObjC -I/opt/local/include   conftest.c >&5
1471configure:9201: $? = 0
1472configure:9201: result: yes
1473configure:9201: checking dlfcn.h presence
1474configure:9201: /usr/bin/clang -E -I/opt/local/include   conftest.c
1475configure:9201: $? = 0
1476configure:9201: result: yes
1477configure:9201: checking for dlfcn.h
1478configure:9201: result: yes
1479configure:9201: checking dl.h usability
1480configure:9201: /usr/bin/clang -c -pipe -Os -F/opt/local/Library/Frameworks -arch x86_64 -ObjC -I/opt/local/include   conftest.c >&5
1481conftest.c:92:10: fatal error: 'dl.h' file not found
1482#include <dl.h>
1483         ^
14841 error generated.
1485configure:9201: $? = 1
1486configure: failed program was:
1487| /* confdefs.h */
1488| #define PACKAGE_NAME "gnuplot"
1489| #define PACKAGE_TARNAME "gnuplot"
1490| #define PACKAGE_VERSION "5.0.6"
1491| #define PACKAGE_STRING "gnuplot 5.0.6"
1492| #define PACKAGE_BUGREPORT ""
1493| #define PACKAGE_URL ""
1494| #define PACKAGE "gnuplot"
1495| #define VERSION "5.0.6"
1496| #define PROTOTYPES 1
1497| #define STDC_HEADERS 1
1498| #define HAVE_SYS_TYPES_H 1
1499| #define HAVE_SYS_STAT_H 1
1500| #define HAVE_STDLIB_H 1
1501| #define HAVE_STRING_H 1
1502| #define HAVE_MEMORY_H 1
1503| #define HAVE_STRINGS_H 1
1504| #define HAVE_INTTYPES_H 1
1505| #define HAVE_STDINT_H 1
1506| #define HAVE_UNISTD_H 1
1507| #define __EXTENSIONS__ 1
1508| #define _ALL_SOURCE 1
1509| #define _GNU_SOURCE 1
1510| #define _POSIX_PTHREAD_SEMANTICS 1
1511| #define _TANDEM_SOURCE 1
1512| #define HAVE_STRINGIZE 1
1513| #define HAVE_OFF_T 1
1514| #define HAVE_FSEEKO 1
1515| #define HAVE_LIBCERF 1
1516| #define X11 1
1517| #define HAVE_FRAMEWORK_AQUATERM 1
1518| #define STDC_HEADERS 1
1519| #define HAVE_DIRENT_H 1
1520| #define HAVE_ERRNO_H 1
1521| #define HAVE_FLOAT_H 1
1522| #define HAVE_LANGINFO_H 1
1523| #define HAVE_LIMITS_H 1
1524| #define HAVE_LOCALE_H 1
1525| #define HAVE_MATH_H 1
1526| #define HAVE_STDLIB_H 1
1527| #define HAVE_STRING_H 1
1528| #define HAVE_TIME_H 1
1529| #define HAVE_SYS_TIME_H 1
1530| #define HAVE_SYS_TYPES_H 1
1531| #define HAVE_SYS_IOCTL_H 1
1532| #define HAVE_SYS_PARAM_H 1
1533| #define HAVE_SYS_SELECT_H 1
1534| #define HAVE_SYS_SOCKET_H 1
1535| #define HAVE_SYS_STAT_H 1
1536| #define HAVE_SYS_TIMEB_H 1
1537| #define HAVE_SYS_UTSNAME_H 1
1538| #define HAVE_LIBC_H 1
1539| #define HAVE_POLL_H 1
1540| #define HAVE_SGTTY_H 1
1541| #define HAVE_TERMIOS_H 1
1542| #define HAVE_DIRENT_H 1
1543| #define HAVE_DLFCN_H 1
1544| /* end confdefs.h.  */
1545| #include <stdio.h>
1546| #ifdef HAVE_SYS_TYPES_H
1547| # include <sys/types.h>
1548| #endif
1549| #ifdef HAVE_SYS_STAT_H
1550| # include <sys/stat.h>
1551| #endif
1552| #ifdef STDC_HEADERS
1553| # include <stdlib.h>
1554| # include <stddef.h>
1555| #else
1556| # ifdef HAVE_STDLIB_H
1557| #  include <stdlib.h>
1558| # endif
1559| #endif
1560| #ifdef HAVE_STRING_H
1561| # if !defined STDC_HEADERS && defined HAVE_MEMORY_H
1562| #  include <memory.h>
1563| # endif
1564| # include <string.h>
1565| #endif
1566| #ifdef HAVE_STRINGS_H
1567| # include <strings.h>
1568| #endif
1569| #ifdef HAVE_INTTYPES_H
1570| # include <inttypes.h>
1571| #endif
1572| #ifdef HAVE_STDINT_H
1573| # include <stdint.h>
1574| #endif
1575| #ifdef HAVE_UNISTD_H
1576| # include <unistd.h>
1577| #endif
1578| #include <dl.h>
1579configure:9201: result: no
1580configure:9201: checking dl.h presence
1581configure:9201: /usr/bin/clang -E -I/opt/local/include   conftest.c
1582conftest.c:59:10: fatal error: 'dl.h' file not found
1583#include <dl.h>
1584         ^
15851 error generated.
1586configure:9201: $? = 1
1587configure: failed program was:
1588| /* confdefs.h */
1589| #define PACKAGE_NAME "gnuplot"
1590| #define PACKAGE_TARNAME "gnuplot"
1591| #define PACKAGE_VERSION "5.0.6"
1592| #define PACKAGE_STRING "gnuplot 5.0.6"
1593| #define PACKAGE_BUGREPORT ""
1594| #define PACKAGE_URL ""
1595| #define PACKAGE "gnuplot"
1596| #define VERSION "5.0.6"
1597| #define PROTOTYPES 1
1598| #define STDC_HEADERS 1
1599| #define HAVE_SYS_TYPES_H 1
1600| #define HAVE_SYS_STAT_H 1
1601| #define HAVE_STDLIB_H 1
1602| #define HAVE_STRING_H 1
1603| #define HAVE_MEMORY_H 1
1604| #define HAVE_STRINGS_H 1
1605| #define HAVE_INTTYPES_H 1
1606| #define HAVE_STDINT_H 1
1607| #define HAVE_UNISTD_H 1
1608| #define __EXTENSIONS__ 1
1609| #define _ALL_SOURCE 1
1610| #define _GNU_SOURCE 1
1611| #define _POSIX_PTHREAD_SEMANTICS 1
1612| #define _TANDEM_SOURCE 1
1613| #define HAVE_STRINGIZE 1
1614| #define HAVE_OFF_T 1
1615| #define HAVE_FSEEKO 1
1616| #define HAVE_LIBCERF 1
1617| #define X11 1
1618| #define HAVE_FRAMEWORK_AQUATERM 1
1619| #define STDC_HEADERS 1
1620| #define HAVE_DIRENT_H 1
1621| #define HAVE_ERRNO_H 1
1622| #define HAVE_FLOAT_H 1
1623| #define HAVE_LANGINFO_H 1
1624| #define HAVE_LIMITS_H 1
1625| #define HAVE_LOCALE_H 1
1626| #define HAVE_MATH_H 1
1627| #define HAVE_STDLIB_H 1
1628| #define HAVE_STRING_H 1
1629| #define HAVE_TIME_H 1
1630| #define HAVE_SYS_TIME_H 1
1631| #define HAVE_SYS_TYPES_H 1
1632| #define HAVE_SYS_IOCTL_H 1
1633| #define HAVE_SYS_PARAM_H 1
1634| #define HAVE_SYS_SELECT_H 1
1635| #define HAVE_SYS_SOCKET_H 1
1636| #define HAVE_SYS_STAT_H 1
1637| #define HAVE_SYS_TIMEB_H 1
1638| #define HAVE_SYS_UTSNAME_H 1
1639| #define HAVE_LIBC_H 1
1640| #define HAVE_POLL_H 1
1641| #define HAVE_SGTTY_H 1
1642| #define HAVE_TERMIOS_H 1
1643| #define HAVE_DIRENT_H 1
1644| #define HAVE_DLFCN_H 1
1645| /* end confdefs.h.  */
1646| #include <dl.h>
1647configure:9201: result: no
1648configure:9201: checking for dl.h
1649configure:9201: result: no
1650configure:9212: checking for stdbool.h that conforms to C99
1651configure:9279: /usr/bin/clang -c -pipe -Os -F/opt/local/Library/Frameworks -arch x86_64 -ObjC -I/opt/local/include   conftest.c >&5
1652conftest.c:108:24: warning: address of 's' will always evaluate to 'true' [-Wpointer-bool-conversion]
1653             bool e = &s;
1654                  ~    ^
1655conftest.c:112:23: warning: address of array 'a' will always evaluate to 'true' [-Wpointer-bool-conversion]
1656             return (!a + !b + !c + !d + !e + !f + !g + !h + !i + !!j + !k + !!l
1657                     ~^
1658conftest.c:112:28: warning: address of array 'b' will always evaluate to 'true' [-Wpointer-bool-conversion]
1659             return (!a + !b + !c + !d + !e + !f + !g + !h + !i + !!j + !k + !!l
1660                          ~^
1661conftest.c:112:33: warning: address of array 'c' will always evaluate to 'true' [-Wpointer-bool-conversion]
1662             return (!a + !b + !c + !d + !e + !f + !g + !h + !i + !!j + !k + !!l
1663                               ~^
1664conftest.c:112:38: warning: address of array 'd' will always evaluate to 'true' [-Wpointer-bool-conversion]
1665             return (!a + !b + !c + !d + !e + !f + !g + !h + !i + !!j + !k + !!l
1666                                    ~^
1667conftest.c:112:48: warning: address of array 'f' will always evaluate to 'true' [-Wpointer-bool-conversion]
1668             return (!a + !b + !c + !d + !e + !f + !g + !h + !i + !!j + !k + !!l
1669                                              ~^
1670conftest.c:112:53: warning: address of array 'g' will always evaluate to 'true' [-Wpointer-bool-conversion]
1671             return (!a + !b + !c + !d + !e + !f + !g + !h + !i + !!j + !k + !!l
1672                                                   ~^
1673conftest.c:112:58: warning: address of array 'h' will always evaluate to 'true' [-Wpointer-bool-conversion]
1674             return (!a + !b + !c + !d + !e + !f + !g + !h + !i + !!j + !k + !!l
1675                                                        ~^
1676conftest.c:112:63: warning: address of array 'i' will always evaluate to 'true' [-Wpointer-bool-conversion]
1677             return (!a + !b + !c + !d + !e + !f + !g + !h + !i + !!j + !k + !!l
1678                                                             ~^
1679conftest.c:113:30: warning: address of array 'n' will always evaluate to 'true' [-Wpointer-bool-conversion]
1680                            ~^
1681conftest.c:113:35: warning: address of array 'o' will always evaluate to 'true' [-Wpointer-bool-conversion]
1682                                 ~^
1683conftest.c:113:40: warning: address of array 'p' will always evaluate to 'true' [-Wpointer-bool-conversion]
1684                                      ~^
168512 warnings generated.
1686configure:9279: $? = 0
1687configure:9286: result: yes
1688configure:9288: checking for _Bool
1689configure:9288: /usr/bin/clang -c -pipe -Os -F/opt/local/Library/Frameworks -arch x86_64 -ObjC -I/opt/local/include   conftest.c >&5
1690configure:9288: $? = 0
1691configure:9288: /usr/bin/clang -c -pipe -Os -F/opt/local/Library/Frameworks -arch x86_64 -ObjC -I/opt/local/include   conftest.c >&5
1692conftest.c:95:20: error: expected expression
1693if (sizeof ((_Bool)))
1694                   ^
16951 error generated.
1696configure:9288: $? = 1
1697configure: failed program was:
1698| /* confdefs.h */
1699| #define PACKAGE_NAME "gnuplot"
1700| #define PACKAGE_TARNAME "gnuplot"
1701| #define PACKAGE_VERSION "5.0.6"
1702| #define PACKAGE_STRING "gnuplot 5.0.6"
1703| #define PACKAGE_BUGREPORT ""
1704| #define PACKAGE_URL ""
1705| #define PACKAGE "gnuplot"
1706| #define VERSION "5.0.6"
1707| #define PROTOTYPES 1
1708| #define STDC_HEADERS 1
1709| #define HAVE_SYS_TYPES_H 1
1710| #define HAVE_SYS_STAT_H 1
1711| #define HAVE_STDLIB_H 1
1712| #define HAVE_STRING_H 1
1713| #define HAVE_MEMORY_H 1
1714| #define HAVE_STRINGS_H 1
1715| #define HAVE_INTTYPES_H 1
1716| #define HAVE_STDINT_H 1
1717| #define HAVE_UNISTD_H 1
1718| #define __EXTENSIONS__ 1
1719| #define _ALL_SOURCE 1
1720| #define _GNU_SOURCE 1
1721| #define _POSIX_PTHREAD_SEMANTICS 1
1722| #define _TANDEM_SOURCE 1
1723| #define HAVE_STRINGIZE 1
1724| #define HAVE_OFF_T 1
1725| #define HAVE_FSEEKO 1
1726| #define HAVE_LIBCERF 1
1727| #define X11 1
1728| #define HAVE_FRAMEWORK_AQUATERM 1
1729| #define STDC_HEADERS 1
1730| #define HAVE_DIRENT_H 1
1731| #define HAVE_ERRNO_H 1
1732| #define HAVE_FLOAT_H 1
1733| #define HAVE_LANGINFO_H 1
1734| #define HAVE_LIMITS_H 1
1735| #define HAVE_LOCALE_H 1
1736| #define HAVE_MATH_H 1
1737| #define HAVE_STDLIB_H 1
1738| #define HAVE_STRING_H 1
1739| #define HAVE_TIME_H 1
1740| #define HAVE_SYS_TIME_H 1
1741| #define HAVE_SYS_TYPES_H 1
1742| #define HAVE_SYS_IOCTL_H 1
1743| #define HAVE_SYS_PARAM_H 1
1744| #define HAVE_SYS_SELECT_H 1
1745| #define HAVE_SYS_SOCKET_H 1
1746| #define HAVE_SYS_STAT_H 1
1747| #define HAVE_SYS_TIMEB_H 1
1748| #define HAVE_SYS_UTSNAME_H 1
1749| #define HAVE_LIBC_H 1
1750| #define HAVE_POLL_H 1
1751| #define HAVE_SGTTY_H 1
1752| #define HAVE_TERMIOS_H 1
1753| #define HAVE_DIRENT_H 1
1754| #define HAVE_DLFCN_H 1
1755| /* end confdefs.h.  */
1756| #include <stdio.h>
1757| #ifdef HAVE_SYS_TYPES_H
1758| # include <sys/types.h>
1759| #endif
1760| #ifdef HAVE_SYS_STAT_H
1761| # include <sys/stat.h>
1762| #endif
1763| #ifdef STDC_HEADERS
1764| # include <stdlib.h>
1765| # include <stddef.h>
1766| #else
1767| # ifdef HAVE_STDLIB_H
1768| #  include <stdlib.h>
1769| # endif
1770| #endif
1771| #ifdef HAVE_STRING_H
1772| # if !defined STDC_HEADERS && defined HAVE_MEMORY_H
1773| #  include <memory.h>
1774| # endif
1775| # include <string.h>
1776| #endif
1777| #ifdef HAVE_STRINGS_H
1778| # include <strings.h>
1779| #endif
1780| #ifdef HAVE_INTTYPES_H
1781| # include <inttypes.h>
1782| #endif
1783| #ifdef HAVE_STDINT_H
1784| # include <stdint.h>
1785| #endif
1786| #ifdef HAVE_UNISTD_H
1787| # include <unistd.h>
1788| #endif
1789| int
1790| main ()
1791| {
1792| if (sizeof ((_Bool)))
1793|           return 0;
1794|   ;
1795|   return 0;
1796| }
1797configure:9288: result: yes
1798configure:9307: checking for struct exception in math.h
1799configure:9320: /usr/bin/clang -o conftest -pipe -Os -F/opt/local/Library/Frameworks -arch x86_64 -ObjC -I/opt/local/include   -L/opt/local/lib -Wl,-headerpad_max_install_names -F/opt/local/Library/Frameworks -arch x86_64 -L/opt/local/lib -lcerf -framework Foundation -framework AquaTerm conftest.c  >&5
1800conftest.c:65:25: warning: expression result unused [-Wunused-value]
1801struct exception *x; x->type; x->name;
1802                     ~  ^~~~
1803conftest.c:65:34: warning: expression result unused [-Wunused-value]
1804struct exception *x; x->type; x->name;
1805                              ~  ^~~~
18062 warnings generated.
1807configure:9320: $? = 0
1808configure:9321: result: yes
1809configure:9335: checking whether stat file-mode macros are broken
1810configure:9362: /usr/bin/clang -c -pipe -Os -F/opt/local/Library/Frameworks -arch x86_64 -ObjC -I/opt/local/include   conftest.c >&5
1811configure:9362: $? = 0
1812configure:9369: result: no
1813configure:9449: checking for library containing dlopen
1814configure:9480: /usr/bin/clang -o conftest -pipe -Os -F/opt/local/Library/Frameworks -arch x86_64 -ObjC -I/opt/local/include   -L/opt/local/lib -Wl,-headerpad_max_install_names -F/opt/local/Library/Frameworks -arch x86_64 -L/opt/local/lib -lcerf -framework Foundation -framework AquaTerm conftest.c  >&5
1815configure:9480: $? = 0
1816configure:9497: result: none required
1817configure:9520: checking for unistd.h
1818configure:9530: result: yes
1819configure:9539: checking if errno variable is declared
1820configure:9555: /usr/bin/clang -c -pipe -Os -F/opt/local/Library/Frameworks -arch x86_64 -ObjC -I/opt/local/include   conftest.c >&5
1821configure:9555: $? = 0
1822configure:9556: result: yes
1823configure:9568: checking for size_t
1824configure:9568: /usr/bin/clang -c -pipe -Os -F/opt/local/Library/Frameworks -arch x86_64 -ObjC -I/opt/local/include   conftest.c >&5
1825configure:9568: $? = 0
1826configure:9568: /usr/bin/clang -c -pipe -Os -F/opt/local/Library/Frameworks -arch x86_64 -ObjC -I/opt/local/include   conftest.c >&5
1827conftest.c:100:21: error: expected expression
1828if (sizeof ((size_t)))
1829                    ^
18301 error generated.
1831configure:9568: $? = 1
1832configure: failed program was:
1833| /* confdefs.h */
1834| #define PACKAGE_NAME "gnuplot"
1835| #define PACKAGE_TARNAME "gnuplot"
1836| #define PACKAGE_VERSION "5.0.6"
1837| #define PACKAGE_STRING "gnuplot 5.0.6"
1838| #define PACKAGE_BUGREPORT ""
1839| #define PACKAGE_URL ""
1840| #define PACKAGE "gnuplot"
1841| #define VERSION "5.0.6"
1842| #define PROTOTYPES 1
1843| #define STDC_HEADERS 1
1844| #define HAVE_SYS_TYPES_H 1
1845| #define HAVE_SYS_STAT_H 1
1846| #define HAVE_STDLIB_H 1
1847| #define HAVE_STRING_H 1
1848| #define HAVE_MEMORY_H 1
1849| #define HAVE_STRINGS_H 1
1850| #define HAVE_INTTYPES_H 1
1851| #define HAVE_STDINT_H 1
1852| #define HAVE_UNISTD_H 1
1853| #define __EXTENSIONS__ 1
1854| #define _ALL_SOURCE 1
1855| #define _GNU_SOURCE 1
1856| #define _POSIX_PTHREAD_SEMANTICS 1
1857| #define _TANDEM_SOURCE 1
1858| #define HAVE_STRINGIZE 1
1859| #define HAVE_OFF_T 1
1860| #define HAVE_FSEEKO 1
1861| #define HAVE_LIBCERF 1
1862| #define X11 1
1863| #define HAVE_FRAMEWORK_AQUATERM 1
1864| #define STDC_HEADERS 1
1865| #define HAVE_DIRENT_H 1
1866| #define HAVE_ERRNO_H 1
1867| #define HAVE_FLOAT_H 1
1868| #define HAVE_LANGINFO_H 1
1869| #define HAVE_LIMITS_H 1
1870| #define HAVE_LOCALE_H 1
1871| #define HAVE_MATH_H 1
1872| #define HAVE_STDLIB_H 1
1873| #define HAVE_STRING_H 1
1874| #define HAVE_TIME_H 1
1875| #define HAVE_SYS_TIME_H 1
1876| #define HAVE_SYS_TYPES_H 1
1877| #define HAVE_SYS_IOCTL_H 1
1878| #define HAVE_SYS_PARAM_H 1
1879| #define HAVE_SYS_SELECT_H 1
1880| #define HAVE_SYS_SOCKET_H 1
1881| #define HAVE_SYS_STAT_H 1
1882| #define HAVE_SYS_TIMEB_H 1
1883| #define HAVE_SYS_UTSNAME_H 1
1884| #define HAVE_LIBC_H 1
1885| #define HAVE_POLL_H 1
1886| #define HAVE_SGTTY_H 1
1887| #define HAVE_TERMIOS_H 1
1888| #define HAVE_DIRENT_H 1
1889| #define HAVE_DLFCN_H 1
1890| #define HAVE__BOOL 1
1891| #define HAVE_STDBOOL_H 1
1892| #define HAVE_STRUCT_EXCEPTION_IN_MATH_H 1
1893| #define HAVE_EXTERNAL_FUNCTIONS 1
1894| #define HAVE_UNISTD_H 1
1895| /* end confdefs.h.  */
1896| #include <stdio.h>
1897| #ifdef HAVE_SYS_TYPES_H
1898| # include <sys/types.h>
1899| #endif
1900| #ifdef HAVE_SYS_STAT_H
1901| # include <sys/stat.h>
1902| #endif
1903| #ifdef STDC_HEADERS
1904| # include <stdlib.h>
1905| # include <stddef.h>
1906| #else
1907| # ifdef HAVE_STDLIB_H
1908| #  include <stdlib.h>
1909| # endif
1910| #endif
1911| #ifdef HAVE_STRING_H
1912| # if !defined STDC_HEADERS && defined HAVE_MEMORY_H
1913| #  include <memory.h>
1914| # endif
1915| # include <string.h>
1916| #endif
1917| #ifdef HAVE_STRINGS_H
1918| # include <strings.h>
1919| #endif
1920| #ifdef HAVE_INTTYPES_H
1921| # include <inttypes.h>
1922| #endif
1923| #ifdef HAVE_STDINT_H
1924| # include <stdint.h>
1925| #endif
1926| #ifdef HAVE_UNISTD_H
1927| # include <unistd.h>
1928| #endif
1929| int
1930| main ()
1931| {
1932| if (sizeof ((size_t)))
1933|           return 0;
1934|   ;
1935|   return 0;
1936| }
1937configure:9568: result: yes
1938configure:9579: checking for time_t in time.h
1939configure:9588: result: yes
1940configure:9596: checking return type of signal handlers
1941configure:9614: /usr/bin/clang -c -pipe -Os -F/opt/local/Library/Frameworks -arch x86_64 -ObjC -I/opt/local/include   conftest.c >&5
1942conftest.c:71:8: error: indirection requires pointer operand ('void' invalid)
1943return *(signal (0, 0)) (0) == 1;
1944       ^~~~~~~~~~~~~~~~~~~~
19451 error generated.
1946configure:9614: $? = 1
1947configure: failed program was:
1948| /* confdefs.h */
1949| #define PACKAGE_NAME "gnuplot"
1950| #define PACKAGE_TARNAME "gnuplot"
1951| #define PACKAGE_VERSION "5.0.6"
1952| #define PACKAGE_STRING "gnuplot 5.0.6"
1953| #define PACKAGE_BUGREPORT ""
1954| #define PACKAGE_URL ""
1955| #define PACKAGE "gnuplot"
1956| #define VERSION "5.0.6"
1957| #define PROTOTYPES 1
1958| #define STDC_HEADERS 1
1959| #define HAVE_SYS_TYPES_H 1
1960| #define HAVE_SYS_STAT_H 1
1961| #define HAVE_STDLIB_H 1
1962| #define HAVE_STRING_H 1
1963| #define HAVE_MEMORY_H 1
1964| #define HAVE_STRINGS_H 1
1965| #define HAVE_INTTYPES_H 1
1966| #define HAVE_STDINT_H 1
1967| #define HAVE_UNISTD_H 1
1968| #define __EXTENSIONS__ 1
1969| #define _ALL_SOURCE 1
1970| #define _GNU_SOURCE 1
1971| #define _POSIX_PTHREAD_SEMANTICS 1
1972| #define _TANDEM_SOURCE 1
1973| #define HAVE_STRINGIZE 1
1974| #define HAVE_OFF_T 1
1975| #define HAVE_FSEEKO 1
1976| #define HAVE_LIBCERF 1
1977| #define X11 1
1978| #define HAVE_FRAMEWORK_AQUATERM 1
1979| #define STDC_HEADERS 1
1980| #define HAVE_DIRENT_H 1
1981| #define HAVE_ERRNO_H 1
1982| #define HAVE_FLOAT_H 1
1983| #define HAVE_LANGINFO_H 1
1984| #define HAVE_LIMITS_H 1
1985| #define HAVE_LOCALE_H 1
1986| #define HAVE_MATH_H 1
1987| #define HAVE_STDLIB_H 1
1988| #define HAVE_STRING_H 1
1989| #define HAVE_TIME_H 1
1990| #define HAVE_SYS_TIME_H 1
1991| #define HAVE_SYS_TYPES_H 1
1992| #define HAVE_SYS_IOCTL_H 1
1993| #define HAVE_SYS_PARAM_H 1
1994| #define HAVE_SYS_SELECT_H 1
1995| #define HAVE_SYS_SOCKET_H 1
1996| #define HAVE_SYS_STAT_H 1
1997| #define HAVE_SYS_TIMEB_H 1
1998| #define HAVE_SYS_UTSNAME_H 1
1999| #define HAVE_LIBC_H 1
2000| #define HAVE_POLL_H 1
2001| #define HAVE_SGTTY_H 1
2002| #define HAVE_TERMIOS_H 1
2003| #define HAVE_DIRENT_H 1
2004| #define HAVE_DLFCN_H 1
2005| #define HAVE__BOOL 1
2006| #define HAVE_STDBOOL_H 1
2007| #define HAVE_STRUCT_EXCEPTION_IN_MATH_H 1
2008| #define HAVE_EXTERNAL_FUNCTIONS 1
2009| #define HAVE_UNISTD_H 1
2010| #define HAVE_TIME_T_IN_TIME_H 1
2011| /* end confdefs.h.  */
2012| #include <sys/types.h>
2013| #include <signal.h>
2014|
2015| int
2016| main ()
2017| {
2018| return *(signal (0, 0)) (0) == 1;
2019|   ;
2020|   return 0;
2021| }
2022configure:9621: result: void
2023configure:9643: checking for atexit
2024configure:9643: /usr/bin/clang -o conftest -pipe -Os -F/opt/local/Library/Frameworks -arch x86_64 -ObjC -I/opt/local/include   -L/opt/local/lib -Wl,-headerpad_max_install_names -F/opt/local/Library/Frameworks -arch x86_64 -L/opt/local/lib -lcerf -framework Foundation -framework AquaTerm conftest.c  >&5
2025configure:9643: $? = 0
2026configure:9643: result: yes
2027configure:9643: checking for memcpy
2028configure:9643: /usr/bin/clang -o conftest -pipe -Os -F/opt/local/Library/Frameworks -arch x86_64 -ObjC -I/opt/local/include   -L/opt/local/lib -Wl,-headerpad_max_install_names -F/opt/local/Library/Frameworks -arch x86_64 -L/opt/local/lib -lcerf -framework Foundation -framework AquaTerm conftest.c  >&5
2029conftest.c:90:6: warning: incompatible redeclaration of library function 'memcpy' [-Wincompatible-library-redeclaration]
2030char memcpy ();
2031     ^
2032conftest.c:90:6: note: 'memcpy' is a builtin with type 'void *(void *, const void *, unsigned long)'
20331 warning generated.
2034configure:9643: $? = 0
2035configure:9643: result: yes
2036configure:9643: checking for memmove
2037configure:9643: /usr/bin/clang -o conftest -pipe -Os -F/opt/local/Library/Frameworks -arch x86_64 -ObjC -I/opt/local/include   -L/opt/local/lib -Wl,-headerpad_max_install_names -F/opt/local/Library/Frameworks -arch x86_64 -L/opt/local/lib -lcerf -framework Foundation -framework AquaTerm conftest.c  >&5
2038conftest.c:91:6: warning: incompatible redeclaration of library function 'memmove' [-Wincompatible-library-redeclaration]
2039char memmove ();
2040     ^
2041conftest.c:91:6: note: 'memmove' is a builtin with type 'void *(void *, const void *, unsigned long)'
20421 warning generated.
2043configure:9643: $? = 0
2044configure:9643: result: yes
2045configure:9643: checking for memset
2046configure:9643: /usr/bin/clang -o conftest -pipe -Os -F/opt/local/Library/Frameworks -arch x86_64 -ObjC -I/opt/local/include   -L/opt/local/lib -Wl,-headerpad_max_install_names -F/opt/local/Library/Frameworks -arch x86_64 -L/opt/local/lib -lcerf -framework Foundation -framework AquaTerm conftest.c  >&5
2047conftest.c:92:6: warning: incompatible redeclaration of library function 'memset' [-Wincompatible-library-redeclaration]
2048char memset ();
2049     ^
2050conftest.c:92:6: note: 'memset' is a builtin with type 'void *(void *, int, unsigned long)'
20511 warning generated.
2052configure:9643: $? = 0
2053configure:9643: result: yes
2054configure:9643: checking for on_exit
2055configure:9643: /usr/bin/clang -o conftest -pipe -Os -F/opt/local/Library/Frameworks -arch x86_64 -ObjC -I/opt/local/include   -L/opt/local/lib -Wl,-headerpad_max_install_names -F/opt/local/Library/Frameworks -arch x86_64 -L/opt/local/lib -lcerf -framework Foundation -framework AquaTerm conftest.c  >&5
2056Undefined symbols for architecture x86_64:
2057  "_on_exit", referenced from:
2058      _main in conftest-008e3f.o
2059ld: symbol(s) not found for architecture x86_64
2060clang: error: linker command failed with exit code 1 (use -v to see invocation)
2061configure:9643: $? = 1
2062configure: failed program was:
2063| /* confdefs.h */
2064| #define PACKAGE_NAME "gnuplot"
2065| #define PACKAGE_TARNAME "gnuplot"
2066| #define PACKAGE_VERSION "5.0.6"
2067| #define PACKAGE_STRING "gnuplot 5.0.6"
2068| #define PACKAGE_BUGREPORT ""
2069| #define PACKAGE_URL ""
2070| #define PACKAGE "gnuplot"
2071| #define VERSION "5.0.6"
2072| #define PROTOTYPES 1
2073| #define STDC_HEADERS 1
2074| #define HAVE_SYS_TYPES_H 1
2075| #define HAVE_SYS_STAT_H 1
2076| #define HAVE_STDLIB_H 1
2077| #define HAVE_STRING_H 1
2078| #define HAVE_MEMORY_H 1
2079| #define HAVE_STRINGS_H 1
2080| #define HAVE_INTTYPES_H 1
2081| #define HAVE_STDINT_H 1
2082| #define HAVE_UNISTD_H 1
2083| #define __EXTENSIONS__ 1
2084| #define _ALL_SOURCE 1
2085| #define _GNU_SOURCE 1
2086| #define _POSIX_PTHREAD_SEMANTICS 1
2087| #define _TANDEM_SOURCE 1
2088| #define HAVE_STRINGIZE 1
2089| #define HAVE_OFF_T 1
2090| #define HAVE_FSEEKO 1
2091| #define HAVE_LIBCERF 1
2092| #define X11 1
2093| #define HAVE_FRAMEWORK_AQUATERM 1
2094| #define STDC_HEADERS 1
2095| #define HAVE_DIRENT_H 1
2096| #define HAVE_ERRNO_H 1
2097| #define HAVE_FLOAT_H 1
2098| #define HAVE_LANGINFO_H 1
2099| #define HAVE_LIMITS_H 1
2100| #define HAVE_LOCALE_H 1
2101| #define HAVE_MATH_H 1
2102| #define HAVE_STDLIB_H 1
2103| #define HAVE_STRING_H 1
2104| #define HAVE_TIME_H 1
2105| #define HAVE_SYS_TIME_H 1
2106| #define HAVE_SYS_TYPES_H 1
2107| #define HAVE_SYS_IOCTL_H 1
2108| #define HAVE_SYS_PARAM_H 1
2109| #define HAVE_SYS_SELECT_H 1
2110| #define HAVE_SYS_SOCKET_H 1
2111| #define HAVE_SYS_STAT_H 1
2112| #define HAVE_SYS_TIMEB_H 1
2113| #define HAVE_SYS_UTSNAME_H 1
2114| #define HAVE_LIBC_H 1
2115| #define HAVE_POLL_H 1
2116| #define HAVE_SGTTY_H 1
2117| #define HAVE_TERMIOS_H 1
2118| #define HAVE_DIRENT_H 1
2119| #define HAVE_DLFCN_H 1
2120| #define HAVE__BOOL 1
2121| #define HAVE_STDBOOL_H 1
2122| #define HAVE_STRUCT_EXCEPTION_IN_MATH_H 1
2123| #define HAVE_EXTERNAL_FUNCTIONS 1
2124| #define HAVE_UNISTD_H 1
2125| #define HAVE_TIME_T_IN_TIME_H 1
2126| #define RETSIGTYPE void
2127| #define HAVE_ATEXIT 1
2128| #define HAVE_MEMCPY 1
2129| #define HAVE_MEMMOVE 1
2130| #define HAVE_MEMSET 1
2131| /* end confdefs.h.  */
2132| /* Define on_exit to an innocuous variant, in case <limits.h> declares on_exit.
2133|    For example, HP-UX 11i <limits.h> declares gettimeofday.  */
2134| #define on_exit innocuous_on_exit
2135|
2136| /* System header to define __stub macros and hopefully few prototypes,
2137|     which can conflict with char on_exit (); below.
2138|     Prefer <limits.h> to <assert.h> if __STDC__ is defined, since
2139|     <limits.h> exists even on freestanding compilers.  */
2140|
2141| #ifdef __STDC__
2142| # include <limits.h>
2143| #else
2144| # include <assert.h>
2145| #endif
2146|
2147| #undef on_exit
2148|
2149| /* Override any GCC internal prototype to avoid an error.
2150|    Use char because int might match the return type of a GCC
2151|    builtin and then its argument prototype would still apply.  */
2152| #ifdef __cplusplus
2153| extern "C"
2154| #endif
2155| char on_exit ();
2156| /* The GNU C library defines this for functions which it implements
2157|     to always fail with ENOSYS.  Some functions are actually named
2158|     something starting with __ and the normal name is an alias.  */
2159| #if defined __stub_on_exit || defined __stub___on_exit
2160| choke me
2161| #endif
2162|
2163| int
2164| main ()
2165| {
2166| return on_exit ();
2167|   ;
2168|   return 0;
2169| }
2170configure:9643: result: no
2171configure:9643: checking for bcopy
2172configure:9643: /usr/bin/clang -o conftest -pipe -Os -F/opt/local/Library/Frameworks -arch x86_64 -ObjC -I/opt/local/include   -L/opt/local/lib -Wl,-headerpad_max_install_names -F/opt/local/Library/Frameworks -arch x86_64 -L/opt/local/lib -lcerf -framework Foundation -framework AquaTerm conftest.c  >&5
2173configure:9643: $? = 0
2174configure:9643: result: yes
2175configure:9643: checking for bzero
2176configure:9643: /usr/bin/clang -o conftest -pipe -Os -F/opt/local/Library/Frameworks -arch x86_64 -ObjC -I/opt/local/include   -L/opt/local/lib -Wl,-headerpad_max_install_names -F/opt/local/Library/Frameworks -arch x86_64 -L/opt/local/lib -lcerf -framework Foundation -framework AquaTerm conftest.c  >&5
2177conftest.c:94:6: warning: incompatible redeclaration of library function 'bzero' [-Wincompatible-library-redeclaration]
2178char bzero ();
2179     ^
2180conftest.c:94:6: note: 'bzero' is a builtin with type 'void (void *, unsigned long)'
21811 warning generated.
2182configure:9643: $? = 0
2183configure:9643: result: yes
2184configure:9643: checking for setvbuf
2185configure:9643: /usr/bin/clang -o conftest -pipe -Os -F/opt/local/Library/Frameworks -arch x86_64 -ObjC -I/opt/local/include   -L/opt/local/lib -Wl,-headerpad_max_install_names -F/opt/local/Library/Frameworks -arch x86_64 -L/opt/local/lib -lcerf -framework Foundation -framework AquaTerm conftest.c  >&5
2186configure:9643: $? = 0
2187configure:9643: result: yes
2188configure:9643: checking for strerror
2189configure:9643: /usr/bin/clang -o conftest -pipe -Os -F/opt/local/Library/Frameworks -arch x86_64 -ObjC -I/opt/local/include   -L/opt/local/lib -Wl,-headerpad_max_install_names -F/opt/local/Library/Frameworks -arch x86_64 -L/opt/local/lib -lcerf -framework Foundation -framework AquaTerm conftest.c  >&5
2190conftest.c:96:6: warning: incompatible redeclaration of library function 'strerror' [-Wincompatible-library-redeclaration]
2191char strerror ();
2192     ^
2193conftest.c:96:6: note: 'strerror' is a builtin with type 'char *(int)'
21941 warning generated.
2195configure:9643: $? = 0
2196configure:9643: result: yes
2197configure:9643: checking for strchr
2198configure:9643: /usr/bin/clang -o conftest -pipe -Os -F/opt/local/Library/Frameworks -arch x86_64 -ObjC -I/opt/local/include   -L/opt/local/lib -Wl,-headerpad_max_install_names -F/opt/local/Library/Frameworks -arch x86_64 -L/opt/local/lib -lcerf -framework Foundation -framework AquaTerm conftest.c  >&5
2199conftest.c:97:6: warning: incompatible redeclaration of library function 'strchr' [-Wincompatible-library-redeclaration]
2200char strchr ();
2201     ^
2202conftest.c:97:6: note: 'strchr' is a builtin with type 'char *(const char *, int)'
22031 warning generated.
2204configure:9643: $? = 0
2205configure:9643: result: yes
2206configure:9643: checking for strrchr
2207configure:9643: /usr/bin/clang -o conftest -pipe -Os -F/opt/local/Library/Frameworks -arch x86_64 -ObjC -I/opt/local/include   -L/opt/local/lib -Wl,-headerpad_max_install_names -F/opt/local/Library/Frameworks -arch x86_64 -L/opt/local/lib -lcerf -framework Foundation -framework AquaTerm conftest.c  >&5
2208conftest.c:98:6: warning: incompatible redeclaration of library function 'strrchr' [-Wincompatible-library-redeclaration]
2209char strrchr ();
2210     ^
2211conftest.c:98:6: note: 'strrchr' is a builtin with type 'char *(const char *, int)'
22121 warning generated.
2213configure:9643: $? = 0
2214configure:9643: result: yes
2215configure:9643: checking for strstr
2216configure:9643: /usr/bin/clang -o conftest -pipe -Os -F/opt/local/Library/Frameworks -arch x86_64 -ObjC -I/opt/local/include   -L/opt/local/lib -Wl,-headerpad_max_install_names -F/opt/local/Library/Frameworks -arch x86_64 -L/opt/local/lib -lcerf -framework Foundation -framework AquaTerm conftest.c  >&5
2217conftest.c:99:6: warning: incompatible redeclaration of library function 'strstr' [-Wincompatible-library-redeclaration]
2218char strstr ();
2219     ^
2220conftest.c:99:6: note: 'strstr' is a builtin with type 'char *(const char *, const char *)'
22211 warning generated.
2222configure:9643: $? = 0
2223configure:9643: result: yes
2224configure:9643: checking for index
2225configure:9643: /usr/bin/clang -o conftest -pipe -Os -F/opt/local/Library/Frameworks -arch x86_64 -ObjC -I/opt/local/include   -L/opt/local/lib -Wl,-headerpad_max_install_names -F/opt/local/Library/Frameworks -arch x86_64 -L/opt/local/lib -lcerf -framework Foundation -framework AquaTerm conftest.c  >&5
2226conftest.c:100:6: warning: incompatible redeclaration of library function 'index' [-Wincompatible-library-redeclaration]
2227char index ();
2228     ^
2229conftest.c:100:6: note: 'index' is a builtin with type 'char *(const char *, int)'
22301 warning generated.
2231configure:9643: $? = 0
2232configure:9643: result: yes
2233configure:9643: checking for rindex
2234configure:9643: /usr/bin/clang -o conftest -pipe -Os -F/opt/local/Library/Frameworks -arch x86_64 -ObjC -I/opt/local/include   -L/opt/local/lib -Wl,-headerpad_max_install_names -F/opt/local/Library/Frameworks -arch x86_64 -L/opt/local/lib -lcerf -framework Foundation -framework AquaTerm conftest.c  >&5
2235conftest.c:101:6: warning: incompatible redeclaration of library function 'rindex' [-Wincompatible-library-redeclaration]
2236char rindex ();
2237     ^
2238conftest.c:101:6: note: 'rindex' is a builtin with type 'char *(const char *, int)'
22391 warning generated.
2240configure:9643: $? = 0
2241configure:9643: result: yes
2242configure:9643: checking for erf
2243configure:9643: /usr/bin/clang -o conftest -pipe -Os -F/opt/local/Library/Frameworks -arch x86_64 -ObjC -I/opt/local/include   -L/opt/local/lib -Wl,-headerpad_max_install_names -F/opt/local/Library/Frameworks -arch x86_64 -L/opt/local/lib -lcerf -framework Foundation -framework AquaTerm conftest.c  >&5
2244conftest.c:102:6: warning: incompatible redeclaration of library function 'erf' [-Wincompatible-library-redeclaration]
2245char erf ();
2246     ^
2247conftest.c:102:6: note: 'erf' is a builtin with type 'double (double)'
22481 warning generated.
2249configure:9643: $? = 0
2250configure:9643: result: yes
2251configure:9643: checking for erfc
2252configure:9643: /usr/bin/clang -o conftest -pipe -Os -F/opt/local/Library/Frameworks -arch x86_64 -ObjC -I/opt/local/include   -L/opt/local/lib -Wl,-headerpad_max_install_names -F/opt/local/Library/Frameworks -arch x86_64 -L/opt/local/lib -lcerf -framework Foundation -framework AquaTerm conftest.c  >&5
2253conftest.c:103:6: warning: incompatible redeclaration of library function 'erfc' [-Wincompatible-library-redeclaration]
2254char erfc ();
2255     ^
2256conftest.c:103:6: note: 'erfc' is a builtin with type 'double (double)'
22571 warning generated.
2258configure:9643: $? = 0
2259configure:9643: result: yes
2260configure:9643: checking for gamma
2261configure:9643: /usr/bin/clang -o conftest -pipe -Os -F/opt/local/Library/Frameworks -arch x86_64 -ObjC -I/opt/local/include   -L/opt/local/lib -Wl,-headerpad_max_install_names -F/opt/local/Library/Frameworks -arch x86_64 -L/opt/local/lib -lcerf -framework Foundation -framework AquaTerm conftest.c  >&5
2262configure:9643: $? = 0
2263configure:9643: result: yes
2264configure:9643: checking for lgamma
2265configure:9643: /usr/bin/clang -o conftest -pipe -Os -F/opt/local/Library/Frameworks -arch x86_64 -ObjC -I/opt/local/include   -L/opt/local/lib -Wl,-headerpad_max_install_names -F/opt/local/Library/Frameworks -arch x86_64 -L/opt/local/lib -lcerf -framework Foundation -framework AquaTerm conftest.c  >&5
2266conftest.c:105:6: warning: incompatible redeclaration of library function 'lgamma' [-Wincompatible-library-redeclaration]
2267char lgamma ();
2268     ^
2269conftest.c:105:6: note: 'lgamma' is a builtin with type 'double (double)'
22701 warning generated.
2271configure:9643: $? = 0
2272configure:9643: result: yes
2273configure:9643: checking for getcwd
2274configure:9643: /usr/bin/clang -o conftest -pipe -Os -F/opt/local/Library/Frameworks -arch x86_64 -ObjC -I/opt/local/include   -L/opt/local/lib -Wl,-headerpad_max_install_names -F/opt/local/Library/Frameworks -arch x86_64 -L/opt/local/lib -lcerf -framework Foundation -framework AquaTerm conftest.c  >&5
2275configure:9643: $? = 0
2276configure:9643: result: yes
2277configure:9643: checking for poll
2278configure:9643: /usr/bin/clang -o conftest -pipe -Os -F/opt/local/Library/Frameworks -arch x86_64 -ObjC -I/opt/local/include   -L/opt/local/lib -Wl,-headerpad_max_install_names -F/opt/local/Library/Frameworks -arch x86_64 -L/opt/local/lib -lcerf -framework Foundation -framework AquaTerm conftest.c  >&5
2279configure:9643: $? = 0
2280configure:9643: result: yes
2281configure:9643: checking for pclose
2282configure:9643: /usr/bin/clang -o conftest -pipe -Os -F/opt/local/Library/Frameworks -arch x86_64 -ObjC -I/opt/local/include   -L/opt/local/lib -Wl,-headerpad_max_install_names -F/opt/local/Library/Frameworks -arch x86_64 -L/opt/local/lib -lcerf -framework Foundation -framework AquaTerm conftest.c  >&5
2283configure:9643: $? = 0
2284configure:9643: result: yes
2285configure:9643: checking for popen
2286configure:9643: /usr/bin/clang -o conftest -pipe -Os -F/opt/local/Library/Frameworks -arch x86_64 -ObjC -I/opt/local/include   -L/opt/local/lib -Wl,-headerpad_max_install_names -F/opt/local/Library/Frameworks -arch x86_64 -L/opt/local/lib -lcerf -framework Foundation -framework AquaTerm conftest.c  >&5
2287configure:9643: $? = 0
2288configure:9643: result: yes
2289configure:9643: checking for fdopen
2290configure:9643: /usr/bin/clang -o conftest -pipe -Os -F/opt/local/Library/Frameworks -arch x86_64 -ObjC -I/opt/local/include   -L/opt/local/lib -Wl,-headerpad_max_install_names -F/opt/local/Library/Frameworks -arch x86_64 -L/opt/local/lib -lcerf -framework Foundation -framework AquaTerm conftest.c  >&5
2291configure:9643: $? = 0
2292configure:9643: result: yes
2293configure:9643: checking for select
2294configure:9643: /usr/bin/clang -o conftest -pipe -Os -F/opt/local/Library/Frameworks -arch x86_64 -ObjC -I/opt/local/include   -L/opt/local/lib -Wl,-headerpad_max_install_names -F/opt/local/Library/Frameworks -arch x86_64 -L/opt/local/lib -lcerf -framework Foundation -framework AquaTerm conftest.c  >&5
2295configure:9643: $? = 0
2296configure:9643: result: yes
2297configure:9643: checking for sleep
2298configure:9643: /usr/bin/clang -o conftest -pipe -Os -F/opt/local/Library/Frameworks -arch x86_64 -ObjC -I/opt/local/include   -L/opt/local/lib -Wl,-headerpad_max_install_names -F/opt/local/Library/Frameworks -arch x86_64 -L/opt/local/lib -lcerf -framework Foundation -framework AquaTerm conftest.c  >&5
2299configure:9643: $? = 0
2300configure:9643: result: yes
2301configure:9643: checking for stpcpy
2302configure:9643: /usr/bin/clang -o conftest -pipe -Os -F/opt/local/Library/Frameworks -arch x86_64 -ObjC -I/opt/local/include   -L/opt/local/lib -Wl,-headerpad_max_install_names -F/opt/local/Library/Frameworks -arch x86_64 -L/opt/local/lib -lcerf -framework Foundation -framework AquaTerm conftest.c  >&5
2303conftest.c:113:6: warning: incompatible redeclaration of library function 'stpcpy' [-Wincompatible-library-redeclaration]
2304char stpcpy ();
2305     ^
2306conftest.c:113:6: note: 'stpcpy' is a builtin with type 'char *(char *, const char *)'
23071 warning generated.
2308configure:9643: $? = 0
2309configure:9643: result: yes
2310configure:9643: checking for strcspn
2311configure:9643: /usr/bin/clang -o conftest -pipe -Os -F/opt/local/Library/Frameworks -arch x86_64 -ObjC -I/opt/local/include   -L/opt/local/lib -Wl,-headerpad_max_install_names -F/opt/local/Library/Frameworks -arch x86_64 -L/opt/local/lib -lcerf -framework Foundation -framework AquaTerm conftest.c  >&5
2312conftest.c:114:6: warning: incompatible redeclaration of library function 'strcspn' [-Wincompatible-library-redeclaration]
2313char strcspn ();
2314     ^
2315conftest.c:114:6: note: 'strcspn' is a builtin with type 'unsigned long (const char *, const char *)'
23161 warning generated.
2317configure:9643: $? = 0
2318configure:9643: result: yes
2319configure:9643: checking for strdup
2320configure:9643: /usr/bin/clang -o conftest -pipe -Os -F/opt/local/Library/Frameworks -arch x86_64 -ObjC -I/opt/local/include   -L/opt/local/lib -Wl,-headerpad_max_install_names -F/opt/local/Library/Frameworks -arch x86_64 -L/opt/local/lib -lcerf -framework Foundation -framework AquaTerm conftest.c  >&5
2321conftest.c:115:6: warning: incompatible redeclaration of library function 'strdup' [-Wincompatible-library-redeclaration]
2322char strdup ();
2323     ^
2324conftest.c:115:6: note: 'strdup' is a builtin with type 'char *(const char *)'
23251 warning generated.
2326configure:9643: $? = 0
2327configure:9643: result: yes
2328configure:9643: checking for strndup
2329configure:9643: /usr/bin/clang -o conftest -pipe -Os -F/opt/local/Library/Frameworks -arch x86_64 -ObjC -I/opt/local/include   -L/opt/local/lib -Wl,-headerpad_max_install_names -F/opt/local/Library/Frameworks -arch x86_64 -L/opt/local/lib -lcerf -framework Foundation -framework AquaTerm conftest.c  >&5
2330conftest.c:116:6: warning: incompatible redeclaration of library function 'strndup' [-Wincompatible-library-redeclaration]
2331char strndup ();
2332     ^
2333conftest.c:116:6: note: 'strndup' is a builtin with type 'char *(const char *, unsigned long)'
23341 warning generated.
2335configure:9643: $? = 0
2336configure:9643: result: yes
2337configure:9643: checking for strnlen
2338configure:9643: /usr/bin/clang -o conftest -pipe -Os -F/opt/local/Library/Frameworks -arch x86_64 -ObjC -I/opt/local/include   -L/opt/local/lib -Wl,-headerpad_max_install_names -F/opt/local/Library/Frameworks -arch x86_64 -L/opt/local/lib -lcerf -framework Foundation -framework AquaTerm conftest.c  >&5
2339configure:9643: $? = 0
2340configure:9643: result: yes
2341configure:9643: checking for strcasecmp
2342configure:9643: /usr/bin/clang -o conftest -pipe -Os -F/opt/local/Library/Frameworks -arch x86_64 -ObjC -I/opt/local/include   -L/opt/local/lib -Wl,-headerpad_max_install_names -F/opt/local/Library/Frameworks -arch x86_64 -L/opt/local/lib -lcerf -framework Foundation -framework AquaTerm conftest.c  >&5
2343conftest.c:118:6: warning: incompatible redeclaration of library function 'strcasecmp' [-Wincompatible-library-redeclaration]
2344char strcasecmp ();
2345     ^
2346conftest.c:118:6: note: 'strcasecmp' is a builtin with type 'int (const char *, const char *)'
23471 warning generated.
2348configure:9643: $? = 0
2349configure:9643: result: yes
2350configure:9643: checking for stricmp
2351configure:9643: /usr/bin/clang -o conftest -pipe -Os -F/opt/local/Library/Frameworks -arch x86_64 -ObjC -I/opt/local/include   -L/opt/local/lib -Wl,-headerpad_max_install_names -F/opt/local/Library/Frameworks -arch x86_64 -L/opt/local/lib -lcerf -framework Foundation -framework AquaTerm conftest.c  >&5
2352Undefined symbols for architecture x86_64:
2353  "_stricmp", referenced from:
2354      _main in conftest-f2b3a2.o
2355ld: symbol(s) not found for architecture x86_64
2356clang: error: linker command failed with exit code 1 (use -v to see invocation)
2357configure:9643: $? = 1
2358configure: failed program was:
2359| /* confdefs.h */
2360| #define PACKAGE_NAME "gnuplot"
2361| #define PACKAGE_TARNAME "gnuplot"
2362| #define PACKAGE_VERSION "5.0.6"
2363| #define PACKAGE_STRING "gnuplot 5.0.6"
2364| #define PACKAGE_BUGREPORT ""
2365| #define PACKAGE_URL ""
2366| #define PACKAGE "gnuplot"
2367| #define VERSION "5.0.6"
2368| #define PROTOTYPES 1
2369| #define STDC_HEADERS 1
2370| #define HAVE_SYS_TYPES_H 1
2371| #define HAVE_SYS_STAT_H 1
2372| #define HAVE_STDLIB_H 1
2373| #define HAVE_STRING_H 1
2374| #define HAVE_MEMORY_H 1
2375| #define HAVE_STRINGS_H 1
2376| #define HAVE_INTTYPES_H 1
2377| #define HAVE_STDINT_H 1
2378| #define HAVE_UNISTD_H 1
2379| #define __EXTENSIONS__ 1
2380| #define _ALL_SOURCE 1
2381| #define _GNU_SOURCE 1
2382| #define _POSIX_PTHREAD_SEMANTICS 1
2383| #define _TANDEM_SOURCE 1
2384| #define HAVE_STRINGIZE 1
2385| #define HAVE_OFF_T 1
2386| #define HAVE_FSEEKO 1
2387| #define HAVE_LIBCERF 1
2388| #define X11 1
2389| #define HAVE_FRAMEWORK_AQUATERM 1
2390| #define STDC_HEADERS 1
2391| #define HAVE_DIRENT_H 1
2392| #define HAVE_ERRNO_H 1
2393| #define HAVE_FLOAT_H 1
2394| #define HAVE_LANGINFO_H 1
2395| #define HAVE_LIMITS_H 1
2396| #define HAVE_LOCALE_H 1
2397| #define HAVE_MATH_H 1
2398| #define HAVE_STDLIB_H 1
2399| #define HAVE_STRING_H 1
2400| #define HAVE_TIME_H 1
2401| #define HAVE_SYS_TIME_H 1
2402| #define HAVE_SYS_TYPES_H 1
2403| #define HAVE_SYS_IOCTL_H 1
2404| #define HAVE_SYS_PARAM_H 1
2405| #define HAVE_SYS_SELECT_H 1
2406| #define HAVE_SYS_SOCKET_H 1
2407| #define HAVE_SYS_STAT_H 1
2408| #define HAVE_SYS_TIMEB_H 1
2409| #define HAVE_SYS_UTSNAME_H 1
2410| #define HAVE_LIBC_H 1
2411| #define HAVE_POLL_H 1
2412| #define HAVE_SGTTY_H 1
2413| #define HAVE_TERMIOS_H 1
2414| #define HAVE_DIRENT_H 1
2415| #define HAVE_DLFCN_H 1
2416| #define HAVE__BOOL 1
2417| #define HAVE_STDBOOL_H 1
2418| #define HAVE_STRUCT_EXCEPTION_IN_MATH_H 1
2419| #define HAVE_EXTERNAL_FUNCTIONS 1
2420| #define HAVE_UNISTD_H 1
2421| #define HAVE_TIME_T_IN_TIME_H 1
2422| #define RETSIGTYPE void
2423| #define HAVE_ATEXIT 1
2424| #define HAVE_MEMCPY 1
2425| #define HAVE_MEMMOVE 1
2426| #define HAVE_MEMSET 1
2427| #define HAVE_BCOPY 1
2428| #define HAVE_BZERO 1
2429| #define HAVE_SETVBUF 1
2430| #define HAVE_STRERROR 1
2431| #define HAVE_STRCHR 1
2432| #define HAVE_STRRCHR 1
2433| #define HAVE_STRSTR 1
2434| #define HAVE_INDEX 1
2435| #define HAVE_RINDEX 1
2436| #define HAVE_ERF 1
2437| #define HAVE_ERFC 1
2438| #define HAVE_GAMMA 1
2439| #define HAVE_LGAMMA 1
2440| #define HAVE_GETCWD 1
2441| #define HAVE_POLL 1
2442| #define HAVE_PCLOSE 1
2443| #define HAVE_POPEN 1
2444| #define HAVE_FDOPEN 1
2445| #define HAVE_SELECT 1
2446| #define HAVE_SLEEP 1
2447| #define HAVE_STPCPY 1
2448| #define HAVE_STRCSPN 1
2449| #define HAVE_STRDUP 1
2450| #define HAVE_STRNDUP 1
2451| #define HAVE_STRNLEN 1
2452| #define HAVE_STRCASECMP 1
2453| /* end confdefs.h.  */
2454| /* Define stricmp to an innocuous variant, in case <limits.h> declares stricmp.
2455|    For example, HP-UX 11i <limits.h> declares gettimeofday.  */
2456| #define stricmp innocuous_stricmp
2457|
2458| /* System header to define __stub macros and hopefully few prototypes,
2459|     which can conflict with char stricmp (); below.
2460|     Prefer <limits.h> to <assert.h> if __STDC__ is defined, since
2461|     <limits.h> exists even on freestanding compilers.  */
2462|
2463| #ifdef __STDC__
2464| # include <limits.h>
2465| #else
2466| # include <assert.h>
2467| #endif
2468|
2469| #undef stricmp
2470|
2471| /* Override any GCC internal prototype to avoid an error.
2472|    Use char because int might match the return type of a GCC
2473|    builtin and then its argument prototype would still apply.  */
2474| #ifdef __cplusplus
2475| extern "C"
2476| #endif
2477| char stricmp ();
2478| /* The GNU C library defines this for functions which it implements
2479|     to always fail with ENOSYS.  Some functions are actually named
2480|     something starting with __ and the normal name is an alias.  */
2481| #if defined __stub_stricmp || defined __stub___stricmp
2482| choke me
2483| #endif
2484|
2485| int
2486| main ()
2487| {
2488| return stricmp ();
2489|   ;
2490|   return 0;
2491| }
2492configure:9643: result: no
2493configure:9643: checking for strncasecmp
2494configure:9643: /usr/bin/clang -o conftest -pipe -Os -F/opt/local/Library/Frameworks -arch x86_64 -ObjC -I/opt/local/include   -L/opt/local/lib -Wl,-headerpad_max_install_names -F/opt/local/Library/Frameworks -arch x86_64 -L/opt/local/lib -lcerf -framework Foundation -framework AquaTerm conftest.c  >&5
2495conftest.c:119:6: warning: incompatible redeclaration of library function 'strncasecmp' [-Wincompatible-library-redeclaration]
2496char strncasecmp ();
2497     ^
2498conftest.c:119:6: note: 'strncasecmp' is a builtin with type 'int (const char *, const char *, unsigned long)'
24991 warning generated.
2500configure:9643: $? = 0
2501configure:9643: result: yes
2502configure:9643: checking for strnicmp
2503configure:9643: /usr/bin/clang -o conftest -pipe -Os -F/opt/local/Library/Frameworks -arch x86_64 -ObjC -I/opt/local/include   -L/opt/local/lib -Wl,-headerpad_max_install_names -F/opt/local/Library/Frameworks -arch x86_64 -L/opt/local/lib -lcerf -framework Foundation -framework AquaTerm conftest.c  >&5
2504Undefined symbols for architecture x86_64:
2505  "_strnicmp", referenced from:
2506      _main in conftest-682d8b.o
2507ld: symbol(s) not found for architecture x86_64
2508clang: error: linker command failed with exit code 1 (use -v to see invocation)
2509configure:9643: $? = 1
2510configure: failed program was:
2511| /* confdefs.h */
2512| #define PACKAGE_NAME "gnuplot"
2513| #define PACKAGE_TARNAME "gnuplot"
2514| #define PACKAGE_VERSION "5.0.6"
2515| #define PACKAGE_STRING "gnuplot 5.0.6"
2516| #define PACKAGE_BUGREPORT ""
2517| #define PACKAGE_URL ""
2518| #define PACKAGE "gnuplot"
2519| #define VERSION "5.0.6"
2520| #define PROTOTYPES 1
2521| #define STDC_HEADERS 1
2522| #define HAVE_SYS_TYPES_H 1
2523| #define HAVE_SYS_STAT_H 1
2524| #define HAVE_STDLIB_H 1
2525| #define HAVE_STRING_H 1
2526| #define HAVE_MEMORY_H 1
2527| #define HAVE_STRINGS_H 1
2528| #define HAVE_INTTYPES_H 1
2529| #define HAVE_STDINT_H 1
2530| #define HAVE_UNISTD_H 1
2531| #define __EXTENSIONS__ 1
2532| #define _ALL_SOURCE 1
2533| #define _GNU_SOURCE 1
2534| #define _POSIX_PTHREAD_SEMANTICS 1
2535| #define _TANDEM_SOURCE 1
2536| #define HAVE_STRINGIZE 1
2537| #define HAVE_OFF_T 1
2538| #define HAVE_FSEEKO 1
2539| #define HAVE_LIBCERF 1
2540| #define X11 1
2541| #define HAVE_FRAMEWORK_AQUATERM 1
2542| #define STDC_HEADERS 1
2543| #define HAVE_DIRENT_H 1
2544| #define HAVE_ERRNO_H 1
2545| #define HAVE_FLOAT_H 1
2546| #define HAVE_LANGINFO_H 1
2547| #define HAVE_LIMITS_H 1
2548| #define HAVE_LOCALE_H 1
2549| #define HAVE_MATH_H 1
2550| #define HAVE_STDLIB_H 1
2551| #define HAVE_STRING_H 1
2552| #define HAVE_TIME_H 1
2553| #define HAVE_SYS_TIME_H 1
2554| #define HAVE_SYS_TYPES_H 1
2555| #define HAVE_SYS_IOCTL_H 1
2556| #define HAVE_SYS_PARAM_H 1
2557| #define HAVE_SYS_SELECT_H 1
2558| #define HAVE_SYS_SOCKET_H 1
2559| #define HAVE_SYS_STAT_H 1
2560| #define HAVE_SYS_TIMEB_H 1
2561| #define HAVE_SYS_UTSNAME_H 1
2562| #define HAVE_LIBC_H 1
2563| #define HAVE_POLL_H 1
2564| #define HAVE_SGTTY_H 1
2565| #define HAVE_TERMIOS_H 1
2566| #define HAVE_DIRENT_H 1
2567| #define HAVE_DLFCN_H 1
2568| #define HAVE__BOOL 1
2569| #define HAVE_STDBOOL_H 1
2570| #define HAVE_STRUCT_EXCEPTION_IN_MATH_H 1
2571| #define HAVE_EXTERNAL_FUNCTIONS 1
2572| #define HAVE_UNISTD_H 1
2573| #define HAVE_TIME_T_IN_TIME_H 1
2574| #define RETSIGTYPE void
2575| #define HAVE_ATEXIT 1
2576| #define HAVE_MEMCPY 1
2577| #define HAVE_MEMMOVE 1
2578| #define HAVE_MEMSET 1
2579| #define HAVE_BCOPY 1
2580| #define HAVE_BZERO 1
2581| #define HAVE_SETVBUF 1
2582| #define HAVE_STRERROR 1
2583| #define HAVE_STRCHR 1
2584| #define HAVE_STRRCHR 1
2585| #define HAVE_STRSTR 1
2586| #define HAVE_INDEX 1
2587| #define HAVE_RINDEX 1
2588| #define HAVE_ERF 1
2589| #define HAVE_ERFC 1
2590| #define HAVE_GAMMA 1
2591| #define HAVE_LGAMMA 1
2592| #define HAVE_GETCWD 1
2593| #define HAVE_POLL 1
2594| #define HAVE_PCLOSE 1
2595| #define HAVE_POPEN 1
2596| #define HAVE_FDOPEN 1
2597| #define HAVE_SELECT 1
2598| #define HAVE_SLEEP 1
2599| #define HAVE_STPCPY 1
2600| #define HAVE_STRCSPN 1
2601| #define HAVE_STRDUP 1
2602| #define HAVE_STRNDUP 1
2603| #define HAVE_STRNLEN 1
2604| #define HAVE_STRCASECMP 1
2605| #define HAVE_STRNCASECMP 1
2606| /* end confdefs.h.  */
2607| /* Define strnicmp to an innocuous variant, in case <limits.h> declares strnicmp.
2608|    For example, HP-UX 11i <limits.h> declares gettimeofday.  */
2609| #define strnicmp innocuous_strnicmp
2610|
2611| /* System header to define __stub macros and hopefully few prototypes,
2612|     which can conflict with char strnicmp (); below.
2613|     Prefer <limits.h> to <assert.h> if __STDC__ is defined, since
2614|     <limits.h> exists even on freestanding compilers.  */
2615|
2616| #ifdef __STDC__
2617| # include <limits.h>
2618| #else
2619| # include <assert.h>
2620| #endif
2621|
2622| #undef strnicmp
2623|
2624| /* Override any GCC internal prototype to avoid an error.
2625|    Use char because int might match the return type of a GCC
2626|    builtin and then its argument prototype would still apply.  */
2627| #ifdef __cplusplus
2628| extern "C"
2629| #endif
2630| char strnicmp ();
2631| /* The GNU C library defines this for functions which it implements
2632|     to always fail with ENOSYS.  Some functions are actually named
2633|     something starting with __ and the normal name is an alias.  */
2634| #if defined __stub_strnicmp || defined __stub___strnicmp
2635| choke me
2636| #endif
2637|
2638| int
2639| main ()
2640| {
2641| return strnicmp ();
2642|   ;
2643|   return 0;
2644| }
2645configure:9643: result: no
2646configure:9643: checking for sysinfo
2647configure:9643: /usr/bin/clang -o conftest -pipe -Os -F/opt/local/Library/Frameworks -arch x86_64 -ObjC -I/opt/local/include   -L/opt/local/lib -Wl,-headerpad_max_install_names -F/opt/local/Library/Frameworks -arch x86_64 -L/opt/local/lib -lcerf -framework Foundation -framework AquaTerm conftest.c  >&5
2648Undefined symbols for architecture x86_64:
2649  "_sysinfo", referenced from:
2650      _main in conftest-369953.o
2651ld: symbol(s) not found for architecture x86_64
2652clang: error: linker command failed with exit code 1 (use -v to see invocation)
2653configure:9643: $? = 1
2654configure: failed program was:
2655| /* confdefs.h */
2656| #define PACKAGE_NAME "gnuplot"
2657| #define PACKAGE_TARNAME "gnuplot"
2658| #define PACKAGE_VERSION "5.0.6"
2659| #define PACKAGE_STRING "gnuplot 5.0.6"
2660| #define PACKAGE_BUGREPORT ""
2661| #define PACKAGE_URL ""
2662| #define PACKAGE "gnuplot"
2663| #define VERSION "5.0.6"
2664| #define PROTOTYPES 1
2665| #define STDC_HEADERS 1
2666| #define HAVE_SYS_TYPES_H 1
2667| #define HAVE_SYS_STAT_H 1
2668| #define HAVE_STDLIB_H 1
2669| #define HAVE_STRING_H 1
2670| #define HAVE_MEMORY_H 1
2671| #define HAVE_STRINGS_H 1
2672| #define HAVE_INTTYPES_H 1
2673| #define HAVE_STDINT_H 1
2674| #define HAVE_UNISTD_H 1
2675| #define __EXTENSIONS__ 1
2676| #define _ALL_SOURCE 1
2677| #define _GNU_SOURCE 1
2678| #define _POSIX_PTHREAD_SEMANTICS 1
2679| #define _TANDEM_SOURCE 1
2680| #define HAVE_STRINGIZE 1
2681| #define HAVE_OFF_T 1
2682| #define HAVE_FSEEKO 1
2683| #define HAVE_LIBCERF 1
2684| #define X11 1
2685| #define HAVE_FRAMEWORK_AQUATERM 1
2686| #define STDC_HEADERS 1
2687| #define HAVE_DIRENT_H 1
2688| #define HAVE_ERRNO_H 1
2689| #define HAVE_FLOAT_H 1
2690| #define HAVE_LANGINFO_H 1
2691| #define HAVE_LIMITS_H 1
2692| #define HAVE_LOCALE_H 1
2693| #define HAVE_MATH_H 1
2694| #define HAVE_STDLIB_H 1
2695| #define HAVE_STRING_H 1
2696| #define HAVE_TIME_H 1
2697| #define HAVE_SYS_TIME_H 1
2698| #define HAVE_SYS_TYPES_H 1
2699| #define HAVE_SYS_IOCTL_H 1
2700| #define HAVE_SYS_PARAM_H 1
2701| #define HAVE_SYS_SELECT_H 1
2702| #define HAVE_SYS_SOCKET_H 1
2703| #define HAVE_SYS_STAT_H 1
2704| #define HAVE_SYS_TIMEB_H 1
2705| #define HAVE_SYS_UTSNAME_H 1
2706| #define HAVE_LIBC_H 1
2707| #define HAVE_POLL_H 1
2708| #define HAVE_SGTTY_H 1
2709| #define HAVE_TERMIOS_H 1
2710| #define HAVE_DIRENT_H 1
2711| #define HAVE_DLFCN_H 1
2712| #define HAVE__BOOL 1
2713| #define HAVE_STDBOOL_H 1
2714| #define HAVE_STRUCT_EXCEPTION_IN_MATH_H 1
2715| #define HAVE_EXTERNAL_FUNCTIONS 1
2716| #define HAVE_UNISTD_H 1
2717| #define HAVE_TIME_T_IN_TIME_H 1
2718| #define RETSIGTYPE void
2719| #define HAVE_ATEXIT 1
2720| #define HAVE_MEMCPY 1
2721| #define HAVE_MEMMOVE 1
2722| #define HAVE_MEMSET 1
2723| #define HAVE_BCOPY 1
2724| #define HAVE_BZERO 1
2725| #define HAVE_SETVBUF 1
2726| #define HAVE_STRERROR 1
2727| #define HAVE_STRCHR 1
2728| #define HAVE_STRRCHR 1
2729| #define HAVE_STRSTR 1
2730| #define HAVE_INDEX 1
2731| #define HAVE_RINDEX 1
2732| #define HAVE_ERF 1
2733| #define HAVE_ERFC 1
2734| #define HAVE_GAMMA 1
2735| #define HAVE_LGAMMA 1
2736| #define HAVE_GETCWD 1
2737| #define HAVE_POLL 1
2738| #define HAVE_PCLOSE 1
2739| #define HAVE_POPEN 1
2740| #define HAVE_FDOPEN 1
2741| #define HAVE_SELECT 1
2742| #define HAVE_SLEEP 1
2743| #define HAVE_STPCPY 1
2744| #define HAVE_STRCSPN 1
2745| #define HAVE_STRDUP 1
2746| #define HAVE_STRNDUP 1
2747| #define HAVE_STRNLEN 1
2748| #define HAVE_STRCASECMP 1
2749| #define HAVE_STRNCASECMP 1
2750| /* end confdefs.h.  */
2751| /* Define sysinfo to an innocuous variant, in case <limits.h> declares sysinfo.
2752|    For example, HP-UX 11i <limits.h> declares gettimeofday.  */
2753| #define sysinfo innocuous_sysinfo
2754|
2755| /* System header to define __stub macros and hopefully few prototypes,
2756|     which can conflict with char sysinfo (); below.
2757|     Prefer <limits.h> to <assert.h> if __STDC__ is defined, since
2758|     <limits.h> exists even on freestanding compilers.  */
2759|
2760| #ifdef __STDC__
2761| # include <limits.h>
2762| #else
2763| # include <assert.h>
2764| #endif
2765|
2766| #undef sysinfo
2767|
2768| /* Override any GCC internal prototype to avoid an error.
2769|    Use char because int might match the return type of a GCC
2770|    builtin and then its argument prototype would still apply.  */
2771| #ifdef __cplusplus
2772| extern "C"
2773| #endif
2774| char sysinfo ();
2775| /* The GNU C library defines this for functions which it implements
2776|     to always fail with ENOSYS.  Some functions are actually named
2777|     something starting with __ and the normal name is an alias.  */
2778| #if defined __stub_sysinfo || defined __stub___sysinfo
2779| choke me
2780| #endif
2781|
2782| int
2783| main ()
2784| {
2785| return sysinfo ();
2786|   ;
2787|   return 0;
2788| }
2789configure:9643: result: no
2790configure:9643: checking for tcgetattr
2791configure:9643: /usr/bin/clang -o conftest -pipe -Os -F/opt/local/Library/Frameworks -arch x86_64 -ObjC -I/opt/local/include   -L/opt/local/lib -Wl,-headerpad_max_install_names -F/opt/local/Library/Frameworks -arch x86_64 -L/opt/local/lib -lcerf -framework Foundation -framework AquaTerm conftest.c  >&5
2792configure:9643: $? = 0
2793configure:9643: result: yes
2794configure:9643: checking for vfprintf
2795configure:9643: /usr/bin/clang -o conftest -pipe -Os -F/opt/local/Library/Frameworks -arch x86_64 -ObjC -I/opt/local/include   -L/opt/local/lib -Wl,-headerpad_max_install_names -F/opt/local/Library/Frameworks -arch x86_64 -L/opt/local/lib -lcerf -framework Foundation -framework AquaTerm conftest.c  >&5
2796conftest.c:121:6: warning: incompatible redeclaration of library function 'vfprintf' [-Wincompatible-library-redeclaration]
2797char vfprintf ();
2798     ^
2799conftest.c:121:6: note: 'vfprintf' is a builtin with type 'int ()'
28001 warning generated.
2801configure:9643: $? = 0
2802configure:9643: result: yes
2803configure:9643: checking for doprnt
2804configure:9643: /usr/bin/clang -o conftest -pipe -Os -F/opt/local/Library/Frameworks -arch x86_64 -ObjC -I/opt/local/include   -L/opt/local/lib -Wl,-headerpad_max_install_names -F/opt/local/Library/Frameworks -arch x86_64 -L/opt/local/lib -lcerf -framework Foundation -framework AquaTerm conftest.c  >&5
2805Undefined symbols for architecture x86_64:
2806  "_doprnt", referenced from:
2807      _main in conftest-29722d.o
2808ld: symbol(s) not found for architecture x86_64
2809clang: error: linker command failed with exit code 1 (use -v to see invocation)
2810configure:9643: $? = 1
2811configure: failed program was:
2812| /* confdefs.h */
2813| #define PACKAGE_NAME "gnuplot"
2814| #define PACKAGE_TARNAME "gnuplot"
2815| #define PACKAGE_VERSION "5.0.6"
2816| #define PACKAGE_STRING "gnuplot 5.0.6"
2817| #define PACKAGE_BUGREPORT ""
2818| #define PACKAGE_URL ""
2819| #define PACKAGE "gnuplot"
2820| #define VERSION "5.0.6"
2821| #define PROTOTYPES 1
2822| #define STDC_HEADERS 1
2823| #define HAVE_SYS_TYPES_H 1
2824| #define HAVE_SYS_STAT_H 1
2825| #define HAVE_STDLIB_H 1
2826| #define HAVE_STRING_H 1
2827| #define HAVE_MEMORY_H 1
2828| #define HAVE_STRINGS_H 1
2829| #define HAVE_INTTYPES_H 1
2830| #define HAVE_STDINT_H 1
2831| #define HAVE_UNISTD_H 1
2832| #define __EXTENSIONS__ 1
2833| #define _ALL_SOURCE 1
2834| #define _GNU_SOURCE 1
2835| #define _POSIX_PTHREAD_SEMANTICS 1
2836| #define _TANDEM_SOURCE 1
2837| #define HAVE_STRINGIZE 1
2838| #define HAVE_OFF_T 1
2839| #define HAVE_FSEEKO 1
2840| #define HAVE_LIBCERF 1
2841| #define X11 1
2842| #define HAVE_FRAMEWORK_AQUATERM 1
2843| #define STDC_HEADERS 1
2844| #define HAVE_DIRENT_H 1
2845| #define HAVE_ERRNO_H 1
2846| #define HAVE_FLOAT_H 1
2847| #define HAVE_LANGINFO_H 1
2848| #define HAVE_LIMITS_H 1
2849| #define HAVE_LOCALE_H 1
2850| #define HAVE_MATH_H 1
2851| #define HAVE_STDLIB_H 1
2852| #define HAVE_STRING_H 1
2853| #define HAVE_TIME_H 1
2854| #define HAVE_SYS_TIME_H 1
2855| #define HAVE_SYS_TYPES_H 1
2856| #define HAVE_SYS_IOCTL_H 1
2857| #define HAVE_SYS_PARAM_H 1
2858| #define HAVE_SYS_SELECT_H 1
2859| #define HAVE_SYS_SOCKET_H 1
2860| #define HAVE_SYS_STAT_H 1
2861| #define HAVE_SYS_TIMEB_H 1
2862| #define HAVE_SYS_UTSNAME_H 1
2863| #define HAVE_LIBC_H 1
2864| #define HAVE_POLL_H 1
2865| #define HAVE_SGTTY_H 1
2866| #define HAVE_TERMIOS_H 1
2867| #define HAVE_DIRENT_H 1
2868| #define HAVE_DLFCN_H 1
2869| #define HAVE__BOOL 1
2870| #define HAVE_STDBOOL_H 1
2871| #define HAVE_STRUCT_EXCEPTION_IN_MATH_H 1
2872| #define HAVE_EXTERNAL_FUNCTIONS 1
2873| #define HAVE_UNISTD_H 1
2874| #define HAVE_TIME_T_IN_TIME_H 1
2875| #define RETSIGTYPE void
2876| #define HAVE_ATEXIT 1
2877| #define HAVE_MEMCPY 1
2878| #define HAVE_MEMMOVE 1
2879| #define HAVE_MEMSET 1
2880| #define HAVE_BCOPY 1
2881| #define HAVE_BZERO 1
2882| #define HAVE_SETVBUF 1
2883| #define HAVE_STRERROR 1
2884| #define HAVE_STRCHR 1
2885| #define HAVE_STRRCHR 1
2886| #define HAVE_STRSTR 1
2887| #define HAVE_INDEX 1
2888| #define HAVE_RINDEX 1
2889| #define HAVE_ERF 1
2890| #define HAVE_ERFC 1
2891| #define HAVE_GAMMA 1
2892| #define HAVE_LGAMMA 1
2893| #define HAVE_GETCWD 1
2894| #define HAVE_POLL 1
2895| #define HAVE_PCLOSE 1
2896| #define HAVE_POPEN 1
2897| #define HAVE_FDOPEN 1
2898| #define HAVE_SELECT 1
2899| #define HAVE_SLEEP 1
2900| #define HAVE_STPCPY 1
2901| #define HAVE_STRCSPN 1
2902| #define HAVE_STRDUP 1
2903| #define HAVE_STRNDUP 1
2904| #define HAVE_STRNLEN 1
2905| #define HAVE_STRCASECMP 1
2906| #define HAVE_STRNCASECMP 1
2907| #define HAVE_TCGETATTR 1
2908| #define HAVE_VFPRINTF 1
2909| /* end confdefs.h.  */
2910| /* Define doprnt to an innocuous variant, in case <limits.h> declares doprnt.
2911|    For example, HP-UX 11i <limits.h> declares gettimeofday.  */
2912| #define doprnt innocuous_doprnt
2913|
2914| /* System header to define __stub macros and hopefully few prototypes,
2915|     which can conflict with char doprnt (); below.
2916|     Prefer <limits.h> to <assert.h> if __STDC__ is defined, since
2917|     <limits.h> exists even on freestanding compilers.  */
2918|
2919| #ifdef __STDC__
2920| # include <limits.h>
2921| #else
2922| # include <assert.h>
2923| #endif
2924|
2925| #undef doprnt
2926|
2927| /* Override any GCC internal prototype to avoid an error.
2928|    Use char because int might match the return type of a GCC
2929|    builtin and then its argument prototype would still apply.  */
2930| #ifdef __cplusplus
2931| extern "C"
2932| #endif
2933| char doprnt ();
2934| /* The GNU C library defines this for functions which it implements
2935|     to always fail with ENOSYS.  Some functions are actually named
2936|     something starting with __ and the normal name is an alias.  */
2937| #if defined __stub_doprnt || defined __stub___doprnt
2938| choke me
2939| #endif
2940|
2941| int
2942| main ()
2943| {
2944| return doprnt ();
2945|   ;
2946|   return 0;
2947| }
2948configure:9643: result: no
2949configure:9643: checking for usleep
2950configure:9643: /usr/bin/clang -o conftest -pipe -Os -F/opt/local/Library/Frameworks -arch x86_64 -ObjC -I/opt/local/include   -L/opt/local/lib -Wl,-headerpad_max_install_names -F/opt/local/Library/Frameworks -arch x86_64 -L/opt/local/lib -lcerf -framework Foundation -framework AquaTerm conftest.c  >&5
2951configure:9643: $? = 0
2952configure:9643: result: yes
2953configure:9655: checking for snprintf
2954configure:9655: /usr/bin/clang -o conftest -pipe -Os -F/opt/local/Library/Frameworks -arch x86_64 -ObjC -I/opt/local/include   -L/opt/local/lib -Wl,-headerpad_max_install_names -F/opt/local/Library/Frameworks -arch x86_64 -L/opt/local/lib -lcerf -framework Foundation -framework AquaTerm conftest.c  >&5
2955conftest.c:123:6: warning: incompatible redeclaration of library function 'snprintf' [-Wincompatible-library-redeclaration]
2956char snprintf ();
2957     ^
2958conftest.c:123:6: note: 'snprintf' is a builtin with type 'int (char *, unsigned long, const char *, ...)'
29591 warning generated.
2960configure:9655: $? = 0
2961configure:9655: result: yes
2962configure:9680: checking whether signgam is declared
2963configure:9680: /usr/bin/clang -c -pipe -Os -F/opt/local/Library/Frameworks -arch x86_64 -ObjC -I/opt/local/include   conftest.c >&5
2964configure:9680: $? = 0
2965configure:9680: result: yes
2966configure:9696: checking for sigsetjmp
2967configure:9709: /usr/bin/clang -o conftest -pipe -Os -F/opt/local/Library/Frameworks -arch x86_64 -ObjC -I/opt/local/include   -L/opt/local/lib -Wl,-headerpad_max_install_names -F/opt/local/Library/Frameworks -arch x86_64 -L/opt/local/lib -lcerf -framework Foundation -framework AquaTerm conftest.c  >&5
2968configure:9709: $? = 0
2969configure:9710: result: yes
2970configure:9728: checking if malloc(0) returns 0
2971configure:9747: /usr/bin/clang -o conftest -pipe -Os -F/opt/local/Library/Frameworks -arch x86_64 -ObjC -I/opt/local/include   -L/opt/local/lib -Wl,-headerpad_max_install_names -F/opt/local/Library/Frameworks -arch x86_64 -L/opt/local/lib -lcerf -framework Foundation -framework AquaTerm conftest.c  >&5
2972configure:9747: $? = 0
2973configure:9747: ./conftest
2974configure:9747: $? = 0
2975configure:9756: result: no
2976configure:9767: checking for sys/select.h
2977configure:9767: result: yes
2978configure:9767: checking for sys/socket.h
2979configure:9767: result: yes
2980configure:9777: checking types of arguments for select
2981configure:9805: /usr/bin/clang -c -pipe -Os -F/opt/local/Library/Frameworks -arch x86_64 -ObjC -I/opt/local/include   conftest.c >&5
2982configure:9805: $? = 0
2983configure:9816: result: int,fd_set *,struct timeval *
2984configure:10239: checking for tputs in -lncurses
2985configure:10264: /usr/bin/clang -o conftest -pipe -Os -F/opt/local/Library/Frameworks -arch x86_64 -ObjC -I/opt/local/include   -L/opt/local/lib -Wl,-headerpad_max_install_names -F/opt/local/Library/Frameworks -arch x86_64 -L/opt/local/lib -lcerf -framework Foundation -framework AquaTerm conftest.c -lncurses   >&5
2986configure:10264: $? = 0
2987configure:10274: result: yes
2988configure:10336: checking for remove_history in -lreadline
2989configure:10361: /usr/bin/clang -o conftest -pipe -Os -F/opt/local/Library/Frameworks -arch x86_64 -ObjC -I/opt/local/include   -I/opt/local/include -L/opt/local/lib -Wl,-headerpad_max_install_names -F/opt/local/Library/Frameworks -arch x86_64 -L/opt/local/lib -lcerf -framework Foundation -framework AquaTerm -L/opt/local/lib conftest.c -lreadline  -lncurses  >&5
2990configure:10361: $? = 0
2991configure:10370: result: yes
2992configure:10427: checking for library containing rl_ding
2993configure:10458: /usr/bin/clang -o conftest -pipe -Os -F/opt/local/Library/Frameworks -arch x86_64 -ObjC -I/opt/local/include   -I/opt/local/include -L/opt/local/lib -Wl,-headerpad_max_install_names -F/opt/local/Library/Frameworks -arch x86_64 -L/opt/local/lib -lcerf -framework Foundation -framework AquaTerm -L/opt/local/lib conftest.c  >&5
2994Undefined symbols for architecture x86_64:
2995  "_rl_ding", referenced from:
2996      _main in conftest-50dd31.o
2997ld: symbol(s) not found for architecture x86_64
2998clang: error: linker command failed with exit code 1 (use -v to see invocation)
2999configure:10458: $? = 1
3000configure: failed program was:
3001| /* confdefs.h */
3002| #define PACKAGE_NAME "gnuplot"
3003| #define PACKAGE_TARNAME "gnuplot"
3004| #define PACKAGE_VERSION "5.0.6"
3005| #define PACKAGE_STRING "gnuplot 5.0.6"
3006| #define PACKAGE_BUGREPORT ""
3007| #define PACKAGE_URL ""
3008| #define PACKAGE "gnuplot"
3009| #define VERSION "5.0.6"
3010| #define PROTOTYPES 1
3011| #define STDC_HEADERS 1
3012| #define HAVE_SYS_TYPES_H 1
3013| #define HAVE_SYS_STAT_H 1
3014| #define HAVE_STDLIB_H 1
3015| #define HAVE_STRING_H 1
3016| #define HAVE_MEMORY_H 1
3017| #define HAVE_STRINGS_H 1
3018| #define HAVE_INTTYPES_H 1
3019| #define HAVE_STDINT_H 1
3020| #define HAVE_UNISTD_H 1
3021| #define __EXTENSIONS__ 1
3022| #define _ALL_SOURCE 1
3023| #define _GNU_SOURCE 1
3024| #define _POSIX_PTHREAD_SEMANTICS 1
3025| #define _TANDEM_SOURCE 1
3026| #define HAVE_STRINGIZE 1
3027| #define HAVE_OFF_T 1
3028| #define HAVE_FSEEKO 1
3029| #define HAVE_LIBCERF 1
3030| #define X11 1
3031| #define HAVE_FRAMEWORK_AQUATERM 1
3032| #define STDC_HEADERS 1
3033| #define HAVE_DIRENT_H 1
3034| #define HAVE_ERRNO_H 1
3035| #define HAVE_FLOAT_H 1
3036| #define HAVE_LANGINFO_H 1
3037| #define HAVE_LIMITS_H 1
3038| #define HAVE_LOCALE_H 1
3039| #define HAVE_MATH_H 1
3040| #define HAVE_STDLIB_H 1
3041| #define HAVE_STRING_H 1
3042| #define HAVE_TIME_H 1
3043| #define HAVE_SYS_TIME_H 1
3044| #define HAVE_SYS_TYPES_H 1
3045| #define HAVE_SYS_IOCTL_H 1
3046| #define HAVE_SYS_PARAM_H 1
3047| #define HAVE_SYS_SELECT_H 1
3048| #define HAVE_SYS_SOCKET_H 1
3049| #define HAVE_SYS_STAT_H 1
3050| #define HAVE_SYS_TIMEB_H 1
3051| #define HAVE_SYS_UTSNAME_H 1
3052| #define HAVE_LIBC_H 1
3053| #define HAVE_POLL_H 1
3054| #define HAVE_SGTTY_H 1
3055| #define HAVE_TERMIOS_H 1
3056| #define HAVE_DIRENT_H 1
3057| #define HAVE_DLFCN_H 1
3058| #define HAVE__BOOL 1
3059| #define HAVE_STDBOOL_H 1
3060| #define HAVE_STRUCT_EXCEPTION_IN_MATH_H 1
3061| #define HAVE_EXTERNAL_FUNCTIONS 1
3062| #define HAVE_UNISTD_H 1
3063| #define HAVE_TIME_T_IN_TIME_H 1
3064| #define RETSIGTYPE void
3065| #define HAVE_ATEXIT 1
3066| #define HAVE_MEMCPY 1
3067| #define HAVE_MEMMOVE 1
3068| #define HAVE_MEMSET 1
3069| #define HAVE_BCOPY 1
3070| #define HAVE_BZERO 1
3071| #define HAVE_SETVBUF 1
3072| #define HAVE_STRERROR 1
3073| #define HAVE_STRCHR 1
3074| #define HAVE_STRRCHR 1
3075| #define HAVE_STRSTR 1
3076| #define HAVE_INDEX 1
3077| #define HAVE_RINDEX 1
3078| #define HAVE_ERF 1
3079| #define HAVE_ERFC 1
3080| #define HAVE_GAMMA 1
3081| #define HAVE_LGAMMA 1
3082| #define HAVE_GETCWD 1
3083| #define HAVE_POLL 1
3084| #define HAVE_PCLOSE 1
3085| #define HAVE_POPEN 1
3086| #define HAVE_FDOPEN 1
3087| #define HAVE_SELECT 1
3088| #define HAVE_SLEEP 1
3089| #define HAVE_STPCPY 1
3090| #define HAVE_STRCSPN 1
3091| #define HAVE_STRDUP 1
3092| #define HAVE_STRNDUP 1
3093| #define HAVE_STRNLEN 1
3094| #define HAVE_STRCASECMP 1
3095| #define HAVE_STRNCASECMP 1
3096| #define HAVE_TCGETATTR 1
3097| #define HAVE_VFPRINTF 1
3098| #define HAVE_USLEEP 1
3099| #define HAVE_SNPRINTF 1
3100| #define HAVE_DECL_SIGNGAM 1
3101| #define HAVE_SIGSETJMP 1
3102| #define PIPES 1
3103| #define HAVE_SYS_SELECT_H 1
3104| #define HAVE_SYS_SOCKET_H 1
3105| #define SELECT_TYPE_ARG1 int
3106| #define SELECT_TYPE_ARG234 (fd_set *)
3107| #define SELECT_TYPE_ARG5 (struct timeval *)
3108| /* end confdefs.h.  */
3109|
3110| /* Override any GCC internal prototype to avoid an error.
3111|    Use char because int might match the return type of a GCC
3112|    builtin and then its argument prototype would still apply.  */
3113| #ifdef __cplusplus
3114| extern "C"
3115| #endif
3116| char rl_ding ();
3117| int
3118| main ()
3119| {
3120| return rl_ding ();
3121|   ;
3122|   return 0;
3123| }
3124configure:10458: /usr/bin/clang -o conftest -pipe -Os -F/opt/local/Library/Frameworks -arch x86_64 -ObjC -I/opt/local/include   -I/opt/local/include -L/opt/local/lib -Wl,-headerpad_max_install_names -F/opt/local/Library/Frameworks -arch x86_64 -L/opt/local/lib -lcerf -framework Foundation -framework AquaTerm -L/opt/local/lib conftest.c -lreadline -lreadline  -lncurses   >&5
3125configure:10458: $? = 0
3126configure:10475: result: -lreadline
3127configure:10487: checking for library containing rl_forced_update_display
3128configure:10518: /usr/bin/clang -o conftest -pipe -Os -F/opt/local/Library/Frameworks -arch x86_64 -ObjC -I/opt/local/include   -I/opt/local/include -L/opt/local/lib -Wl,-headerpad_max_install_names -F/opt/local/Library/Frameworks -arch x86_64 -L/opt/local/lib -lcerf -framework Foundation -framework AquaTerm -L/opt/local/lib conftest.c -lreadline  >&5
3129configure:10518: $? = 0
3130configure:10535: result: none required
3131configure:10547: checking for library containing rl_reset_after_signal
3132configure:10578: /usr/bin/clang -o conftest -pipe -Os -F/opt/local/Library/Frameworks -arch x86_64 -ObjC -I/opt/local/include   -I/opt/local/include -L/opt/local/lib -Wl,-headerpad_max_install_names -F/opt/local/Library/Frameworks -arch x86_64 -L/opt/local/lib -lcerf -framework Foundation -framework AquaTerm -L/opt/local/lib conftest.c -lreadline  >&5
3133configure:10578: $? = 0
3134configure:10595: result: none required
3135configure:10607: checking for library containing rl_complete_with_tilde_expansion
3136configure:10638: /usr/bin/clang -o conftest -pipe -Os -F/opt/local/Library/Frameworks -arch x86_64 -ObjC -I/opt/local/include   -I/opt/local/include -L/opt/local/lib -Wl,-headerpad_max_install_names -F/opt/local/Library/Frameworks -arch x86_64 -L/opt/local/lib -lcerf -framework Foundation -framework AquaTerm -L/opt/local/lib conftest.c -lreadline  >&5
3137configure:10638: $? = 0
3138configure:10655: result: none required
3139configure:10680: checking readline/readline.h usability
3140configure:10680: /usr/bin/clang -c -pipe -Os -F/opt/local/Library/Frameworks -arch x86_64 -ObjC -I/opt/local/include   -I/opt/local/include conftest.c >&5
3141configure:10680: $? = 0
3142configure:10680: result: yes
3143configure:10680: checking readline/readline.h presence
3144configure:10680: /usr/bin/clang -E -I/opt/local/include   -I/opt/local/include conftest.c
3145configure:10680: $? = 0
3146configure:10680: result: yes
3147configure:10680: checking for readline/readline.h
3148configure:10680: result: yes
3149configure:10697: checking readline/history.h usability
3150configure:10697: /usr/bin/clang -c -pipe -Os -F/opt/local/Library/Frameworks -arch x86_64 -ObjC -I/opt/local/include   -I/opt/local/include conftest.c >&5
3151configure:10697: $? = 0
3152configure:10697: result: yes
3153configure:10697: checking readline/history.h presence
3154configure:10697: /usr/bin/clang -E -I/opt/local/include   -I/opt/local/include conftest.c
3155configure:10697: $? = 0
3156configure:10697: result: yes
3157configure:10697: checking for readline/history.h
3158configure:10697: result: yes
3159configure:10765: checking for deflate in -lz
3160configure:10790: /usr/bin/clang -o conftest -pipe -Os -F/opt/local/Library/Frameworks -arch x86_64 -ObjC -I/opt/local/include   -I/opt/local/include -L/opt/local/lib -Wl,-headerpad_max_install_names -F/opt/local/Library/Frameworks -arch x86_64 -L/opt/local/lib -lcerf -framework Foundation -framework AquaTerm -L/opt/local/lib conftest.c -lz   >&5
3161configure:10790: $? = 0
3162configure:10799: result: yes
3163configure:10806: checking zlib.h usability
3164configure:10806: /usr/bin/clang -c -pipe -Os -F/opt/local/Library/Frameworks -arch x86_64 -ObjC -I/opt/local/include   -I/opt/local/include conftest.c >&5
3165configure:10806: $? = 0
3166configure:10806: result: yes
3167configure:10806: checking zlib.h presence
3168configure:10806: /usr/bin/clang -E -I/opt/local/include   -I/opt/local/include conftest.c
3169configure:10806: $? = 0
3170configure:10806: result: yes
3171configure:10806: checking for zlib.h
3172configure:10806: result: yes
3173configure:10835: checking for gdlib-config
3174configure:10853: found /opt/local/bin/gdlib-config
3175configure:10865: result: /opt/local/bin/gdlib-config
3176configure:10890: checking for gdImageCreateTrueColor in -lgd
3177configure:10915: /usr/bin/clang -o conftest -pipe -Os -F/opt/local/Library/Frameworks -arch x86_64 -ObjC -I/opt/local/include   -I/opt/local/include -I/opt/local/include -L/opt/local/lib -Wl,-headerpad_max_install_names -F/opt/local/Library/Frameworks -arch x86_64 -L/opt/local/lib -lcerf -framework Foundation -framework AquaTerm -L/opt/local/lib -L/opt/local/lib -Wl,-headerpad_max_install_names -L/opt/local/lib conftest.c -lgd   -lgd -L/opt/local/lib -lz -L/opt/local/lib -L/opt/local/lib -lpng16 -L/opt/local/lib -L/opt/local/lib -lfreetype -L/opt/local/lib -lfontconfig -L/opt/local/lib -ljpeg -L/opt/local/lib -lXpm -L/opt/local/lib -ltiff -L/opt/local/lib -lwebp -liconv >&5
3178configure:10915: $? = 0
3179configure:10924: result: yes
3180configure:10932: checking gd.h usability
3181configure:10932: /usr/bin/clang -c -pipe -Os -F/opt/local/Library/Frameworks -arch x86_64 -ObjC -I/opt/local/include   -I/opt/local/include -I/opt/local/include conftest.c >&5
3182configure:10932: $? = 0
3183configure:10932: result: yes
3184configure:10932: checking gd.h presence
3185configure:10932: /usr/bin/clang -E -I/opt/local/include   -I/opt/local/include -I/opt/local/include conftest.c
3186configure:10932: $? = 0
3187configure:10932: result: yes
3188configure:10932: checking for gd.h
3189configure:10932: result: yes
3190configure:10946: checking for gdImageGif in -lgd
3191configure:10971: /usr/bin/clang -o conftest -pipe -Os -F/opt/local/Library/Frameworks -arch x86_64 -ObjC -I/opt/local/include   -I/opt/local/include -I/opt/local/include -L/opt/local/lib -Wl,-headerpad_max_install_names -F/opt/local/Library/Frameworks -arch x86_64 -L/opt/local/lib -lcerf -framework Foundation -framework AquaTerm -L/opt/local/lib -L/opt/local/lib -Wl,-headerpad_max_install_names -L/opt/local/lib conftest.c -lgd   -lgd -L/opt/local/lib -lz -L/opt/local/lib -L/opt/local/lib -lpng16 -L/opt/local/lib -L/opt/local/lib -lfreetype -L/opt/local/lib -lfontconfig -L/opt/local/lib -ljpeg -L/opt/local/lib -lXpm -L/opt/local/lib -ltiff -L/opt/local/lib -lwebp -liconv >&5
3192configure:10971: $? = 0
3193configure:10980: result: yes
3194configure:10988: checking for gdImageGifAnimBegin in -lgd
3195configure:11013: /usr/bin/clang -o conftest -pipe -Os -F/opt/local/Library/Frameworks -arch x86_64 -ObjC -I/opt/local/include   -I/opt/local/include -I/opt/local/include -L/opt/local/lib -Wl,-headerpad_max_install_names -F/opt/local/Library/Frameworks -arch x86_64 -L/opt/local/lib -lcerf -framework Foundation -framework AquaTerm -L/opt/local/lib -L/opt/local/lib -Wl,-headerpad_max_install_names -L/opt/local/lib conftest.c -lgd   -lgd -L/opt/local/lib -lz -L/opt/local/lib -L/opt/local/lib -lpng16 -L/opt/local/lib -L/opt/local/lib -lfreetype -L/opt/local/lib -lfontconfig -L/opt/local/lib -ljpeg -L/opt/local/lib -lXpm -L/opt/local/lib -ltiff -L/opt/local/lib -lwebp -liconv >&5
3196configure:11013: $? = 0
3197configure:11022: result: yes
3198configure:11031: checking for gdImageJpeg in -lgd
3199configure:11056: /usr/bin/clang -o conftest -pipe -Os -F/opt/local/Library/Frameworks -arch x86_64 -ObjC -I/opt/local/include   -I/opt/local/include -I/opt/local/include -L/opt/local/lib -Wl,-headerpad_max_install_names -F/opt/local/Library/Frameworks -arch x86_64 -L/opt/local/lib -lcerf -framework Foundation -framework AquaTerm -L/opt/local/lib -L/opt/local/lib -Wl,-headerpad_max_install_names -L/opt/local/lib conftest.c -lgd   -lgd -L/opt/local/lib -lz -L/opt/local/lib -L/opt/local/lib -lpng16 -L/opt/local/lib -L/opt/local/lib -lfreetype -L/opt/local/lib -lfontconfig -L/opt/local/lib -ljpeg -L/opt/local/lib -lXpm -L/opt/local/lib -ltiff -L/opt/local/lib -lwebp -liconv >&5
3200configure:11056: $? = 0
3201configure:11065: result: yes
3202configure:11074: checking for gdImageStringFT in -lgd
3203configure:11099: /usr/bin/clang -o conftest -pipe -Os -F/opt/local/Library/Frameworks -arch x86_64 -ObjC -I/opt/local/include   -I/opt/local/include -I/opt/local/include -L/opt/local/lib -Wl,-headerpad_max_install_names -F/opt/local/Library/Frameworks -arch x86_64 -L/opt/local/lib -lcerf -framework Foundation -framework AquaTerm -L/opt/local/lib -L/opt/local/lib -Wl,-headerpad_max_install_names -L/opt/local/lib conftest.c -lgd   -lgd -L/opt/local/lib -lz -L/opt/local/lib -L/opt/local/lib -lpng16 -L/opt/local/lib -L/opt/local/lib -lfreetype -L/opt/local/lib -lfontconfig -L/opt/local/lib -ljpeg -L/opt/local/lib -lXpm -L/opt/local/lib -ltiff -L/opt/local/lib -lwebp -liconv >&5
3204configure:11099: $? = 0
3205configure:11108: result: yes
3206configure:11117: checking for gdImagePng in -lgd
3207configure:11142: /usr/bin/clang -o conftest -pipe -Os -F/opt/local/Library/Frameworks -arch x86_64 -ObjC -I/opt/local/include   -I/opt/local/include -I/opt/local/include -L/opt/local/lib -Wl,-headerpad_max_install_names -F/opt/local/Library/Frameworks -arch x86_64 -L/opt/local/lib -lcerf -framework Foundation -framework AquaTerm -L/opt/local/lib -L/opt/local/lib -Wl,-headerpad_max_install_names -L/opt/local/lib conftest.c -lgd   -lgd -L/opt/local/lib -lz -L/opt/local/lib -L/opt/local/lib -lpng16 -L/opt/local/lib -L/opt/local/lib -lfreetype -L/opt/local/lib -lfontconfig -L/opt/local/lib -ljpeg -L/opt/local/lib -lXpm -L/opt/local/lib -ltiff -L/opt/local/lib -lwebp -liconv >&5
3208configure:11142: $? = 0
3209configure:11151: result: yes
3210configure:11180: checking for library containing iconv_open
3211configure:11211: /usr/bin/clang -o conftest -pipe -Os -F/opt/local/Library/Frameworks -arch x86_64 -ObjC -I/opt/local/include   -I/opt/local/include -I/opt/local/include -L/opt/local/lib -Wl,-headerpad_max_install_names -F/opt/local/Library/Frameworks -arch x86_64 -L/opt/local/lib -lcerf -framework Foundation -framework AquaTerm -L/opt/local/lib -L/opt/local/lib -Wl,-headerpad_max_install_names -L/opt/local/lib conftest.c  >&5
3212Undefined symbols for architecture x86_64:
3213  "_iconv_open", referenced from:
3214      _main in conftest-6dc59a.o
3215ld: symbol(s) not found for architecture x86_64
3216clang: error: linker command failed with exit code 1 (use -v to see invocation)
3217configure:11211: $? = 1
3218configure: failed program was:
3219| /* confdefs.h */
3220| #define PACKAGE_NAME "gnuplot"
3221| #define PACKAGE_TARNAME "gnuplot"
3222| #define PACKAGE_VERSION "5.0.6"
3223| #define PACKAGE_STRING "gnuplot 5.0.6"
3224| #define PACKAGE_BUGREPORT ""
3225| #define PACKAGE_URL ""
3226| #define PACKAGE "gnuplot"
3227| #define VERSION "5.0.6"
3228| #define PROTOTYPES 1
3229| #define STDC_HEADERS 1
3230| #define HAVE_SYS_TYPES_H 1
3231| #define HAVE_SYS_STAT_H 1
3232| #define HAVE_STDLIB_H 1
3233| #define HAVE_STRING_H 1
3234| #define HAVE_MEMORY_H 1
3235| #define HAVE_STRINGS_H 1
3236| #define HAVE_INTTYPES_H 1
3237| #define HAVE_STDINT_H 1
3238| #define HAVE_UNISTD_H 1
3239| #define __EXTENSIONS__ 1
3240| #define _ALL_SOURCE 1
3241| #define _GNU_SOURCE 1
3242| #define _POSIX_PTHREAD_SEMANTICS 1
3243| #define _TANDEM_SOURCE 1
3244| #define HAVE_STRINGIZE 1
3245| #define HAVE_OFF_T 1
3246| #define HAVE_FSEEKO 1
3247| #define HAVE_LIBCERF 1
3248| #define X11 1
3249| #define HAVE_FRAMEWORK_AQUATERM 1
3250| #define STDC_HEADERS 1
3251| #define HAVE_DIRENT_H 1
3252| #define HAVE_ERRNO_H 1
3253| #define HAVE_FLOAT_H 1
3254| #define HAVE_LANGINFO_H 1
3255| #define HAVE_LIMITS_H 1
3256| #define HAVE_LOCALE_H 1
3257| #define HAVE_MATH_H 1
3258| #define HAVE_STDLIB_H 1
3259| #define HAVE_STRING_H 1
3260| #define HAVE_TIME_H 1
3261| #define HAVE_SYS_TIME_H 1
3262| #define HAVE_SYS_TYPES_H 1
3263| #define HAVE_SYS_IOCTL_H 1
3264| #define HAVE_SYS_PARAM_H 1
3265| #define HAVE_SYS_SELECT_H 1
3266| #define HAVE_SYS_SOCKET_H 1
3267| #define HAVE_SYS_STAT_H 1
3268| #define HAVE_SYS_TIMEB_H 1
3269| #define HAVE_SYS_UTSNAME_H 1
3270| #define HAVE_LIBC_H 1
3271| #define HAVE_POLL_H 1
3272| #define HAVE_SGTTY_H 1
3273| #define HAVE_TERMIOS_H 1
3274| #define HAVE_DIRENT_H 1
3275| #define HAVE_DLFCN_H 1
3276| #define HAVE__BOOL 1
3277| #define HAVE_STDBOOL_H 1
3278| #define HAVE_STRUCT_EXCEPTION_IN_MATH_H 1
3279| #define HAVE_EXTERNAL_FUNCTIONS 1
3280| #define HAVE_UNISTD_H 1
3281| #define HAVE_TIME_T_IN_TIME_H 1
3282| #define RETSIGTYPE void
3283| #define HAVE_ATEXIT 1
3284| #define HAVE_MEMCPY 1
3285| #define HAVE_MEMMOVE 1
3286| #define HAVE_MEMSET 1
3287| #define HAVE_BCOPY 1
3288| #define HAVE_BZERO 1
3289| #define HAVE_SETVBUF 1
3290| #define HAVE_STRERROR 1
3291| #define HAVE_STRCHR 1
3292| #define HAVE_STRRCHR 1
3293| #define HAVE_STRSTR 1
3294| #define HAVE_INDEX 1
3295| #define HAVE_RINDEX 1
3296| #define HAVE_ERF 1
3297| #define HAVE_ERFC 1
3298| #define HAVE_GAMMA 1
3299| #define HAVE_LGAMMA 1
3300| #define HAVE_GETCWD 1
3301| #define HAVE_POLL 1
3302| #define HAVE_PCLOSE 1
3303| #define HAVE_POPEN 1
3304| #define HAVE_FDOPEN 1
3305| #define HAVE_SELECT 1
3306| #define HAVE_SLEEP 1
3307| #define HAVE_STPCPY 1
3308| #define HAVE_STRCSPN 1
3309| #define HAVE_STRDUP 1
3310| #define HAVE_STRNDUP 1
3311| #define HAVE_STRNLEN 1
3312| #define HAVE_STRCASECMP 1
3313| #define HAVE_STRNCASECMP 1
3314| #define HAVE_TCGETATTR 1
3315| #define HAVE_VFPRINTF 1
3316| #define HAVE_USLEEP 1
3317| #define HAVE_SNPRINTF 1
3318| #define HAVE_DECL_SIGNGAM 1
3319| #define HAVE_SIGSETJMP 1
3320| #define PIPES 1
3321| #define HAVE_SYS_SELECT_H 1
3322| #define HAVE_SYS_SOCKET_H 1
3323| #define SELECT_TYPE_ARG1 int
3324| #define SELECT_TYPE_ARG234 (fd_set *)
3325| #define SELECT_TYPE_ARG5 (struct timeval *)
3326| #define HAVE_READLINE_RESET 1
3327| #define HAVE_LIBREADLINE 1
3328| #define HAVE_READLINE_READLINE_H 1
3329| #define HAVE_READLINE_HISTORY_H 1
3330| #define GNUPLOT_HISTORY 1
3331| #define HAVE_LIBZ 1
3332| #define HAVE_LIBGD 1
3333| #define HAVE_GD_H 1
3334| #define HAVE_GD_GIF 1
3335| #define GIF_ANIMATION 1
3336| #define HAVE_GD_JPEG 1
3337| #define HAVE_GD_TTF 1
3338| #define HAVE_GD_PNG 1
3339| /* end confdefs.h.  */
3340|
3341| /* Override any GCC internal prototype to avoid an error.
3342|    Use char because int might match the return type of a GCC
3343|    builtin and then its argument prototype would still apply.  */
3344| #ifdef __cplusplus
3345| extern "C"
3346| #endif
3347| char iconv_open ();
3348| int
3349| main ()
3350| {
3351| return iconv_open ();
3352|   ;
3353|   return 0;
3354| }
3355configure:11211: /usr/bin/clang -o conftest -pipe -Os -F/opt/local/Library/Frameworks -arch x86_64 -ObjC -I/opt/local/include   -I/opt/local/include -I/opt/local/include -L/opt/local/lib -Wl,-headerpad_max_install_names -F/opt/local/Library/Frameworks -arch x86_64 -L/opt/local/lib -lcerf -framework Foundation -framework AquaTerm -L/opt/local/lib -L/opt/local/lib -Wl,-headerpad_max_install_names -L/opt/local/lib conftest.c -liconv   >&5
3356Undefined symbols for architecture x86_64:
3357  "_iconv_open", referenced from:
3358      _main in conftest-e716a4.o
3359ld: symbol(s) not found for architecture x86_64
3360clang: error: linker command failed with exit code 1 (use -v to see invocation)
3361configure:11211: $? = 1
3362configure: failed program was:
3363| /* confdefs.h */
3364| #define PACKAGE_NAME "gnuplot"
3365| #define PACKAGE_TARNAME "gnuplot"
3366| #define PACKAGE_VERSION "5.0.6"
3367| #define PACKAGE_STRING "gnuplot 5.0.6"
3368| #define PACKAGE_BUGREPORT ""
3369| #define PACKAGE_URL ""
3370| #define PACKAGE "gnuplot"
3371| #define VERSION "5.0.6"
3372| #define PROTOTYPES 1
3373| #define STDC_HEADERS 1
3374| #define HAVE_SYS_TYPES_H 1
3375| #define HAVE_SYS_STAT_H 1
3376| #define HAVE_STDLIB_H 1
3377| #define HAVE_STRING_H 1
3378| #define HAVE_MEMORY_H 1
3379| #define HAVE_STRINGS_H 1
3380| #define HAVE_INTTYPES_H 1
3381| #define HAVE_STDINT_H 1
3382| #define HAVE_UNISTD_H 1
3383| #define __EXTENSIONS__ 1
3384| #define _ALL_SOURCE 1
3385| #define _GNU_SOURCE 1
3386| #define _POSIX_PTHREAD_SEMANTICS 1
3387| #define _TANDEM_SOURCE 1
3388| #define HAVE_STRINGIZE 1
3389| #define HAVE_OFF_T 1
3390| #define HAVE_FSEEKO 1
3391| #define HAVE_LIBCERF 1
3392| #define X11 1
3393| #define HAVE_FRAMEWORK_AQUATERM 1
3394| #define STDC_HEADERS 1
3395| #define HAVE_DIRENT_H 1
3396| #define HAVE_ERRNO_H 1
3397| #define HAVE_FLOAT_H 1
3398| #define HAVE_LANGINFO_H 1
3399| #define HAVE_LIMITS_H 1
3400| #define HAVE_LOCALE_H 1
3401| #define HAVE_MATH_H 1
3402| #define HAVE_STDLIB_H 1
3403| #define HAVE_STRING_H 1
3404| #define HAVE_TIME_H 1
3405| #define HAVE_SYS_TIME_H 1
3406| #define HAVE_SYS_TYPES_H 1
3407| #define HAVE_SYS_IOCTL_H 1
3408| #define HAVE_SYS_PARAM_H 1
3409| #define HAVE_SYS_SELECT_H 1
3410| #define HAVE_SYS_SOCKET_H 1
3411| #define HAVE_SYS_STAT_H 1
3412| #define HAVE_SYS_TIMEB_H 1
3413| #define HAVE_SYS_UTSNAME_H 1
3414| #define HAVE_LIBC_H 1
3415| #define HAVE_POLL_H 1
3416| #define HAVE_SGTTY_H 1
3417| #define HAVE_TERMIOS_H 1
3418| #define HAVE_DIRENT_H 1
3419| #define HAVE_DLFCN_H 1
3420| #define HAVE__BOOL 1
3421| #define HAVE_STDBOOL_H 1
3422| #define HAVE_STRUCT_EXCEPTION_IN_MATH_H 1
3423| #define HAVE_EXTERNAL_FUNCTIONS 1
3424| #define HAVE_UNISTD_H 1
3425| #define HAVE_TIME_T_IN_TIME_H 1
3426| #define RETSIGTYPE void
3427| #define HAVE_ATEXIT 1
3428| #define HAVE_MEMCPY 1
3429| #define HAVE_MEMMOVE 1
3430| #define HAVE_MEMSET 1
3431| #define HAVE_BCOPY 1
3432| #define HAVE_BZERO 1
3433| #define HAVE_SETVBUF 1
3434| #define HAVE_STRERROR 1
3435| #define HAVE_STRCHR 1
3436| #define HAVE_STRRCHR 1
3437| #define HAVE_STRSTR 1
3438| #define HAVE_INDEX 1
3439| #define HAVE_RINDEX 1
3440| #define HAVE_ERF 1
3441| #define HAVE_ERFC 1
3442| #define HAVE_GAMMA 1
3443| #define HAVE_LGAMMA 1
3444| #define HAVE_GETCWD 1
3445| #define HAVE_POLL 1
3446| #define HAVE_PCLOSE 1
3447| #define HAVE_POPEN 1
3448| #define HAVE_FDOPEN 1
3449| #define HAVE_SELECT 1
3450| #define HAVE_SLEEP 1
3451| #define HAVE_STPCPY 1
3452| #define HAVE_STRCSPN 1
3453| #define HAVE_STRDUP 1
3454| #define HAVE_STRNDUP 1
3455| #define HAVE_STRNLEN 1
3456| #define HAVE_STRCASECMP 1
3457| #define HAVE_STRNCASECMP 1
3458| #define HAVE_TCGETATTR 1
3459| #define HAVE_VFPRINTF 1
3460| #define HAVE_USLEEP 1
3461| #define HAVE_SNPRINTF 1
3462| #define HAVE_DECL_SIGNGAM 1
3463| #define HAVE_SIGSETJMP 1
3464| #define PIPES 1
3465| #define HAVE_SYS_SELECT_H 1
3466| #define HAVE_SYS_SOCKET_H 1
3467| #define SELECT_TYPE_ARG1 int
3468| #define SELECT_TYPE_ARG234 (fd_set *)
3469| #define SELECT_TYPE_ARG5 (struct timeval *)
3470| #define HAVE_READLINE_RESET 1
3471| #define HAVE_LIBREADLINE 1
3472| #define HAVE_READLINE_READLINE_H 1
3473| #define HAVE_READLINE_HISTORY_H 1
3474| #define GNUPLOT_HISTORY 1
3475| #define HAVE_LIBZ 1
3476| #define HAVE_LIBGD 1
3477| #define HAVE_GD_H 1
3478| #define HAVE_GD_GIF 1
3479| #define GIF_ANIMATION 1
3480| #define HAVE_GD_JPEG 1
3481| #define HAVE_GD_TTF 1
3482| #define HAVE_GD_PNG 1
3483| /* end confdefs.h.  */
3484|
3485| /* Override any GCC internal prototype to avoid an error.
3486|    Use char because int might match the return type of a GCC
3487|    builtin and then its argument prototype would still apply.  */
3488| #ifdef __cplusplus
3489| extern "C"
3490| #endif
3491| char iconv_open ();
3492| int
3493| main ()
3494| {
3495| return iconv_open ();
3496|   ;
3497|   return 0;
3498| }
3499configure:11228: result: no
3500configure:11559: checking for LUA
3501configure:11567: $PKG_CONFIG --exists --print-errors "lua"
3502configure:11570: $? = 0
3503configure:11585: $PKG_CONFIG --exists --print-errors "lua"
3504configure:11588: $? = 0
3505configure:11770: result: yes
3506configure:11849: checking lua.h usability
3507configure:11849: /usr/bin/clang -c -pipe -Os -F/opt/local/Library/Frameworks -arch x86_64 -ObjC -I/opt/local/include   -I/opt/local/include -I/opt/local/include  conftest.c >&5
3508configure:11849: $? = 0
3509configure:11849: result: yes
3510configure:11849: checking lua.h presence
3511configure:11849: /usr/bin/clang -E -I/opt/local/include   -I/opt/local/include -I/opt/local/include  conftest.c
3512configure:11849: $? = 0
3513configure:11849: result: yes
3514configure:11849: checking for lua.h
3515configure:11849: result: yes
3516configure:12021: checking for caca_get_version in -lcaca
3517configure:12046: /usr/bin/clang -o conftest -pipe -Os -F/opt/local/Library/Frameworks -arch x86_64 -ObjC -I/opt/local/include -I/opt/local/include   -I/opt/local/include -I/opt/local/include  -L/opt/local/lib -Wl,-rpath -Wl,/opt/local/lib -L/opt/local/lib -Wl,-headerpad_max_install_names -F/opt/local/Library/Frameworks -arch x86_64 -L/opt/local/lib -lcerf -framework Foundation -framework AquaTerm -L/opt/local/lib -L/opt/local/lib -Wl,-headerpad_max_install_names -L/opt/local/lib conftest.c -lcaca   >&5
3518configure:12046: $? = 0
3519configure:12055: result: yes
3520configure:12058: checking for caca_export_canvas_to_memory in -lcaca
3521configure:12083: /usr/bin/clang -o conftest -pipe -Os -F/opt/local/Library/Frameworks -arch x86_64 -ObjC -I/opt/local/include -I/opt/local/include   -I/opt/local/include -I/opt/local/include  -L/opt/local/lib -Wl,-rpath -Wl,/opt/local/lib -L/opt/local/lib -Wl,-headerpad_max_install_names -F/opt/local/Library/Frameworks -arch x86_64 -L/opt/local/lib -lcerf -framework Foundation -framework AquaTerm -L/opt/local/lib -L/opt/local/lib -Wl,-headerpad_max_install_names -L/opt/local/lib conftest.c -lcaca   >&5
3522configure:12083: $? = 0
3523configure:12092: result: yes
3524configure:12107: checking whether CACA_DEPRECATED is declared
3525configure:12107: /usr/bin/clang -c -pipe -Os -F/opt/local/Library/Frameworks -arch x86_64 -ObjC -I/opt/local/include -I/opt/local/include   -I/opt/local/include -I/opt/local/include  conftest.c >&5
3526configure:12107: $? = 0
3527configure:12107: result: yes
3528configure:12244: checking for multi-byte support in x11
3529configure:12246: checking for XmbDrawString in -lX11
3530configure:12271: /usr/bin/clang -o conftest -pipe -Os -F/opt/local/Library/Frameworks -arch x86_64 -ObjC -I/opt/local/include -I/opt/local/include   -I/opt/local/include -I/opt/local/include  -L/opt/local/lib -Wl,-rpath -Wl,/opt/local/lib -L/opt/local/lib -Wl,-headerpad_max_install_names -F/opt/local/Library/Frameworks -arch x86_64 -L/opt/local/lib -lcerf -framework Foundation -framework AquaTerm -L/opt/local/lib -L/opt/local/lib -Wl,-headerpad_max_install_names -L/opt/local/lib  -lX11  conftest.c -lX11  -lcaca  >&5
3531configure:12271: $? = 0
3532configure:12280: result: yes
3533configure:12587: checking for pkg-config
3534configure:12617: result: /opt/local/bin/pkg-config
3535configure:12642: checking pkg-config is at least version 0.9.0
3536configure:12645: result: yes
3537configure:12770: checking for C++ compiler version
3538configure:12779: /usr/bin/clang++ --version >&5
3539Apple LLVM version 8.1.0 (clang-802.0.38)
3540Target: x86_64-apple-darwin16.6.0
3541Thread model: posix
3542InstalledDir: /Applications/Xcode.app/Contents/Developer/Toolchains/XcodeDefault.xctoolchain/usr/bin
3543configure:12790: $? = 0
3544configure:12779: /usr/bin/clang++ -v >&5
3545Apple LLVM version 8.1.0 (clang-802.0.38)
3546Target: x86_64-apple-darwin16.6.0
3547Thread model: posix
3548InstalledDir: /Applications/Xcode.app/Contents/Developer/Toolchains/XcodeDefault.xctoolchain/usr/bin
3549configure:12790: $? = 0
3550configure:12779: /usr/bin/clang++ -V >&5
3551clang: error: argument to '-V' is missing (expected 1 value)
3552clang: error: no input files
3553configure:12790: $? = 1
3554configure:12779: /usr/bin/clang++ -qversion >&5
3555clang: error: unknown argument: '-qversion'
3556clang: error: no input files
3557configure:12790: $? = 1
3558configure:12794: checking whether we are using the GNU C++ compiler
3559configure:12813: /usr/bin/clang++ -c -pipe -Os -stdlib=libc++ -arch x86_64 -I/opt/local/include -I/opt/local/include   -I/opt/local/include -I/opt/local/include  conftest.cpp >&5
3560configure:12813: $? = 0
3561configure:12822: result: yes
3562configure:12831: checking whether /usr/bin/clang++ accepts -g
3563configure:12851: /usr/bin/clang++ -c -g -I/opt/local/include -I/opt/local/include   -I/opt/local/include -I/opt/local/include  conftest.cpp >&5
3564configure:12851: $? = 0
3565configure:12892: result: yes
3566configure:12917: checking dependency style of /usr/bin/clang++
3567configure:13028: result: gcc3
3568configure:13064: /usr/bin/clang++ -c -pipe -Os -stdlib=libc++ -arch x86_64 -I/opt/local/include -I/opt/local/include   -I/opt/local/include -I/opt/local/include  conftest.cpp >&5
3569configure:13064: $? = 0
3570configure:13071: checking how to run the C++ preprocessor
3571configure:13098: /usr/bin/clang++ -E -I/opt/local/include -I/opt/local/include   -I/opt/local/include -I/opt/local/include  conftest.cpp
3572configure:13098: $? = 0
3573configure:13112: /usr/bin/clang++ -E -I/opt/local/include -I/opt/local/include   -I/opt/local/include -I/opt/local/include  conftest.cpp
3574conftest.cpp:133:10: fatal error: 'ac_nonexistent.h' file not found
3575#include <ac_nonexistent.h>
3576         ^
35771 error generated.
3578configure:13112: $? = 1
3579configure: failed program was:
3580| /* confdefs.h */
3581| #define PACKAGE_NAME "gnuplot"
3582| #define PACKAGE_TARNAME "gnuplot"
3583| #define PACKAGE_VERSION "5.0.6"
3584| #define PACKAGE_STRING "gnuplot 5.0.6"
3585| #define PACKAGE_BUGREPORT ""
3586| #define PACKAGE_URL ""
3587| #define PACKAGE "gnuplot"
3588| #define VERSION "5.0.6"
3589| #define PROTOTYPES 1
3590| #define STDC_HEADERS 1
3591| #define HAVE_SYS_TYPES_H 1
3592| #define HAVE_SYS_STAT_H 1
3593| #define HAVE_STDLIB_H 1
3594| #define HAVE_STRING_H 1
3595| #define HAVE_MEMORY_H 1
3596| #define HAVE_STRINGS_H 1
3597| #define HAVE_INTTYPES_H 1
3598| #define HAVE_STDINT_H 1
3599| #define HAVE_UNISTD_H 1
3600| #define __EXTENSIONS__ 1
3601| #define _ALL_SOURCE 1
3602| #define _GNU_SOURCE 1
3603| #define _POSIX_PTHREAD_SEMANTICS 1
3604| #define _TANDEM_SOURCE 1
3605| #define HAVE_STRINGIZE 1
3606| #define HAVE_OFF_T 1
3607| #define HAVE_FSEEKO 1
3608| #define HAVE_LIBCERF 1
3609| #define X11 1
3610| #define HAVE_FRAMEWORK_AQUATERM 1
3611| #define STDC_HEADERS 1
3612| #define HAVE_DIRENT_H 1
3613| #define HAVE_ERRNO_H 1
3614| #define HAVE_FLOAT_H 1
3615| #define HAVE_LANGINFO_H 1
3616| #define HAVE_LIMITS_H 1
3617| #define HAVE_LOCALE_H 1
3618| #define HAVE_MATH_H 1
3619| #define HAVE_STDLIB_H 1
3620| #define HAVE_STRING_H 1
3621| #define HAVE_TIME_H 1
3622| #define HAVE_SYS_TIME_H 1
3623| #define HAVE_SYS_TYPES_H 1
3624| #define HAVE_SYS_IOCTL_H 1
3625| #define HAVE_SYS_PARAM_H 1
3626| #define HAVE_SYS_SELECT_H 1
3627| #define HAVE_SYS_SOCKET_H 1
3628| #define HAVE_SYS_STAT_H 1
3629| #define HAVE_SYS_TIMEB_H 1
3630| #define HAVE_SYS_UTSNAME_H 1
3631| #define HAVE_LIBC_H 1
3632| #define HAVE_POLL_H 1
3633| #define HAVE_SGTTY_H 1
3634| #define HAVE_TERMIOS_H 1
3635| #define HAVE_DIRENT_H 1
3636| #define HAVE_DLFCN_H 1
3637| #define HAVE__BOOL 1
3638| #define HAVE_STDBOOL_H 1
3639| #define HAVE_STRUCT_EXCEPTION_IN_MATH_H 1
3640| #define HAVE_EXTERNAL_FUNCTIONS 1
3641| #define HAVE_UNISTD_H 1
3642| #define HAVE_TIME_T_IN_TIME_H 1
3643| #define RETSIGTYPE void
3644| #define HAVE_ATEXIT 1
3645| #define HAVE_MEMCPY 1
3646| #define HAVE_MEMMOVE 1
3647| #define HAVE_MEMSET 1
3648| #define HAVE_BCOPY 1
3649| #define HAVE_BZERO 1
3650| #define HAVE_SETVBUF 1
3651| #define HAVE_STRERROR 1
3652| #define HAVE_STRCHR 1
3653| #define HAVE_STRRCHR 1
3654| #define HAVE_STRSTR 1
3655| #define HAVE_INDEX 1
3656| #define HAVE_RINDEX 1
3657| #define HAVE_ERF 1
3658| #define HAVE_ERFC 1
3659| #define HAVE_GAMMA 1
3660| #define HAVE_LGAMMA 1
3661| #define HAVE_GETCWD 1
3662| #define HAVE_POLL 1
3663| #define HAVE_PCLOSE 1
3664| #define HAVE_POPEN 1
3665| #define HAVE_FDOPEN 1
3666| #define HAVE_SELECT 1
3667| #define HAVE_SLEEP 1
3668| #define HAVE_STPCPY 1
3669| #define HAVE_STRCSPN 1
3670| #define HAVE_STRDUP 1
3671| #define HAVE_STRNDUP 1
3672| #define HAVE_STRNLEN 1
3673| #define HAVE_STRCASECMP 1
3674| #define HAVE_STRNCASECMP 1
3675| #define HAVE_TCGETATTR 1
3676| #define HAVE_VFPRINTF 1
3677| #define HAVE_USLEEP 1
3678| #define HAVE_SNPRINTF 1
3679| #define HAVE_DECL_SIGNGAM 1
3680| #define HAVE_SIGSETJMP 1
3681| #define PIPES 1
3682| #define HAVE_SYS_SELECT_H 1
3683| #define HAVE_SYS_SOCKET_H 1
3684| #define SELECT_TYPE_ARG1 int
3685| #define SELECT_TYPE_ARG234 (fd_set *)
3686| #define SELECT_TYPE_ARG5 (struct timeval *)
3687| #define HAVE_READLINE_RESET 1
3688| #define HAVE_LIBREADLINE 1
3689| #define HAVE_READLINE_READLINE_H 1
3690| #define HAVE_READLINE_HISTORY_H 1
3691| #define GNUPLOT_HISTORY 1
3692| #define HAVE_LIBZ 1
3693| #define HAVE_LIBGD 1
3694| #define HAVE_GD_H 1
3695| #define HAVE_GD_GIF 1
3696| #define GIF_ANIMATION 1
3697| #define HAVE_GD_JPEG 1
3698| #define HAVE_GD_TTF 1
3699| #define HAVE_GD_PNG 1
3700| #define HAVE_LUA 1
3701| #define HAVE_LUA_H 1
3702| #define HAVE_LIBCACA 1
3703| #define HAVE_LIBCACA 1
3704| #define USE_CWDRC 1
3705| #define USE_X11_MULTIBYTE 1
3706| #define EXTERNAL_X11_WINDOW 1
3707| #define EAM_BOXED_TEXT 1
3708| #define EAM_OBJECTS 1
3709| #define HIDDEN3D_QUADTREE 1
3710| #define HIDDEN3D_VAR_PTSIZE 1
3711| /* end confdefs.h.  */
3712| #include <ac_nonexistent.h>
3713configure:13137: result: /usr/bin/clang++ -E
3714configure:13157: /usr/bin/clang++ -E -I/opt/local/include -I/opt/local/include   -I/opt/local/include -I/opt/local/include  conftest.cpp
3715configure:13157: $? = 0
3716configure:13171: /usr/bin/clang++ -E -I/opt/local/include -I/opt/local/include   -I/opt/local/include -I/opt/local/include  conftest.cpp
3717conftest.cpp:133:10: fatal error: 'ac_nonexistent.h' file not found
3718#include <ac_nonexistent.h>
3719         ^
37201 error generated.
3721configure:13171: $? = 1
3722configure: failed program was:
3723| /* confdefs.h */
3724| #define PACKAGE_NAME "gnuplot"
3725| #define PACKAGE_TARNAME "gnuplot"
3726| #define PACKAGE_VERSION "5.0.6"
3727| #define PACKAGE_STRING "gnuplot 5.0.6"
3728| #define PACKAGE_BUGREPORT ""
3729| #define PACKAGE_URL ""
3730| #define PACKAGE "gnuplot"
3731| #define VERSION "5.0.6"
3732| #define PROTOTYPES 1
3733| #define STDC_HEADERS 1
3734| #define HAVE_SYS_TYPES_H 1
3735| #define HAVE_SYS_STAT_H 1
3736| #define HAVE_STDLIB_H 1
3737| #define HAVE_STRING_H 1
3738| #define HAVE_MEMORY_H 1
3739| #define HAVE_STRINGS_H 1
3740| #define HAVE_INTTYPES_H 1
3741| #define HAVE_STDINT_H 1
3742| #define HAVE_UNISTD_H 1
3743| #define __EXTENSIONS__ 1
3744| #define _ALL_SOURCE 1
3745| #define _GNU_SOURCE 1
3746| #define _POSIX_PTHREAD_SEMANTICS 1
3747| #define _TANDEM_SOURCE 1
3748| #define HAVE_STRINGIZE 1
3749| #define HAVE_OFF_T 1
3750| #define HAVE_FSEEKO 1
3751| #define HAVE_LIBCERF 1
3752| #define X11 1
3753| #define HAVE_FRAMEWORK_AQUATERM 1
3754| #define STDC_HEADERS 1
3755| #define HAVE_DIRENT_H 1
3756| #define HAVE_ERRNO_H 1
3757| #define HAVE_FLOAT_H 1
3758| #define HAVE_LANGINFO_H 1
3759| #define HAVE_LIMITS_H 1
3760| #define HAVE_LOCALE_H 1
3761| #define HAVE_MATH_H 1
3762| #define HAVE_STDLIB_H 1
3763| #define HAVE_STRING_H 1
3764| #define HAVE_TIME_H 1
3765| #define HAVE_SYS_TIME_H 1
3766| #define HAVE_SYS_TYPES_H 1
3767| #define HAVE_SYS_IOCTL_H 1
3768| #define HAVE_SYS_PARAM_H 1
3769| #define HAVE_SYS_SELECT_H 1
3770| #define HAVE_SYS_SOCKET_H 1
3771| #define HAVE_SYS_STAT_H 1
3772| #define HAVE_SYS_TIMEB_H 1
3773| #define HAVE_SYS_UTSNAME_H 1
3774| #define HAVE_LIBC_H 1
3775| #define HAVE_POLL_H 1
3776| #define HAVE_SGTTY_H 1
3777| #define HAVE_TERMIOS_H 1
3778| #define HAVE_DIRENT_H 1
3779| #define HAVE_DLFCN_H 1
3780| #define HAVE__BOOL 1
3781| #define HAVE_STDBOOL_H 1
3782| #define HAVE_STRUCT_EXCEPTION_IN_MATH_H 1
3783| #define HAVE_EXTERNAL_FUNCTIONS 1
3784| #define HAVE_UNISTD_H 1
3785| #define HAVE_TIME_T_IN_TIME_H 1
3786| #define RETSIGTYPE void
3787| #define HAVE_ATEXIT 1
3788| #define HAVE_MEMCPY 1
3789| #define HAVE_MEMMOVE 1
3790| #define HAVE_MEMSET 1
3791| #define HAVE_BCOPY 1
3792| #define HAVE_BZERO 1
3793| #define HAVE_SETVBUF 1
3794| #define HAVE_STRERROR 1
3795| #define HAVE_STRCHR 1
3796| #define HAVE_STRRCHR 1
3797| #define HAVE_STRSTR 1
3798| #define HAVE_INDEX 1
3799| #define HAVE_RINDEX 1
3800| #define HAVE_ERF 1
3801| #define HAVE_ERFC 1
3802| #define HAVE_GAMMA 1
3803| #define HAVE_LGAMMA 1
3804| #define HAVE_GETCWD 1
3805| #define HAVE_POLL 1
3806| #define HAVE_PCLOSE 1
3807| #define HAVE_POPEN 1
3808| #define HAVE_FDOPEN 1
3809| #define HAVE_SELECT 1
3810| #define HAVE_SLEEP 1
3811| #define HAVE_STPCPY 1
3812| #define HAVE_STRCSPN 1
3813| #define HAVE_STRDUP 1
3814| #define HAVE_STRNDUP 1
3815| #define HAVE_STRNLEN 1
3816| #define HAVE_STRCASECMP 1
3817| #define HAVE_STRNCASECMP 1
3818| #define HAVE_TCGETATTR 1
3819| #define HAVE_VFPRINTF 1
3820| #define HAVE_USLEEP 1
3821| #define HAVE_SNPRINTF 1
3822| #define HAVE_DECL_SIGNGAM 1
3823| #define HAVE_SIGSETJMP 1
3824| #define PIPES 1
3825| #define HAVE_SYS_SELECT_H 1
3826| #define HAVE_SYS_SOCKET_H 1
3827| #define SELECT_TYPE_ARG1 int
3828| #define SELECT_TYPE_ARG234 (fd_set *)
3829| #define SELECT_TYPE_ARG5 (struct timeval *)
3830| #define HAVE_READLINE_RESET 1
3831| #define HAVE_LIBREADLINE 1
3832| #define HAVE_READLINE_READLINE_H 1
3833| #define HAVE_READLINE_HISTORY_H 1
3834| #define GNUPLOT_HISTORY 1
3835| #define HAVE_LIBZ 1
3836| #define HAVE_LIBGD 1
3837| #define HAVE_GD_H 1
3838| #define HAVE_GD_GIF 1
3839| #define GIF_ANIMATION 1
3840| #define HAVE_GD_JPEG 1
3841| #define HAVE_GD_TTF 1
3842| #define HAVE_GD_PNG 1
3843| #define HAVE_LUA 1
3844| #define HAVE_LUA_H 1
3845| #define HAVE_LIBCACA 1
3846| #define HAVE_LIBCACA 1
3847| #define USE_CWDRC 1
3848| #define USE_X11_MULTIBYTE 1
3849| #define EXTERNAL_X11_WINDOW 1
3850| #define EAM_BOXED_TEXT 1
3851| #define EAM_OBJECTS 1
3852| #define HIDDEN3D_QUADTREE 1
3853| #define HIDDEN3D_VAR_PTSIZE 1
3854| /* end confdefs.h.  */
3855| #include <ac_nonexistent.h>
3856configure:13241: checking for wx-config
3857configure:13259: found /opt/local/Library/Frameworks/wxWidgets.framework/Versions/wxWidgets/3.0/bin/wx-config
3858configure:13272: result: /opt/local/Library/Frameworks/wxWidgets.framework/Versions/wxWidgets/3.0/bin/wx-config
3859configure:13307: checking for CAIROPANGO
3860configure:13315: $PKG_CONFIG --exists --print-errors "cairo >= 0.9.0 pango >= 1.10 pangocairo >= 1.10"
3861configure:13318: $? = 0
3862configure:13333: $PKG_CONFIG --exists --print-errors "cairo >= 0.9.0 pango >= 1.10 pangocairo >= 1.10"
3863configure:13336: $? = 0
3864configure:13412: result: yes
3865configure:13424: checking for PANGO_1_10_2
3866configure:13432: $PKG_CONFIG --exists --print-errors "pango = 1.10.2"
3867Requested 'pango = 1.10.2' but version of Pango is 1.40.5
3868configure:13435: $? = 1
3869configure:13450: $PKG_CONFIG --exists --print-errors "pango = 1.10.2"
3870Requested 'pango = 1.10.2' but version of Pango is 1.40.5
3871configure:13453: $? = 1
3872Requested 'pango = 1.10.2' but version of Pango is 1.40.5
3873configure:13481: result: no
3874configure:13507: checking for pid_t
3875configure:13507: /usr/bin/clang -c -pipe -Os -F/opt/local/Library/Frameworks -arch x86_64 -ObjC -I/opt/local/include -I/opt/local/include   -I/opt/local/include -I/opt/local/include  conftest.c >&5
3876configure:13507: $? = 0
3877configure:13507: /usr/bin/clang -c -pipe -Os -F/opt/local/Library/Frameworks -arch x86_64 -ObjC -I/opt/local/include -I/opt/local/include   -I/opt/local/include -I/opt/local/include  conftest.c >&5
3878conftest.c:170:20: error: expected expression
3879if (sizeof ((pid_t)))
3880                   ^
38811 error generated.
3882configure:13507: $? = 1
3883configure: failed program was:
3884| /* confdefs.h */
3885| #define PACKAGE_NAME "gnuplot"
3886| #define PACKAGE_TARNAME "gnuplot"
3887| #define PACKAGE_VERSION "5.0.6"
3888| #define PACKAGE_STRING "gnuplot 5.0.6"
3889| #define PACKAGE_BUGREPORT ""
3890| #define PACKAGE_URL ""
3891| #define PACKAGE "gnuplot"
3892| #define VERSION "5.0.6"
3893| #define PROTOTYPES 1
3894| #define STDC_HEADERS 1
3895| #define HAVE_SYS_TYPES_H 1
3896| #define HAVE_SYS_STAT_H 1
3897| #define HAVE_STDLIB_H 1
3898| #define HAVE_STRING_H 1
3899| #define HAVE_MEMORY_H 1
3900| #define HAVE_STRINGS_H 1
3901| #define HAVE_INTTYPES_H 1
3902| #define HAVE_STDINT_H 1
3903| #define HAVE_UNISTD_H 1
3904| #define __EXTENSIONS__ 1
3905| #define _ALL_SOURCE 1
3906| #define _GNU_SOURCE 1
3907| #define _POSIX_PTHREAD_SEMANTICS 1
3908| #define _TANDEM_SOURCE 1
3909| #define HAVE_STRINGIZE 1
3910| #define HAVE_OFF_T 1
3911| #define HAVE_FSEEKO 1
3912| #define HAVE_LIBCERF 1
3913| #define X11 1
3914| #define HAVE_FRAMEWORK_AQUATERM 1
3915| #define STDC_HEADERS 1
3916| #define HAVE_DIRENT_H 1
3917| #define HAVE_ERRNO_H 1
3918| #define HAVE_FLOAT_H 1
3919| #define HAVE_LANGINFO_H 1
3920| #define HAVE_LIMITS_H 1
3921| #define HAVE_LOCALE_H 1
3922| #define HAVE_MATH_H 1
3923| #define HAVE_STDLIB_H 1
3924| #define HAVE_STRING_H 1
3925| #define HAVE_TIME_H 1
3926| #define HAVE_SYS_TIME_H 1
3927| #define HAVE_SYS_TYPES_H 1
3928| #define HAVE_SYS_IOCTL_H 1
3929| #define HAVE_SYS_PARAM_H 1
3930| #define HAVE_SYS_SELECT_H 1
3931| #define HAVE_SYS_SOCKET_H 1
3932| #define HAVE_SYS_STAT_H 1
3933| #define HAVE_SYS_TIMEB_H 1
3934| #define HAVE_SYS_UTSNAME_H 1
3935| #define HAVE_LIBC_H 1
3936| #define HAVE_POLL_H 1
3937| #define HAVE_SGTTY_H 1
3938| #define HAVE_TERMIOS_H 1
3939| #define HAVE_DIRENT_H 1
3940| #define HAVE_DLFCN_H 1
3941| #define HAVE__BOOL 1
3942| #define HAVE_STDBOOL_H 1
3943| #define HAVE_STRUCT_EXCEPTION_IN_MATH_H 1
3944| #define HAVE_EXTERNAL_FUNCTIONS 1
3945| #define HAVE_UNISTD_H 1
3946| #define HAVE_TIME_T_IN_TIME_H 1
3947| #define RETSIGTYPE void
3948| #define HAVE_ATEXIT 1
3949| #define HAVE_MEMCPY 1
3950| #define HAVE_MEMMOVE 1
3951| #define HAVE_MEMSET 1
3952| #define HAVE_BCOPY 1
3953| #define HAVE_BZERO 1
3954| #define HAVE_SETVBUF 1
3955| #define HAVE_STRERROR 1
3956| #define HAVE_STRCHR 1
3957| #define HAVE_STRRCHR 1
3958| #define HAVE_STRSTR 1
3959| #define HAVE_INDEX 1
3960| #define HAVE_RINDEX 1
3961| #define HAVE_ERF 1
3962| #define HAVE_ERFC 1
3963| #define HAVE_GAMMA 1
3964| #define HAVE_LGAMMA 1
3965| #define HAVE_GETCWD 1
3966| #define HAVE_POLL 1
3967| #define HAVE_PCLOSE 1
3968| #define HAVE_POPEN 1
3969| #define HAVE_FDOPEN 1
3970| #define HAVE_SELECT 1
3971| #define HAVE_SLEEP 1
3972| #define HAVE_STPCPY 1
3973| #define HAVE_STRCSPN 1
3974| #define HAVE_STRDUP 1
3975| #define HAVE_STRNDUP 1
3976| #define HAVE_STRNLEN 1
3977| #define HAVE_STRCASECMP 1
3978| #define HAVE_STRNCASECMP 1
3979| #define HAVE_TCGETATTR 1
3980| #define HAVE_VFPRINTF 1
3981| #define HAVE_USLEEP 1
3982| #define HAVE_SNPRINTF 1
3983| #define HAVE_DECL_SIGNGAM 1
3984| #define HAVE_SIGSETJMP 1
3985| #define PIPES 1
3986| #define HAVE_SYS_SELECT_H 1
3987| #define HAVE_SYS_SOCKET_H 1
3988| #define SELECT_TYPE_ARG1 int
3989| #define SELECT_TYPE_ARG234 (fd_set *)
3990| #define SELECT_TYPE_ARG5 (struct timeval *)
3991| #define HAVE_READLINE_RESET 1
3992| #define HAVE_LIBREADLINE 1
3993| #define HAVE_READLINE_READLINE_H 1
3994| #define HAVE_READLINE_HISTORY_H 1
3995| #define GNUPLOT_HISTORY 1
3996| #define HAVE_LIBZ 1
3997| #define HAVE_LIBGD 1
3998| #define HAVE_GD_H 1
3999| #define HAVE_GD_GIF 1
4000| #define GIF_ANIMATION 1
4001| #define HAVE_GD_JPEG 1
4002| #define HAVE_GD_TTF 1
4003| #define HAVE_GD_PNG 1
4004| #define HAVE_LUA 1
4005| #define HAVE_LUA_H 1
4006| #define HAVE_LIBCACA 1
4007| #define HAVE_LIBCACA 1
4008| #define USE_CWDRC 1
4009| #define USE_X11_MULTIBYTE 1
4010| #define EXTERNAL_X11_WINDOW 1
4011| #define EAM_BOXED_TEXT 1
4012| #define EAM_OBJECTS 1
4013| #define HIDDEN3D_QUADTREE 1
4014| #define HIDDEN3D_VAR_PTSIZE 1
4015| #define WX_NEEDS_XINITTHREADS 1
4016| /* end confdefs.h.  */
4017| #include <stdio.h>
4018| #ifdef HAVE_SYS_TYPES_H
4019| # include <sys/types.h>
4020| #endif
4021| #ifdef HAVE_SYS_STAT_H
4022| # include <sys/stat.h>
4023| #endif
4024| #ifdef STDC_HEADERS
4025| # include <stdlib.h>
4026| # include <stddef.h>
4027| #else
4028| # ifdef HAVE_STDLIB_H
4029| #  include <stdlib.h>
4030| # endif
4031| #endif
4032| #ifdef HAVE_STRING_H
4033| # if !defined STDC_HEADERS && defined HAVE_MEMORY_H
4034| #  include <memory.h>
4035| # endif
4036| # include <string.h>
4037| #endif
4038| #ifdef HAVE_STRINGS_H
4039| # include <strings.h>
4040| #endif
4041| #ifdef HAVE_INTTYPES_H
4042| # include <inttypes.h>
4043| #endif
4044| #ifdef HAVE_STDINT_H
4045| # include <stdint.h>
4046| #endif
4047| #ifdef HAVE_UNISTD_H
4048| # include <unistd.h>
4049| #endif
4050| int
4051| main ()
4052| {
4053| if (sizeof ((pid_t)))
4054|           return 0;
4055|   ;
4056|   return 0;
4057| }
4058configure:13507: result: yes
4059configure:13520: checking vfork.h usability
4060configure:13520: /usr/bin/clang -c -pipe -Os -F/opt/local/Library/Frameworks -arch x86_64 -ObjC -I/opt/local/include -I/opt/local/include   -I/opt/local/include -I/opt/local/include  conftest.c >&5
4061conftest.c:167:10: fatal error: 'vfork.h' file not found
4062#include <vfork.h>
4063         ^
40641 error generated.
4065configure:13520: $? = 1
4066configure: failed program was:
4067| /* confdefs.h */
4068| #define PACKAGE_NAME "gnuplot"
4069| #define PACKAGE_TARNAME "gnuplot"
4070| #define PACKAGE_VERSION "5.0.6"
4071| #define PACKAGE_STRING "gnuplot 5.0.6"
4072| #define PACKAGE_BUGREPORT ""
4073| #define PACKAGE_URL ""
4074| #define PACKAGE "gnuplot"
4075| #define VERSION "5.0.6"
4076| #define PROTOTYPES 1
4077| #define STDC_HEADERS 1
4078| #define HAVE_SYS_TYPES_H 1
4079| #define HAVE_SYS_STAT_H 1
4080| #define HAVE_STDLIB_H 1
4081| #define HAVE_STRING_H 1
4082| #define HAVE_MEMORY_H 1
4083| #define HAVE_STRINGS_H 1
4084| #define HAVE_INTTYPES_H 1
4085| #define HAVE_STDINT_H 1
4086| #define HAVE_UNISTD_H 1
4087| #define __EXTENSIONS__ 1
4088| #define _ALL_SOURCE 1
4089| #define _GNU_SOURCE 1
4090| #define _POSIX_PTHREAD_SEMANTICS 1
4091| #define _TANDEM_SOURCE 1
4092| #define HAVE_STRINGIZE 1
4093| #define HAVE_OFF_T 1
4094| #define HAVE_FSEEKO 1
4095| #define HAVE_LIBCERF 1
4096| #define X11 1
4097| #define HAVE_FRAMEWORK_AQUATERM 1
4098| #define STDC_HEADERS 1
4099| #define HAVE_DIRENT_H 1
4100| #define HAVE_ERRNO_H 1
4101| #define HAVE_FLOAT_H 1
4102| #define HAVE_LANGINFO_H 1
4103| #define HAVE_LIMITS_H 1
4104| #define HAVE_LOCALE_H 1
4105| #define HAVE_MATH_H 1
4106| #define HAVE_STDLIB_H 1
4107| #define HAVE_STRING_H 1
4108| #define HAVE_TIME_H 1
4109| #define HAVE_SYS_TIME_H 1
4110| #define HAVE_SYS_TYPES_H 1
4111| #define HAVE_SYS_IOCTL_H 1
4112| #define HAVE_SYS_PARAM_H 1
4113| #define HAVE_SYS_SELECT_H 1
4114| #define HAVE_SYS_SOCKET_H 1
4115| #define HAVE_SYS_STAT_H 1
4116| #define HAVE_SYS_TIMEB_H 1
4117| #define HAVE_SYS_UTSNAME_H 1
4118| #define HAVE_LIBC_H 1
4119| #define HAVE_POLL_H 1
4120| #define HAVE_SGTTY_H 1
4121| #define HAVE_TERMIOS_H 1
4122| #define HAVE_DIRENT_H 1
4123| #define HAVE_DLFCN_H 1
4124| #define HAVE__BOOL 1
4125| #define HAVE_STDBOOL_H 1
4126| #define HAVE_STRUCT_EXCEPTION_IN_MATH_H 1
4127| #define HAVE_EXTERNAL_FUNCTIONS 1
4128| #define HAVE_UNISTD_H 1
4129| #define HAVE_TIME_T_IN_TIME_H 1
4130| #define RETSIGTYPE void
4131| #define HAVE_ATEXIT 1
4132| #define HAVE_MEMCPY 1
4133| #define HAVE_MEMMOVE 1
4134| #define HAVE_MEMSET 1
4135| #define HAVE_BCOPY 1
4136| #define HAVE_BZERO 1
4137| #define HAVE_SETVBUF 1
4138| #define HAVE_STRERROR 1
4139| #define HAVE_STRCHR 1
4140| #define HAVE_STRRCHR 1
4141| #define HAVE_STRSTR 1
4142| #define HAVE_INDEX 1
4143| #define HAVE_RINDEX 1
4144| #define HAVE_ERF 1
4145| #define HAVE_ERFC 1
4146| #define HAVE_GAMMA 1
4147| #define HAVE_LGAMMA 1
4148| #define HAVE_GETCWD 1
4149| #define HAVE_POLL 1
4150| #define HAVE_PCLOSE 1
4151| #define HAVE_POPEN 1
4152| #define HAVE_FDOPEN 1
4153| #define HAVE_SELECT 1
4154| #define HAVE_SLEEP 1
4155| #define HAVE_STPCPY 1
4156| #define HAVE_STRCSPN 1
4157| #define HAVE_STRDUP 1
4158| #define HAVE_STRNDUP 1
4159| #define HAVE_STRNLEN 1
4160| #define HAVE_STRCASECMP 1
4161| #define HAVE_STRNCASECMP 1
4162| #define HAVE_TCGETATTR 1
4163| #define HAVE_VFPRINTF 1
4164| #define HAVE_USLEEP 1
4165| #define HAVE_SNPRINTF 1
4166| #define HAVE_DECL_SIGNGAM 1
4167| #define HAVE_SIGSETJMP 1
4168| #define PIPES 1
4169| #define HAVE_SYS_SELECT_H 1
4170| #define HAVE_SYS_SOCKET_H 1
4171| #define SELECT_TYPE_ARG1 int
4172| #define SELECT_TYPE_ARG234 (fd_set *)
4173| #define SELECT_TYPE_ARG5 (struct timeval *)
4174| #define HAVE_READLINE_RESET 1
4175| #define HAVE_LIBREADLINE 1
4176| #define HAVE_READLINE_READLINE_H 1
4177| #define HAVE_READLINE_HISTORY_H 1
4178| #define GNUPLOT_HISTORY 1
4179| #define HAVE_LIBZ 1
4180| #define HAVE_LIBGD 1
4181| #define HAVE_GD_H 1
4182| #define HAVE_GD_GIF 1
4183| #define GIF_ANIMATION 1
4184| #define HAVE_GD_JPEG 1
4185| #define HAVE_GD_TTF 1
4186| #define HAVE_GD_PNG 1
4187| #define HAVE_LUA 1
4188| #define HAVE_LUA_H 1
4189| #define HAVE_LIBCACA 1
4190| #define HAVE_LIBCACA 1
4191| #define USE_CWDRC 1
4192| #define USE_X11_MULTIBYTE 1
4193| #define EXTERNAL_X11_WINDOW 1
4194| #define EAM_BOXED_TEXT 1
4195| #define EAM_OBJECTS 1
4196| #define HIDDEN3D_QUADTREE 1
4197| #define HIDDEN3D_VAR_PTSIZE 1
4198| #define WX_NEEDS_XINITTHREADS 1
4199| /* end confdefs.h.  */
4200| #include <stdio.h>
4201| #ifdef HAVE_SYS_TYPES_H
4202| # include <sys/types.h>
4203| #endif
4204| #ifdef HAVE_SYS_STAT_H
4205| # include <sys/stat.h>
4206| #endif
4207| #ifdef STDC_HEADERS
4208| # include <stdlib.h>
4209| # include <stddef.h>
4210| #else
4211| # ifdef HAVE_STDLIB_H
4212| #  include <stdlib.h>
4213| # endif
4214| #endif
4215| #ifdef HAVE_STRING_H
4216| # if !defined STDC_HEADERS && defined HAVE_MEMORY_H
4217| #  include <memory.h>
4218| # endif
4219| # include <string.h>
4220| #endif
4221| #ifdef HAVE_STRINGS_H
4222| # include <strings.h>
4223| #endif
4224| #ifdef HAVE_INTTYPES_H
4225| # include <inttypes.h>
4226| #endif
4227| #ifdef HAVE_STDINT_H
4228| # include <stdint.h>
4229| #endif
4230| #ifdef HAVE_UNISTD_H
4231| # include <unistd.h>
4232| #endif
4233| #include <vfork.h>
4234configure:13520: result: no
4235configure:13520: checking vfork.h presence
4236configure:13520: /usr/bin/clang -E -I/opt/local/include -I/opt/local/include   -I/opt/local/include -I/opt/local/include  conftest.c
4237conftest.c:134:10: fatal error: 'vfork.h' file not found
4238#include <vfork.h>
4239         ^
42401 error generated.
4241configure:13520: $? = 1
4242configure: failed program was:
4243| /* confdefs.h */
4244| #define PACKAGE_NAME "gnuplot"
4245| #define PACKAGE_TARNAME "gnuplot"
4246| #define PACKAGE_VERSION "5.0.6"
4247| #define PACKAGE_STRING "gnuplot 5.0.6"
4248| #define PACKAGE_BUGREPORT ""
4249| #define PACKAGE_URL ""
4250| #define PACKAGE "gnuplot"
4251| #define VERSION "5.0.6"
4252| #define PROTOTYPES 1
4253| #define STDC_HEADERS 1
4254| #define HAVE_SYS_TYPES_H 1
4255| #define HAVE_SYS_STAT_H 1
4256| #define HAVE_STDLIB_H 1
4257| #define HAVE_STRING_H 1
4258| #define HAVE_MEMORY_H 1
4259| #define HAVE_STRINGS_H 1
4260| #define HAVE_INTTYPES_H 1
4261| #define HAVE_STDINT_H 1
4262| #define HAVE_UNISTD_H 1
4263| #define __EXTENSIONS__ 1
4264| #define _ALL_SOURCE 1
4265| #define _GNU_SOURCE 1
4266| #define _POSIX_PTHREAD_SEMANTICS 1
4267| #define _TANDEM_SOURCE 1
4268| #define HAVE_STRINGIZE 1
4269| #define HAVE_OFF_T 1
4270| #define HAVE_FSEEKO 1
4271| #define HAVE_LIBCERF 1
4272| #define X11 1
4273| #define HAVE_FRAMEWORK_AQUATERM 1
4274| #define STDC_HEADERS 1
4275| #define HAVE_DIRENT_H 1
4276| #define HAVE_ERRNO_H 1
4277| #define HAVE_FLOAT_H 1
4278| #define HAVE_LANGINFO_H 1
4279| #define HAVE_LIMITS_H 1
4280| #define HAVE_LOCALE_H 1
4281| #define HAVE_MATH_H 1
4282| #define HAVE_STDLIB_H 1
4283| #define HAVE_STRING_H 1
4284| #define HAVE_TIME_H 1
4285| #define HAVE_SYS_TIME_H 1
4286| #define HAVE_SYS_TYPES_H 1
4287| #define HAVE_SYS_IOCTL_H 1
4288| #define HAVE_SYS_PARAM_H 1
4289| #define HAVE_SYS_SELECT_H 1
4290| #define HAVE_SYS_SOCKET_H 1
4291| #define HAVE_SYS_STAT_H 1
4292| #define HAVE_SYS_TIMEB_H 1
4293| #define HAVE_SYS_UTSNAME_H 1
4294| #define HAVE_LIBC_H 1
4295| #define HAVE_POLL_H 1
4296| #define HAVE_SGTTY_H 1
4297| #define HAVE_TERMIOS_H 1
4298| #define HAVE_DIRENT_H 1
4299| #define HAVE_DLFCN_H 1
4300| #define HAVE__BOOL 1
4301| #define HAVE_STDBOOL_H 1
4302| #define HAVE_STRUCT_EXCEPTION_IN_MATH_H 1
4303| #define HAVE_EXTERNAL_FUNCTIONS 1
4304| #define HAVE_UNISTD_H 1
4305| #define HAVE_TIME_T_IN_TIME_H 1
4306| #define RETSIGTYPE void
4307| #define HAVE_ATEXIT 1
4308| #define HAVE_MEMCPY 1
4309| #define HAVE_MEMMOVE 1
4310| #define HAVE_MEMSET 1
4311| #define HAVE_BCOPY 1
4312| #define HAVE_BZERO 1
4313| #define HAVE_SETVBUF 1
4314| #define HAVE_STRERROR 1
4315| #define HAVE_STRCHR 1
4316| #define HAVE_STRRCHR 1
4317| #define HAVE_STRSTR 1
4318| #define HAVE_INDEX 1
4319| #define HAVE_RINDEX 1
4320| #define HAVE_ERF 1
4321| #define HAVE_ERFC 1
4322| #define HAVE_GAMMA 1
4323| #define HAVE_LGAMMA 1
4324| #define HAVE_GETCWD 1
4325| #define HAVE_POLL 1
4326| #define HAVE_PCLOSE 1
4327| #define HAVE_POPEN 1
4328| #define HAVE_FDOPEN 1
4329| #define HAVE_SELECT 1
4330| #define HAVE_SLEEP 1
4331| #define HAVE_STPCPY 1
4332| #define HAVE_STRCSPN 1
4333| #define HAVE_STRDUP 1
4334| #define HAVE_STRNDUP 1
4335| #define HAVE_STRNLEN 1
4336| #define HAVE_STRCASECMP 1
4337| #define HAVE_STRNCASECMP 1
4338| #define HAVE_TCGETATTR 1
4339| #define HAVE_VFPRINTF 1
4340| #define HAVE_USLEEP 1
4341| #define HAVE_SNPRINTF 1
4342| #define HAVE_DECL_SIGNGAM 1
4343| #define HAVE_SIGSETJMP 1
4344| #define PIPES 1
4345| #define HAVE_SYS_SELECT_H 1
4346| #define HAVE_SYS_SOCKET_H 1
4347| #define SELECT_TYPE_ARG1 int
4348| #define SELECT_TYPE_ARG234 (fd_set *)
4349| #define SELECT_TYPE_ARG5 (struct timeval *)
4350| #define HAVE_READLINE_RESET 1
4351| #define HAVE_LIBREADLINE 1
4352| #define HAVE_READLINE_READLINE_H 1
4353| #define HAVE_READLINE_HISTORY_H 1
4354| #define GNUPLOT_HISTORY 1
4355| #define HAVE_LIBZ 1
4356| #define HAVE_LIBGD 1
4357| #define HAVE_GD_H 1
4358| #define HAVE_GD_GIF 1
4359| #define GIF_ANIMATION 1
4360| #define HAVE_GD_JPEG 1
4361| #define HAVE_GD_TTF 1
4362| #define HAVE_GD_PNG 1
4363| #define HAVE_LUA 1
4364| #define HAVE_LUA_H 1
4365| #define HAVE_LIBCACA 1
4366| #define HAVE_LIBCACA 1
4367| #define USE_CWDRC 1
4368| #define USE_X11_MULTIBYTE 1
4369| #define EXTERNAL_X11_WINDOW 1
4370| #define EAM_BOXED_TEXT 1
4371| #define EAM_OBJECTS 1
4372| #define HIDDEN3D_QUADTREE 1
4373| #define HIDDEN3D_VAR_PTSIZE 1
4374| #define WX_NEEDS_XINITTHREADS 1
4375| /* end confdefs.h.  */
4376| #include <vfork.h>
4377configure:13520: result: no
4378configure:13520: checking for vfork.h
4379configure:13520: result: no
4380configure:13533: checking for fork
4381configure:13533: /usr/bin/clang -o conftest -pipe -Os -F/opt/local/Library/Frameworks -arch x86_64 -ObjC -I/opt/local/include -I/opt/local/include   -I/opt/local/include -I/opt/local/include  -L/opt/local/lib -Wl,-rpath -Wl,/opt/local/lib -L/opt/local/lib -Wl,-headerpad_max_install_names -F/opt/local/Library/Frameworks -arch x86_64 -L/opt/local/lib -lcerf -framework Foundation -framework AquaTerm -L/opt/local/lib -L/opt/local/lib -Wl,-headerpad_max_install_names -L/opt/local/lib conftest.c -lcaca  >&5
4382configure:13533: $? = 0
4383configure:13533: result: yes
4384configure:13533: checking for vfork
4385configure:13533: /usr/bin/clang -o conftest -pipe -Os -F/opt/local/Library/Frameworks -arch x86_64 -ObjC -I/opt/local/include -I/opt/local/include   -I/opt/local/include -I/opt/local/include  -L/opt/local/lib -Wl,-rpath -Wl,/opt/local/lib -L/opt/local/lib -Wl,-headerpad_max_install_names -F/opt/local/Library/Frameworks -arch x86_64 -L/opt/local/lib -lcerf -framework Foundation -framework AquaTerm -L/opt/local/lib -L/opt/local/lib -Wl,-headerpad_max_install_names -L/opt/local/lib conftest.c -lcaca  >&5
4386conftest.c:158:6: warning: incompatible redeclaration of library function 'vfork' [-Wincompatible-library-redeclaration]
4387char vfork ();
4388     ^
4389conftest.c:158:6: note: 'vfork' is a builtin with type 'int (void)'
43901 warning generated.
4391configure:13533: $? = 0
4392configure:13533: result: yes
4393configure:13543: checking for working fork
4394configure:13565: /usr/bin/clang -o conftest -pipe -Os -F/opt/local/Library/Frameworks -arch x86_64 -ObjC -I/opt/local/include -I/opt/local/include   -I/opt/local/include -I/opt/local/include  -L/opt/local/lib -Wl,-rpath -Wl,/opt/local/lib -L/opt/local/lib -Wl,-headerpad_max_install_names -F/opt/local/Library/Frameworks -arch x86_64 -L/opt/local/lib -lcerf -framework Foundation -framework AquaTerm -L/opt/local/lib -L/opt/local/lib -Wl,-headerpad_max_install_names -L/opt/local/lib conftest.c -lcaca  >&5
4395configure:13565: $? = 0
4396configure:13565: ./conftest
4397configure:13565: $? = 0
4398configure:13575: result: yes
4399configure:13596: checking for working vfork
4400configure:13706: result: yes
4401configure:13975: checking for CAIROPDF
4402configure:13983: $PKG_CONFIG --exists --print-errors "       cairo >= 1.2 cairo-pdf >= 1.2 pango >= 1.10 pangocairo >= 1.10 glib-2.0"
4403configure:13986: $? = 0
4404configure:14001: $PKG_CONFIG --exists --print-errors "       cairo >= 1.2 cairo-pdf >= 1.2 pango >= 1.10 pangocairo >= 1.10 glib-2.0"
4405configure:14004: $? = 0
4406configure:14080: result: yes
4407configure:14097: checking for CAIROEPS
4408configure:14105: $PKG_CONFIG --exists --print-errors "cairo >= 1.6.0"
4409configure:14108: $? = 0
4410configure:14123: $PKG_CONFIG --exists --print-errors "cairo >= 1.6.0"
4411configure:14126: $? = 0
4412configure:14166: result: yes
4413configure:14925: checking that generated files are newer than configure
4414configure:14931: result: done
4415configure:15014: creating ./config.status
4416
4417## ---------------------- ##
4418## Running config.status. ##
4419## ---------------------- ##
4420
4421This file was extended by gnuplot config.status 5.0.6, which was
4422generated by GNU Autoconf 2.69.  Invocation command line was
4423
4424  CONFIG_FILES    =
4425  CONFIG_HEADERS  =
4426  CONFIG_LINKS    =
4427  CONFIG_COMMANDS =
4428  $ ./config.status
4429
4430on Luiss-MacBook-Pro.local
4431
4432config.status:1100: creating Makefile
4433config.status:1252: error: could not create Makefile
4434
4435## ---------------- ##
4436## Cache variables. ##
4437## ---------------- ##
4438
4439ac_cv_c_compiler_gnu=yes
4440ac_cv_c_const=yes
4441ac_cv_c_inline=inline
4442ac_cv_c_stringize=yes
4443ac_cv_cxx_compiler_gnu=yes
4444ac_cv_env_CAIROEPS_CFLAGS_set=
4445ac_cv_env_CAIROEPS_CFLAGS_value=
4446ac_cv_env_CAIROEPS_LIBS_set=
4447ac_cv_env_CAIROEPS_LIBS_value=
4448ac_cv_env_CAIROPANGO_CFLAGS_set=
4449ac_cv_env_CAIROPANGO_CFLAGS_value=
4450ac_cv_env_CAIROPANGO_LIBS_set=
4451ac_cv_env_CAIROPANGO_LIBS_value=
4452ac_cv_env_CAIROPDF_CFLAGS_set=
4453ac_cv_env_CAIROPDF_CFLAGS_value=
4454ac_cv_env_CAIROPDF_LIBS_set=
4455ac_cv_env_CAIROPDF_LIBS_value=
4456ac_cv_env_CCC_set=
4457ac_cv_env_CCC_value=
4458ac_cv_env_CC_set=set
4459ac_cv_env_CC_value=/usr/bin/clang
4460ac_cv_env_CFLAGS_set=set
4461ac_cv_env_CFLAGS_value='-pipe -Os -F/opt/local/Library/Frameworks -arch x86_64'
4462ac_cv_env_CPPFLAGS_set=set
4463ac_cv_env_CPPFLAGS_value=-I/opt/local/include
4464ac_cv_env_CPP_set=
4465ac_cv_env_CPP_value=
4466ac_cv_env_CXXCPP_set=
4467ac_cv_env_CXXCPP_value=
4468ac_cv_env_CXXFLAGS_set=set
4469ac_cv_env_CXXFLAGS_value='-pipe -Os -stdlib=libc++ -arch x86_64'
4470ac_cv_env_CXX_set=set
4471ac_cv_env_CXX_value=/usr/bin/clang++
4472ac_cv_env_DIST_CONTACT_set=
4473ac_cv_env_DIST_CONTACT_value=
4474ac_cv_env_GTK_CFLAGS_set=
4475ac_cv_env_GTK_CFLAGS_value=
4476ac_cv_env_GTK_LIBS_set=
4477ac_cv_env_GTK_LIBS_value=
4478ac_cv_env_LDFLAGS_set=set
4479ac_cv_env_LDFLAGS_value='-L/opt/local/lib -Wl,-headerpad_max_install_names -F/opt/local/Library/Frameworks -arch x86_64'
4480ac_cv_env_LIBCERF_CFLAGS_set=
4481ac_cv_env_LIBCERF_CFLAGS_value=
4482ac_cv_env_LIBCERF_LIBS_set=
4483ac_cv_env_LIBCERF_LIBS_value=
4484ac_cv_env_LIBS_set=
4485ac_cv_env_LIBS_value=
4486ac_cv_env_LUA_CFLAGS_set=
4487ac_cv_env_LUA_CFLAGS_value=
4488ac_cv_env_LUA_LIBS_set=
4489ac_cv_env_LUA_LIBS_value=
4490ac_cv_env_OBJCFLAGS_set=set
4491ac_cv_env_OBJCFLAGS_value='-pipe -Os -arch x86_64'
4492ac_cv_env_OBJC_set=set
4493ac_cv_env_OBJC_value=/usr/bin/clang
4494ac_cv_env_PANGO_1_10_2_CFLAGS_set=
4495ac_cv_env_PANGO_1_10_2_CFLAGS_value=
4496ac_cv_env_PANGO_1_10_2_LIBS_set=
4497ac_cv_env_PANGO_1_10_2_LIBS_value=
4498ac_cv_env_PKG_CONFIG_set=
4499ac_cv_env_PKG_CONFIG_value=
4500ac_cv_env_QT_CFLAGS_set=
4501ac_cv_env_QT_CFLAGS_value=
4502ac_cv_env_QT_LIBS_set=
4503ac_cv_env_QT_LIBS_value=
4504ac_cv_env_XMKMF_set=
4505ac_cv_env_XMKMF_value=
4506ac_cv_env_build_alias_set=
4507ac_cv_env_build_alias_value=
4508ac_cv_env_caca_CFLAGS_set=
4509ac_cv_env_caca_CFLAGS_value=
4510ac_cv_env_caca_LIBS_set=
4511ac_cv_env_caca_LIBS_value=
4512ac_cv_env_host_alias_set=
4513ac_cv_env_host_alias_value=
4514ac_cv_env_target_alias_set=
4515ac_cv_env_target_alias_value=
4516ac_cv_func_atexit=yes
4517ac_cv_func_bcopy=yes
4518ac_cv_func_bzero=yes
4519ac_cv_func_connect=yes
4520ac_cv_func_doprnt=no
4521ac_cv_func_erf=yes
4522ac_cv_func_erfc=yes
4523ac_cv_func_fdopen=yes
4524ac_cv_func_fork=yes
4525ac_cv_func_fork_works=yes
4526ac_cv_func_gamma=yes
4527ac_cv_func_getcwd=yes
4528ac_cv_func_gethostbyname=yes
4529ac_cv_func_index=yes
4530ac_cv_func_lgamma=yes
4531ac_cv_func_memcpy=yes
4532ac_cv_func_memmove=yes
4533ac_cv_func_memset=yes
4534ac_cv_func_on_exit=no
4535ac_cv_func_pclose=yes
4536ac_cv_func_poll=yes
4537ac_cv_func_popen=yes
4538ac_cv_func_remove=yes
4539ac_cv_func_rindex=yes
4540ac_cv_func_select=yes
4541ac_cv_func_select_args='int,fd_set *,struct timeval *'
4542ac_cv_func_setvbuf=yes
4543ac_cv_func_shmat=yes
4544ac_cv_func_sin=yes
4545ac_cv_func_sleep=yes
4546ac_cv_func_snprintf=yes
4547ac_cv_func_stpcpy=yes
4548ac_cv_func_strcasecmp=yes
4549ac_cv_func_strchr=yes
4550ac_cv_func_strcspn=yes
4551ac_cv_func_strdup=yes
4552ac_cv_func_strerror=yes
4553ac_cv_func_stricmp=no
4554ac_cv_func_strncasecmp=yes
4555ac_cv_func_strndup=yes
4556ac_cv_func_strnicmp=no
4557ac_cv_func_strnlen=yes
4558ac_cv_func_strrchr=yes
4559ac_cv_func_strstr=yes
4560ac_cv_func_sysinfo=no
4561ac_cv_func_tcgetattr=yes
4562ac_cv_func_usleep=yes
4563ac_cv_func_vfork=yes
4564ac_cv_func_vfork_works=yes
4565ac_cv_func_vfprintf=yes
4566ac_cv_have_decl_CACA_DEPRECATED=yes
4567ac_cv_have_decl_signgam=yes
4568ac_cv_have_x='have_x=yes        ac_x_includes='\'''\''  ac_x_libraries='\'''\'''
4569ac_cv_header_dirent_h=yes
4570ac_cv_header_dl_h=no
4571ac_cv_header_dlfcn_h=yes
4572ac_cv_header_errno_h=yes
4573ac_cv_header_float_h=yes
4574ac_cv_header_gd_h=yes
4575ac_cv_header_inttypes_h=yes
4576ac_cv_header_langinfo_h=yes
4577ac_cv_header_libc_h=yes
4578ac_cv_header_limits_h=yes
4579ac_cv_header_locale_h=yes
4580ac_cv_header_lua_h=yes
4581ac_cv_header_malloc_h=no
4582ac_cv_header_math_h=yes
4583ac_cv_header_memory_h=yes
4584ac_cv_header_minix_config_h=no
4585ac_cv_header_poll_h=yes
4586ac_cv_header_readline_history_h=yes
4587ac_cv_header_readline_readline_h=yes
4588ac_cv_header_sgtty_h=yes
4589ac_cv_header_stat_broken=no
4590ac_cv_header_stdbool_h=yes
4591ac_cv_header_stdc=yes
4592ac_cv_header_stdint_h=yes
4593ac_cv_header_stdlib_h=yes
4594ac_cv_header_string_h=yes
4595ac_cv_header_strings_h=yes
4596ac_cv_header_sys_bsdtypes_h=no
4597ac_cv_header_sys_ioctl_h=yes
4598ac_cv_header_sys_param_h=yes
4599ac_cv_header_sys_select_h=yes
4600ac_cv_header_sys_socket_h=yes
4601ac_cv_header_sys_stat_h=yes
4602ac_cv_header_sys_systeminfo_h=no
4603ac_cv_header_sys_time_h=yes
4604ac_cv_header_sys_timeb_h=yes
4605ac_cv_header_sys_types_h=yes
4606ac_cv_header_sys_utsname_h=yes
4607ac_cv_header_termios_h=yes
4608ac_cv_header_time_h=yes
4609ac_cv_header_unistd_h=yes
4610ac_cv_header_values_h=no
4611ac_cv_header_vfork_h=no
4612ac_cv_header_zlib_h=yes
4613ac_cv_lib_ICE_IceConnectionNumber=yes
4614ac_cv_lib_X11_XmbDrawString=yes
4615ac_cv_lib_caca_caca_export_canvas_to_memory=yes
4616ac_cv_lib_caca_caca_get_version=yes
4617ac_cv_lib_gd_gdImageCreateTrueColor=yes
4618ac_cv_lib_gd_gdImageGif=yes
4619ac_cv_lib_gd_gdImageGifAnimBegin=yes
4620ac_cv_lib_gd_gdImageJpeg=yes
4621ac_cv_lib_gd_gdImagePng=yes
4622ac_cv_lib_gd_gdImageStringFT=yes
4623ac_cv_lib_ncurses___tputs=yes
4624ac_cv_lib_readline_remove_history=yes
4625ac_cv_lib_z_deflate=yes
4626ac_cv_objc_compiler_gnu=yes
4627ac_cv_objext=o
4628ac_cv_path_EGREP='/usr/bin/grep -E'
4629ac_cv_path_GDLIB_CONFIG=/opt/local/bin/gdlib-config
4630ac_cv_path_GREP=/usr/bin/grep
4631ac_cv_path_WX_CONFIG=/opt/local/Library/Frameworks/wxWidgets.framework/Versions/wxWidgets/3.0/bin/wx-config
4632ac_cv_path_ac_pt_PKG_CONFIG=/opt/local/bin/pkg-config
4633ac_cv_prog_AWK=gawk
4634ac_cv_prog_CPP='/usr/bin/clang -E'
4635ac_cv_prog_CXXCPP='/usr/bin/clang++ -E'
4636ac_cv_prog_EMACS=emacs
4637ac_cv_prog_TROFF=troff
4638ac_cv_prog_ac_ct_CC=/usr/bin/clang
4639ac_cv_prog_cc_c89=
4640ac_cv_prog_cc_g=yes
4641ac_cv_prog_cxx_g=yes
4642ac_cv_prog_make_make_set=yes
4643ac_cv_prog_objc_g=yes
4644ac_cv_safe_to_define___extensions__=yes
4645ac_cv_search_cdawson='none required'
4646ac_cv_search_dlopen='none required'
4647ac_cv_search_iconv_open=no
4648ac_cv_search_rl_complete_with_tilde_expansion='none required'
4649ac_cv_search_rl_ding=-lreadline
4650ac_cv_search_rl_forced_update_display='none required'
4651ac_cv_search_rl_reset_after_signal='none required'
4652ac_cv_sys_file_offset_bits=no
4653ac_cv_sys_largefile_CC=no
4654ac_cv_sys_largefile_source=no
4655ac_cv_type__Bool=yes
4656ac_cv_type_off_t=yes
4657ac_cv_type_pid_t=yes
4658ac_cv_type_signal=void
4659ac_cv_type_size_t=yes
4660am_cv_CC_dependencies_compiler_type=gcc3
4661am_cv_CXX_dependencies_compiler_type=gcc3
4662am_cv_OBJC_dependencies_compiler_type=gcc3
4663am_cv_make_support_nested_variables=yes
4664am_cv_prog_cc_c_o=yes
4665pkg_cv_CAIROEPS_CFLAGS='-I/opt/local/include/cairo -I/opt/local/include/glib-2.0 -I/opt/local/lib/glib-2.0/include -I/opt/local/include/pixman-1 -I/opt/local/include/freetype2 -I/opt/local/include/libpng16'
4666pkg_cv_CAIROEPS_LIBS='-L/opt/local/lib -lcairo'
4667pkg_cv_CAIROPANGO_CFLAGS='-I/opt/local/include/pango-1.0 -I/opt/local/include/harfbuzz -I/opt/local/include/pango-1.0 -I/opt/local/include/cairo -I/opt/local/include/glib-2.0 -I/opt/local/lib/glib-2.0/include -I/opt/local/include/pixman-1 -I/opt/local/include/freetype2 -I/opt/local/include/libpng16'
4668pkg_cv_CAIROPANGO_LIBS='-L/opt/local/lib -lpangocairo-1.0 -lpango-1.0 -lgobject-2.0 -lglib-2.0 -lintl -lcairo'
4669pkg_cv_CAIROPDF_CFLAGS='-I/opt/local/include/cairo -I/opt/local/include/pango-1.0 -I/opt/local/include/harfbuzz -I/opt/local/include/pango-1.0 -I/opt/local/include/cairo -I/opt/local/include/pixman-1 -I/opt/local/include/freetype2 -I/opt/local/include/libpng16 -I/opt/local/include/glib-2.0 -I/opt/local/lib/glib-2.0/include'
4670pkg_cv_CAIROPDF_LIBS='-L/opt/local/lib -lz -lpangocairo-1.0 -lpango-1.0 -lgobject-2.0 -lcairo -lglib-2.0 -lintl'
4671pkg_cv_LIBCERF_CFLAGS=
4672pkg_cv_LIBCERF_LIBS='-L/opt/local/lib -lcerf'
4673pkg_cv_LUA_CFLAGS=
4674pkg_cv_LUA_LIBS='-L/opt/local/lib -llua -lm'
4675
4676## ----------------- ##
4677## Output variables. ##
4678## ----------------- ##
4679
4680ACLOCAL='aclocal-1.14'
4681AMDEPBACKSLASH='\'
4682AMDEP_FALSE='#'
4683AMDEP_TRUE=''
4684AMTAR='$${TAR-tar}'
4685AM_BACKSLASH='\'
4686AM_DEFAULT_V='$(AM_DEFAULT_VERBOSITY)'
4687AM_DEFAULT_VERBOSITY='1'
4688AM_V='$(V)'
4689AUTOCONF='autoconf'
4690AUTOHEADER='autoheader'
4691AUTOMAKE='automake-1.14'
4692AWK='gawk'
4693BUILD_BITMAP_FALSE=''
4694BUILD_BITMAP_TRUE='#'
4695BUILD_GNUPLOT_X11_FALSE='#'
4696BUILD_GNUPLOT_X11_TRUE=''
4697BUILD_GPCAIRO_FALSE='#'
4698BUILD_GPCAIRO_TRUE=''
4699BUILD_LUA_FALSE='#'
4700BUILD_LUA_TRUE=''
4701BUILD_PLUGIN_FALSE='#'
4702BUILD_PLUGIN_TRUE=''
4703BUILD_QT_FALSE=''
4704BUILD_QT_TRUE='#'
4705BUILD_SRC_BEOS_SUBDIR_FALSE=''
4706BUILD_SRC_BEOS_SUBDIR_TRUE='#'
4707BUILD_WXWIDGETS_FALSE='#'
4708BUILD_WXWIDGETS_TRUE=''
4709CACA_CONFIG=''
4710CAIROEPS_CFLAGS='-I/opt/local/include/cairo -I/opt/local/include/glib-2.0 -I/opt/local/lib/glib-2.0/include -I/opt/local/include/pixman-1 -I/opt/local/include/freetype2 -I/opt/local/include/libpng16'
4711CAIROEPS_LIBS='-L/opt/local/lib -lcairo'
4712CAIROPANGO_CFLAGS='-I/opt/local/include/pango-1.0 -I/opt/local/include/harfbuzz -I/opt/local/include/pango-1.0 -I/opt/local/include/cairo -I/opt/local/include/glib-2.0 -I/opt/local/lib/glib-2.0/include -I/opt/local/include/pixman-1 -I/opt/local/include/freetype2 -I/opt/local/include/libpng16'
4713CAIROPANGO_LIBS='-L/opt/local/lib -lpangocairo-1.0 -lpango-1.0 -lgobject-2.0 -lglib-2.0 -lintl -lcairo'
4714CAIROPDF_CFLAGS='-I/opt/local/include/cairo -I/opt/local/include/pango-1.0 -I/opt/local/include/harfbuzz -I/opt/local/include/pango-1.0 -I/opt/local/include/cairo -I/opt/local/include/pixman-1 -I/opt/local/include/freetype2 -I/opt/local/include/libpng16 -I/opt/local/include/glib-2.0 -I/opt/local/lib/glib-2.0/include'
4715CAIROPDF_LIBS='-L/opt/local/lib -lz -lpangocairo-1.0 -lpango-1.0 -lgobject-2.0 -lcairo -lglib-2.0 -lintl'
4716CC='/usr/bin/clang'
4717CCDEPMODE='depmode=gcc3'
4718CC_FOR_BUILD='/usr/bin/clang'
4719CFLAGS='-pipe -Os -F/opt/local/Library/Frameworks -arch x86_64 -ObjC'
4720CPP='/usr/bin/clang -E'
4721CPPFLAGS='-I/opt/local/include -I/opt/local/include   -I/opt/local/include -I/opt/local/include  -I/opt/local/include/pango-1.0 -I/opt/local/include/harfbuzz -I/opt/local/include/pango-1.0 -I/opt/local/include/cairo -I/opt/local/include/glib-2.0 -I/opt/local/lib/glib-2.0/include -I/opt/local/include/pixman-1 -I/opt/local/include/freetype2 -I/opt/local/include/libpng16 -I/opt/local/include/cairo -I/opt/local/include/pango-1.0 -I/opt/local/include/harfbuzz -I/opt/local/include/pango-1.0 -I/opt/local/include/cairo -I/opt/local/include/pixman-1 -I/opt/local/include/freetype2 -I/opt/local/include/libpng16 -I/opt/local/include/glib-2.0 -I/opt/local/lib/glib-2.0/include'
4722CXX='/usr/bin/clang++'
4723CXXCPP='/usr/bin/clang++ -E'
4724CXXDEPMODE='depmode=gcc3'
4725CXXFLAGS='-pipe -Os -stdlib=libc++ -arch x86_64 -I/opt/local/Library/Frameworks/wxWidgets.framework/Versions/wxWidgets/3.0/lib/wx/include/osx_cocoa-unicode-3.0 -I/opt/local/Library/Frameworks/wxWidgets.framework/Versions/wxWidgets/3.0/include/wx-3.0 -D_FILE_OFFSET_BITS=64 -DWXUSINGDLL -D__WXMAC__ -D__WXOSX__ -D__WXOSX_COCOA__  -I/opt/local/include/pango-1.0 -I/opt/local/include/harfbuzz -I/opt/local/include/pango-1.0 -I/opt/local/include/cairo -I/opt/local/include/glib-2.0 -I/opt/local/lib/glib-2.0/include -I/opt/local/include/pixman-1 -I/opt/local/include/freetype2 -I/opt/local/include/libpng16'
4726CYGPATH_W='echo'
4727DEFS='-DHAVE_CONFIG_H'
4728DEPDIR='.deps'
4729DIST_CONTACT=''
4730DVIPS='no'
4731ECHO_C='\c'
4732ECHO_N=''
4733ECHO_T=''
4734EGREP='/usr/bin/grep -E'
4735EMACS='emacs'
4736EXEEXT=''
4737GDLIB_CONFIG='/opt/local/bin/gdlib-config'
4738GIHDIR='${datarootdir}/gnuplot/5.0'
4739GREP='/usr/bin/grep'
4740GTK_CFLAGS=''
4741GTK_LIBS=''
4742HAVE_LATEX_FALSE=''
4743HAVE_LATEX_TRUE='#'
4744HAVE_LRELEASE_FALSE='#'
4745HAVE_LRELEASE_TRUE=''
4746INSTALL_DATA='${INSTALL} -m 644'
4747INSTALL_PROGRAM='${INSTALL}'
4748INSTALL_SCRIPT='${INSTALL}'
4749INSTALL_STRIP_PROGRAM='$(install_sh) -c -s'
4750KPSEXPAND='no'
4751LATEX2HTML=''
4752LATEX='no'
4753LDFLAGS='-L/opt/local/lib -Wl,-rpath -Wl,/opt/local/lib -L/opt/local/lib -Wl,-headerpad_max_install_names -F/opt/local/Library/Frameworks -arch x86_64 -L/opt/local/lib -lcerf -framework Foundation -framework AquaTerm -L/opt/local/lib -L/opt/local/lib -Wl,-headerpad_max_install_names -L/opt/local/lib'
4754LIBCERF_CFLAGS=''
4755LIBCERF_LIBS='-L/opt/local/lib -lcerf'
4756LIBOBJS=''
4757LIBRARIES_FOR_X=' -lX11 '
4758LIBS='-lcaca  -L/opt/local/lib -lz -lpangocairo-1.0 -lpango-1.0 -lgobject-2.0 -lcairo -lglib-2.0 -lintl'
4759LINUXSUID=''
4760LN_S='ln -s'
4761LRELEASE=''
4762LTLIBOBJS=''
4763LUA_CFLAGS=''
4764LUA_LIBS='-L/opt/local/lib -llua -lm'
4765MAINT='#'
4766MAINTAINER_MODE_FALSE=''
4767MAINTAINER_MODE_TRUE='#'
4768MAKEINFO='makeinfo'
4769MKDIR_P='./install-sh -c -d'
4770MOC=''
4771OBJC='/usr/bin/clang'
4772OBJCDEPMODE='depmode=gcc3'
4773OBJCFLAGS='-pipe -Os -arch x86_64'
4774OBJEXT='o'
4775PACKAGE='gnuplot'
4776PACKAGE_BUGREPORT=''
4777PACKAGE_NAME='gnuplot'
4778PACKAGE_STRING='gnuplot 5.0.6'
4779PACKAGE_TARNAME='gnuplot'
4780PACKAGE_URL=''
4781PACKAGE_VERSION='5.0.6'
4782PANGO_1_10_2_CFLAGS=''
4783PANGO_1_10_2_LIBS=''
4784PATH_SEPARATOR=':'
4785PDFLATEX='no'
4786PDFLIB_CONFIG=''
4787PKG_CONFIG='/opt/local/bin/pkg-config'
4788PLAINTEX='no'
4789QT_CFLAGS=''
4790QT_LIBS=''
4791RCC=''
4792SET_MAKE=''
4793SHELL='/bin/sh'
4794STRIP=''
4795TERMLIBS=' -lreadline  -lncurses  -lz -lgd -lgd -L/opt/local/lib -lz -L/opt/local/lib -L/opt/local/lib -lpng16 -L/opt/local/lib -L/opt/local/lib -lfreetype -L/opt/local/lib -lfontconfig -L/opt/local/lib -ljpeg -L/opt/local/lib -lXpm -L/opt/local/lib -ltiff -L/opt/local/lib -lwebp -liconv -L/opt/local/lib -llua -lm -lcaca'
4796TERMXLIBS=''
4797TEXDIR='no'
4798TEXHASH='true'
4799TROFF='troff'
4800TUTORIAL='notutorial'
4801UIC=''
4802VERSION='5.0.6'
4803VERSION_MAJOR='5.0'
4804WX_CONFIG='/opt/local/Library/Frameworks/wxWidgets.framework/Versions/wxWidgets/3.0/bin/wx-config'
4805WX_LIBS='-L/opt/local/Library/Frameworks/wxWidgets.framework/Versions/wxWidgets/3.0/lib   -framework IOKit -framework Carbon -framework Cocoa -framework AudioToolbox -framework System -framework OpenGL -lwx_osx_cocoau_xrc-3.0 -lwx_osx_cocoau_webview-3.0 -lwx_osx_cocoau_html-3.0 -lwx_osx_cocoau_qa-3.0 -lwx_osx_cocoau_adv-3.0 -lwx_osx_cocoau_core-3.0 -lwx_baseu_xml-3.0 -lwx_baseu_net-3.0 -lwx_baseu-3.0  -L/opt/local/lib -lpangocairo-1.0 -lpango-1.0 -lgobject-2.0 -lglib-2.0 -lintl -lcairo'
4806X11_APPDEFAULTS_DIR='/etc/X11/app-defaults/'
4807XMKMF=''
4808X_CFLAGS=''
4809X_EXTRA_LIBS=''
4810X_LIBS=''
4811X_PRE_LIBS=' -lSM -lICE'
4812ac_ct_CC='/usr/bin/clang'
4813ac_ct_CXX=''
4814ac_ct_OBJC=''
4815am__EXEEXT_FALSE=''
4816am__EXEEXT_TRUE='#'
4817am__fastdepCC_FALSE='#'
4818am__fastdepCC_TRUE=''
4819am__fastdepCXX_FALSE='#'
4820am__fastdepCXX_TRUE=''
4821am__fastdepOBJC_FALSE='#'
4822am__fastdepOBJC_TRUE=''
4823am__include='include'
4824am__isrc=''
4825am__leading_dot='.'
4826am__nodep='_no'
4827am__quote=''
4828am__tar='$${TAR-tar} chof - "$$tardir"'
4829am__untar='$${TAR-tar} xf -'
4830bindir='${exec_prefix}/bin'
4831build_alias=''
4832caca_CFLAGS=''
4833caca_LIBS='-lcaca'
4834datadir='${datarootdir}'
4835datarootdir='${prefix}/share'
4836docdir='${datarootdir}/doc/${PACKAGE_TARNAME}'
4837dvidir='${docdir}'
4838exec_prefix='${prefix}'
4839host_alias=''
4840htmldir='${docdir}'
4841includedir='${prefix}/include'
4842infodir='${prefix}/share/info'
4843install_sh='${SHELL} /opt/local/var/macports/build/_opt_local_var_macports_sources_rsync.macports.org_release_tarballs_ports_math_gnuplot/gnuplot/work/gnuplot-5.0.6/install-sh'
4844libdir='${exec_prefix}/lib'
4845libexecdir='${exec_prefix}/libexec'
4846localedir='${datarootdir}/locale'
4847localstatedir='${prefix}/var'
4848mandir='${prefix}/share/man'
4849mkdir_p='$(MKDIR_P)'
4850oldincludedir='/usr/include'
4851pdfdir='${docdir}'
4852prefix='/opt/local'
4853program_transform_name='s,x,x,'
4854psdir='${docdir}'
4855sbindir='${exec_prefix}/sbin'
4856sharedstatedir='${prefix}/com'
4857sysconfdir='${prefix}/etc'
4858target_alias=''
4859
4860## ----------- ##
4861## confdefs.h. ##
4862## ----------- ##
4863
4864/* confdefs.h */
4865#define PACKAGE_NAME "gnuplot"
4866#define PACKAGE_TARNAME "gnuplot"
4867#define PACKAGE_VERSION "5.0.6"
4868#define PACKAGE_STRING "gnuplot 5.0.6"
4869#define PACKAGE_BUGREPORT ""
4870#define PACKAGE_URL ""
4871#define PACKAGE "gnuplot"
4872#define VERSION "5.0.6"
4873#define PROTOTYPES 1
4874#define STDC_HEADERS 1
4875#define HAVE_SYS_TYPES_H 1
4876#define HAVE_SYS_STAT_H 1
4877#define HAVE_STDLIB_H 1
4878#define HAVE_STRING_H 1
4879#define HAVE_MEMORY_H 1
4880#define HAVE_STRINGS_H 1
4881#define HAVE_INTTYPES_H 1
4882#define HAVE_STDINT_H 1
4883#define HAVE_UNISTD_H 1
4884#define __EXTENSIONS__ 1
4885#define _ALL_SOURCE 1
4886#define _GNU_SOURCE 1
4887#define _POSIX_PTHREAD_SEMANTICS 1
4888#define _TANDEM_SOURCE 1
4889#define HAVE_STRINGIZE 1
4890#define HAVE_OFF_T 1
4891#define HAVE_FSEEKO 1
4892#define HAVE_LIBCERF 1
4893#define X11 1
4894#define HAVE_FRAMEWORK_AQUATERM 1
4895#define STDC_HEADERS 1
4896#define HAVE_DIRENT_H 1
4897#define HAVE_ERRNO_H 1
4898#define HAVE_FLOAT_H 1
4899#define HAVE_LANGINFO_H 1
4900#define HAVE_LIMITS_H 1
4901#define HAVE_LOCALE_H 1
4902#define HAVE_MATH_H 1
4903#define HAVE_STDLIB_H 1
4904#define HAVE_STRING_H 1
4905#define HAVE_TIME_H 1
4906#define HAVE_SYS_TIME_H 1
4907#define HAVE_SYS_TYPES_H 1
4908#define HAVE_SYS_IOCTL_H 1
4909#define HAVE_SYS_PARAM_H 1
4910#define HAVE_SYS_SELECT_H 1
4911#define HAVE_SYS_SOCKET_H 1
4912#define HAVE_SYS_STAT_H 1
4913#define HAVE_SYS_TIMEB_H 1
4914#define HAVE_SYS_UTSNAME_H 1
4915#define HAVE_LIBC_H 1
4916#define HAVE_POLL_H 1
4917#define HAVE_SGTTY_H 1
4918#define HAVE_TERMIOS_H 1
4919#define HAVE_DIRENT_H 1
4920#define HAVE_DLFCN_H 1
4921#define HAVE__BOOL 1
4922#define HAVE_STDBOOL_H 1
4923#define HAVE_STRUCT_EXCEPTION_IN_MATH_H 1
4924#define HAVE_EXTERNAL_FUNCTIONS 1
4925#define HAVE_UNISTD_H 1
4926#define HAVE_TIME_T_IN_TIME_H 1
4927#define RETSIGTYPE void
4928#define HAVE_ATEXIT 1
4929#define HAVE_MEMCPY 1
4930#define HAVE_MEMMOVE 1
4931#define HAVE_MEMSET 1
4932#define HAVE_BCOPY 1
4933#define HAVE_BZERO 1
4934#define HAVE_SETVBUF 1
4935#define HAVE_STRERROR 1
4936#define HAVE_STRCHR 1
4937#define HAVE_STRRCHR 1
4938#define HAVE_STRSTR 1
4939#define HAVE_INDEX 1
4940#define HAVE_RINDEX 1
4941#define HAVE_ERF 1
4942#define HAVE_ERFC 1
4943#define HAVE_GAMMA 1
4944#define HAVE_LGAMMA 1
4945#define HAVE_GETCWD 1
4946#define HAVE_POLL 1
4947#define HAVE_PCLOSE 1
4948#define HAVE_POPEN 1
4949#define HAVE_FDOPEN 1
4950#define HAVE_SELECT 1
4951#define HAVE_SLEEP 1
4952#define HAVE_STPCPY 1
4953#define HAVE_STRCSPN 1
4954#define HAVE_STRDUP 1
4955#define HAVE_STRNDUP 1
4956#define HAVE_STRNLEN 1
4957#define HAVE_STRCASECMP 1
4958#define HAVE_STRNCASECMP 1
4959#define HAVE_TCGETATTR 1
4960#define HAVE_VFPRINTF 1
4961#define HAVE_USLEEP 1
4962#define HAVE_SNPRINTF 1
4963#define HAVE_DECL_SIGNGAM 1
4964#define HAVE_SIGSETJMP 1
4965#define PIPES 1
4966#define HAVE_SYS_SELECT_H 1
4967#define HAVE_SYS_SOCKET_H 1
4968#define SELECT_TYPE_ARG1 int
4969#define SELECT_TYPE_ARG234 (fd_set *)
4970#define SELECT_TYPE_ARG5 (struct timeval *)
4971#define HAVE_READLINE_RESET 1
4972#define HAVE_LIBREADLINE 1
4973#define HAVE_READLINE_READLINE_H 1
4974#define HAVE_READLINE_HISTORY_H 1
4975#define GNUPLOT_HISTORY 1
4976#define HAVE_LIBZ 1
4977#define HAVE_LIBGD 1
4978#define HAVE_GD_H 1
4979#define HAVE_GD_GIF 1
4980#define GIF_ANIMATION 1
4981#define HAVE_GD_JPEG 1
4982#define HAVE_GD_TTF 1
4983#define HAVE_GD_PNG 1
4984#define HAVE_LUA 1
4985#define HAVE_LUA_H 1
4986#define HAVE_LIBCACA 1
4987#define HAVE_LIBCACA 1
4988#define USE_CWDRC 1
4989#define USE_X11_MULTIBYTE 1
4990#define EXTERNAL_X11_WINDOW 1
4991#define EAM_BOXED_TEXT 1
4992#define EAM_OBJECTS 1
4993#define HIDDEN3D_QUADTREE 1
4994#define HIDDEN3D_VAR_PTSIZE 1
4995#define WX_NEEDS_XINITTHREADS 1
4996#define HAVE_FORK 1
4997#define HAVE_VFORK 1
4998#define HAVE_WORKING_VFORK 1
4999#define HAVE_WORKING_FORK 1
5000#define WXWIDGETS 1
5001#define NO_BITMAP_SUPPORT 1
5002#define HAVE_CAIROPDF 1
5003#define HAVE_CAIROEPS 1
5004#define USE_STATS 1
5005#define USE_MOUSE 1
5006#define PIPE_IPC 1
5007#define MAX_PARALLEL_AXES 7
5008
5009configure: exit 1