Ticket #54289: main.log

File main.log, 25.8 KB (added by potmj (Michael Pot), 5 years ago)

Leopard port -v upgrade libcxx

Line 
1version:1
2:msg:main --->  Computing dependencies for libcxx:info:main .:debug:main libcxx has no conflicts
3:debug:main Searching for dependency: xz
4:debug:main Found Dependency: receipt exists for xz
5:debug:main Executing org.macports.main (libcxx)
6:debug:main dropping privileges: euid changed to 504, egid changed to 500.
7:debug:archivefetch archivefetch phase started at Tue Jan 16 22:51:01 NZDT 2018
8:debug:archivefetch Executing org.macports.archivefetch (libcxx)
9:debug:archivefetch Privilege de-escalation not attempted as not running as root.
10:debug:fetch fetch phase started at Tue Jan 16 22:52:01 NZDT 2018
11:notice:fetch --->  Fetching distfiles for libcxx
12:debug:fetch Executing org.macports.fetch (libcxx)
13:debug:fetch Privilege de-escalation not attempted as not running as root.
14:debug:checksum checksum phase started at Tue Jan 16 22:52:01 NZDT 2018
15:notice:checksum --->  Verifying checksums for libcxx
16:debug:checksum Executing org.macports.checksum (libcxx)
17:info:checksum --->  Checksumming libcxxabi-5.0.1.src.tar.xz
18:debug:checksum Calculated (rmd160) is 93b74a0644c1afd565938fba5e21b200b206c72a
19:debug:checksum Correct (rmd160) checksum for libcxxabi-5.0.1.src.tar.xz
20:debug:checksum Calculated (sha256) is 5a25152cb7f21e3c223ad36a1022faeb8a5ac27c9e75936a5ae2d3ac48f6e854
21:debug:checksum Correct (sha256) checksum for libcxxabi-5.0.1.src.tar.xz
22:info:checksum --->  Checksumming libcxx-5.0.1.src.tar.xz
23:debug:checksum Calculated (rmd160) is 1e5a22e62515382488f232039e31f0b12c08ca4f
24:debug:checksum Correct (rmd160) checksum for libcxx-5.0.1.src.tar.xz
25:debug:checksum Calculated (sha256) is fa8f99dd2bde109daa3276d529851a3bce5718d46ce1c5d0806f46caa3e57c00
26:debug:checksum Correct (sha256) checksum for libcxx-5.0.1.src.tar.xz
27:debug:checksum Privilege de-escalation not attempted as not running as root.
28:debug:extract extract phase started at Tue Jan 16 22:52:01 NZDT 2018
29:notice:extract --->  Extracting libcxx
30:debug:extract setting option extract.cmd to /opt/local/bin/xz
31:debug:extract Executing org.macports.extract (libcxx)
32:info:extract --->  Extracting libcxxabi-5.0.1.src.tar.xz
33:debug:extract setting option extract.args to '/opt/local/var/macports/distfiles/llvm/libcxxabi-5.0.1.src.tar.xz'
34:debug:extract Environment:
35:debug:extract CC_PRINT_OPTIONS='YES'
36:debug:extract CC_PRINT_OPTIONS_FILE='/opt/local/var/macports/build/_opt_local_var_macports_sources_rsync.macports.org_macports_release_tarballs_ports_lang_libcxx/libcxx/work/.CC_PRINT_OPTIONS'
37:debug:extract CPATH='/opt/local/include'
38:debug:extract LIBRARY_PATH='/opt/local/lib'
39:debug:extract MACOSX_DEPLOYMENT_TARGET='10.5'
40:info:extract Executing:  cd "/opt/local/var/macports/build/_opt_local_var_macports_sources_rsync.macports.org_macports_release_tarballs_ports_lang_libcxx/libcxx/work" && /opt/local/bin/xz -dc '/opt/local/var/macports/distfiles/llvm/libcxxabi-5.0.1.src.tar.xz' | /usr/bin/gnutar --no-same-owner -xf -
41:debug:extract system:  cd "/opt/local/var/macports/build/_opt_local_var_macports_sources_rsync.macports.org_macports_release_tarballs_ports_lang_libcxx/libcxx/work" && /opt/local/bin/xz -dc '/opt/local/var/macports/distfiles/llvm/libcxxabi-5.0.1.src.tar.xz' | /usr/bin/gnutar --no-same-owner -xf -
42:debug:extract euid/egid changed to: 0/0
43:debug:extract chowned /opt/local/var/macports/build/_opt_local_var_macports_sources_rsync.macports.org_macports_release_tarballs_ports_lang_libcxx/libcxx/work to macports
44:debug:extract euid/egid changed to: 504/500
45:info:extract --->  Extracting libcxx-5.0.1.src.tar.xz
46:debug:extract setting option extract.args to '/opt/local/var/macports/distfiles/llvm/libcxx-5.0.1.src.tar.xz'
47:debug:extract Environment:
48:debug:extract CC_PRINT_OPTIONS='YES'
49:debug:extract CC_PRINT_OPTIONS_FILE='/opt/local/var/macports/build/_opt_local_var_macports_sources_rsync.macports.org_macports_release_tarballs_ports_lang_libcxx/libcxx/work/.CC_PRINT_OPTIONS'
50:debug:extract CPATH='/opt/local/include'
51:debug:extract LIBRARY_PATH='/opt/local/lib'
52:debug:extract MACOSX_DEPLOYMENT_TARGET='10.5'
53:info:extract Executing:  cd "/opt/local/var/macports/build/_opt_local_var_macports_sources_rsync.macports.org_macports_release_tarballs_ports_lang_libcxx/libcxx/work" && /opt/local/bin/xz -dc '/opt/local/var/macports/distfiles/llvm/libcxx-5.0.1.src.tar.xz' | /usr/bin/gnutar --no-same-owner -xf -
54:debug:extract system:  cd "/opt/local/var/macports/build/_opt_local_var_macports_sources_rsync.macports.org_macports_release_tarballs_ports_lang_libcxx/libcxx/work" && /opt/local/bin/xz -dc '/opt/local/var/macports/distfiles/llvm/libcxx-5.0.1.src.tar.xz' | /usr/bin/gnutar --no-same-owner -xf -
55:debug:extract euid/egid changed to: 0/0
56:debug:extract chowned /opt/local/var/macports/build/_opt_local_var_macports_sources_rsync.macports.org_macports_release_tarballs_ports_lang_libcxx/libcxx/work to macports
57:debug:extract euid/egid changed to: 504/500
58:debug:extract Executing proc-post-org.macports.extract-extract-0
59:debug:extract Privilege de-escalation not attempted as not running as root.
60:debug:patch patch phase started at Tue Jan 16 22:52:10 NZDT 2018
61:debug:patch Executing org.macports.patch (libcxx)
62:notice:patch --->  Applying patches to libcxx
63:info:patch --->  Applying 0001-Update-buildit-script-to-read-EXTRA_LDFLAGS-from-the.patch
64:debug:patch Environment:
65:debug:patch CC_PRINT_OPTIONS='YES'
66:debug:patch CC_PRINT_OPTIONS_FILE='/opt/local/var/macports/build/_opt_local_var_macports_sources_rsync.macports.org_macports_release_tarballs_ports_lang_libcxx/libcxx/work/.CC_PRINT_OPTIONS'
67:debug:patch CPATH='/opt/local/include'
68:debug:patch LIBRARY_PATH='/opt/local/lib'
69:debug:patch MACOSX_DEPLOYMENT_TARGET='10.5'
70:info:patch Executing:  cd "/opt/local/var/macports/build/_opt_local_var_macports_sources_rsync.macports.org_macports_release_tarballs_ports_lang_libcxx/libcxx/work" && /usr/bin/patch -p0 < '/opt/local/var/macports/sources/rsync.macports.org/macports/release/tarballs/ports/lang/libcxx/files/0001-Update-buildit-script-to-read-EXTRA_LDFLAGS-from-the.patch'
71:debug:patch system:  cd "/opt/local/var/macports/build/_opt_local_var_macports_sources_rsync.macports.org_macports_release_tarballs_ports_lang_libcxx/libcxx/work" && /usr/bin/patch -p0 < '/opt/local/var/macports/sources/rsync.macports.org/macports/release/tarballs/ports/lang/libcxx/files/0001-Update-buildit-script-to-read-EXTRA_LDFLAGS-from-the.patch'
72:info:patch patching file libcxxabi-5.0.1.src/lib/buildit
73:info:patch --->  Applying 0002-Define-_LIBCPP_BUILDING_LIBRARY-during-build-to-supp.patch
74:debug:patch Environment:
75:debug:patch CC_PRINT_OPTIONS='YES'
76:debug:patch CC_PRINT_OPTIONS_FILE='/opt/local/var/macports/build/_opt_local_var_macports_sources_rsync.macports.org_macports_release_tarballs_ports_lang_libcxx/libcxx/work/.CC_PRINT_OPTIONS'
77:debug:patch CPATH='/opt/local/include'
78:debug:patch LIBRARY_PATH='/opt/local/lib'
79:debug:patch MACOSX_DEPLOYMENT_TARGET='10.5'
80:info:patch Executing:  cd "/opt/local/var/macports/build/_opt_local_var_macports_sources_rsync.macports.org_macports_release_tarballs_ports_lang_libcxx/libcxx/work" && /usr/bin/patch -p0 < '/opt/local/var/macports/sources/rsync.macports.org/macports/release/tarballs/ports/lang/libcxx/files/0002-Define-_LIBCPP_BUILDING_LIBRARY-during-build-to-supp.patch'
81:debug:patch system:  cd "/opt/local/var/macports/build/_opt_local_var_macports_sources_rsync.macports.org_macports_release_tarballs_ports_lang_libcxx/libcxx/work" && /usr/bin/patch -p0 < '/opt/local/var/macports/sources/rsync.macports.org/macports/release/tarballs/ports/lang/libcxx/files/0002-Define-_LIBCPP_BUILDING_LIBRARY-during-build-to-supp.patch'
82:info:patch patching file libcxxabi-5.0.1.src/lib/buildit
83:info:patch --->  Applying 0003-buildit-Use-undefined-dynamic_lookup-when-linking.patch
84:debug:patch Environment:
85:debug:patch CC_PRINT_OPTIONS='YES'
86:debug:patch CC_PRINT_OPTIONS_FILE='/opt/local/var/macports/build/_opt_local_var_macports_sources_rsync.macports.org_macports_release_tarballs_ports_lang_libcxx/libcxx/work/.CC_PRINT_OPTIONS'
87:debug:patch CPATH='/opt/local/include'
88:debug:patch LIBRARY_PATH='/opt/local/lib'
89:debug:patch MACOSX_DEPLOYMENT_TARGET='10.5'
90:info:patch Executing:  cd "/opt/local/var/macports/build/_opt_local_var_macports_sources_rsync.macports.org_macports_release_tarballs_ports_lang_libcxx/libcxx/work" && /usr/bin/patch -p0 < '/opt/local/var/macports/sources/rsync.macports.org/macports/release/tarballs/ports/lang/libcxx/files/0003-buildit-Use-undefined-dynamic_lookup-when-linking.patch'
91:debug:patch system:  cd "/opt/local/var/macports/build/_opt_local_var_macports_sources_rsync.macports.org_macports_release_tarballs_ports_lang_libcxx/libcxx/work" && /usr/bin/patch -p0 < '/opt/local/var/macports/sources/rsync.macports.org/macports/release/tarballs/ports/lang/libcxx/files/0003-buildit-Use-undefined-dynamic_lookup-when-linking.patch'
92:info:patch patching file libcxxabi-5.0.1.src/lib/buildit
93:info:patch --->  Applying 3001-Fix-local-and-iterator-when-building-with-Lion-and-n.patch
94:debug:patch Environment:
95:debug:patch CC_PRINT_OPTIONS='YES'
96:debug:patch CC_PRINT_OPTIONS_FILE='/opt/local/var/macports/build/_opt_local_var_macports_sources_rsync.macports.org_macports_release_tarballs_ports_lang_libcxx/libcxx/work/.CC_PRINT_OPTIONS'
97:debug:patch CPATH='/opt/local/include'
98:debug:patch LIBRARY_PATH='/opt/local/lib'
99:debug:patch MACOSX_DEPLOYMENT_TARGET='10.5'
100:info:patch Executing:  cd "/opt/local/var/macports/build/_opt_local_var_macports_sources_rsync.macports.org_macports_release_tarballs_ports_lang_libcxx/libcxx/work" && /usr/bin/patch -p0 < '/opt/local/var/macports/sources/rsync.macports.org/macports/release/tarballs/ports/lang/libcxx/files/3001-Fix-local-and-iterator-when-building-with-Lion-and-n.patch'
101:debug:patch system:  cd "/opt/local/var/macports/build/_opt_local_var_macports_sources_rsync.macports.org_macports_release_tarballs_ports_lang_libcxx/libcxx/work" && /usr/bin/patch -p0 < '/opt/local/var/macports/sources/rsync.macports.org/macports/release/tarballs/ports/lang/libcxx/files/3001-Fix-local-and-iterator-when-building-with-Lion-and-n.patch'
102:info:patch patching file libcxx-5.0.1.src/include/iterator
103:info:patch patching file libcxx-5.0.1.src/include/locale
104:info:patch --->  Applying 3002-Fix-missing-long-long-math-prototypes-when-using-the.patch
105:debug:patch Environment:
106:debug:patch CC_PRINT_OPTIONS='YES'
107:debug:patch CC_PRINT_OPTIONS_FILE='/opt/local/var/macports/build/_opt_local_var_macports_sources_rsync.macports.org_macports_release_tarballs_ports_lang_libcxx/libcxx/work/.CC_PRINT_OPTIONS'
108:debug:patch CPATH='/opt/local/include'
109:debug:patch LIBRARY_PATH='/opt/local/lib'
110:debug:patch MACOSX_DEPLOYMENT_TARGET='10.5'
111:info:patch Executing:  cd "/opt/local/var/macports/build/_opt_local_var_macports_sources_rsync.macports.org_macports_release_tarballs_ports_lang_libcxx/libcxx/work" && /usr/bin/patch -p0 < '/opt/local/var/macports/sources/rsync.macports.org/macports/release/tarballs/ports/lang/libcxx/files/3002-Fix-missing-long-long-math-prototypes-when-using-the.patch'
112:debug:patch system:  cd "/opt/local/var/macports/build/_opt_local_var_macports_sources_rsync.macports.org_macports_release_tarballs_ports_lang_libcxx/libcxx/work" && /usr/bin/patch -p0 < '/opt/local/var/macports/sources/rsync.macports.org/macports/release/tarballs/ports/lang/libcxx/files/3002-Fix-missing-long-long-math-prototypes-when-using-the.patch'
113:info:patch patching file libcxx-5.0.1.src/include/math.h
114:info:patch --->  Applying 3003-implement-atomic-using-mutex-lock_guard-for-64b-ops-.patch
115:debug:patch Environment:
116:debug:patch CC_PRINT_OPTIONS='YES'
117:debug:patch CC_PRINT_OPTIONS_FILE='/opt/local/var/macports/build/_opt_local_var_macports_sources_rsync.macports.org_macports_release_tarballs_ports_lang_libcxx/libcxx/work/.CC_PRINT_OPTIONS'
118:debug:patch CPATH='/opt/local/include'
119:debug:patch LIBRARY_PATH='/opt/local/lib'
120:debug:patch MACOSX_DEPLOYMENT_TARGET='10.5'
121:info:patch Executing:  cd "/opt/local/var/macports/build/_opt_local_var_macports_sources_rsync.macports.org_macports_release_tarballs_ports_lang_libcxx/libcxx/work" && /usr/bin/patch -p0 < '/opt/local/var/macports/sources/rsync.macports.org/macports/release/tarballs/ports/lang/libcxx/files/3003-implement-atomic-using-mutex-lock_guard-for-64b-ops-.patch'
122:debug:patch system:  cd "/opt/local/var/macports/build/_opt_local_var_macports_sources_rsync.macports.org_macports_release_tarballs_ports_lang_libcxx/libcxx/work" && /usr/bin/patch -p0 < '/opt/local/var/macports/sources/rsync.macports.org/macports/release/tarballs/ports/lang/libcxx/files/3003-implement-atomic-using-mutex-lock_guard-for-64b-ops-.patch'
123:info:patch patching file libcxx-5.0.1.src/include/__atomic_locked
124:info:patch patching file libcxx-5.0.1.src/include/atomic
125:info:patch --->  Applying 3004-Revert-Remove-the-buildit-and-testit-scripts-they-ha.patch
126:debug:patch Environment:
127:debug:patch CC_PRINT_OPTIONS='YES'
128:debug:patch CC_PRINT_OPTIONS_FILE='/opt/local/var/macports/build/_opt_local_var_macports_sources_rsync.macports.org_macports_release_tarballs_ports_lang_libcxx/libcxx/work/.CC_PRINT_OPTIONS'
129:debug:patch CPATH='/opt/local/include'
130:debug:patch LIBRARY_PATH='/opt/local/lib'
131:debug:patch MACOSX_DEPLOYMENT_TARGET='10.5'
132:info:patch Executing:  cd "/opt/local/var/macports/build/_opt_local_var_macports_sources_rsync.macports.org_macports_release_tarballs_ports_lang_libcxx/libcxx/work" && /usr/bin/patch -p0 < '/opt/local/var/macports/sources/rsync.macports.org/macports/release/tarballs/ports/lang/libcxx/files/3004-Revert-Remove-the-buildit-and-testit-scripts-they-ha.patch'
133:debug:patch system:  cd "/opt/local/var/macports/build/_opt_local_var_macports_sources_rsync.macports.org_macports_release_tarballs_ports_lang_libcxx/libcxx/work" && /usr/bin/patch -p0 < '/opt/local/var/macports/sources/rsync.macports.org/macports/release/tarballs/ports/lang/libcxx/files/3004-Revert-Remove-the-buildit-and-testit-scripts-they-ha.patch'
134:info:patch patching file libcxx-5.0.1.src/lib/buildit
135:info:patch patching file libcxx-5.0.1.src/test/testit
136:info:patch --->  Applying 3005-buildit-build-fix-for-Leopard.patch
137:debug:patch Environment:
138:debug:patch CC_PRINT_OPTIONS='YES'
139:debug:patch CC_PRINT_OPTIONS_FILE='/opt/local/var/macports/build/_opt_local_var_macports_sources_rsync.macports.org_macports_release_tarballs_ports_lang_libcxx/libcxx/work/.CC_PRINT_OPTIONS'
140:debug:patch CPATH='/opt/local/include'
141:debug:patch LIBRARY_PATH='/opt/local/lib'
142:debug:patch MACOSX_DEPLOYMENT_TARGET='10.5'
143:info:patch Executing:  cd "/opt/local/var/macports/build/_opt_local_var_macports_sources_rsync.macports.org_macports_release_tarballs_ports_lang_libcxx/libcxx/work" && /usr/bin/patch -p0 < '/opt/local/var/macports/sources/rsync.macports.org/macports/release/tarballs/ports/lang/libcxx/files/3005-buildit-build-fix-for-Leopard.patch'
144:debug:patch system:  cd "/opt/local/var/macports/build/_opt_local_var_macports_sources_rsync.macports.org_macports_release_tarballs_ports_lang_libcxx/libcxx/work" && /usr/bin/patch -p0 < '/opt/local/var/macports/sources/rsync.macports.org/macports/release/tarballs/ports/lang/libcxx/files/3005-buildit-build-fix-for-Leopard.patch'
145:info:patch patching file libcxx-5.0.1.src/lib/buildit
146:info:patch --->  Applying 3006-buildit-Set-compatibility-version-to-RC_ProjectSourc.patch
147:debug:patch Environment:
148:debug:patch CC_PRINT_OPTIONS='YES'
149:debug:patch CC_PRINT_OPTIONS_FILE='/opt/local/var/macports/build/_opt_local_var_macports_sources_rsync.macports.org_macports_release_tarballs_ports_lang_libcxx/libcxx/work/.CC_PRINT_OPTIONS'
150:debug:patch CPATH='/opt/local/include'
151:debug:patch LIBRARY_PATH='/opt/local/lib'
152:debug:patch MACOSX_DEPLOYMENT_TARGET='10.5'
153:info:patch Executing:  cd "/opt/local/var/macports/build/_opt_local_var_macports_sources_rsync.macports.org_macports_release_tarballs_ports_lang_libcxx/libcxx/work" && /usr/bin/patch -p0 < '/opt/local/var/macports/sources/rsync.macports.org/macports/release/tarballs/ports/lang/libcxx/files/3006-buildit-Set-compatibility-version-to-RC_ProjectSourc.patch'
154:debug:patch system:  cd "/opt/local/var/macports/build/_opt_local_var_macports_sources_rsync.macports.org_macports_release_tarballs_ports_lang_libcxx/libcxx/work" && /usr/bin/patch -p0 < '/opt/local/var/macports/sources/rsync.macports.org/macports/release/tarballs/ports/lang/libcxx/files/3006-buildit-Set-compatibility-version-to-RC_ProjectSourc.patch'
155:info:patch patching file libcxx-5.0.1.src/lib/buildit
156:info:patch --->  Applying 3007-MacPorts-Use-LIBCXXABI_PATH-for-path-to-build-time-l.patch
157:debug:patch Environment:
158:debug:patch CC_PRINT_OPTIONS='YES'
159:debug:patch CC_PRINT_OPTIONS_FILE='/opt/local/var/macports/build/_opt_local_var_macports_sources_rsync.macports.org_macports_release_tarballs_ports_lang_libcxx/libcxx/work/.CC_PRINT_OPTIONS'
160:debug:patch CPATH='/opt/local/include'
161:debug:patch LIBRARY_PATH='/opt/local/lib'
162:debug:patch MACOSX_DEPLOYMENT_TARGET='10.5'
163:info:patch Executing:  cd "/opt/local/var/macports/build/_opt_local_var_macports_sources_rsync.macports.org_macports_release_tarballs_ports_lang_libcxx/libcxx/work" && /usr/bin/patch -p0 < '/opt/local/var/macports/sources/rsync.macports.org/macports/release/tarballs/ports/lang/libcxx/files/3007-MacPorts-Use-LIBCXXABI_PATH-for-path-to-build-time-l.patch'
164:debug:patch system:  cd "/opt/local/var/macports/build/_opt_local_var_macports_sources_rsync.macports.org_macports_release_tarballs_ports_lang_libcxx/libcxx/work" && /usr/bin/patch -p0 < '/opt/local/var/macports/sources/rsync.macports.org/macports/release/tarballs/ports/lang/libcxx/files/3007-MacPorts-Use-LIBCXXABI_PATH-for-path-to-build-time-l.patch'
165:info:patch patching file libcxx-5.0.1.src/lib/buildit
166:info:patch --->  Applying 3008-buildit-Fix-CFLAGS-for-Leopard-and-Snow-Leopard-to-i.patch
167:debug:patch Environment:
168:debug:patch CC_PRINT_OPTIONS='YES'
169:debug:patch CC_PRINT_OPTIONS_FILE='/opt/local/var/macports/build/_opt_local_var_macports_sources_rsync.macports.org_macports_release_tarballs_ports_lang_libcxx/libcxx/work/.CC_PRINT_OPTIONS'
170:debug:patch CPATH='/opt/local/include'
171:debug:patch LIBRARY_PATH='/opt/local/lib'
172:debug:patch MACOSX_DEPLOYMENT_TARGET='10.5'
173:info:patch Executing:  cd "/opt/local/var/macports/build/_opt_local_var_macports_sources_rsync.macports.org_macports_release_tarballs_ports_lang_libcxx/libcxx/work" && /usr/bin/patch -p0 < '/opt/local/var/macports/sources/rsync.macports.org/macports/release/tarballs/ports/lang/libcxx/files/3008-buildit-Fix-CFLAGS-for-Leopard-and-Snow-Leopard-to-i.patch'
174:debug:patch system:  cd "/opt/local/var/macports/build/_opt_local_var_macports_sources_rsync.macports.org_macports_release_tarballs_ports_lang_libcxx/libcxx/work" && /usr/bin/patch -p0 < '/opt/local/var/macports/sources/rsync.macports.org/macports/release/tarballs/ports/lang/libcxx/files/3008-buildit-Fix-CFLAGS-for-Leopard-and-Snow-Leopard-to-i.patch'
175:info:patch patching file libcxx-5.0.1.src/lib/buildit
176:debug:patch Executing proc-post-org.macports.patch-patch-0
177:debug:patch system: chmod 755 /opt/local/var/macports/build/_opt_local_var_macports_sources_rsync.macports.org_macports_release_tarballs_ports_lang_libcxx/libcxx/work/libcxx-5.0.1.src/lib/buildit
178:debug:patch Privilege de-escalation not attempted as not running as root.
179:debug:configure configure phase started at Tue Jan 16 22:52:11 NZDT 2018
180:notice:configure --->  Configuring libcxx
181:warn:configure All compilers are either blacklisted or unavailable; defaulting to first fallback option
182:debug:configure Preferred compilers: gcc-4.2 apple-gcc-4.2 gcc-4.0 macports-clang-3.4 macports-clang-3.3
183:debug:configure Using compiler 'Xcode GCC 4.2'
184:debug:configure Executing org.macports.configure (libcxx)
185:debug:configure Privilege de-escalation not attempted as not running as root.
186:debug:build build phase started at Tue Jan 16 22:52:11 NZDT 2018
187:notice:build --->  Building libcxx
188:debug:build Executing org.macports.build (libcxx)
189:debug:build Environment:
190:debug:build CC='/usr/bin/gcc-4.2'
191:debug:build CC_PRINT_OPTIONS='YES'
192:debug:build CC_PRINT_OPTIONS_FILE='/opt/local/var/macports/build/_opt_local_var_macports_sources_rsync.macports.org_macports_release_tarballs_ports_lang_libcxx/libcxx/work/.CC_PRINT_OPTIONS'
193:debug:build CPATH='/opt/local/include'
194:debug:build CXX='/usr/bin/g++-4.2'
195:debug:build LIBRARY_PATH='/opt/local/lib'
196:debug:build MACOSX_DEPLOYMENT_TARGET='10.5'
197:debug:build RC_CFLAGS='-arch x86_64 -arch i386 -arch ppc -I/opt/local/var/macports/build/_opt_local_var_macports_sources_rsync.macports.org_macports_release_tarballs_ports_lang_libcxx/libcxx/work/libcxxabi-5.0.1.src/include -I/opt/local/var/macports/build/_opt_local_var_macports_sources_rsync.macports.org_macports_release_tarballs_ports_lang_libcxx/libcxx/work/libcxx-5.0.1.src/include -Os'
198:debug:build RC_ProjectSourceVersion='5.0.1'
199:debug:build RC_XBS='1'
200:debug:build TRIPLE='-apple-darwin9'
201:info:build Executing:  cd "/opt/local/var/macports/build/_opt_local_var_macports_sources_rsync.macports.org_macports_release_tarballs_ports_lang_libcxx/libcxx/work/build" && /usr/bin/make -w all LIBCXXABI_PATH=/opt/local/var/macports/build/_opt_local_var_macports_sources_rsync.macports.org_macports_release_tarballs_ports_lang_libcxx/libcxx/work/libcxxabi-5.0.1.src LIBCXX_PATH=/opt/local/var/macports/build/_opt_local_var_macports_sources_rsync.macports.org_macports_release_tarballs_ports_lang_libcxx/libcxx/work/libcxx-5.0.1.src LIBCXXABI_DYLIB_PATH=/opt/local/var/macports/build/_opt_local_var_macports_sources_rsync.macports.org_macports_release_tarballs_ports_lang_libcxx/libcxx/work/build/libc++abi.dylib
202:debug:build system:  cd "/opt/local/var/macports/build/_opt_local_var_macports_sources_rsync.macports.org_macports_release_tarballs_ports_lang_libcxx/libcxx/work/build" && /usr/bin/make -w all LIBCXXABI_PATH=/opt/local/var/macports/build/_opt_local_var_macports_sources_rsync.macports.org_macports_release_tarballs_ports_lang_libcxx/libcxx/work/libcxxabi-5.0.1.src LIBCXX_PATH=/opt/local/var/macports/build/_opt_local_var_macports_sources_rsync.macports.org_macports_release_tarballs_ports_lang_libcxx/libcxx/work/libcxx-5.0.1.src LIBCXXABI_DYLIB_PATH=/opt/local/var/macports/build/_opt_local_var_macports_sources_rsync.macports.org_macports_release_tarballs_ports_lang_libcxx/libcxx/work/build/libc++abi.dylib
203:info:build make: Entering directory `/opt/local/var/macports/build/_opt_local_var_macports_sources_rsync.macports.org_macports_release_tarballs_ports_lang_libcxx/libcxx/work/build'
204:info:build cd /opt/local/var/macports/build/_opt_local_var_macports_sources_rsync.macports.org_macports_release_tarballs_ports_lang_libcxx/libcxx/work/libcxxabi-5.0.1.src/lib && ./buildit
205:info:build + for FILE in '../src/*.cpp'
206:info:build + /usr/bin/g++-4.2 -c -g -O3 -arch x86_64 -arch i386 -arch ppc -I/opt/local/var/macports/build/_opt_local_var_macports_sources_rsync.macports.org_macports_release_tarballs_ports_lang_libcxx/libcxx/work/libcxxabi-5.0.1.src/include -I/opt/local/var/macports/build/_opt_local_var_macports_sources_rsync.macports.org_macports_release_tarballs_ports_lang_libcxx/libcxx/work/libcxx-5.0.1.src/include -Os -std=c++11 -stdlib=libc++ -fstrict-aliasing -Wstrict-aliasing=2 -Wsign-conversion -Wshadow -Wconversion -Wunused-variable -Wmissing-field-initializers -Wchar-subscripts -Wmismatched-tags -Wmissing-braces -Wshorten-64-to-32 -Wsign-compare -Wstrict-aliasing=2 -Wstrict-overflow=4 -Wunused-parameter -Wnewline-eof -D_LIBCPP_BUILDING_LIBRARY -I../include ../src/abort_message.cpp
207:info:build cc1plus: error: unrecognized command line option "-Wsign-conversion"
208:info:build cc1plus: error: unrecognized command line option "-Wmismatched-tags"
209:info:build cc1plus: error: unrecognized command line option "-std=c++11"
210:info:build cc1plus: error: unrecognized command line option "-stdlib=libc++"
211:info:build cc1plus: error: unrecognized command line option "-Wsign-conversion"
212:info:build cc1plus: error: unrecognized command line option "-Wmismatched-tags"
213:info:build cc1plus: error: unrecognized command line option "-std=c++11"
214:info:build cc1plus: error: unrecognized command line option "-stdlib=libc++"
215:info:build cc1plus: error: unrecognized command line option "-Wsign-conversion"
216:info:build cc1plus: error: unrecognized command line option "-Wmismatched-tags"
217:info:build cc1plus: error: unrecognized command line option "-std=c++11"
218:info:build cc1plus: error: unrecognized command line option "-stdlib=libc++"
219:info:build lipo: can't figure out the architecture type of: /opt/local/var/macports/build/_opt_local_var_macports_sources_rsync.macports.org_macports_release_tarballs_ports_lang_libcxx/libcxx/work/.tmp/ccU1mFJh.out
220:info:build make: *** [/opt/local/var/macports/build/_opt_local_var_macports_sources_rsync.macports.org_macports_release_tarballs_ports_lang_libcxx/libcxx/work/libcxxabi-5.0.1.src/lib/libc++abi.dylib] Error 1
221:info:build make: Leaving directory `/opt/local/var/macports/build/_opt_local_var_macports_sources_rsync.macports.org_macports_release_tarballs_ports_lang_libcxx/libcxx/work/build'
222:info:build Command failed:  cd "/opt/local/var/macports/build/_opt_local_var_macports_sources_rsync.macports.org_macports_release_tarballs_ports_lang_libcxx/libcxx/work/build" && /usr/bin/make -w all LIBCXXABI_PATH=/opt/local/var/macports/build/_opt_local_var_macports_sources_rsync.macports.org_macports_release_tarballs_ports_lang_libcxx/libcxx/work/libcxxabi-5.0.1.src LIBCXX_PATH=/opt/local/var/macports/build/_opt_local_var_macports_sources_rsync.macports.org_macports_release_tarballs_ports_lang_libcxx/libcxx/work/libcxx-5.0.1.src LIBCXXABI_DYLIB_PATH=/opt/local/var/macports/build/_opt_local_var_macports_sources_rsync.macports.org_macports_release_tarballs_ports_lang_libcxx/libcxx/work/build/libc++abi.dylib
223:info:build Exit code: 2
224:error:build Failed to build libcxx: command execution failed
225:debug:build Error code: CHILDSTATUS 60878 2
226:debug:build Backtrace: command execution failed
227:debug:build     while executing
228:debug:build "system {*}$notty {*}$nice $fullcmdstring"
229:debug:build     invoked from within
230:debug:build "command_exec build"
231:debug:build     (procedure "portbuild::build_main" line 8)
232:debug:build     invoked from within
233:debug:build "$procedure $targetname"
234:error:build See /opt/local/var/macports/logs/_opt_local_var_macports_sources_rsync.macports.org_macports_release_tarballs_ports_lang_libcxx/libcxx/main.log for details.