Ticket #55709: main.log

File main.log, 26.1 KB (added by potmj, 3 years ago)

Leopard port -v upgrade libcxx

Line 
1version:1
2:msg:main --->  Computing dependencies for libcxx:info:main .:debug:main libcxx has no conflicts
3:debug:main Searching for dependency: xz
4:debug:main Found Dependency: receipt exists for xz
5:debug:main Executing org.macports.main (libcxx)
6:debug:main dropping privileges: euid changed to 504, egid changed to 500.
7:debug:archivefetch archivefetch phase started at Wed Jan 17 23:24:06 NZDT 2018
8:warn:archivefetch Your DNS servers incorrectly claim to know the address of nonexistent hosts. This may cause checksum mismatches for some ports. See this page for more information: <https://trac.macports.org/wiki/MisbehavingServers>
9:debug:archivefetch Executing org.macports.archivefetch (libcxx)
10:debug:archivefetch Privilege de-escalation not attempted as not running as root.
11:debug:fetch fetch phase started at Wed Jan 17 23:24:06 NZDT 2018
12:notice:fetch --->  Fetching distfiles for libcxx
13:debug:fetch Executing org.macports.fetch (libcxx)
14:debug:fetch Privilege de-escalation not attempted as not running as root.
15:debug:checksum checksum phase started at Wed Jan 17 23:24:06 NZDT 2018
16:notice:checksum --->  Verifying checksums for libcxx
17:debug:checksum Executing org.macports.checksum (libcxx)
18:info:checksum --->  Checksumming libcxxabi-5.0.1.src.tar.xz
19:debug:checksum Calculated (rmd160) is 93b74a0644c1afd565938fba5e21b200b206c72a
20:debug:checksum Correct (rmd160) checksum for libcxxabi-5.0.1.src.tar.xz
21:debug:checksum Calculated (sha256) is 5a25152cb7f21e3c223ad36a1022faeb8a5ac27c9e75936a5ae2d3ac48f6e854
22:debug:checksum Correct (sha256) checksum for libcxxabi-5.0.1.src.tar.xz
23:info:checksum --->  Checksumming libcxx-5.0.1.src.tar.xz
24:debug:checksum Calculated (rmd160) is 1e5a22e62515382488f232039e31f0b12c08ca4f
25:debug:checksum Correct (rmd160) checksum for libcxx-5.0.1.src.tar.xz
26:debug:checksum Calculated (sha256) is fa8f99dd2bde109daa3276d529851a3bce5718d46ce1c5d0806f46caa3e57c00
27:debug:checksum Correct (sha256) checksum for libcxx-5.0.1.src.tar.xz
28:debug:checksum Privilege de-escalation not attempted as not running as root.
29:debug:extract extract phase started at Wed Jan 17 23:24:06 NZDT 2018
30:notice:extract --->  Extracting libcxx
31:debug:extract setting option extract.cmd to /opt/local/bin/xz
32:debug:extract Executing org.macports.extract (libcxx)
33:info:extract --->  Extracting libcxxabi-5.0.1.src.tar.xz
34:debug:extract setting option extract.args to '/opt/local/var/macports/distfiles/llvm/libcxxabi-5.0.1.src.tar.xz'
35:debug:extract Environment:
36:debug:extract CC_PRINT_OPTIONS='YES'
37:debug:extract CC_PRINT_OPTIONS_FILE='/opt/local/var/macports/build/_opt_local_var_macports_sources_rsync.macports.org_macports_release_tarballs_ports_lang_libcxx/libcxx/work/.CC_PRINT_OPTIONS'
38:debug:extract CPATH='/opt/local/include'
39:debug:extract LIBRARY_PATH='/opt/local/lib'
40:debug:extract MACOSX_DEPLOYMENT_TARGET='10.5'
41:info:extract Executing:  cd "/opt/local/var/macports/build/_opt_local_var_macports_sources_rsync.macports.org_macports_release_tarballs_ports_lang_libcxx/libcxx/work" && /opt/local/bin/xz -dc '/opt/local/var/macports/distfiles/llvm/libcxxabi-5.0.1.src.tar.xz' | /usr/bin/gnutar --no-same-owner -xf -
42:debug:extract system:  cd "/opt/local/var/macports/build/_opt_local_var_macports_sources_rsync.macports.org_macports_release_tarballs_ports_lang_libcxx/libcxx/work" && /opt/local/bin/xz -dc '/opt/local/var/macports/distfiles/llvm/libcxxabi-5.0.1.src.tar.xz' | /usr/bin/gnutar --no-same-owner -xf -
43:debug:extract euid/egid changed to: 0/0
44:debug:extract chowned /opt/local/var/macports/build/_opt_local_var_macports_sources_rsync.macports.org_macports_release_tarballs_ports_lang_libcxx/libcxx/work to macports
45:debug:extract euid/egid changed to: 504/500
46:info:extract --->  Extracting libcxx-5.0.1.src.tar.xz
47:debug:extract setting option extract.args to '/opt/local/var/macports/distfiles/llvm/libcxx-5.0.1.src.tar.xz'
48:debug:extract Environment:
49:debug:extract CC_PRINT_OPTIONS='YES'
50:debug:extract CC_PRINT_OPTIONS_FILE='/opt/local/var/macports/build/_opt_local_var_macports_sources_rsync.macports.org_macports_release_tarballs_ports_lang_libcxx/libcxx/work/.CC_PRINT_OPTIONS'
51:debug:extract CPATH='/opt/local/include'
52:debug:extract LIBRARY_PATH='/opt/local/lib'
53:debug:extract MACOSX_DEPLOYMENT_TARGET='10.5'
54:info:extract Executing:  cd "/opt/local/var/macports/build/_opt_local_var_macports_sources_rsync.macports.org_macports_release_tarballs_ports_lang_libcxx/libcxx/work" && /opt/local/bin/xz -dc '/opt/local/var/macports/distfiles/llvm/libcxx-5.0.1.src.tar.xz' | /usr/bin/gnutar --no-same-owner -xf -
55:debug:extract system:  cd "/opt/local/var/macports/build/_opt_local_var_macports_sources_rsync.macports.org_macports_release_tarballs_ports_lang_libcxx/libcxx/work" && /opt/local/bin/xz -dc '/opt/local/var/macports/distfiles/llvm/libcxx-5.0.1.src.tar.xz' | /usr/bin/gnutar --no-same-owner -xf -
56:debug:extract euid/egid changed to: 0/0
57:debug:extract chowned /opt/local/var/macports/build/_opt_local_var_macports_sources_rsync.macports.org_macports_release_tarballs_ports_lang_libcxx/libcxx/work to macports
58:debug:extract euid/egid changed to: 504/500
59:debug:extract Executing proc-post-org.macports.extract-extract-0
60:debug:extract Privilege de-escalation not attempted as not running as root.
61:debug:patch patch phase started at Wed Jan 17 23:24:13 NZDT 2018
62:debug:patch Executing org.macports.patch (libcxx)
63:notice:patch --->  Applying patches to libcxx
64:info:patch --->  Applying 0001-Update-buildit-script-to-read-EXTRA_LDFLAGS-from-the.patch
65:debug:patch Environment:
66:debug:patch CC_PRINT_OPTIONS='YES'
67:debug:patch CC_PRINT_OPTIONS_FILE='/opt/local/var/macports/build/_opt_local_var_macports_sources_rsync.macports.org_macports_release_tarballs_ports_lang_libcxx/libcxx/work/.CC_PRINT_OPTIONS'
68:debug:patch CPATH='/opt/local/include'
69:debug:patch LIBRARY_PATH='/opt/local/lib'
70:debug:patch MACOSX_DEPLOYMENT_TARGET='10.5'
71:info:patch Executing:  cd "/opt/local/var/macports/build/_opt_local_var_macports_sources_rsync.macports.org_macports_release_tarballs_ports_lang_libcxx/libcxx/work" && /usr/bin/patch -p0 < '/opt/local/var/macports/sources/rsync.macports.org/macports/release/tarballs/ports/lang/libcxx/files/0001-Update-buildit-script-to-read-EXTRA_LDFLAGS-from-the.patch'
72:debug:patch system:  cd "/opt/local/var/macports/build/_opt_local_var_macports_sources_rsync.macports.org_macports_release_tarballs_ports_lang_libcxx/libcxx/work" && /usr/bin/patch -p0 < '/opt/local/var/macports/sources/rsync.macports.org/macports/release/tarballs/ports/lang/libcxx/files/0001-Update-buildit-script-to-read-EXTRA_LDFLAGS-from-the.patch'
73:info:patch patching file libcxxabi-5.0.1.src/lib/buildit
74:info:patch --->  Applying 0002-Define-_LIBCPP_BUILDING_LIBRARY-during-build-to-supp.patch
75:debug:patch Environment:
76:debug:patch CC_PRINT_OPTIONS='YES'
77:debug:patch CC_PRINT_OPTIONS_FILE='/opt/local/var/macports/build/_opt_local_var_macports_sources_rsync.macports.org_macports_release_tarballs_ports_lang_libcxx/libcxx/work/.CC_PRINT_OPTIONS'
78:debug:patch CPATH='/opt/local/include'
79:debug:patch LIBRARY_PATH='/opt/local/lib'
80:debug:patch MACOSX_DEPLOYMENT_TARGET='10.5'
81:info:patch Executing:  cd "/opt/local/var/macports/build/_opt_local_var_macports_sources_rsync.macports.org_macports_release_tarballs_ports_lang_libcxx/libcxx/work" && /usr/bin/patch -p0 < '/opt/local/var/macports/sources/rsync.macports.org/macports/release/tarballs/ports/lang/libcxx/files/0002-Define-_LIBCPP_BUILDING_LIBRARY-during-build-to-supp.patch'
82:debug:patch system:  cd "/opt/local/var/macports/build/_opt_local_var_macports_sources_rsync.macports.org_macports_release_tarballs_ports_lang_libcxx/libcxx/work" && /usr/bin/patch -p0 < '/opt/local/var/macports/sources/rsync.macports.org/macports/release/tarballs/ports/lang/libcxx/files/0002-Define-_LIBCPP_BUILDING_LIBRARY-during-build-to-supp.patch'
83:info:patch patching file libcxxabi-5.0.1.src/lib/buildit
84:info:patch --->  Applying 0003-buildit-Use-undefined-dynamic_lookup-when-linking.patch
85:debug:patch Environment:
86:debug:patch CC_PRINT_OPTIONS='YES'
87:debug:patch CC_PRINT_OPTIONS_FILE='/opt/local/var/macports/build/_opt_local_var_macports_sources_rsync.macports.org_macports_release_tarballs_ports_lang_libcxx/libcxx/work/.CC_PRINT_OPTIONS'
88:debug:patch CPATH='/opt/local/include'
89:debug:patch LIBRARY_PATH='/opt/local/lib'
90:debug:patch MACOSX_DEPLOYMENT_TARGET='10.5'
91:info:patch Executing:  cd "/opt/local/var/macports/build/_opt_local_var_macports_sources_rsync.macports.org_macports_release_tarballs_ports_lang_libcxx/libcxx/work" && /usr/bin/patch -p0 < '/opt/local/var/macports/sources/rsync.macports.org/macports/release/tarballs/ports/lang/libcxx/files/0003-buildit-Use-undefined-dynamic_lookup-when-linking.patch'
92:debug:patch system:  cd "/opt/local/var/macports/build/_opt_local_var_macports_sources_rsync.macports.org_macports_release_tarballs_ports_lang_libcxx/libcxx/work" && /usr/bin/patch -p0 < '/opt/local/var/macports/sources/rsync.macports.org/macports/release/tarballs/ports/lang/libcxx/files/0003-buildit-Use-undefined-dynamic_lookup-when-linking.patch'
93:info:patch patching file libcxxabi-5.0.1.src/lib/buildit
94:info:patch --->  Applying 3001-Fix-local-and-iterator-when-building-with-Lion-and-n.patch
95:debug:patch Environment:
96:debug:patch CC_PRINT_OPTIONS='YES'
97:debug:patch CC_PRINT_OPTIONS_FILE='/opt/local/var/macports/build/_opt_local_var_macports_sources_rsync.macports.org_macports_release_tarballs_ports_lang_libcxx/libcxx/work/.CC_PRINT_OPTIONS'
98:debug:patch CPATH='/opt/local/include'
99:debug:patch LIBRARY_PATH='/opt/local/lib'
100:debug:patch MACOSX_DEPLOYMENT_TARGET='10.5'
101:info:patch Executing:  cd "/opt/local/var/macports/build/_opt_local_var_macports_sources_rsync.macports.org_macports_release_tarballs_ports_lang_libcxx/libcxx/work" && /usr/bin/patch -p0 < '/opt/local/var/macports/sources/rsync.macports.org/macports/release/tarballs/ports/lang/libcxx/files/3001-Fix-local-and-iterator-when-building-with-Lion-and-n.patch'
102:debug:patch system:  cd "/opt/local/var/macports/build/_opt_local_var_macports_sources_rsync.macports.org_macports_release_tarballs_ports_lang_libcxx/libcxx/work" && /usr/bin/patch -p0 < '/opt/local/var/macports/sources/rsync.macports.org/macports/release/tarballs/ports/lang/libcxx/files/3001-Fix-local-and-iterator-when-building-with-Lion-and-n.patch'
103:info:patch patching file libcxx-5.0.1.src/include/iterator
104:info:patch patching file libcxx-5.0.1.src/include/locale
105:info:patch --->  Applying 3002-Fix-missing-long-long-math-prototypes-when-using-the.patch
106:debug:patch Environment:
107:debug:patch CC_PRINT_OPTIONS='YES'
108:debug:patch CC_PRINT_OPTIONS_FILE='/opt/local/var/macports/build/_opt_local_var_macports_sources_rsync.macports.org_macports_release_tarballs_ports_lang_libcxx/libcxx/work/.CC_PRINT_OPTIONS'
109:debug:patch CPATH='/opt/local/include'
110:debug:patch LIBRARY_PATH='/opt/local/lib'
111:debug:patch MACOSX_DEPLOYMENT_TARGET='10.5'
112:info:patch Executing:  cd "/opt/local/var/macports/build/_opt_local_var_macports_sources_rsync.macports.org_macports_release_tarballs_ports_lang_libcxx/libcxx/work" && /usr/bin/patch -p0 < '/opt/local/var/macports/sources/rsync.macports.org/macports/release/tarballs/ports/lang/libcxx/files/3002-Fix-missing-long-long-math-prototypes-when-using-the.patch'
113:debug:patch system:  cd "/opt/local/var/macports/build/_opt_local_var_macports_sources_rsync.macports.org_macports_release_tarballs_ports_lang_libcxx/libcxx/work" && /usr/bin/patch -p0 < '/opt/local/var/macports/sources/rsync.macports.org/macports/release/tarballs/ports/lang/libcxx/files/3002-Fix-missing-long-long-math-prototypes-when-using-the.patch'
114:info:patch patching file libcxx-5.0.1.src/include/math.h
115:info:patch --->  Applying 3003-implement-atomic-using-mutex-lock_guard-for-64b-ops-.patch
116:debug:patch Environment:
117:debug:patch CC_PRINT_OPTIONS='YES'
118:debug:patch CC_PRINT_OPTIONS_FILE='/opt/local/var/macports/build/_opt_local_var_macports_sources_rsync.macports.org_macports_release_tarballs_ports_lang_libcxx/libcxx/work/.CC_PRINT_OPTIONS'
119:debug:patch CPATH='/opt/local/include'
120:debug:patch LIBRARY_PATH='/opt/local/lib'
121:debug:patch MACOSX_DEPLOYMENT_TARGET='10.5'
122:info:patch Executing:  cd "/opt/local/var/macports/build/_opt_local_var_macports_sources_rsync.macports.org_macports_release_tarballs_ports_lang_libcxx/libcxx/work" && /usr/bin/patch -p0 < '/opt/local/var/macports/sources/rsync.macports.org/macports/release/tarballs/ports/lang/libcxx/files/3003-implement-atomic-using-mutex-lock_guard-for-64b-ops-.patch'
123:debug:patch system:  cd "/opt/local/var/macports/build/_opt_local_var_macports_sources_rsync.macports.org_macports_release_tarballs_ports_lang_libcxx/libcxx/work" && /usr/bin/patch -p0 < '/opt/local/var/macports/sources/rsync.macports.org/macports/release/tarballs/ports/lang/libcxx/files/3003-implement-atomic-using-mutex-lock_guard-for-64b-ops-.patch'
124:info:patch patching file libcxx-5.0.1.src/include/__atomic_locked
125:info:patch patching file libcxx-5.0.1.src/include/atomic
126:info:patch --->  Applying 3004-Revert-Remove-the-buildit-and-testit-scripts-they-ha.patch
127:debug:patch Environment:
128:debug:patch CC_PRINT_OPTIONS='YES'
129:debug:patch CC_PRINT_OPTIONS_FILE='/opt/local/var/macports/build/_opt_local_var_macports_sources_rsync.macports.org_macports_release_tarballs_ports_lang_libcxx/libcxx/work/.CC_PRINT_OPTIONS'
130:debug:patch CPATH='/opt/local/include'
131:debug:patch LIBRARY_PATH='/opt/local/lib'
132:debug:patch MACOSX_DEPLOYMENT_TARGET='10.5'
133:info:patch Executing:  cd "/opt/local/var/macports/build/_opt_local_var_macports_sources_rsync.macports.org_macports_release_tarballs_ports_lang_libcxx/libcxx/work" && /usr/bin/patch -p0 < '/opt/local/var/macports/sources/rsync.macports.org/macports/release/tarballs/ports/lang/libcxx/files/3004-Revert-Remove-the-buildit-and-testit-scripts-they-ha.patch'
134:debug:patch system:  cd "/opt/local/var/macports/build/_opt_local_var_macports_sources_rsync.macports.org_macports_release_tarballs_ports_lang_libcxx/libcxx/work" && /usr/bin/patch -p0 < '/opt/local/var/macports/sources/rsync.macports.org/macports/release/tarballs/ports/lang/libcxx/files/3004-Revert-Remove-the-buildit-and-testit-scripts-they-ha.patch'
135:info:patch patching file libcxx-5.0.1.src/lib/buildit
136:info:patch patching file libcxx-5.0.1.src/test/testit
137:info:patch --->  Applying 3005-buildit-build-fix-for-Leopard.patch
138:debug:patch Environment:
139:debug:patch CC_PRINT_OPTIONS='YES'
140:debug:patch CC_PRINT_OPTIONS_FILE='/opt/local/var/macports/build/_opt_local_var_macports_sources_rsync.macports.org_macports_release_tarballs_ports_lang_libcxx/libcxx/work/.CC_PRINT_OPTIONS'
141:debug:patch CPATH='/opt/local/include'
142:debug:patch LIBRARY_PATH='/opt/local/lib'
143:debug:patch MACOSX_DEPLOYMENT_TARGET='10.5'
144:info:patch Executing:  cd "/opt/local/var/macports/build/_opt_local_var_macports_sources_rsync.macports.org_macports_release_tarballs_ports_lang_libcxx/libcxx/work" && /usr/bin/patch -p0 < '/opt/local/var/macports/sources/rsync.macports.org/macports/release/tarballs/ports/lang/libcxx/files/3005-buildit-build-fix-for-Leopard.patch'
145:debug:patch system:  cd "/opt/local/var/macports/build/_opt_local_var_macports_sources_rsync.macports.org_macports_release_tarballs_ports_lang_libcxx/libcxx/work" && /usr/bin/patch -p0 < '/opt/local/var/macports/sources/rsync.macports.org/macports/release/tarballs/ports/lang/libcxx/files/3005-buildit-build-fix-for-Leopard.patch'
146:info:patch patching file libcxx-5.0.1.src/lib/buildit
147:info:patch --->  Applying 3006-buildit-Set-compatibility-version-to-RC_ProjectSourc.patch
148:debug:patch Environment:
149:debug:patch CC_PRINT_OPTIONS='YES'
150:debug:patch CC_PRINT_OPTIONS_FILE='/opt/local/var/macports/build/_opt_local_var_macports_sources_rsync.macports.org_macports_release_tarballs_ports_lang_libcxx/libcxx/work/.CC_PRINT_OPTIONS'
151:debug:patch CPATH='/opt/local/include'
152:debug:patch LIBRARY_PATH='/opt/local/lib'
153:debug:patch MACOSX_DEPLOYMENT_TARGET='10.5'
154:info:patch Executing:  cd "/opt/local/var/macports/build/_opt_local_var_macports_sources_rsync.macports.org_macports_release_tarballs_ports_lang_libcxx/libcxx/work" && /usr/bin/patch -p0 < '/opt/local/var/macports/sources/rsync.macports.org/macports/release/tarballs/ports/lang/libcxx/files/3006-buildit-Set-compatibility-version-to-RC_ProjectSourc.patch'
155:debug:patch system:  cd "/opt/local/var/macports/build/_opt_local_var_macports_sources_rsync.macports.org_macports_release_tarballs_ports_lang_libcxx/libcxx/work" && /usr/bin/patch -p0 < '/opt/local/var/macports/sources/rsync.macports.org/macports/release/tarballs/ports/lang/libcxx/files/3006-buildit-Set-compatibility-version-to-RC_ProjectSourc.patch'
156:info:patch patching file libcxx-5.0.1.src/lib/buildit
157:info:patch --->  Applying 3007-MacPorts-Use-LIBCXXABI_PATH-for-path-to-build-time-l.patch
158:debug:patch Environment:
159:debug:patch CC_PRINT_OPTIONS='YES'
160:debug:patch CC_PRINT_OPTIONS_FILE='/opt/local/var/macports/build/_opt_local_var_macports_sources_rsync.macports.org_macports_release_tarballs_ports_lang_libcxx/libcxx/work/.CC_PRINT_OPTIONS'
161:debug:patch CPATH='/opt/local/include'
162:debug:patch LIBRARY_PATH='/opt/local/lib'
163:debug:patch MACOSX_DEPLOYMENT_TARGET='10.5'
164:info:patch Executing:  cd "/opt/local/var/macports/build/_opt_local_var_macports_sources_rsync.macports.org_macports_release_tarballs_ports_lang_libcxx/libcxx/work" && /usr/bin/patch -p0 < '/opt/local/var/macports/sources/rsync.macports.org/macports/release/tarballs/ports/lang/libcxx/files/3007-MacPorts-Use-LIBCXXABI_PATH-for-path-to-build-time-l.patch'
165:debug:patch system:  cd "/opt/local/var/macports/build/_opt_local_var_macports_sources_rsync.macports.org_macports_release_tarballs_ports_lang_libcxx/libcxx/work" && /usr/bin/patch -p0 < '/opt/local/var/macports/sources/rsync.macports.org/macports/release/tarballs/ports/lang/libcxx/files/3007-MacPorts-Use-LIBCXXABI_PATH-for-path-to-build-time-l.patch'
166:info:patch patching file libcxx-5.0.1.src/lib/buildit
167:info:patch --->  Applying 3008-buildit-Fix-CFLAGS-for-Leopard-and-Snow-Leopard-to-i.patch
168:debug:patch Environment:
169:debug:patch CC_PRINT_OPTIONS='YES'
170:debug:patch CC_PRINT_OPTIONS_FILE='/opt/local/var/macports/build/_opt_local_var_macports_sources_rsync.macports.org_macports_release_tarballs_ports_lang_libcxx/libcxx/work/.CC_PRINT_OPTIONS'
171:debug:patch CPATH='/opt/local/include'
172:debug:patch LIBRARY_PATH='/opt/local/lib'
173:debug:patch MACOSX_DEPLOYMENT_TARGET='10.5'
174:info:patch Executing:  cd "/opt/local/var/macports/build/_opt_local_var_macports_sources_rsync.macports.org_macports_release_tarballs_ports_lang_libcxx/libcxx/work" && /usr/bin/patch -p0 < '/opt/local/var/macports/sources/rsync.macports.org/macports/release/tarballs/ports/lang/libcxx/files/3008-buildit-Fix-CFLAGS-for-Leopard-and-Snow-Leopard-to-i.patch'
175:debug:patch system:  cd "/opt/local/var/macports/build/_opt_local_var_macports_sources_rsync.macports.org_macports_release_tarballs_ports_lang_libcxx/libcxx/work" && /usr/bin/patch -p0 < '/opt/local/var/macports/sources/rsync.macports.org/macports/release/tarballs/ports/lang/libcxx/files/3008-buildit-Fix-CFLAGS-for-Leopard-and-Snow-Leopard-to-i.patch'
176:info:patch patching file libcxx-5.0.1.src/lib/buildit
177:debug:patch Executing proc-post-org.macports.patch-patch-0
178:debug:patch system: chmod 755 /opt/local/var/macports/build/_opt_local_var_macports_sources_rsync.macports.org_macports_release_tarballs_ports_lang_libcxx/libcxx/work/libcxx-5.0.1.src/lib/buildit
179:debug:patch Privilege de-escalation not attempted as not running as root.
180:debug:configure configure phase started at Wed Jan 17 23:24:14 NZDT 2018
181:notice:configure --->  Configuring libcxx
182:warn:configure All compilers are either blacklisted or unavailable; defaulting to first fallback option
183:debug:configure Preferred compilers: gcc-4.2 apple-gcc-4.2 gcc-4.0 macports-clang-3.4 macports-clang-3.3
184:debug:configure Using compiler 'Xcode GCC 4.2'
185:debug:configure Executing org.macports.configure (libcxx)
186:debug:configure Privilege de-escalation not attempted as not running as root.
187:debug:build build phase started at Wed Jan 17 23:24:14 NZDT 2018
188:notice:build --->  Building libcxx
189:debug:build Executing org.macports.build (libcxx)
190:debug:build Environment:
191:debug:build CC='/usr/bin/gcc-4.2'
192:debug:build CC_PRINT_OPTIONS='YES'
193:debug:build CC_PRINT_OPTIONS_FILE='/opt/local/var/macports/build/_opt_local_var_macports_sources_rsync.macports.org_macports_release_tarballs_ports_lang_libcxx/libcxx/work/.CC_PRINT_OPTIONS'
194:debug:build CPATH='/opt/local/include'
195:debug:build CXX='/usr/bin/g++-4.2'
196:debug:build LIBRARY_PATH='/opt/local/lib'
197:debug:build MACOSX_DEPLOYMENT_TARGET='10.5'
198:debug:build RC_CFLAGS='-arch x86_64 -arch i386 -arch ppc -I/opt/local/var/macports/build/_opt_local_var_macports_sources_rsync.macports.org_macports_release_tarballs_ports_lang_libcxx/libcxx/work/libcxxabi-5.0.1.src/include -I/opt/local/var/macports/build/_opt_local_var_macports_sources_rsync.macports.org_macports_release_tarballs_ports_lang_libcxx/libcxx/work/libcxx-5.0.1.src/include -Os'
199:debug:build RC_ProjectSourceVersion='5.0.1'
200:debug:build RC_XBS='1'
201:debug:build TRIPLE='-apple-darwin9'
202:info:build Executing:  cd "/opt/local/var/macports/build/_opt_local_var_macports_sources_rsync.macports.org_macports_release_tarballs_ports_lang_libcxx/libcxx/work/build" && /usr/bin/make -w all LIBCXXABI_PATH=/opt/local/var/macports/build/_opt_local_var_macports_sources_rsync.macports.org_macports_release_tarballs_ports_lang_libcxx/libcxx/work/libcxxabi-5.0.1.src LIBCXX_PATH=/opt/local/var/macports/build/_opt_local_var_macports_sources_rsync.macports.org_macports_release_tarballs_ports_lang_libcxx/libcxx/work/libcxx-5.0.1.src LIBCXXABI_DYLIB_PATH=/opt/local/var/macports/build/_opt_local_var_macports_sources_rsync.macports.org_macports_release_tarballs_ports_lang_libcxx/libcxx/work/build/libc++abi.dylib
203:debug:build system:  cd "/opt/local/var/macports/build/_opt_local_var_macports_sources_rsync.macports.org_macports_release_tarballs_ports_lang_libcxx/libcxx/work/build" && /usr/bin/make -w all LIBCXXABI_PATH=/opt/local/var/macports/build/_opt_local_var_macports_sources_rsync.macports.org_macports_release_tarballs_ports_lang_libcxx/libcxx/work/libcxxabi-5.0.1.src LIBCXX_PATH=/opt/local/var/macports/build/_opt_local_var_macports_sources_rsync.macports.org_macports_release_tarballs_ports_lang_libcxx/libcxx/work/libcxx-5.0.1.src LIBCXXABI_DYLIB_PATH=/opt/local/var/macports/build/_opt_local_var_macports_sources_rsync.macports.org_macports_release_tarballs_ports_lang_libcxx/libcxx/work/build/libc++abi.dylib
204:info:build make: Entering directory `/opt/local/var/macports/build/_opt_local_var_macports_sources_rsync.macports.org_macports_release_tarballs_ports_lang_libcxx/libcxx/work/build'
205:info:build cd /opt/local/var/macports/build/_opt_local_var_macports_sources_rsync.macports.org_macports_release_tarballs_ports_lang_libcxx/libcxx/work/libcxxabi-5.0.1.src/lib && ./buildit
206:info:build + for FILE in '../src/*.cpp'
207:info:build + /usr/bin/g++-4.2 -c -g -O3 -arch x86_64 -arch i386 -arch ppc -I/opt/local/var/macports/build/_opt_local_var_macports_sources_rsync.macports.org_macports_release_tarballs_ports_lang_libcxx/libcxx/work/libcxxabi-5.0.1.src/include -I/opt/local/var/macports/build/_opt_local_var_macports_sources_rsync.macports.org_macports_release_tarballs_ports_lang_libcxx/libcxx/work/libcxx-5.0.1.src/include -Os -std=c++11 -stdlib=libc++ -fstrict-aliasing -Wstrict-aliasing=2 -Wsign-conversion -Wshadow -Wconversion -Wunused-variable -Wmissing-field-initializers -Wchar-subscripts -Wmismatched-tags -Wmissing-braces -Wshorten-64-to-32 -Wsign-compare -Wstrict-aliasing=2 -Wstrict-overflow=4 -Wunused-parameter -Wnewline-eof -D_LIBCPP_BUILDING_LIBRARY -I../include ../src/abort_message.cpp
208:info:build cc1plus: error: unrecognized command line option "-Wsign-conversion"
209:info:build cc1plus: error: unrecognized command line option "-Wmismatched-tags"
210:info:build cc1plus: error: unrecognized command line option "-std=c++11"
211:info:build cc1plus: error: unrecognized command line option "-stdlib=libc++"
212:info:build cc1plus: error: unrecognized command line option "-Wsign-conversion"
213:info:build cc1plus: error: unrecognized command line option "-Wmismatched-tags"
214:info:build cc1plus: error: unrecognized command line option "-std=c++11"
215:info:build cc1plus: error: unrecognized command line option "-stdlib=libc++"
216:info:build cc1plus: error: unrecognized command line option "-Wsign-conversion"
217:info:build cc1plus: error: unrecognized command line option "-Wmismatched-tags"
218:info:build cc1plus: error: unrecognized command line option "-std=c++11"
219:info:build cc1plus: error: unrecognized command line option "-stdlib=libc++"
220:info:build lipo: can't figure out the architecture type of: /opt/local/var/macports/build/_opt_local_var_macports_sources_rsync.macports.org_macports_release_tarballs_ports_lang_libcxx/libcxx/work/.tmp/ccOYa1lC.out
221:info:build make: *** [/opt/local/var/macports/build/_opt_local_var_macports_sources_rsync.macports.org_macports_release_tarballs_ports_lang_libcxx/libcxx/work/libcxxabi-5.0.1.src/lib/libc++abi.dylib] Error 1
222:info:build make: Leaving directory `/opt/local/var/macports/build/_opt_local_var_macports_sources_rsync.macports.org_macports_release_tarballs_ports_lang_libcxx/libcxx/work/build'
223:info:build Command failed:  cd "/opt/local/var/macports/build/_opt_local_var_macports_sources_rsync.macports.org_macports_release_tarballs_ports_lang_libcxx/libcxx/work/build" && /usr/bin/make -w all LIBCXXABI_PATH=/opt/local/var/macports/build/_opt_local_var_macports_sources_rsync.macports.org_macports_release_tarballs_ports_lang_libcxx/libcxx/work/libcxxabi-5.0.1.src LIBCXX_PATH=/opt/local/var/macports/build/_opt_local_var_macports_sources_rsync.macports.org_macports_release_tarballs_ports_lang_libcxx/libcxx/work/libcxx-5.0.1.src LIBCXXABI_DYLIB_PATH=/opt/local/var/macports/build/_opt_local_var_macports_sources_rsync.macports.org_macports_release_tarballs_ports_lang_libcxx/libcxx/work/build/libc++abi.dylib
224:info:build Exit code: 2
225:error:build Failed to build libcxx: command execution failed
226:debug:build Error code: CHILDSTATUS 88659 2
227:debug:build Backtrace: command execution failed
228:debug:build     while executing
229:debug:build "system {*}$notty {*}$nice $fullcmdstring"
230:debug:build     invoked from within
231:debug:build "command_exec build"
232:debug:build     (procedure "portbuild::build_main" line 8)
233:debug:build     invoked from within
234:debug:build "$procedure $targetname"
235:error:build See /opt/local/var/macports/logs/_opt_local_var_macports_sources_rsync.macports.org_macports_release_tarballs_ports_lang_libcxx/libcxx/main.log for details.