Ticket #56095: report failure to build xercesc3

File report failure to build xercesc3, 11.5 KB (added by MarcChenevier, 3 years ago)

copy of terminal

Line 
1:info:build ld: duplicate symbol xercesc_3_2::ArrayJanitor<unsigned char>::ArrayJanitor(unsigned char*)in xercesc/util/.libs/TransService.o and xercesc/util/.libs/PlatformUtils.o
2:info:build collect2: ld returned 1 exit status
3:info:build make[3]: *** [libxerces-c.la] Error 1
4:info:build make[3]: Leaving directory `/opt/local/var/macports/build/_opt_local_var_macports_sources_rsync.macports.org_macports_release_tarballs_ports_textproc_xercesc3/xercesc3/work/xerces-c-3.2.1/src'
5:info:build make[2]: *** [all] Error 2
6:info:build make[2]: Leaving directory `/opt/local/var/macports/build/_opt_local_var_macports_sources_rsync.macports.org_macports_release_tarballs_ports_textproc_xercesc3/xercesc3/work/xerces-c-3.2.1/src'
7:info:build make[1]: *** [all-recursive] Error 1
8:info:build make[1]: Leaving directory `/opt/local/var/macports/build/_opt_local_var_macports_sources_rsync.macports.org_macports_release_tarballs_ports_textproc_xercesc3/xercesc3/work/xerces-c-3.2.1'
9:info:build make: *** [all] Error 2
10:info:build make: Leaving directory `/opt/local/var/macports/build/_opt_local_var_macports_sources_rsync.macports.org_macports_release_tarballs_ports_textproc_xercesc3/xercesc3/work/xerces-c-3.2.1'
11:info:build Command failed:  cd "/opt/local/var/macports/build/_opt_local_var_macports_sources_rsync.macports.org_macports_release_tarballs_ports_textproc_xercesc3/xercesc3/work/xerces-c-3.2.1" && /usr/bin/make -j2 -w all
12:info:build Exit code: 2
13:error:build Failed to build xercesc3: command execution failed
14:debug:build Error code: CHILDSTATUS 6736 2
15:debug:build Backtrace: command execution failed
16:debug:build     while executing
17:debug:build "system {*}$notty {*}$nice $fullcmdstring"
18:debug:build     invoked from within
19:debug:build "command_exec build"
20:debug:build     (procedure "portbuild::build_main" line 8)
21:debug:build     invoked from within
22:debug:build "$procedure $targetname"
23:debug:build Failed to locate 'lbzip2' in path: '/opt/local/bin:/opt/local/sbin:/bin:/sbin:/usr/bin:/usr/sbin' or at its MacPorts configuration time location, did you move it?
24:debug:build     while executing
25:debug:build "error "$eMessage or at its MacPorts configuration time location, did you move it?""
26:debug:build     invoked from within
27:debug:build "try -pass_signal {
28:debug:build             set cmd_path [macports::binaryInPath $prog]
29:debug:build             return $cmd_path
30:debug:build         } catch {{*} eCode eMessage} {
31:debug:build        ..."
32:debug:build     (procedure "macports::findBinary" line 5)
33:error:build See /opt/local/var/macports/logs/_opt_local_var_macports_sources_rsync.macports.org_macports_release_tarballs_ports_textproc_xercesc3/xercesc3/main.log for details.
34version:1
35:debug:main dropping privileges: euid changed to 504, egid changed to 501.
36:debug:main Executing org.macports.main (xercesc3)
37:debug:main Privilege de-escalation not attempted as not running as root.
38:debug:main Skipping completed org.macports.archivefetch (xercesc3)
39:debug:main Privilege de-escalation not attempted as not running as root.
40:debug:main Skipping completed org.macports.fetch (xercesc3)
41:debug:main Privilege de-escalation not attempted as not running as root.
42:debug:main Skipping completed org.macports.checksum (xercesc3)
43:debug:main Privilege de-escalation not attempted as not running as root.
44:debug:main Skipping completed org.macports.extract (xercesc3)
45:debug:main Privilege de-escalation not attempted as not running as root.
46:debug:main Skipping completed org.macports.patch (xercesc3)
47:debug:main Privilege de-escalation not attempted as not running as root.
48:debug:main Skipping completed org.macports.configure (xercesc3)
49:debug:main Privilege de-escalation not attempted as not running as root.
50:debug:build build phase started at Mon Mar 19 10:21:49 CET 2018
51:notice:build --->  Building xercesc3
52:debug:build Executing org.macports.build (xercesc3)
53:debug:build Environment:
54:debug:build CC_PRINT_OPTIONS='YES'
55:debug:build CC_PRINT_OPTIONS_FILE='/opt/local/var/macports/build/_opt_local_var_macports_sources_rsync.macports.org_macports_release_tarballs_ports_textproc_xercesc3/xercesc3/work/.CC_PRINT_OPTIONS'
56:debug:build CPATH='/opt/local/include'
57:debug:build LIBRARY_PATH='/opt/local/lib'
58:debug:build MACOSX_DEPLOYMENT_TARGET='10.6'
59:info:build Executing:  cd "/opt/local/var/macports/build/_opt_local_var_macports_sources_rsync.macports.org_macports_release_tarballs_ports_textproc_xercesc3/xercesc3/work/xerces-c-3.2.1" && /usr/bin/make -j2 -w all
60:debug:build system:  cd "/opt/local/var/macports/build/_opt_local_var_macports_sources_rsync.macports.org_macports_release_tarballs_ports_textproc_xercesc3/xercesc3/work/xerces-c-3.2.1" && /usr/bin/make -j2 -w all
61:info:build make: Entering directory `/opt/local/var/macports/build/_opt_local_var_macports_sources_rsync.macports.org_macports_release_tarballs_ports_textproc_xercesc3/xercesc3/work/xerces-c-3.2.1'
62:info:build /usr/bin/make  all-recursive
63:info:build make[1]: Entering directory `/opt/local/var/macports/build/_opt_local_var_macports_sources_rsync.macports.org_macports_release_tarballs_ports_textproc_xercesc3/xercesc3/work/xerces-c-3.2.1'
64:info:build Making all in doc
65:info:build make[2]: Entering directory `/opt/local/var/macports/build/_opt_local_var_macports_sources_rsync.macports.org_macports_release_tarballs_ports_textproc_xercesc3/xercesc3/work/xerces-c-3.2.1/doc'
66:info:build make[2]: Nothing to be done for `all'.
67:info:build make[2]: Leaving directory `/opt/local/var/macports/build/_opt_local_var_macports_sources_rsync.macports.org_macports_release_tarballs_ports_textproc_xercesc3/xercesc3/work/xerces-c-3.2.1/doc'
68:info:build Making all in src
69:info:build make[2]: Entering directory `/opt/local/var/macports/build/_opt_local_var_macports_sources_rsync.macports.org_macports_release_tarballs_ports_textproc_xercesc3/xercesc3/work/xerces-c-3.2.1/src'
70:info:build /usr/bin/make  all-am
71:info:build make[3]: Entering directory `/opt/local/var/macports/build/_opt_local_var_macports_sources_rsync.macports.org_macports_release_tarballs_ports_textproc_xercesc3/xercesc3/work/xerces-c-3.2.1/src'
72:info:build /bin/sh ../libtool  --tag=CXX   --mode=link /usr/bin/g++-4.2  -pipe -Os -arch x86_64 -D_THREAD_SAFE  -msse2 -release 3.2 -L/opt/local/lib -Wl,-headerpad_max_install_names -arch x86_64 -o libxerces-c.la -rpath /opt/local/lib xercesc/util/Base64.lo xercesc/util/BinFileInputStream.lo xercesc/util/BinInputStream.lo xercesc/util/BinMemInputStream.lo xercesc/util/BitSet.lo xercesc/util/DefaultPanicHandler.lo xercesc/util/EncodingValidator.lo xercesc/util/HeaderDummy.lo xercesc/util/HexBin.lo xercesc/util/KVStringPair.lo xercesc/util/Mutexes.lo xercesc/util/PanicHandler.lo xercesc/util/PlatformUtils.lo xercesc/util/PSVIUni.lo xercesc/util/QName.lo xercesc/util/regx/ASCIIRangeFactory.lo xercesc/util/regx/BlockRangeFactory.lo xercesc/util/regx/BMPattern.lo xercesc/util/regx/CharToken.lo xercesc/util/regx/ClosureToken.lo xercesc/util/regx/ConcatToken.lo xercesc/util/regx/Match.lo xercesc/util/regx/Op.lo xercesc/util/regx/OpFactory.lo xercesc/util/regx/ParenToken.lo xercesc/util/regx/ParserForXMLSchema.lo xercesc/util/regx/RangeFactory.lo xercesc/util/regx/RangeToken.lo xercesc/util/regx/RangeTokenMap.lo xercesc/util/regx/RegularExpression.lo xercesc/util/regx/RegxParser.lo xercesc/util/regx/RegxUtil.lo xercesc/util/regx/StringToken.lo xercesc/util/regx/Token.lo xercesc/util/regx/TokenFactory.lo xercesc/util/regx/UnicodeRangeFactory.lo xercesc/util/regx/UnionToken.lo xercesc/util/regx/XMLRangeFactory.lo xercesc/util/regx/XMLUniCharacter.lo xercesc/util/StringPool.lo xercesc/util/SynchronizedStringPool.lo xercesc/util/TransService.lo xercesc/util/XMemory.lo xercesc/util/XML256TableTranscoder.lo xercesc/util/XML88591Transcoder.lo xercesc/util/XMLAbstractDoubleFloat.lo xercesc/util/XMLASCIITranscoder.lo xercesc/util/XMLBigDecimal.lo xercesc/util/XMLBigInteger.lo xercesc/util/XMLChar.lo xercesc/util/XMLChTranscoder.lo xercesc/util/XMLDateTime.lo xercesc/util/XMLDouble.lo xercesc/util/XMLEBCDICTranscoder.lo xercesc/util/XMLException.lo xercesc/util/XMLFloat.lo xercesc/util/XMLIBM1047Transcoder.lo xercesc/util/XMLIBM1140Transcoder.lo xercesc/util/XMLInitializer.lo xercesc/util/XMLMsgLoader.lo xercesc/util/XMLNumber.lo xercesc/util/XMLString.lo xercesc/util/XMLStringTokenizer.lo xercesc/util/XMLUCS4Transcoder.lo xercesc/util/XMLUni.lo xercesc/util/XMLUri.lo xercesc/util/XMLURL.lo xercesc/util/XMLUTF16Transcoder.lo xercesc/util/XMLUTF8Transcoder.lo xercesc/util/XMLWin1252Transcoder.lo xercesc/dom/DOMException.lo xercesc/dom/DOMLSException.lo xercesc/dom/DOMRangeException.lo xercesc/dom/DOMXPathException.lo xercesc/dom/impl/DOMAttrImpl.lo xercesc/dom/impl/DOMAttrMapImpl.lo xercesc/dom/impl/DOMAttrNSImpl.lo xercesc/dom/impl/DOMCDATASectionImpl.lo xercesc/dom/impl/DOMCharacterDataImpl.lo xercesc/dom/impl/DOMChildNode.lo xercesc/dom/impl/DOMCommentImpl.lo xercesc/dom/impl/DOMConfigurationImpl.lo xercesc/dom/impl/DOMDeepNodeListImpl.lo xercesc/dom/impl/DOMDocu:
73blablabla---------------------------------
74the end:
75:info:build ld: duplicate symbol xercesc_3_2::ArrayJanitor<unsigned char>::ArrayJanitor(unsigned char*)in xercesc/util/.libs/TransService.o and xercesc/util/.libs/PlatformUtils.o
76:info:build collect2: ld returned 1 exit status
77:info:build make[3]: *** [libxerces-c.la] Error 1
78:info:build make[3]: Leaving directory `/opt/local/var/macports/build/_opt_local_var_macports_sources_rsync.macports.org_macports_release_tarballs_ports_textproc_xercesc3/xercesc3/work/xerces-c-3.2.1/src'
79:info:build make[2]: *** [all] Error 2
80:info:build make[2]: Leaving directory `/opt/local/var/macports/build/_opt_local_var_macports_sources_rsync.macports.org_macports_release_tarballs_ports_textproc_xercesc3/xercesc3/work/xerces-c-3.2.1/src'
81:info:build make[1]: *** [all-recursive] Error 1
82:info:build make[1]: Leaving directory `/opt/local/var/macports/build/_opt_local_var_macports_sources_rsync.macports.org_macports_release_tarballs_ports_textproc_xercesc3/xercesc3/work/xerces-c-3.2.1'
83:info:build make: *** [all] Error 2
84:info:build make: Leaving directory `/opt/local/var/macports/build/_opt_local_var_macports_sources_rsync.macports.org_macports_release_tarballs_ports_textproc_xercesc3/xercesc3/work/xerces-c-3.2.1'
85:info:build Command failed:  cd "/opt/local/var/macports/build/_opt_local_var_macports_sources_rsync.macports.org_macports_release_tarballs_ports_textproc_xercesc3/xercesc3/work/xerces-c-3.2.1" && /usr/bin/make -j2 -w all
86:info:build Exit code: 2
87:error:build Failed to build xercesc3: command execution failed
88:debug:build Error code: CHILDSTATUS 372 2
89:debug:build Backtrace: command execution failed
90:debug:build     while executing
91:debug:build "system {*}$notty {*}$nice $fullcmdstring"
92:debug:build     invoked from within
93:debug:build "command_exec build"
94:debug:build     (procedure "portbuild::build_main" line 8)
95:debug:build     invoked from within
96:debug:build "$procedure $targetname"
97:debug:build Failed to locate 'lbzip2' in path: '/opt/local/bin:/opt/local/sbin:/bin:/sbin:/usr/bin:/usr/sbin' or at its MacPorts configuration time location, did you move it?
98:debug:build     while executing
99:debug:build "error "$eMessage or at its MacPorts configuration time location, did you move it?""
100:debug:build     invoked from within
101:debug:build "try -pass_signal {
102:debug:build             set cmd_path [macports::binaryInPath $prog]
103:debug:build             return $cmd_path
104:debug:build         } catch {{*} eCode eMessage} {
105:debug:build        ..."
106:debug:build     (procedure "macports::findBinary" line 5)
107:error:build See /opt/local/var/macports/logs/_opt_local_var_macports_sources_rsync.macports.org_macports_release_ta: