Ticket #56193: main.log

File main.log, 142.7 KB (added by tehcog (tehcog), 3 years ago)

main.log

Line 
1version:1
2:debug:main Executing org.macports.main (volk)
3:debug:main dropping privileges: euid changed to 502, egid changed to 501.
4:debug:fetch fetch phase started at Fri Mar 30 15:42:58 EDT 2018
5:notice:fetch --->  Fetching distfiles for volk
6:debug:fetch elevating privileges for fetch: euid changed to 0, egid changed to 0.
7:debug:fetch dropping privileges: euid changed to 502, egid changed to 501.
8:debug:fetch Executing org.macports.fetch (volk)
9:info:fetch --->  volk-1.4.tar.gz does not exist in /opt/local/var/macports/distfiles/volk
10:notice:fetch --->  Attempting to fetch volk-1.4.tar.gz from https://distfiles.macports.org/volk
11version:1
12:msg:clean --->  Computing dependencies for volk:info:clean .:debug:clean Checking for conflicts against volk
13:debug:clean Searching for dependency: volk-devel
14:debug:clean Didn't find receipt, going to depspec regex for: volk-devel
15:debug:clean Searching for dependency: cmake
16:debug:clean Found Dependency: receipt exists for cmake
17:debug:clean Searching for dependency: pkgconfig
18:debug:clean Found Dependency: receipt exists for pkgconfig
19:debug:clean Searching for dependency: py27-cheetah
20:debug:clean Found Dependency: receipt exists for py27-cheetah
21:debug:clean Searching for dependency: doxygen
22:debug:clean Found Dependency: receipt exists for doxygen
23:debug:clean Searching for dependency: boost
24:debug:clean Found Dependency: receipt exists for boost
25:debug:clean Searching for dependency: python27
26:debug:clean Found Dependency: receipt exists for python27
27:debug:clean Searching for dependency: orc
28:debug:clean Found Dependency: receipt exists for orc
29:debug:main Executing org.macports.main (volk)
30:debug:main dropping privileges: euid changed to 502, egid changed to 501.
31:debug:archivefetch archivefetch phase started at Fri Mar 30 15:56:34 EDT 2018
32:msg:archivefetch --->  Fetching archive for volk
33:debug:archivefetch Executing org.macports.archivefetch (volk)
34:debug:archivefetch euid/egid changed to: 0/0
35:debug:archivefetch chowned /opt/local/var/macports/incoming to macports
36:debug:archivefetch euid/egid changed to: 502/501
37:info:archivefetch --->  volk-1.4_0+docs+orc.darwin_13.x86_64.tbz2 doesn't seem to exist in /opt/local/var/macports/incoming/verified
38:msg:archivefetch --->  Attempting to fetch volk-1.4_0+docs+orc.darwin_13.x86_64.tbz2 from https://packages.macports.org/volk
39:debug:archivefetch Fetching archive failed: The requested URL returned error: 404 Not Found
40:msg:archivefetch --->  Attempting to fetch volk-1.4_0+docs+orc.darwin_13.x86_64.tbz2 from http://mse.uk.packages.macports.org/sites/packages.macports.org/volk
41:debug:archivefetch Fetching archive failed: The requested URL returned error: 404 Not Found
42:msg:archivefetch --->  Attempting to fetch volk-1.4_0+docs+orc.darwin_13.x86_64.tbz2 from http://lil.fr.packages.macports.org/volk
43:debug:archivefetch Fetching archive failed: The requested URL returned error: 404 Not Found
44:debug:archivefetch Privilege de-escalation not attempted as not running as root.
45:debug:archivefetch Skipping completed org.macports.fetch (volk)
46:debug:archivefetch Privilege de-escalation not attempted as not running as root.
47:debug:checksum checksum phase started at Fri Mar 30 15:56:37 EDT 2018
48:notice:checksum --->  Verifying checksums for volk
49:debug:checksum Executing org.macports.checksum (volk)
50:info:checksum --->  Checksumming volk-1.4.tar.gz
51:debug:checksum Calculated (rmd160) is cf9e7a2a6d981871cc3321135f2f97fa872da94f
52:debug:checksum Correct (rmd160) checksum for volk-1.4.tar.gz
53:debug:checksum Calculated (sha256) is 369dffa2ad16c0439f72bdb6d948d91a66cc274388e3bb343e1c19348dcb0ead
54:debug:checksum Correct (sha256) checksum for volk-1.4.tar.gz
55:debug:checksum Calculated (size) is 233428
56:debug:checksum Correct (size) checksum for volk-1.4.tar.gz
57:debug:checksum Privilege de-escalation not attempted as not running as root.
58:debug:extract extract phase started at Fri Mar 30 15:56:37 EDT 2018
59:notice:extract --->  Extracting volk
60:debug:extract Executing proc-pre-org.macports.extract-extract-0
61:debug:extract Executing org.macports.extract (volk)
62:info:extract --->  Extracting volk-1.4.tar.gz
63:debug:extract setting option extract.args to '/opt/local/var/macports/distfiles/volk/volk-1.4.tar.gz'
64:debug:extract Environment:
65:debug:extract CC_PRINT_OPTIONS='YES'
66:debug:extract CC_PRINT_OPTIONS_FILE='/opt/local/var/macports/build/_opt_local_var_macports_sources_rsync.macports.org_release_tarballs_ports_science_volk/volk/work/.CC_PRINT_OPTIONS'
67:debug:extract CPATH='/opt/local/include'
68:debug:extract LIBRARY_PATH='/opt/local/lib'
69:debug:extract MACOSX_DEPLOYMENT_TARGET='10.9'
70:info:extract Executing:  cd "/opt/local/var/macports/build/_opt_local_var_macports_sources_rsync.macports.org_release_tarballs_ports_science_volk/volk/work" && /usr/bin/gzip -dc '/opt/local/var/macports/distfiles/volk/volk-1.4.tar.gz' | /usr/bin/tar -xf -
71:debug:extract system:  cd "/opt/local/var/macports/build/_opt_local_var_macports_sources_rsync.macports.org_release_tarballs_ports_science_volk/volk/work" && /usr/bin/gzip -dc '/opt/local/var/macports/distfiles/volk/volk-1.4.tar.gz' | /usr/bin/tar -xf -
72:debug:extract euid/egid changed to: 0/0
73:debug:extract chowned /opt/local/var/macports/build/_opt_local_var_macports_sources_rsync.macports.org_release_tarballs_ports_science_volk/volk/work to macports
74:debug:extract euid/egid changed to: 502/501
75:debug:extract Executing proc-post-org.macports.extract-extract-0
76:debug:extract Privilege de-escalation not attempted as not running as root.
77:debug:patch patch phase started at Fri Mar 30 15:56:37 EDT 2018
78:debug:patch Executing org.macports.patch (volk)
79:debug:patch Privilege de-escalation not attempted as not running as root.
80:debug:configure configure phase started at Fri Mar 30 15:56:37 EDT 2018
81:notice:configure --->  Configuring volk
82:debug:configure Preferred compilers: clang macports-clang-4.0 macports-clang-3.9 macports-clang-3.8 macports-clang-3.7 macports-clang-3.4 macports-llvm-gcc-4.2 apple-gcc-4.2
83:debug:configure Using compiler 'Xcode Clang'
84:debug:configure Executing proc-pre-org.macports.configure-configure-0
85:debug:configure Executing proc-pre-org.macports.configure-configure-1
86:debug:configure Executing proc-pre-org.macports.configure-configure-2
87:debug:configure Executing org.macports.configure (volk)
88:debug:configure Environment:
89:debug:configure CC='/usr/bin/clang'
90:debug:configure CC_PRINT_OPTIONS='YES'
91:debug:configure CC_PRINT_OPTIONS_FILE='/opt/local/var/macports/build/_opt_local_var_macports_sources_rsync.macports.org_release_tarballs_ports_science_volk/volk/work/.CC_PRINT_OPTIONS'
92:debug:configure CFLAGS='-pipe -Os'
93:debug:configure CPATH='/opt/local/include'
94:debug:configure CPPFLAGS='-I/opt/local/include'
95:debug:configure CXX='/usr/bin/clang++'
96:debug:configure CXXFLAGS='-pipe -Os -stdlib=libc++'
97:debug:configure F77FLAGS='-m64'
98:debug:configure F90FLAGS='-pipe -Os -m64'
99:debug:configure FCFLAGS='-pipe -Os -m64'
100:debug:configure FFLAGS='-pipe -Os'
101:debug:configure INSTALL='/usr/bin/install -c'
102:debug:configure LDFLAGS='-Wl,-headerpad_max_install_names'
103:debug:configure LIBRARY_PATH='/opt/local/lib'
104:debug:configure MACOSX_DEPLOYMENT_TARGET='10.9'
105:debug:configure OBJC='/usr/bin/clang'
106:debug:configure OBJCFLAGS='-pipe -Os'
107:debug:configure OBJCXX='/usr/bin/clang++'
108:debug:configure OBJCXXFLAGS='-pipe -Os -stdlib=libc++'
109:info:configure Executing:  cd "/opt/local/var/macports/build/_opt_local_var_macports_sources_rsync.macports.org_release_tarballs_ports_science_volk/volk/work/build" && /opt/local/bin/cmake -DCMAKE_INSTALL_PREFIX='/opt/local' -DCMAKE_BUILD_TYPE=Release -DCMAKE_BUILD_WITH_INSTALL_RPATH=ON -DCMAKE_C_COMPILER="$CC" -DCMAKE_COLOR_MAKEFILE=ON -DCMAKE_CXX_COMPILER="$CXX" -DCMAKE_FIND_FRAMEWORK=LAST -DCMAKE_INSTALL_NAME_DIR=/opt/local/lib -DCMAKE_INSTALL_RPATH=/opt/local/lib -DCMAKE_MODULE_PATH=/opt/local/share/cmake/Modules -DCMAKE_SYSTEM_PREFIX_PATH="/opt/local;/opt/local;/usr" -DCMAKE_VERBOSE_MAKEFILE=ON -DCMAKE_POLICY_DEFAULT_CMP0025=NEW -Wno-dev -DVOLK_GIT_COUNT="MacPorts" -DVOLK_GIT_HASH="git-1.4(1.4)" -DCMAKE_MODULES_DIR=/opt/local/share/cmake -DPYTHON_EXECUTABLE=/opt/local/Library/Frameworks/Python.framework/Versions/2.7/bin/python2.7 -DVOLK_PYTHON_DIR=/opt/local/Library/Frameworks/Python.framework/Versions/2.7/lib/python2.7/site-packages -DDOXYGEN_EXECUTABLE=/opt/local/bin/doxygen -DORCC_EXECUTABLE=/opt/local/bin/orcc -DORC_INCLUDE_DIR=/opt/local/include/orc-0.4 -DORC_LIBRARY_DIR=/opt/local/lib -DCMAKE_C_FLAGS_RELEASE="-DNDEBUG" -DCMAKE_CXX_FLAGS_RELEASE="-DNDEBUG" -DCMAKE_OSX_ARCHITECTURES="x86_64" -DCMAKE_OSX_DEPLOYMENT_TARGET="10.9" -DCMAKE_OSX_SYSROOT="/" /opt/local/var/macports/build/_opt_local_var_macports_sources_rsync.macports.org_release_tarballs_ports_science_volk/volk/work/volk-1.4
110:debug:configure system:  cd "/opt/local/var/macports/build/_opt_local_var_macports_sources_rsync.macports.org_release_tarballs_ports_science_volk/volk/work/build" && /opt/local/bin/cmake -DCMAKE_INSTALL_PREFIX='/opt/local' -DCMAKE_BUILD_TYPE=Release -DCMAKE_BUILD_WITH_INSTALL_RPATH=ON -DCMAKE_C_COMPILER="$CC" -DCMAKE_COLOR_MAKEFILE=ON -DCMAKE_CXX_COMPILER="$CXX" -DCMAKE_FIND_FRAMEWORK=LAST -DCMAKE_INSTALL_NAME_DIR=/opt/local/lib -DCMAKE_INSTALL_RPATH=/opt/local/lib -DCMAKE_MODULE_PATH=/opt/local/share/cmake/Modules -DCMAKE_SYSTEM_PREFIX_PATH="/opt/local;/opt/local;/usr" -DCMAKE_VERBOSE_MAKEFILE=ON -DCMAKE_POLICY_DEFAULT_CMP0025=NEW -Wno-dev -DVOLK_GIT_COUNT="MacPorts" -DVOLK_GIT_HASH="git-1.4(1.4)" -DCMAKE_MODULES_DIR=/opt/local/share/cmake -DPYTHON_EXECUTABLE=/opt/local/Library/Frameworks/Python.framework/Versions/2.7/bin/python2.7 -DVOLK_PYTHON_DIR=/opt/local/Library/Frameworks/Python.framework/Versions/2.7/lib/python2.7/site-packages -DDOXYGEN_EXECUTABLE=/opt/local/bin/doxygen -DORCC_EXECUTABLE=/opt/local/bin/orcc -DORC_INCLUDE_DIR=/opt/local/include/orc-0.4 -DORC_LIBRARY_DIR=/opt/local/lib -DCMAKE_C_FLAGS_RELEASE="-DNDEBUG" -DCMAKE_CXX_FLAGS_RELEASE="-DNDEBUG" -DCMAKE_OSX_ARCHITECTURES="x86_64" -DCMAKE_OSX_DEPLOYMENT_TARGET="10.9" -DCMAKE_OSX_SYSROOT="/" /opt/local/var/macports/build/_opt_local_var_macports_sources_rsync.macports.org_release_tarballs_ports_science_volk/volk/work/volk-1.4
111:info:configure -- The C compiler identification is AppleClang 6.0.0.6000057
112:info:configure -- The CXX compiler identification is AppleClang 6.0.0.6000057
113:info:configure -- Check for working C compiler: /usr/bin/clang
114:info:configure -- Check for working C compiler: /usr/bin/clang -- works
115:info:configure -- Detecting C compiler ABI info
116:info:configure -- Detecting C compiler ABI info - done
117:info:configure -- Detecting C compile features
118:info:configure -- Detecting C compile features - done
119:info:configure -- Check for working CXX compiler: /usr/bin/clang++
120:info:configure -- Check for working CXX compiler: /usr/bin/clang++ -- works
121:info:configure -- Detecting CXX compiler ABI info
122:info:configure -- Detecting CXX compiler ABI info - done
123:info:configure -- Detecting CXX compile features
124:info:configure -- Detecting CXX compile features - done
125:info:configure -- Build type set to Release.
126:info:configure -- Found Git: /opt/local/bin/git (found version "2.16.3")
127:info:configure --
128:info:configure -- Python checking for python >= 2.7
129:info:configure -- Python checking for python >= 2.7 - found
130:info:configure --
131:info:configure -- Python checking for mako >= 0.4.2
132:info:configure -- Python checking for mako >= 0.4.2 - found
133:info:configure --
134:info:configure -- Python checking for six - python 2 and 3 compatibility library
135:info:configure -- Python checking for six - python 2 and 3 compatibility library - found
136:info:configure -- Boost version: 1.66.0
137:info:configure -- Found the following Boost libraries:
138:info:configure --   filesystem
139:info:configure --   system
140:info:configure -- Found PkgConfig: /opt/local/bin/pkg-config (found version "0.29.2")
141:info:configure -- Checking for module 'orc-0.4 > 0.4.11'
142:info:configure --   Found orc-0.4 > 0.4.11, version 0.4.28
143:info:configure -- Found ORC: /opt/local/lib/liborc-0.4.dylib 
144:info:configure -- Found Doxygen: /opt/local/bin/doxygen (found version "1.8.13") found components:  doxygen dot
145:info:configure -- QA Testing is enabled.
146:info:configure --   Modify using: -DENABLE_TESTING=ON/OFF
147:info:configure -- System profiling is disabled.
148:info:configure --   Modify using: -DENABLE_PROFILING=ON/OFF
149:info:configure -- Looking for cpuid.h
150:info:configure -- Looking for cpuid.h - found
151:info:configure -- Looking for intrin.h
152:info:configure -- Looking for intrin.h - not found
153:info:configure -- Looking for fenv.h
154:info:configure -- Looking for fenv.h - found
155:info:configure -- Looking for dlfcn.h
156:info:configure -- Looking for dlfcn.h - found
157:info:configure -- Compiler name: AppleClang
158:info:configure -- Looking for posix_memalign
159:info:configure -- Looking for posix_memalign - found
160:info:configure -- x86* CPU detected
161:info:configure -- Check size of void*[8]
162:info:configure -- Check size of void*[8] - done
163:info:configure -- CPU width is 64 bits, Overruled arch 32
164:info:configure -- Available architectures: generic;orc;norc
165:info:configure -- Available machines: generic_orc
166:info:configure -- BUILD TYPE = RELEASE
167:info:configure -- Base cflags = -DNDEBUG -pipe -Os -Wall
168:info:configure -- BUILD INFO ::: generic_orc ::: AppleClang ::: -DNDEBUG -pipe -Os -Wall
169:info:configure -- Compiler Version: Apple LLVM version 6.0 (clang-600.0.57) (based on LLVM 3.5svn)
170:info:configure Target: x86_64-apple-darwin13.4.0
171:info:configure Thread model: posix
172:info:configure -- The ASM compiler identification is AppleClang
173:info:configure -- Found assembler: /Applications/Utilities/Xcode.app/Contents/Developer/Toolchains/XcodeDefault.xctoolchain/usr/bin/clang
174:info:configure -- c flags: -pipe -Os -Wall;
175:info:configure -- asm flags:
176:info:configure -- Loading version 1.4 into constants...
177:info:configure -- Using install prefix: /opt/local
178:info:configure -- Configuring done
179:info:configure -- Generating done
180:info:configure -- Build files have been written to: /opt/local/var/macports/build/_opt_local_var_macports_sources_rsync.macports.org_release_tarballs_ports_science_volk/volk/work/build
181:debug:configure Executing proc-post-org.macports.configure-configure-0
182:debug:configure Privilege de-escalation not attempted as not running as root.
183:debug:build build phase started at Fri Mar 30 15:56:40 EDT 2018
184:notice:build --->  Building volk
185:debug:build Executing org.macports.build (volk)
186:debug:build Environment:
187:debug:build CC_PRINT_OPTIONS='YES'
188:debug:build CC_PRINT_OPTIONS_FILE='/opt/local/var/macports/build/_opt_local_var_macports_sources_rsync.macports.org_release_tarballs_ports_science_volk/volk/work/.CC_PRINT_OPTIONS'
189:debug:build CPATH='/opt/local/include'
190:debug:build LIBRARY_PATH='/opt/local/lib'
191:debug:build MACOSX_DEPLOYMENT_TARGET='10.9'
192:info:build Executing:  cd "/opt/local/var/macports/build/_opt_local_var_macports_sources_rsync.macports.org_release_tarballs_ports_science_volk/volk/work/build" && /usr/bin/make -j8 -w all VERBOSE=ON
193:debug:build system:  cd "/opt/local/var/macports/build/_opt_local_var_macports_sources_rsync.macports.org_release_tarballs_ports_science_volk/volk/work/build" && /usr/bin/make -j8 -w all VERBOSE=ON
194:info:build make: Entering directory `/opt/local/var/macports/build/_opt_local_var_macports_sources_rsync.macports.org_release_tarballs_ports_science_volk/volk/work/build'
195:info:build /opt/local/bin/cmake -H/opt/local/var/macports/build/_opt_local_var_macports_sources_rsync.macports.org_release_tarballs_ports_science_volk/volk/work/volk-1.4 -B/opt/local/var/macports/build/_opt_local_var_macports_sources_rsync.macports.org_release_tarballs_ports_science_volk/volk/work/build --check-build-system CMakeFiles/Makefile.cmake 0
196:info:build /opt/local/bin/cmake -E cmake_progress_start /opt/local/var/macports/build/_opt_local_var_macports_sources_rsync.macports.org_release_tarballs_ports_science_volk/volk/work/build/CMakeFiles /opt/local/var/macports/build/_opt_local_var_macports_sources_rsync.macports.org_release_tarballs_ports_science_volk/volk/work/build/CMakeFiles/progress.marks
197:info:build /Applications/Utilities/Xcode.app/Contents/Developer/usr/bin/make -f CMakeFiles/Makefile2 all
198:info:build make[1]: Entering directory `/opt/local/var/macports/build/_opt_local_var_macports_sources_rsync.macports.org_release_tarballs_ports_science_volk/volk/work/build'
199:info:build /Applications/Utilities/Xcode.app/Contents/Developer/usr/bin/make -f lib/CMakeFiles/volk_obj.dir/build.make lib/CMakeFiles/volk_obj.dir/depend
200:info:build /Applications/Utilities/Xcode.app/Contents/Developer/usr/bin/make -f python/volk_modtool/CMakeFiles/pygen_python_volk_modtool_5fba6.dir/build.make python/volk_modtool/CMakeFiles/pygen_python_volk_modtool_5fba6.dir/depend
201:info:build /Applications/Utilities/Xcode.app/Contents/Developer/usr/bin/make -f python/volk_modtool/CMakeFiles/pygen_python_volk_modtool_7de50.dir/build.make python/volk_modtool/CMakeFiles/pygen_python_volk_modtool_7de50.dir/depend
202:info:build make[2]: Entering directory `/opt/local/var/macports/build/_opt_local_var_macports_sources_rsync.macports.org_release_tarballs_ports_science_volk/volk/work/build'
203:info:build cd /opt/local/var/macports/build/_opt_local_var_macports_sources_rsync.macports.org_release_tarballs_ports_science_volk/volk/work/build && /opt/local/bin/cmake -E cmake_depends "Unix Makefiles" /opt/local/var/macports/build/_opt_local_var_macports_sources_rsync.macports.org_release_tarballs_ports_science_volk/volk/work/volk-1.4 /opt/local/var/macports/build/_opt_local_var_macports_sources_rsync.macports.org_release_tarballs_ports_science_volk/volk/work/volk-1.4/python/volk_modtool /opt/local/var/macports/build/_opt_local_var_macports_sources_rsync.macports.org_release_tarballs_ports_science_volk/volk/work/build /opt/local/var/macports/build/_opt_local_var_macports_sources_rsync.macports.org_release_tarballs_ports_science_volk/volk/work/build/python/volk_modtool /opt/local/var/macports/build/_opt_local_var_macports_sources_rsync.macports.org_release_tarballs_ports_science_volk/volk/work/build/python/volk_modtool/CMakeFiles/pygen_python_volk_modtool_5fba6.dir/DependInfo.cmake --color=
204:info:build make[2]: Entering directory `/opt/local/var/macports/build/_opt_local_var_macports_sources_rsync.macports.org_release_tarballs_ports_science_volk/volk/work/build'
205:info:build cd /opt/local/var/macports/build/_opt_local_var_macports_sources_rsync.macports.org_release_tarballs_ports_science_volk/volk/work/build && /opt/local/bin/cmake -E cmake_depends "Unix Makefiles" /opt/local/var/macports/build/_opt_local_var_macports_sources_rsync.macports.org_release_tarballs_ports_science_volk/volk/work/volk-1.4 /opt/local/var/macports/build/_opt_local_var_macports_sources_rsync.macports.org_release_tarballs_ports_science_volk/volk/work/volk-1.4/python/volk_modtool /opt/local/var/macports/build/_opt_local_var_macports_sources_rsync.macports.org_release_tarballs_ports_science_volk/volk/work/build /opt/local/var/macports/build/_opt_local_var_macports_sources_rsync.macports.org_release_tarballs_ports_science_volk/volk/work/build/python/volk_modtool /opt/local/var/macports/build/_opt_local_var_macports_sources_rsync.macports.org_release_tarballs_ports_science_volk/volk/work/build/python/volk_modtool/CMakeFiles/pygen_python_volk_modtool_7de50.dir/DependInfo.cmake --color=
206:info:build make[2]: Entering directory `/opt/local/var/macports/build/_opt_local_var_macports_sources_rsync.macports.org_release_tarballs_ports_science_volk/volk/work/build'
207:info:build Dependee "/opt/local/var/macports/build/_opt_local_var_macports_sources_rsync.macports.org_release_tarballs_ports_science_volk/volk/work/build/python/volk_modtool/CMakeFiles/pygen_python_volk_modtool_5fba6.dir/DependInfo.cmake" is newer than depender "/opt/local/var/macports/build/_opt_local_var_macports_sources_rsync.macports.org_release_tarballs_ports_science_volk/volk/work/build/python/volk_modtool/CMakeFiles/pygen_python_volk_modtool_5fba6.dir/depend.internal".
208:info:build Dependee "/opt/local/var/macports/build/_opt_local_var_macports_sources_rsync.macports.org_release_tarballs_ports_science_volk/volk/work/build/python/volk_modtool/CMakeFiles/CMakeDirectoryInformation.cmake" is newer than depender "/opt/local/var/macports/build/_opt_local_var_macports_sources_rsync.macports.org_release_tarballs_ports_science_volk/volk/work/build/python/volk_modtool/CMakeFiles/pygen_python_volk_modtool_5fba6.dir/depend.internal".
209:info:build Dependee "/opt/local/var/macports/build/_opt_local_var_macports_sources_rsync.macports.org_release_tarballs_ports_science_volk/volk/work/build/python/volk_modtool/CMakeFiles/pygen_python_volk_modtool_7de50.dir/DependInfo.cmake" is newer than depender "/opt/local/var/macports/build/_opt_local_var_macports_sources_rsync.macports.org_release_tarballs_ports_science_volk/volk/work/build/python/volk_modtool/CMakeFiles/pygen_python_volk_modtool_7de50.dir/depend.internal".
210:info:build Dependee "/opt/local/var/macports/build/_opt_local_var_macports_sources_rsync.macports.org_release_tarballs_ports_science_volk/volk/work/build/python/volk_modtool/CMakeFiles/CMakeDirectoryInformation.cmake" is newer than depender "/opt/local/var/macports/build/_opt_local_var_macports_sources_rsync.macports.org_release_tarballs_ports_science_volk/volk/work/build/python/volk_modtool/CMakeFiles/pygen_python_volk_modtool_7de50.dir/depend.internal".
211:info:build Scanning dependencies of target pygen_python_volk_modtool_7de50
212:info:build Scanning dependencies of target pygen_python_volk_modtool_5fba6
213:info:build make[2]: Leaving directory `/opt/local/var/macports/build/_opt_local_var_macports_sources_rsync.macports.org_release_tarballs_ports_science_volk/volk/work/build'
214:info:build make[2]: Leaving directory `/opt/local/var/macports/build/_opt_local_var_macports_sources_rsync.macports.org_release_tarballs_ports_science_volk/volk/work/build'
215:info:build /Applications/Utilities/Xcode.app/Contents/Developer/usr/bin/make -f python/volk_modtool/CMakeFiles/pygen_python_volk_modtool_5fba6.dir/build.make python/volk_modtool/CMakeFiles/pygen_python_volk_modtool_5fba6.dir/build
216:info:build /Applications/Utilities/Xcode.app/Contents/Developer/usr/bin/make -f python/volk_modtool/CMakeFiles/pygen_python_volk_modtool_7de50.dir/build.make python/volk_modtool/CMakeFiles/pygen_python_volk_modtool_7de50.dir/build
217:info:build make[2]: Entering directory `/opt/local/var/macports/build/_opt_local_var_macports_sources_rsync.macports.org_release_tarballs_ports_science_volk/volk/work/build'
218:info:build make[2]: Entering directory `/opt/local/var/macports/build/_opt_local_var_macports_sources_rsync.macports.org_release_tarballs_ports_science_volk/volk/work/build'
219:info:build [  1%] Generating volk_machine_generic_orc.c
220:info:build cd /opt/local/var/macports/build/_opt_local_var_macports_sources_rsync.macports.org_release_tarballs_ports_science_volk/volk/work/build/lib && /opt/local/Library/Frameworks/Python.framework/Versions/2.7/bin/python2.7 -B /opt/local/var/macports/build/_opt_local_var_macports_sources_rsync.macports.org_release_tarballs_ports_science_volk/volk/work/volk-1.4/gen/volk_tmpl_utils.py --input /opt/local/var/macports/build/_opt_local_var_macports_sources_rsync.macports.org_release_tarballs_ports_science_volk/volk/work/volk-1.4/tmpl/volk_machine_xxx.tmpl.c --output /opt/local/var/macports/build/_opt_local_var_macports_sources_rsync.macports.org_release_tarballs_ports_science_volk/volk/work/build/lib/volk_machine_generic_orc.c generic_orc
221:info:build [  2%] Generating volk_16ic_deinterleave_16i_x2_a_orc_impl.c
222:info:build [  4%] Generating volk_16ic_deinterleave_real_8i_a_orc_impl.c
223:info:build [  4%] Generating volk_16ic_magnitude_16i_a_orc_impl.c
224:info:build cd /opt/local/var/macports/build/_opt_local_var_macports_sources_rsync.macports.org_release_tarballs_ports_science_volk/volk/work/build/lib && /opt/local/bin/orcc --include math.h --implementation -o /opt/local/var/macports/build/_opt_local_var_macports_sources_rsync.macports.org_release_tarballs_ports_science_volk/volk/work/build/lib/volk_16ic_deinterleave_16i_x2_a_orc_impl.c /opt/local/var/macports/build/_opt_local_var_macports_sources_rsync.macports.org_release_tarballs_ports_science_volk/volk/work/volk-1.4/kernels/volk/asm/orc/volk_16ic_deinterleave_16i_x2_a_orc_impl.orc
225:info:build [  6%] Generating volk_16sc_magnitude_32f_aligned16_orc_impl.c
226:info:build cd /opt/local/var/macports/build/_opt_local_var_macports_sources_rsync.macports.org_release_tarballs_ports_science_volk/volk/work/build/lib && /opt/local/bin/orcc --include math.h --implementation -o /opt/local/var/macports/build/_opt_local_var_macports_sources_rsync.macports.org_release_tarballs_ports_science_volk/volk/work/build/lib/volk_16ic_magnitude_16i_a_orc_impl.c /opt/local/var/macports/build/_opt_local_var_macports_sources_rsync.macports.org_release_tarballs_ports_science_volk/volk/work/volk-1.4/kernels/volk/asm/orc/volk_16ic_magnitude_16i_a_orc_impl.orc
227:info:build cd /opt/local/var/macports/build/_opt_local_var_macports_sources_rsync.macports.org_release_tarballs_ports_science_volk/volk/work/build/lib && /opt/local/bin/orcc --include math.h --implementation -o /opt/local/var/macports/build/_opt_local_var_macports_sources_rsync.macports.org_release_tarballs_ports_science_volk/volk/work/build/lib/volk_16sc_magnitude_32f_aligned16_orc_impl.c /opt/local/var/macports/build/_opt_local_var_macports_sources_rsync.macports.org_release_tarballs_ports_science_volk/volk/work/volk-1.4/kernels/volk/asm/orc/volk_16sc_magnitude_32f_aligned16_orc_impl.orc
228:info:build cd /opt/local/var/macports/build/_opt_local_var_macports_sources_rsync.macports.org_release_tarballs_ports_science_volk/volk/work/build/lib && /opt/local/bin/orcc --include math.h --implementation -o /opt/local/var/macports/build/_opt_local_var_macports_sources_rsync.macports.org_release_tarballs_ports_science_volk/volk/work/build/lib/volk_16ic_deinterleave_real_8i_a_orc_impl.c /opt/local/var/macports/build/_opt_local_var_macports_sources_rsync.macports.org_release_tarballs_ports_science_volk/volk/work/volk-1.4/kernels/volk/asm/orc/volk_16ic_deinterleave_real_8i_a_orc_impl.orc
229:info:build [  7%] Generating volk_16ic_s32f_deinterleave_32f_x2_a_orc_impl.c
230:info:build [  8%] Shebangin volk_modtool
231:info:build cd /opt/local/var/macports/build/_opt_local_var_macports_sources_rsync.macports.org_release_tarballs_ports_science_volk/volk/work/build/lib && /opt/local/bin/orcc --include math.h --implementation -o /opt/local/var/macports/build/_opt_local_var_macports_sources_rsync.macports.org_release_tarballs_ports_science_volk/volk/work/build/lib/volk_16ic_s32f_deinterleave_32f_x2_a_orc_impl.c /opt/local/var/macports/build/_opt_local_var_macports_sources_rsync.macports.org_release_tarballs_ports_science_volk/volk/work/volk-1.4/kernels/volk/asm/orc/volk_16ic_s32f_deinterleave_32f_x2_a_orc_impl.orc
232:info:build cd /opt/local/var/macports/build/_opt_local_var_macports_sources_rsync.macports.org_release_tarballs_ports_science_volk/volk/work/build/python/volk_modtool && /opt/local/Library/Frameworks/Python.framework/Versions/2.7/bin/python2.7 -c "open('/opt/local/var/macports/build/_opt_local_var_macports_sources_rsync.macports.org_release_tarballs_ports_science_volk/volk/work/build/python/volk_modtool/volk_modtool.exe','w').write('#!/opt/local/Library/Frameworks/Python.framework/Versions/2.7/bin/python2.7\\n'+open('/opt/local/var/macports/build/_opt_local_var_macports_sources_rsync.macports.org_release_tarballs_ports_science_volk/volk/work/volk-1.4/python/volk_modtool/volk_modtool').read())"
233:info:build [  9%] Generating __init__.pyc, cfg.pyc, volk_modtool_generate.pyc
234:info:build cd /opt/local/var/macports/build/_opt_local_var_macports_sources_rsync.macports.org_release_tarballs_ports_science_volk/volk/work/build/python/volk_modtool && /opt/local/Library/Frameworks/Python.framework/Versions/2.7/bin/python2.7 /opt/local/var/macports/build/_opt_local_var_macports_sources_rsync.macports.org_release_tarballs_ports_science_volk/volk/work/build/python_compile_helper.py /opt/local/var/macports/build/_opt_local_var_macports_sources_rsync.macports.org_release_tarballs_ports_science_volk/volk/work/volk-1.4/python/volk_modtool/__init__.py /opt/local/var/macports/build/_opt_local_var_macports_sources_rsync.macports.org_release_tarballs_ports_science_volk/volk/work/volk-1.4/python/volk_modtool/cfg.py /opt/local/var/macports/build/_opt_local_var_macports_sources_rsync.macports.org_release_tarballs_ports_science_volk/volk/work/volk-1.4/python/volk_modtool/volk_modtool_generate.py /opt/local/var/macports/build/_opt_local_var_macports_sources_rsync.macports.org_release_tarballs_ports_science_volk/volk/work/build/python/volk_modtool/__init__.pyc /opt/local/var/macports/build/_opt_local_var_macports_sources_rsync.macports.org_release_tarballs_ports_science_volk/volk/work/build/python/volk_modtool/cfg.pyc /opt/local/var/macports/build/_opt_local_var_macports_sources_rsync.macports.org_release_tarballs_ports_science_volk/volk/work/build/python/volk_modtool/volk_modtool_generate.pyc
235:info:build make[2]: Leaving directory `/opt/local/var/macports/build/_opt_local_var_macports_sources_rsync.macports.org_release_tarballs_ports_science_volk/volk/work/build'
236:info:build [ 11%] Generating volk_16u_byteswap_a_orc_impl.c
237:info:build [ 12%] Generating volk_32f_sqrt_32f_a_orc_impl.c
238:info:build [ 14%] Generating volk_32f_s32f_normalize_a_orc_impl.c
239:info:build cd /opt/local/var/macports/build/_opt_local_var_macports_sources_rsync.macports.org_release_tarballs_ports_science_volk/volk/work/build/lib && /opt/local/bin/orcc --include math.h --implementation -o /opt/local/var/macports/build/_opt_local_var_macports_sources_rsync.macports.org_release_tarballs_ports_science_volk/volk/work/build/lib/volk_16u_byteswap_a_orc_impl.c /opt/local/var/macports/build/_opt_local_var_macports_sources_rsync.macports.org_release_tarballs_ports_science_volk/volk/work/volk-1.4/kernels/volk/asm/orc/volk_16u_byteswap_a_orc_impl.orc
240:info:build [ 14%] Generating volk_32f_s32f_multiply_32f_a_orc_impl.c
241:info:build cd /opt/local/var/macports/build/_opt_local_var_macports_sources_rsync.macports.org_release_tarballs_ports_science_volk/volk/work/build/lib && /opt/local/bin/orcc --include math.h --implementation -o /opt/local/var/macports/build/_opt_local_var_macports_sources_rsync.macports.org_release_tarballs_ports_science_volk/volk/work/build/lib/volk_32f_sqrt_32f_a_orc_impl.c /opt/local/var/macports/build/_opt_local_var_macports_sources_rsync.macports.org_release_tarballs_ports_science_volk/volk/work/volk-1.4/kernels/volk/asm/orc/volk_32f_sqrt_32f_a_orc_impl.orc
242:info:build cd /opt/local/var/macports/build/_opt_local_var_macports_sources_rsync.macports.org_release_tarballs_ports_science_volk/volk/work/build/lib && /opt/local/bin/orcc --include math.h --implementation -o /opt/local/var/macports/build/_opt_local_var_macports_sources_rsync.macports.org_release_tarballs_ports_science_volk/volk/work/build/lib/volk_32f_s32f_normalize_a_orc_impl.c /opt/local/var/macports/build/_opt_local_var_macports_sources_rsync.macports.org_release_tarballs_ports_science_volk/volk/work/volk-1.4/kernels/volk/asm/orc/volk_32f_s32f_normalize_a_orc_impl.orc
243:info:build cd /opt/local/var/macports/build/_opt_local_var_macports_sources_rsync.macports.org_release_tarballs_ports_science_volk/volk/work/build/lib && /opt/local/bin/orcc --include math.h --implementation -o /opt/local/var/macports/build/_opt_local_var_macports_sources_rsync.macports.org_release_tarballs_ports_science_volk/volk/work/build/lib/volk_32f_s32f_multiply_32f_a_orc_impl.c /opt/local/var/macports/build/_opt_local_var_macports_sources_rsync.macports.org_release_tarballs_ports_science_volk/volk/work/volk-1.4/kernels/volk/asm/orc/volk_32f_s32f_multiply_32f_a_orc_impl.orc
244:info:build [ 16%] Generating __init__.pyo, cfg.pyo, volk_modtool_generate.pyo
245:info:build [ 16%] Built target pygen_python_volk_modtool_5fba6
246:info:build cd /opt/local/var/macports/build/_opt_local_var_macports_sources_rsync.macports.org_release_tarballs_ports_science_volk/volk/work/build/python/volk_modtool && /opt/local/Library/Frameworks/Python.framework/Versions/2.7/bin/python2.7 -O /opt/local/var/macports/build/_opt_local_var_macports_sources_rsync.macports.org_release_tarballs_ports_science_volk/volk/work/build/python_compile_helper.py /opt/local/var/macports/build/_opt_local_var_macports_sources_rsync.macports.org_release_tarballs_ports_science_volk/volk/work/volk-1.4/python/volk_modtool/__init__.py /opt/local/var/macports/build/_opt_local_var_macports_sources_rsync.macports.org_release_tarballs_ports_science_volk/volk/work/volk-1.4/python/volk_modtool/cfg.py /opt/local/var/macports/build/_opt_local_var_macports_sources_rsync.macports.org_release_tarballs_ports_science_volk/volk/work/volk-1.4/python/volk_modtool/volk_modtool_generate.py /opt/local/var/macports/build/_opt_local_var_macports_sources_rsync.macports.org_release_tarballs_ports_science_volk/volk/work/build/python/volk_modtool/__init__.pyo /opt/local/var/macports/build/_opt_local_var_macports_sources_rsync.macports.org_release_tarballs_ports_science_volk/volk/work/build/python/volk_modtool/cfg.pyo /opt/local/var/macports/build/_opt_local_var_macports_sources_rsync.macports.org_release_tarballs_ports_science_volk/volk/work/build/python/volk_modtool/volk_modtool_generate.pyo
247:info:build [ 17%] Generating volk_32f_x2_add_32f_a_orc_impl.c
248:info:build cd /opt/local/var/macports/build/_opt_local_var_macports_sources_rsync.macports.org_release_tarballs_ports_science_volk/volk/work/build/lib && /opt/local/bin/orcc --include math.h --implementation -o /opt/local/var/macports/build/_opt_local_var_macports_sources_rsync.macports.org_release_tarballs_ports_science_volk/volk/work/build/lib/volk_32f_x2_add_32f_a_orc_impl.c /opt/local/var/macports/build/_opt_local_var_macports_sources_rsync.macports.org_release_tarballs_ports_science_volk/volk/work/volk-1.4/kernels/volk/asm/orc/volk_32f_x2_add_32f_a_orc_impl.orc
249:info:build [ 18%] Generating volk_32f_x2_divide_32f_a_orc_impl.c
250:info:build cd /opt/local/var/macports/build/_opt_local_var_macports_sources_rsync.macports.org_release_tarballs_ports_science_volk/volk/work/build/lib && /opt/local/bin/orcc --include math.h --implementation -o /opt/local/var/macports/build/_opt_local_var_macports_sources_rsync.macports.org_release_tarballs_ports_science_volk/volk/work/build/lib/volk_32f_x2_divide_32f_a_orc_impl.c /opt/local/var/macports/build/_opt_local_var_macports_sources_rsync.macports.org_release_tarballs_ports_science_volk/volk/work/volk-1.4/kernels/volk/asm/orc/volk_32f_x2_divide_32f_a_orc_impl.orc
251:info:build [ 19%] Generating volk_32f_x2_min_32f_a_orc_impl.c
252:info:build [ 20%] Generating volk_32f_x2_max_32f_a_orc_impl.c
253:info:build [ 22%] Generating volk_32f_x2_dot_prod_32f_a_orc_impl.c
254:info:build cd /opt/local/var/macports/build/_opt_local_var_macports_sources_rsync.macports.org_release_tarballs_ports_science_volk/volk/work/build/lib && /opt/local/bin/orcc --include math.h --implementation -o /opt/local/var/macports/build/_opt_local_var_macports_sources_rsync.macports.org_release_tarballs_ports_science_volk/volk/work/build/lib/volk_32f_x2_min_32f_a_orc_impl.c /opt/local/var/macports/build/_opt_local_var_macports_sources_rsync.macports.org_release_tarballs_ports_science_volk/volk/work/volk-1.4/kernels/volk/asm/orc/volk_32f_x2_min_32f_a_orc_impl.orc
255:info:build cd /opt/local/var/macports/build/_opt_local_var_macports_sources_rsync.macports.org_release_tarballs_ports_science_volk/volk/work/build/lib && /opt/local/bin/orcc --include math.h --implementation -o /opt/local/var/macports/build/_opt_local_var_macports_sources_rsync.macports.org_release_tarballs_ports_science_volk/volk/work/build/lib/volk_32f_x2_max_32f_a_orc_impl.c /opt/local/var/macports/build/_opt_local_var_macports_sources_rsync.macports.org_release_tarballs_ports_science_volk/volk/work/volk-1.4/kernels/volk/asm/orc/volk_32f_x2_max_32f_a_orc_impl.orc
256:info:build cd /opt/local/var/macports/build/_opt_local_var_macports_sources_rsync.macports.org_release_tarballs_ports_science_volk/volk/work/build/lib && /opt/local/bin/orcc --include math.h --implementation -o /opt/local/var/macports/build/_opt_local_var_macports_sources_rsync.macports.org_release_tarballs_ports_science_volk/volk/work/build/lib/volk_32f_x2_dot_prod_32f_a_orc_impl.c /opt/local/var/macports/build/_opt_local_var_macports_sources_rsync.macports.org_release_tarballs_ports_science_volk/volk/work/volk-1.4/kernels/volk/asm/orc/volk_32f_x2_dot_prod_32f_a_orc_impl.orc
257:info:build [ 23%] Generating volk_32f_x2_multiply_32f_a_orc_impl.c
258:info:build cd /opt/local/var/macports/build/_opt_local_var_macports_sources_rsync.macports.org_release_tarballs_ports_science_volk/volk/work/build/lib && /opt/local/bin/orcc --include math.h --implementation -o /opt/local/var/macports/build/_opt_local_var_macports_sources_rsync.macports.org_release_tarballs_ports_science_volk/volk/work/build/lib/volk_32f_x2_multiply_32f_a_orc_impl.c /opt/local/var/macports/build/_opt_local_var_macports_sources_rsync.macports.org_release_tarballs_ports_science_volk/volk/work/volk-1.4/kernels/volk/asm/orc/volk_32f_x2_multiply_32f_a_orc_impl.orc
259:info:build [ 24%] Generating volk_32f_x2_subtract_32f_a_orc_impl.c
260:info:build cd /opt/local/var/macports/build/_opt_local_var_macports_sources_rsync.macports.org_release_tarballs_ports_science_volk/volk/work/build/lib && /opt/local/bin/orcc --include math.h --implementation -o /opt/local/var/macports/build/_opt_local_var_macports_sources_rsync.macports.org_release_tarballs_ports_science_volk/volk/work/build/lib/volk_32f_x2_subtract_32f_a_orc_impl.c /opt/local/var/macports/build/_opt_local_var_macports_sources_rsync.macports.org_release_tarballs_ports_science_volk/volk/work/volk-1.4/kernels/volk/asm/orc/volk_32f_x2_subtract_32f_a_orc_impl.orc
261:info:build [ 25%] Generating volk_32fc_32f_multiply_32fc_a_orc_impl.c
262:info:build cd /opt/local/var/macports/build/_opt_local_var_macports_sources_rsync.macports.org_release_tarballs_ports_science_volk/volk/work/build/lib && /opt/local/bin/orcc --include math.h --implementation -o /opt/local/var/macports/build/_opt_local_var_macports_sources_rsync.macports.org_release_tarballs_ports_science_volk/volk/work/build/lib/volk_32fc_32f_multiply_32fc_a_orc_impl.c /opt/local/var/macports/build/_opt_local_var_macports_sources_rsync.macports.org_release_tarballs_ports_science_volk/volk/work/volk-1.4/kernels/volk/asm/orc/volk_32fc_32f_multiply_32fc_a_orc_impl.orc
263:info:build [ 27%] Generating volk_32fc_magnitude_32f_a_orc_impl.c
264:info:build cd /opt/local/var/macports/build/_opt_local_var_macports_sources_rsync.macports.org_release_tarballs_ports_science_volk/volk/work/build/lib && /opt/local/bin/orcc --include math.h --implementation -o /opt/local/var/macports/build/_opt_local_var_macports_sources_rsync.macports.org_release_tarballs_ports_science_volk/volk/work/build/lib/volk_32fc_magnitude_32f_a_orc_impl.c /opt/local/var/macports/build/_opt_local_var_macports_sources_rsync.macports.org_release_tarballs_ports_science_volk/volk/work/volk-1.4/kernels/volk/asm/orc/volk_32fc_magnitude_32f_a_orc_impl.orc
265:info:build [ 28%] Generating volk_32fc_s32f_magnitude_16i_a_orc_impl.c
266:info:build [ 29%] Generating volk_32fc_s32fc_multiply_32fc_a_orc_impl.c
267:info:build cd /opt/local/var/macports/build/_opt_local_var_macports_sources_rsync.macports.org_release_tarballs_ports_science_volk/volk/work/build/lib && /opt/local/bin/orcc --include math.h --implementation -o /opt/local/var/macports/build/_opt_local_var_macports_sources_rsync.macports.org_release_tarballs_ports_science_volk/volk/work/build/lib/volk_32fc_s32f_magnitude_16i_a_orc_impl.c /opt/local/var/macports/build/_opt_local_var_macports_sources_rsync.macports.org_release_tarballs_ports_science_volk/volk/work/volk-1.4/kernels/volk/asm/orc/volk_32fc_s32f_magnitude_16i_a_orc_impl.orc
268:info:build cd /opt/local/var/macports/build/_opt_local_var_macports_sources_rsync.macports.org_release_tarballs_ports_science_volk/volk/work/build/lib && /opt/local/bin/orcc --include math.h --implementation -o /opt/local/var/macports/build/_opt_local_var_macports_sources_rsync.macports.org_release_tarballs_ports_science_volk/volk/work/build/lib/volk_32fc_s32fc_multiply_32fc_a_orc_impl.c /opt/local/var/macports/build/_opt_local_var_macports_sources_rsync.macports.org_release_tarballs_ports_science_volk/volk/work/volk-1.4/kernels/volk/asm/orc/volk_32fc_s32fc_multiply_32fc_a_orc_impl.orc
269:info:build [ 30%] Generating volk_32fc_x2_multiply_32fc_a_orc_impl.c
270:info:build cd /opt/local/var/macports/build/_opt_local_var_macports_sources_rsync.macports.org_release_tarballs_ports_science_volk/volk/work/build/lib && /opt/local/bin/orcc --include math.h --implementation -o /opt/local/var/macports/build/_opt_local_var_macports_sources_rsync.macports.org_release_tarballs_ports_science_volk/volk/work/build/lib/volk_32fc_x2_multiply_32fc_a_orc_impl.c /opt/local/var/macports/build/_opt_local_var_macports_sources_rsync.macports.org_release_tarballs_ports_science_volk/volk/work/volk-1.4/kernels/volk/asm/orc/volk_32fc_x2_multiply_32fc_a_orc_impl.orc
271:info:build make[2]: Leaving directory `/opt/local/var/macports/build/_opt_local_var_macports_sources_rsync.macports.org_release_tarballs_ports_science_volk/volk/work/build'
272:info:build [ 32%] Generating volk_32i_x2_and_32i_a_orc_impl.c
273:info:build cd /opt/local/var/macports/build/_opt_local_var_macports_sources_rsync.macports.org_release_tarballs_ports_science_volk/volk/work/build/lib && /opt/local/bin/orcc --include math.h --implementation -o /opt/local/var/macports/build/_opt_local_var_macports_sources_rsync.macports.org_release_tarballs_ports_science_volk/volk/work/build/lib/volk_32i_x2_and_32i_a_orc_impl.c /opt/local/var/macports/build/_opt_local_var_macports_sources_rsync.macports.org_release_tarballs_ports_science_volk/volk/work/volk-1.4/kernels/volk/asm/orc/volk_32i_x2_and_32i_a_orc_impl.orc
274:info:build [ 33%] Generating volk_32i_x2_or_32i_a_orc_impl.c
275:info:build cd /opt/local/var/macports/build/_opt_local_var_macports_sources_rsync.macports.org_release_tarballs_ports_science_volk/volk/work/build/lib && /opt/local/bin/orcc --include math.h --implementation -o /opt/local/var/macports/build/_opt_local_var_macports_sources_rsync.macports.org_release_tarballs_ports_science_volk/volk/work/build/lib/volk_32i_x2_or_32i_a_orc_impl.c /opt/local/var/macports/build/_opt_local_var_macports_sources_rsync.macports.org_release_tarballs_ports_science_volk/volk/work/volk-1.4/kernels/volk/asm/orc/volk_32i_x2_or_32i_a_orc_impl.orc
276:info:build [ 34%] Generating volk_8i_s32f_convert_32f_a_orc_impl.c
277:info:build [ 35%] Generating volk_8i_convert_16i_a_orc_impl.c
278:info:build [ 35%] Built target pygen_python_volk_modtool_7de50
279:info:build cd /opt/local/var/macports/build/_opt_local_var_macports_sources_rsync.macports.org_release_tarballs_ports_science_volk/volk/work/build/lib && /opt/local/bin/orcc --include math.h --implementation -o /opt/local/var/macports/build/_opt_local_var_macports_sources_rsync.macports.org_release_tarballs_ports_science_volk/volk/work/build/lib/volk_8i_s32f_convert_32f_a_orc_impl.c /opt/local/var/macports/build/_opt_local_var_macports_sources_rsync.macports.org_release_tarballs_ports_science_volk/volk/work/volk-1.4/kernels/volk/asm/orc/volk_8i_s32f_convert_32f_a_orc_impl.orc
280:info:build cd /opt/local/var/macports/build/_opt_local_var_macports_sources_rsync.macports.org_release_tarballs_ports_science_volk/volk/work/build/lib && /opt/local/bin/orcc --include math.h --implementation -o /opt/local/var/macports/build/_opt_local_var_macports_sources_rsync.macports.org_release_tarballs_ports_science_volk/volk/work/build/lib/volk_8i_convert_16i_a_orc_impl.c /opt/local/var/macports/build/_opt_local_var_macports_sources_rsync.macports.org_release_tarballs_ports_science_volk/volk/work/volk-1.4/kernels/volk/asm/orc/volk_8i_convert_16i_a_orc_impl.orc
281:info:build [ 37%] Generating ../include/volk/volk.h
282:info:build cd /opt/local/var/macports/build/_opt_local_var_macports_sources_rsync.macports.org_release_tarballs_ports_science_volk/volk/work/build/lib && /opt/local/Library/Frameworks/Python.framework/Versions/2.7/bin/python2.7 -B /opt/local/var/macports/build/_opt_local_var_macports_sources_rsync.macports.org_release_tarballs_ports_science_volk/volk/work/volk-1.4/gen/volk_tmpl_utils.py --input /opt/local/var/macports/build/_opt_local_var_macports_sources_rsync.macports.org_release_tarballs_ports_science_volk/volk/work/volk-1.4/tmpl/volk.tmpl.h --output /opt/local/var/macports/build/_opt_local_var_macports_sources_rsync.macports.org_release_tarballs_ports_science_volk/volk/work/build/include/volk/volk.h
283:info:build [ 38%] Generating volk.c
284:info:build cd /opt/local/var/macports/build/_opt_local_var_macports_sources_rsync.macports.org_release_tarballs_ports_science_volk/volk/work/build/lib && /opt/local/Library/Frameworks/Python.framework/Versions/2.7/bin/python2.7 -B /opt/local/var/macports/build/_opt_local_var_macports_sources_rsync.macports.org_release_tarballs_ports_science_volk/volk/work/volk-1.4/gen/volk_tmpl_utils.py --input /opt/local/var/macports/build/_opt_local_var_macports_sources_rsync.macports.org_release_tarballs_ports_science_volk/volk/work/volk-1.4/tmpl/volk.tmpl.c --output /opt/local/var/macports/build/_opt_local_var_macports_sources_rsync.macports.org_release_tarballs_ports_science_volk/volk/work/build/lib/volk.c
285:info:build [ 39%] Generating ../include/volk/volk_typedefs.h
286:info:build cd /opt/local/var/macports/build/_opt_local_var_macports_sources_rsync.macports.org_release_tarballs_ports_science_volk/volk/work/build/lib && /opt/local/Library/Frameworks/Python.framework/Versions/2.7/bin/python2.7 -B /opt/local/var/macports/build/_opt_local_var_macports_sources_rsync.macports.org_release_tarballs_ports_science_volk/volk/work/volk-1.4/gen/volk_tmpl_utils.py --input /opt/local/var/macports/build/_opt_local_var_macports_sources_rsync.macports.org_release_tarballs_ports_science_volk/volk/work/volk-1.4/tmpl/volk_typedefs.tmpl.h --output /opt/local/var/macports/build/_opt_local_var_macports_sources_rsync.macports.org_release_tarballs_ports_science_volk/volk/work/build/include/volk/volk_typedefs.h
287:info:build [ 40%] Generating ../include/volk/volk_cpu.h
288:info:build cd /opt/local/var/macports/build/_opt_local_var_macports_sources_rsync.macports.org_release_tarballs_ports_science_volk/volk/work/build/lib && /opt/local/Library/Frameworks/Python.framework/Versions/2.7/bin/python2.7 -B /opt/local/var/macports/build/_opt_local_var_macports_sources_rsync.macports.org_release_tarballs_ports_science_volk/volk/work/volk-1.4/gen/volk_tmpl_utils.py --input /opt/local/var/macports/build/_opt_local_var_macports_sources_rsync.macports.org_release_tarballs_ports_science_volk/volk/work/volk-1.4/tmpl/volk_cpu.tmpl.h --output /opt/local/var/macports/build/_opt_local_var_macports_sources_rsync.macports.org_release_tarballs_ports_science_volk/volk/work/build/include/volk/volk_cpu.h
289:info:build [ 41%] Generating volk_cpu.c
290:info:build cd /opt/local/var/macports/build/_opt_local_var_macports_sources_rsync.macports.org_release_tarballs_ports_science_volk/volk/work/build/lib && /opt/local/Library/Frameworks/Python.framework/Versions/2.7/bin/python2.7 -B /opt/local/var/macports/build/_opt_local_var_macports_sources_rsync.macports.org_release_tarballs_ports_science_volk/volk/work/volk-1.4/gen/volk_tmpl_utils.py --input /opt/local/var/macports/build/_opt_local_var_macports_sources_rsync.macports.org_release_tarballs_ports_science_volk/volk/work/volk-1.4/tmpl/volk_cpu.tmpl.c --output /opt/local/var/macports/build/_opt_local_var_macports_sources_rsync.macports.org_release_tarballs_ports_science_volk/volk/work/build/lib/volk_cpu.c
291:info:build [ 43%] Generating volk_machines.h
292:info:build [ 44%] Generating ../include/volk/volk_config_fixed.h
293:info:build cd /opt/local/var/macports/build/_opt_local_var_macports_sources_rsync.macports.org_release_tarballs_ports_science_volk/volk/work/build/lib && /opt/local/Library/Frameworks/Python.framework/Versions/2.7/bin/python2.7 -B /opt/local/var/macports/build/_opt_local_var_macports_sources_rsync.macports.org_release_tarballs_ports_science_volk/volk/work/volk-1.4/gen/volk_tmpl_utils.py --input /opt/local/var/macports/build/_opt_local_var_macports_sources_rsync.macports.org_release_tarballs_ports_science_volk/volk/work/volk-1.4/tmpl/volk_machines.tmpl.h --output /opt/local/var/macports/build/_opt_local_var_macports_sources_rsync.macports.org_release_tarballs_ports_science_volk/volk/work/build/lib/volk_machines.h
294:info:build cd /opt/local/var/macports/build/_opt_local_var_macports_sources_rsync.macports.org_release_tarballs_ports_science_volk/volk/work/build/lib && /opt/local/Library/Frameworks/Python.framework/Versions/2.7/bin/python2.7 -B /opt/local/var/macports/build/_opt_local_var_macports_sources_rsync.macports.org_release_tarballs_ports_science_volk/volk/work/volk-1.4/gen/volk_tmpl_utils.py --input /opt/local/var/macports/build/_opt_local_var_macports_sources_rsync.macports.org_release_tarballs_ports_science_volk/volk/work/volk-1.4/tmpl/volk_config_fixed.tmpl.h --output /opt/local/var/macports/build/_opt_local_var_macports_sources_rsync.macports.org_release_tarballs_ports_science_volk/volk/work/build/include/volk/volk_config_fixed.h
295:info:build [ 45%] Generating volk_machines.c
296:info:build cd /opt/local/var/macports/build/_opt_local_var_macports_sources_rsync.macports.org_release_tarballs_ports_science_volk/volk/work/build/lib && /opt/local/Library/Frameworks/Python.framework/Versions/2.7/bin/python2.7 -B /opt/local/var/macports/build/_opt_local_var_macports_sources_rsync.macports.org_release_tarballs_ports_science_volk/volk/work/volk-1.4/gen/volk_tmpl_utils.py --input /opt/local/var/macports/build/_opt_local_var_macports_sources_rsync.macports.org_release_tarballs_ports_science_volk/volk/work/volk-1.4/tmpl/volk_machines.tmpl.c --output /opt/local/var/macports/build/_opt_local_var_macports_sources_rsync.macports.org_release_tarballs_ports_science_volk/volk/work/build/lib/volk_machines.c
297:info:build cd /opt/local/var/macports/build/_opt_local_var_macports_sources_rsync.macports.org_release_tarballs_ports_science_volk/volk/work/build && /opt/local/bin/cmake -E cmake_depends "Unix Makefiles" /opt/local/var/macports/build/_opt_local_var_macports_sources_rsync.macports.org_release_tarballs_ports_science_volk/volk/work/volk-1.4 /opt/local/var/macports/build/_opt_local_var_macports_sources_rsync.macports.org_release_tarballs_ports_science_volk/volk/work/volk-1.4/lib /opt/local/var/macports/build/_opt_local_var_macports_sources_rsync.macports.org_release_tarballs_ports_science_volk/volk/work/build /opt/local/var/macports/build/_opt_local_var_macports_sources_rsync.macports.org_release_tarballs_ports_science_volk/volk/work/build/lib /opt/local/var/macports/build/_opt_local_var_macports_sources_rsync.macports.org_release_tarballs_ports_science_volk/volk/work/build/lib/CMakeFiles/volk_obj.dir/DependInfo.cmake --color=
298:info:build Dependee "/opt/local/var/macports/build/_opt_local_var_macports_sources_rsync.macports.org_release_tarballs_ports_science_volk/volk/work/build/lib/CMakeFiles/volk_obj.dir/DependInfo.cmake" is newer than depender "/opt/local/var/macports/build/_opt_local_var_macports_sources_rsync.macports.org_release_tarballs_ports_science_volk/volk/work/build/lib/CMakeFiles/volk_obj.dir/depend.internal".
299:info:build Dependee "/opt/local/var/macports/build/_opt_local_var_macports_sources_rsync.macports.org_release_tarballs_ports_science_volk/volk/work/build/lib/CMakeFiles/CMakeDirectoryInformation.cmake" is newer than depender "/opt/local/var/macports/build/_opt_local_var_macports_sources_rsync.macports.org_release_tarballs_ports_science_volk/volk/work/build/lib/CMakeFiles/volk_obj.dir/depend.internal".
300:info:build Scanning dependencies of target volk_obj
301:info:build make[2]: Leaving directory `/opt/local/var/macports/build/_opt_local_var_macports_sources_rsync.macports.org_release_tarballs_ports_science_volk/volk/work/build'
302:info:build /Applications/Utilities/Xcode.app/Contents/Developer/usr/bin/make -f lib/CMakeFiles/volk_obj.dir/build.make lib/CMakeFiles/volk_obj.dir/build
303:info:build make[2]: Entering directory `/opt/local/var/macports/build/_opt_local_var_macports_sources_rsync.macports.org_release_tarballs_ports_science_volk/volk/work/build'
304:info:build [ 48%] Building C object lib/CMakeFiles/volk_obj.dir/volk_16ic_deinterleave_real_8i_a_orc_impl.c.o
305:info:build [ 48%] Building C object lib/CMakeFiles/volk_obj.dir/volk_16ic_magnitude_16i_a_orc_impl.c.o
306:info:build cd /opt/local/var/macports/build/_opt_local_var_macports_sources_rsync.macports.org_release_tarballs_ports_science_volk/volk/work/build/lib && /usr/bin/clang -DHAVE_CPUID_H -DHAVE_DLFCN_H -DHAVE_FENV_H -DHAVE_POSIX_MEMALIGN -DHAVE_XGETBV -D_GLIBCXX_USE_CXX11_ABI=1 -I/opt/local/include/orc-0.4 -I/opt/local/var/macports/build/_opt_local_var_macports_sources_rsync.macports.org_release_tarballs_ports_science_volk/volk/work/build/include -I/opt/local/var/macports/build/_opt_local_var_macports_sources_rsync.macports.org_release_tarballs_ports_science_volk/volk/work/volk-1.4/include -I/opt/local/var/macports/build/_opt_local_var_macports_sources_rsync.macports.org_release_tarballs_ports_science_volk/volk/work/volk-1.4/kernels -I/opt/local/var/macports/build/_opt_local_var_macports_sources_rsync.macports.org_release_tarballs_ports_science_volk/volk/work/build/lib -I/opt/local/var/macports/build/_opt_local_var_macports_sources_rsync.macports.org_release_tarballs_ports_science_volk/volk/work/volk-1.4/lib -I/opt/local/include  -pipe -Os -Wall -fvisibility=hidden -DNDEBUG -arch x86_64 -mmacosx-version-min=10.9   -fPIC -o CMakeFiles/volk_obj.dir/volk_16ic_deinterleave_real_8i_a_orc_impl.c.o   -c /opt/local/var/macports/build/_opt_local_var_macports_sources_rsync.macports.org_release_tarballs_ports_science_volk/volk/work/build/lib/volk_16ic_deinterleave_real_8i_a_orc_impl.c
307:info:build [ 49%] Building C object lib/CMakeFiles/volk_obj.dir/volk_32f_s32f_multiply_32f_a_orc_impl.c.o
308:info:build cd /opt/local/var/macports/build/_opt_local_var_macports_sources_rsync.macports.org_release_tarballs_ports_science_volk/volk/work/build/lib && /usr/bin/clang -DHAVE_CPUID_H -DHAVE_DLFCN_H -DHAVE_FENV_H -DHAVE_POSIX_MEMALIGN -DHAVE_XGETBV -D_GLIBCXX_USE_CXX11_ABI=1 -I/opt/local/include/orc-0.4 -I/opt/local/var/macports/build/_opt_local_var_macports_sources_rsync.macports.org_release_tarballs_ports_science_volk/volk/work/build/include -I/opt/local/var/macports/build/_opt_local_var_macports_sources_rsync.macports.org_release_tarballs_ports_science_volk/volk/work/volk-1.4/include -I/opt/local/var/macports/build/_opt_local_var_macports_sources_rsync.macports.org_release_tarballs_ports_science_volk/volk/work/volk-1.4/kernels -I/opt/local/var/macports/build/_opt_local_var_macports_sources_rsync.macports.org_release_tarballs_ports_science_volk/volk/work/build/lib -I/opt/local/var/macports/build/_opt_local_var_macports_sources_rsync.macports.org_release_tarballs_ports_science_volk/volk/work/volk-1.4/lib -I/opt/local/include  -pipe -Os -Wall -fvisibility=hidden -DNDEBUG -arch x86_64 -mmacosx-version-min=10.9   -fPIC -o CMakeFiles/volk_obj.dir/volk_16ic_magnitude_16i_a_orc_impl.c.o   -c /opt/local/var/macports/build/_opt_local_var_macports_sources_rsync.macports.org_release_tarballs_ports_science_volk/volk/work/build/lib/volk_16ic_magnitude_16i_a_orc_impl.c
309:info:build cd /opt/local/var/macports/build/_opt_local_var_macports_sources_rsync.macports.org_release_tarballs_ports_science_volk/volk/work/build/lib && /usr/bin/clang -DHAVE_CPUID_H -DHAVE_DLFCN_H -DHAVE_FENV_H -DHAVE_POSIX_MEMALIGN -DHAVE_XGETBV -D_GLIBCXX_USE_CXX11_ABI=1 -I/opt/local/include/orc-0.4 -I/opt/local/var/macports/build/_opt_local_var_macports_sources_rsync.macports.org_release_tarballs_ports_science_volk/volk/work/build/include -I/opt/local/var/macports/build/_opt_local_var_macports_sources_rsync.macports.org_release_tarballs_ports_science_volk/volk/work/volk-1.4/include -I/opt/local/var/macports/build/_opt_local_var_macports_sources_rsync.macports.org_release_tarballs_ports_science_volk/volk/work/volk-1.4/kernels -I/opt/local/var/macports/build/_opt_local_var_macports_sources_rsync.macports.org_release_tarballs_ports_science_volk/volk/work/build/lib -I/opt/local/var/macports/build/_opt_local_var_macports_sources_rsync.macports.org_release_tarballs_ports_science_volk/volk/work/volk-1.4/lib -I/opt/local/include  -pipe -Os -Wall -fvisibility=hidden -DNDEBUG -arch x86_64 -mmacosx-version-min=10.9   -fPIC -o CMakeFiles/volk_obj.dir/volk_32f_s32f_multiply_32f_a_orc_impl.c.o   -c /opt/local/var/macports/build/_opt_local_var_macports_sources_rsync.macports.org_release_tarballs_ports_science_volk/volk/work/build/lib/volk_32f_s32f_multiply_32f_a_orc_impl.c
310:info:build [ 50%] Building C object lib/CMakeFiles/volk_obj.dir/volk_16sc_magnitude_32f_aligned16_orc_impl.c.o
311:info:build [ 51%] Building C object lib/CMakeFiles/volk_obj.dir/volk_16u_byteswap_a_orc_impl.c.o
312:info:build cd /opt/local/var/macports/build/_opt_local_var_macports_sources_rsync.macports.org_release_tarballs_ports_science_volk/volk/work/build/lib && /usr/bin/clang -DHAVE_CPUID_H -DHAVE_DLFCN_H -DHAVE_FENV_H -DHAVE_POSIX_MEMALIGN -DHAVE_XGETBV -D_GLIBCXX_USE_CXX11_ABI=1 -I/opt/local/include/orc-0.4 -I/opt/local/var/macports/build/_opt_local_var_macports_sources_rsync.macports.org_release_tarballs_ports_science_volk/volk/work/build/include -I/opt/local/var/macports/build/_opt_local_var_macports_sources_rsync.macports.org_release_tarballs_ports_science_volk/volk/work/volk-1.4/include -I/opt/local/var/macports/build/_opt_local_var_macports_sources_rsync.macports.org_release_tarballs_ports_science_volk/volk/work/volk-1.4/kernels -I/opt/local/var/macports/build/_opt_local_var_macports_sources_rsync.macports.org_release_tarballs_ports_science_volk/volk/work/build/lib -I/opt/local/var/macports/build/_opt_local_var_macports_sources_rsync.macports.org_release_tarballs_ports_science_volk/volk/work/volk-1.4/lib -I/opt/local/include  -pipe -Os -Wall -fvisibility=hidden -DNDEBUG -arch x86_64 -mmacosx-version-min=10.9   -fPIC -o CMakeFiles/volk_obj.dir/volk_16sc_magnitude_32f_aligned16_orc_impl.c.o   -c /opt/local/var/macports/build/_opt_local_var_macports_sources_rsync.macports.org_release_tarballs_ports_science_volk/volk/work/build/lib/volk_16sc_magnitude_32f_aligned16_orc_impl.c
313:info:build cd /opt/local/var/macports/build/_opt_local_var_macports_sources_rsync.macports.org_release_tarballs_ports_science_volk/volk/work/build/lib && /usr/bin/clang -DHAVE_CPUID_H -DHAVE_DLFCN_H -DHAVE_FENV_H -DHAVE_POSIX_MEMALIGN -DHAVE_XGETBV -D_GLIBCXX_USE_CXX11_ABI=1 -I/opt/local/include/orc-0.4 -I/opt/local/var/macports/build/_opt_local_var_macports_sources_rsync.macports.org_release_tarballs_ports_science_volk/volk/work/build/include -I/opt/local/var/macports/build/_opt_local_var_macports_sources_rsync.macports.org_release_tarballs_ports_science_volk/volk/work/volk-1.4/include -I/opt/local/var/macports/build/_opt_local_var_macports_sources_rsync.macports.org_release_tarballs_ports_science_volk/volk/work/volk-1.4/kernels -I/opt/local/var/macports/build/_opt_local_var_macports_sources_rsync.macports.org_release_tarballs_ports_science_volk/volk/work/build/lib -I/opt/local/var/macports/build/_opt_local_var_macports_sources_rsync.macports.org_release_tarballs_ports_science_volk/volk/work/volk-1.4/lib -I/opt/local/include  -pipe -Os -Wall -fvisibility=hidden -DNDEBUG -arch x86_64 -mmacosx-version-min=10.9   -fPIC -o CMakeFiles/volk_obj.dir/volk_16u_byteswap_a_orc_impl.c.o   -c /opt/local/var/macports/build/_opt_local_var_macports_sources_rsync.macports.org_release_tarballs_ports_science_volk/volk/work/build/lib/volk_16u_byteswap_a_orc_impl.c
314:info:build [ 53%] Building C object lib/CMakeFiles/volk_obj.dir/volk_16ic_s32f_deinterleave_32f_x2_a_orc_impl.c.o
315:info:build cd /opt/local/var/macports/build/_opt_local_var_macports_sources_rsync.macports.org_release_tarballs_ports_science_volk/volk/work/build/lib && /usr/bin/clang -DHAVE_CPUID_H -DHAVE_DLFCN_H -DHAVE_FENV_H -DHAVE_POSIX_MEMALIGN -DHAVE_XGETBV -D_GLIBCXX_USE_CXX11_ABI=1 -I/opt/local/include/orc-0.4 -I/opt/local/var/macports/build/_opt_local_var_macports_sources_rsync.macports.org_release_tarballs_ports_science_volk/volk/work/build/include -I/opt/local/var/macports/build/_opt_local_var_macports_sources_rsync.macports.org_release_tarballs_ports_science_volk/volk/work/volk-1.4/include -I/opt/local/var/macports/build/_opt_local_var_macports_sources_rsync.macports.org_release_tarballs_ports_science_volk/volk/work/volk-1.4/kernels -I/opt/local/var/macports/build/_opt_local_var_macports_sources_rsync.macports.org_release_tarballs_ports_science_volk/volk/work/build/lib -I/opt/local/var/macports/build/_opt_local_var_macports_sources_rsync.macports.org_release_tarballs_ports_science_volk/volk/work/volk-1.4/lib -I/opt/local/include  -pipe -Os -Wall -fvisibility=hidden -DNDEBUG -arch x86_64 -mmacosx-version-min=10.9   -fPIC -o CMakeFiles/volk_obj.dir/volk_16ic_s32f_deinterleave_32f_x2_a_orc_impl.c.o   -c /opt/local/var/macports/build/_opt_local_var_macports_sources_rsync.macports.org_release_tarballs_ports_science_volk/volk/work/build/lib/volk_16ic_s32f_deinterleave_32f_x2_a_orc_impl.c
316:info:build [ 54%] Building C object lib/CMakeFiles/volk_obj.dir/volk_32f_s32f_normalize_a_orc_impl.c.o
317:info:build cd /opt/local/var/macports/build/_opt_local_var_macports_sources_rsync.macports.org_release_tarballs_ports_science_volk/volk/work/build/lib && /usr/bin/clang -DHAVE_CPUID_H -DHAVE_DLFCN_H -DHAVE_FENV_H -DHAVE_POSIX_MEMALIGN -DHAVE_XGETBV -D_GLIBCXX_USE_CXX11_ABI=1 -I/opt/local/include/orc-0.4 -I/opt/local/var/macports/build/_opt_local_var_macports_sources_rsync.macports.org_release_tarballs_ports_science_volk/volk/work/build/include -I/opt/local/var/macports/build/_opt_local_var_macports_sources_rsync.macports.org_release_tarballs_ports_science_volk/volk/work/volk-1.4/include -I/opt/local/var/macports/build/_opt_local_var_macports_sources_rsync.macports.org_release_tarballs_ports_science_volk/volk/work/volk-1.4/kernels -I/opt/local/var/macports/build/_opt_local_var_macports_sources_rsync.macports.org_release_tarballs_ports_science_volk/volk/work/build/lib -I/opt/local/var/macports/build/_opt_local_var_macports_sources_rsync.macports.org_release_tarballs_ports_science_volk/volk/work/volk-1.4/lib -I/opt/local/include  -pipe -Os -Wall -fvisibility=hidden -DNDEBUG -arch x86_64 -mmacosx-version-min=10.9   -fPIC -o CMakeFiles/volk_obj.dir/volk_32f_s32f_normalize_a_orc_impl.c.o   -c /opt/local/var/macports/build/_opt_local_var_macports_sources_rsync.macports.org_release_tarballs_ports_science_volk/volk/work/build/lib/volk_32f_s32f_normalize_a_orc_impl.c
318:info:build [ 55%] Building C object lib/CMakeFiles/volk_obj.dir/volk_16ic_deinterleave_16i_x2_a_orc_impl.c.o
319:info:build cd /opt/local/var/macports/build/_opt_local_var_macports_sources_rsync.macports.org_release_tarballs_ports_science_volk/volk/work/build/lib && /usr/bin/clang -DHAVE_CPUID_H -DHAVE_DLFCN_H -DHAVE_FENV_H -DHAVE_POSIX_MEMALIGN -DHAVE_XGETBV -D_GLIBCXX_USE_CXX11_ABI=1 -I/opt/local/include/orc-0.4 -I/opt/local/var/macports/build/_opt_local_var_macports_sources_rsync.macports.org_release_tarballs_ports_science_volk/volk/work/build/include -I/opt/local/var/macports/build/_opt_local_var_macports_sources_rsync.macports.org_release_tarballs_ports_science_volk/volk/work/volk-1.4/include -I/opt/local/var/macports/build/_opt_local_var_macports_sources_rsync.macports.org_release_tarballs_ports_science_volk/volk/work/volk-1.4/kernels -I/opt/local/var/macports/build/_opt_local_var_macports_sources_rsync.macports.org_release_tarballs_ports_science_volk/volk/work/build/lib -I/opt/local/var/macports/build/_opt_local_var_macports_sources_rsync.macports.org_release_tarballs_ports_science_volk/volk/work/volk-1.4/lib -I/opt/local/include  -pipe -Os -Wall -fvisibility=hidden -DNDEBUG -arch x86_64 -mmacosx-version-min=10.9   -fPIC -o CMakeFiles/volk_obj.dir/volk_16ic_deinterleave_16i_x2_a_orc_impl.c.o   -c /opt/local/var/macports/build/_opt_local_var_macports_sources_rsync.macports.org_release_tarballs_ports_science_volk/volk/work/build/lib/volk_16ic_deinterleave_16i_x2_a_orc_impl.c
320:info:build [ 58%] Building C object lib/CMakeFiles/volk_obj.dir/volk_32f_x2_add_32f_a_orc_impl.c.o
321:info:build [ 58%] Building C object lib/CMakeFiles/volk_obj.dir/volk_32f_sqrt_32f_a_orc_impl.c.o
322:info:build cd /opt/local/var/macports/build/_opt_local_var_macports_sources_rsync.macports.org_release_tarballs_ports_science_volk/volk/work/build/lib && /usr/bin/clang -DHAVE_CPUID_H -DHAVE_DLFCN_H -DHAVE_FENV_H -DHAVE_POSIX_MEMALIGN -DHAVE_XGETBV -D_GLIBCXX_USE_CXX11_ABI=1 -I/opt/local/include/orc-0.4 -I/opt/local/var/macports/build/_opt_local_var_macports_sources_rsync.macports.org_release_tarballs_ports_science_volk/volk/work/build/include -I/opt/local/var/macports/build/_opt_local_var_macports_sources_rsync.macports.org_release_tarballs_ports_science_volk/volk/work/volk-1.4/include -I/opt/local/var/macports/build/_opt_local_var_macports_sources_rsync.macports.org_release_tarballs_ports_science_volk/volk/work/volk-1.4/kernels -I/opt/local/var/macports/build/_opt_local_var_macports_sources_rsync.macports.org_release_tarballs_ports_science_volk/volk/work/build/lib -I/opt/local/var/macports/build/_opt_local_var_macports_sources_rsync.macports.org_release_tarballs_ports_science_volk/volk/work/volk-1.4/lib -I/opt/local/include  -pipe -Os -Wall -fvisibility=hidden -DNDEBUG -arch x86_64 -mmacosx-version-min=10.9   -fPIC -o CMakeFiles/volk_obj.dir/volk_32f_x2_add_32f_a_orc_impl.c.o   -c /opt/local/var/macports/build/_opt_local_var_macports_sources_rsync.macports.org_release_tarballs_ports_science_volk/volk/work/build/lib/volk_32f_x2_add_32f_a_orc_impl.c
323:info:build cd /opt/local/var/macports/build/_opt_local_var_macports_sources_rsync.macports.org_release_tarballs_ports_science_volk/volk/work/build/lib && /usr/bin/clang -DHAVE_CPUID_H -DHAVE_DLFCN_H -DHAVE_FENV_H -DHAVE_POSIX_MEMALIGN -DHAVE_XGETBV -D_GLIBCXX_USE_CXX11_ABI=1 -I/opt/local/include/orc-0.4 -I/opt/local/var/macports/build/_opt_local_var_macports_sources_rsync.macports.org_release_tarballs_ports_science_volk/volk/work/build/include -I/opt/local/var/macports/build/_opt_local_var_macports_sources_rsync.macports.org_release_tarballs_ports_science_volk/volk/work/volk-1.4/include -I/opt/local/var/macports/build/_opt_local_var_macports_sources_rsync.macports.org_release_tarballs_ports_science_volk/volk/work/volk-1.4/kernels -I/opt/local/var/macports/build/_opt_local_var_macports_sources_rsync.macports.org_release_tarballs_ports_science_volk/volk/work/build/lib -I/opt/local/var/macports/build/_opt_local_var_macports_sources_rsync.macports.org_release_tarballs_ports_science_volk/volk/work/volk-1.4/lib -I/opt/local/include  -pipe -Os -Wall -fvisibility=hidden -DNDEBUG -arch x86_64 -mmacosx-version-min=10.9   -fPIC -o CMakeFiles/volk_obj.dir/volk_32f_sqrt_32f_a_orc_impl.c.o   -c /opt/local/var/macports/build/_opt_local_var_macports_sources_rsync.macports.org_release_tarballs_ports_science_volk/volk/work/build/lib/volk_32f_sqrt_32f_a_orc_impl.c
324:info:build [ 59%] Building C object lib/CMakeFiles/volk_obj.dir/volk_32f_x2_divide_32f_a_orc_impl.c.o
325:info:build cd /opt/local/var/macports/build/_opt_local_var_macports_sources_rsync.macports.org_release_tarballs_ports_science_volk/volk/work/build/lib && /usr/bin/clang -DHAVE_CPUID_H -DHAVE_DLFCN_H -DHAVE_FENV_H -DHAVE_POSIX_MEMALIGN -DHAVE_XGETBV -D_GLIBCXX_USE_CXX11_ABI=1 -I/opt/local/include/orc-0.4 -I/opt/local/var/macports/build/_opt_local_var_macports_sources_rsync.macports.org_release_tarballs_ports_science_volk/volk/work/build/include -I/opt/local/var/macports/build/_opt_local_var_macports_sources_rsync.macports.org_release_tarballs_ports_science_volk/volk/work/volk-1.4/include -I/opt/local/var/macports/build/_opt_local_var_macports_sources_rsync.macports.org_release_tarballs_ports_science_volk/volk/work/volk-1.4/kernels -I/opt/local/var/macports/build/_opt_local_var_macports_sources_rsync.macports.org_release_tarballs_ports_science_volk/volk/work/build/lib -I/opt/local/var/macports/build/_opt_local_var_macports_sources_rsync.macports.org_release_tarballs_ports_science_volk/volk/work/volk-1.4/lib -I/opt/local/include  -pipe -Os -Wall -fvisibility=hidden -DNDEBUG -arch x86_64 -mmacosx-version-min=10.9   -fPIC -o CMakeFiles/volk_obj.dir/volk_32f_x2_divide_32f_a_orc_impl.c.o   -c /opt/local/var/macports/build/_opt_local_var_macports_sources_rsync.macports.org_release_tarballs_ports_science_volk/volk/work/build/lib/volk_32f_x2_divide_32f_a_orc_impl.c
326:info:build [ 60%] Building C object lib/CMakeFiles/volk_obj.dir/volk_32f_x2_dot_prod_32f_a_orc_impl.c.o
327:info:build cd /opt/local/var/macports/build/_opt_local_var_macports_sources_rsync.macports.org_release_tarballs_ports_science_volk/volk/work/build/lib && /usr/bin/clang -DHAVE_CPUID_H -DHAVE_DLFCN_H -DHAVE_FENV_H -DHAVE_POSIX_MEMALIGN -DHAVE_XGETBV -D_GLIBCXX_USE_CXX11_ABI=1 -I/opt/local/include/orc-0.4 -I/opt/local/var/macports/build/_opt_local_var_macports_sources_rsync.macports.org_release_tarballs_ports_science_volk/volk/work/build/include -I/opt/local/var/macports/build/_opt_local_var_macports_sources_rsync.macports.org_release_tarballs_ports_science_volk/volk/work/volk-1.4/include -I/opt/local/var/macports/build/_opt_local_var_macports_sources_rsync.macports.org_release_tarballs_ports_science_volk/volk/work/volk-1.4/kernels -I/opt/local/var/macports/build/_opt_local_var_macports_sources_rsync.macports.org_release_tarballs_ports_science_volk/volk/work/build/lib -I/opt/local/var/macports/build/_opt_local_var_macports_sources_rsync.macports.org_release_tarballs_ports_science_volk/volk/work/volk-1.4/lib -I/opt/local/include  -pipe -Os -Wall -fvisibility=hidden -DNDEBUG -arch x86_64 -mmacosx-version-min=10.9   -fPIC -o CMakeFiles/volk_obj.dir/volk_32f_x2_dot_prod_32f_a_orc_impl.c.o   -c /opt/local/var/macports/build/_opt_local_var_macports_sources_rsync.macports.org_release_tarballs_ports_science_volk/volk/work/build/lib/volk_32f_x2_dot_prod_32f_a_orc_impl.c
328:info:build [ 61%] Building C object lib/CMakeFiles/volk_obj.dir/volk_32f_x2_multiply_32f_a_orc_impl.c.o
329:info:build [ 62%] Building C object lib/CMakeFiles/volk_obj.dir/volk_32f_x2_min_32f_a_orc_impl.c.o
330:info:build [ 64%] Building C object lib/CMakeFiles/volk_obj.dir/volk_32f_x2_max_32f_a_orc_impl.c.o
331:info:build cd /opt/local/var/macports/build/_opt_local_var_macports_sources_rsync.macports.org_release_tarballs_ports_science_volk/volk/work/build/lib && /usr/bin/clang -DHAVE_CPUID_H -DHAVE_DLFCN_H -DHAVE_FENV_H -DHAVE_POSIX_MEMALIGN -DHAVE_XGETBV -D_GLIBCXX_USE_CXX11_ABI=1 -I/opt/local/include/orc-0.4 -I/opt/local/var/macports/build/_opt_local_var_macports_sources_rsync.macports.org_release_tarballs_ports_science_volk/volk/work/build/include -I/opt/local/var/macports/build/_opt_local_var_macports_sources_rsync.macports.org_release_tarballs_ports_science_volk/volk/work/volk-1.4/include -I/opt/local/var/macports/build/_opt_local_var_macports_sources_rsync.macports.org_release_tarballs_ports_science_volk/volk/work/volk-1.4/kernels -I/opt/local/var/macports/build/_opt_local_var_macports_sources_rsync.macports.org_release_tarballs_ports_science_volk/volk/work/build/lib -I/opt/local/var/macports/build/_opt_local_var_macports_sources_rsync.macports.org_release_tarballs_ports_science_volk/volk/work/volk-1.4/lib -I/opt/local/include  -pipe -Os -Wall -fvisibility=hidden -DNDEBUG -arch x86_64 -mmacosx-version-min=10.9   -fPIC -o CMakeFiles/volk_obj.dir/volk_32f_x2_multiply_32f_a_orc_impl.c.o   -c /opt/local/var/macports/build/_opt_local_var_macports_sources_rsync.macports.org_release_tarballs_ports_science_volk/volk/work/build/lib/volk_32f_x2_multiply_32f_a_orc_impl.c
332:info:build cd /opt/local/var/macports/build/_opt_local_var_macports_sources_rsync.macports.org_release_tarballs_ports_science_volk/volk/work/build/lib && /usr/bin/clang -DHAVE_CPUID_H -DHAVE_DLFCN_H -DHAVE_FENV_H -DHAVE_POSIX_MEMALIGN -DHAVE_XGETBV -D_GLIBCXX_USE_CXX11_ABI=1 -I/opt/local/include/orc-0.4 -I/opt/local/var/macports/build/_opt_local_var_macports_sources_rsync.macports.org_release_tarballs_ports_science_volk/volk/work/build/include -I/opt/local/var/macports/build/_opt_local_var_macports_sources_rsync.macports.org_release_tarballs_ports_science_volk/volk/work/volk-1.4/include -I/opt/local/var/macports/build/_opt_local_var_macports_sources_rsync.macports.org_release_tarballs_ports_science_volk/volk/work/volk-1.4/kernels -I/opt/local/var/macports/build/_opt_local_var_macports_sources_rsync.macports.org_release_tarballs_ports_science_volk/volk/work/build/lib -I/opt/local/var/macports/build/_opt_local_var_macports_sources_rsync.macports.org_release_tarballs_ports_science_volk/volk/work/volk-1.4/lib -I/opt/local/include  -pipe -Os -Wall -fvisibility=hidden -DNDEBUG -arch x86_64 -mmacosx-version-min=10.9   -fPIC -o CMakeFiles/volk_obj.dir/volk_32f_x2_min_32f_a_orc_impl.c.o   -c /opt/local/var/macports/build/_opt_local_var_macports_sources_rsync.macports.org_release_tarballs_ports_science_volk/volk/work/build/lib/volk_32f_x2_min_32f_a_orc_impl.c
333:info:build cd /opt/local/var/macports/build/_opt_local_var_macports_sources_rsync.macports.org_release_tarballs_ports_science_volk/volk/work/build/lib && /usr/bin/clang -DHAVE_CPUID_H -DHAVE_DLFCN_H -DHAVE_FENV_H -DHAVE_POSIX_MEMALIGN -DHAVE_XGETBV -D_GLIBCXX_USE_CXX11_ABI=1 -I/opt/local/include/orc-0.4 -I/opt/local/var/macports/build/_opt_local_var_macports_sources_rsync.macports.org_release_tarballs_ports_science_volk/volk/work/build/include -I/opt/local/var/macports/build/_opt_local_var_macports_sources_rsync.macports.org_release_tarballs_ports_science_volk/volk/work/volk-1.4/include -I/opt/local/var/macports/build/_opt_local_var_macports_sources_rsync.macports.org_release_tarballs_ports_science_volk/volk/work/volk-1.4/kernels -I/opt/local/var/macports/build/_opt_local_var_macports_sources_rsync.macports.org_release_tarballs_ports_science_volk/volk/work/build/lib -I/opt/local/var/macports/build/_opt_local_var_macports_sources_rsync.macports.org_release_tarballs_ports_science_volk/volk/work/volk-1.4/lib -I/opt/local/include  -pipe -Os -Wall -fvisibility=hidden -DNDEBUG -arch x86_64 -mmacosx-version-min=10.9   -fPIC -o CMakeFiles/volk_obj.dir/volk_32f_x2_max_32f_a_orc_impl.c.o   -c /opt/local/var/macports/build/_opt_local_var_macports_sources_rsync.macports.org_release_tarballs_ports_science_volk/volk/work/build/lib/volk_32f_x2_max_32f_a_orc_impl.c
334:info:build [ 65%] Building C object lib/CMakeFiles/volk_obj.dir/volk_32f_x2_subtract_32f_a_orc_impl.c.o
335:info:build cd /opt/local/var/macports/build/_opt_local_var_macports_sources_rsync.macports.org_release_tarballs_ports_science_volk/volk/work/build/lib && /usr/bin/clang -DHAVE_CPUID_H -DHAVE_DLFCN_H -DHAVE_FENV_H -DHAVE_POSIX_MEMALIGN -DHAVE_XGETBV -D_GLIBCXX_USE_CXX11_ABI=1 -I/opt/local/include/orc-0.4 -I/opt/local/var/macports/build/_opt_local_var_macports_sources_rsync.macports.org_release_tarballs_ports_science_volk/volk/work/build/include -I/opt/local/var/macports/build/_opt_local_var_macports_sources_rsync.macports.org_release_tarballs_ports_science_volk/volk/work/volk-1.4/include -I/opt/local/var/macports/build/_opt_local_var_macports_sources_rsync.macports.org_release_tarballs_ports_science_volk/volk/work/volk-1.4/kernels -I/opt/local/var/macports/build/_opt_local_var_macports_sources_rsync.macports.org_release_tarballs_ports_science_volk/volk/work/build/lib -I/opt/local/var/macports/build/_opt_local_var_macports_sources_rsync.macports.org_release_tarballs_ports_science_volk/volk/work/volk-1.4/lib -I/opt/local/include  -pipe -Os -Wall -fvisibility=hidden -DNDEBUG -arch x86_64 -mmacosx-version-min=10.9   -fPIC -o CMakeFiles/volk_obj.dir/volk_32f_x2_subtract_32f_a_orc_impl.c.o   -c /opt/local/var/macports/build/_opt_local_var_macports_sources_rsync.macports.org_release_tarballs_ports_science_volk/volk/work/build/lib/volk_32f_x2_subtract_32f_a_orc_impl.c
336:info:build [ 66%] Building C object lib/CMakeFiles/volk_obj.dir/volk_32fc_32f_multiply_32fc_a_orc_impl.c.o
337:info:build cd /opt/local/var/macports/build/_opt_local_var_macports_sources_rsync.macports.org_release_tarballs_ports_science_volk/volk/work/build/lib && /usr/bin/clang -DHAVE_CPUID_H -DHAVE_DLFCN_H -DHAVE_FENV_H -DHAVE_POSIX_MEMALIGN -DHAVE_XGETBV -D_GLIBCXX_USE_CXX11_ABI=1 -I/opt/local/include/orc-0.4 -I/opt/local/var/macports/build/_opt_local_var_macports_sources_rsync.macports.org_release_tarballs_ports_science_volk/volk/work/build/include -I/opt/local/var/macports/build/_opt_local_var_macports_sources_rsync.macports.org_release_tarballs_ports_science_volk/volk/work/volk-1.4/include -I/opt/local/var/macports/build/_opt_local_var_macports_sources_rsync.macports.org_release_tarballs_ports_science_volk/volk/work/volk-1.4/kernels -I/opt/local/var/macports/build/_opt_local_var_macports_sources_rsync.macports.org_release_tarballs_ports_science_volk/volk/work/build/lib -I/opt/local/var/macports/build/_opt_local_var_macports_sources_rsync.macports.org_release_tarballs_ports_science_volk/volk/work/volk-1.4/lib -I/opt/local/include  -pipe -Os -Wall -fvisibility=hidden -DNDEBUG -arch x86_64 -mmacosx-version-min=10.9   -fPIC -o CMakeFiles/volk_obj.dir/volk_32fc_32f_multiply_32fc_a_orc_impl.c.o   -c /opt/local/var/macports/build/_opt_local_var_macports_sources_rsync.macports.org_release_tarballs_ports_science_volk/volk/work/build/lib/volk_32fc_32f_multiply_32fc_a_orc_impl.c
338:info:build [ 69%] Building C object lib/CMakeFiles/volk_obj.dir/volk_32fc_s32f_magnitude_16i_a_orc_impl.c.o
339:info:build [ 69%] Building C object lib/CMakeFiles/volk_obj.dir/volk_32fc_magnitude_32f_a_orc_impl.c.o
340:info:build cd /opt/local/var/macports/build/_opt_local_var_macports_sources_rsync.macports.org_release_tarballs_ports_science_volk/volk/work/build/lib && /usr/bin/clang -DHAVE_CPUID_H -DHAVE_DLFCN_H -DHAVE_FENV_H -DHAVE_POSIX_MEMALIGN -DHAVE_XGETBV -D_GLIBCXX_USE_CXX11_ABI=1 -I/opt/local/include/orc-0.4 -I/opt/local/var/macports/build/_opt_local_var_macports_sources_rsync.macports.org_release_tarballs_ports_science_volk/volk/work/build/include -I/opt/local/var/macports/build/_opt_local_var_macports_sources_rsync.macports.org_release_tarballs_ports_science_volk/volk/work/volk-1.4/include -I/opt/local/var/macports/build/_opt_local_var_macports_sources_rsync.macports.org_release_tarballs_ports_science_volk/volk/work/volk-1.4/kernels -I/opt/local/var/macports/build/_opt_local_var_macports_sources_rsync.macports.org_release_tarballs_ports_science_volk/volk/work/build/lib -I/opt/local/var/macports/build/_opt_local_var_macports_sources_rsync.macports.org_release_tarballs_ports_science_volk/volk/work/volk-1.4/lib -I/opt/local/include  -pipe -Os -Wall -fvisibility=hidden -DNDEBUG -arch x86_64 -mmacosx-version-min=10.9   -fPIC -o CMakeFiles/volk_obj.dir/volk_32fc_s32f_magnitude_16i_a_orc_impl.c.o   -c /opt/local/var/macports/build/_opt_local_var_macports_sources_rsync.macports.org_release_tarballs_ports_science_volk/volk/work/build/lib/volk_32fc_s32f_magnitude_16i_a_orc_impl.c
341:info:build cd /opt/local/var/macports/build/_opt_local_var_macports_sources_rsync.macports.org_release_tarballs_ports_science_volk/volk/work/build/lib && /usr/bin/clang -DHAVE_CPUID_H -DHAVE_DLFCN_H -DHAVE_FENV_H -DHAVE_POSIX_MEMALIGN -DHAVE_XGETBV -D_GLIBCXX_USE_CXX11_ABI=1 -I/opt/local/include/orc-0.4 -I/opt/local/var/macports/build/_opt_local_var_macports_sources_rsync.macports.org_release_tarballs_ports_science_volk/volk/work/build/include -I/opt/local/var/macports/build/_opt_local_var_macports_sources_rsync.macports.org_release_tarballs_ports_science_volk/volk/work/volk-1.4/include -I/opt/local/var/macports/build/_opt_local_var_macports_sources_rsync.macports.org_release_tarballs_ports_science_volk/volk/work/volk-1.4/kernels -I/opt/local/var/macports/build/_opt_local_var_macports_sources_rsync.macports.org_release_tarballs_ports_science_volk/volk/work/build/lib -I/opt/local/var/macports/build/_opt_local_var_macports_sources_rsync.macports.org_release_tarballs_ports_science_volk/volk/work/volk-1.4/lib -I/opt/local/include  -pipe -Os -Wall -fvisibility=hidden -DNDEBUG -arch x86_64 -mmacosx-version-min=10.9   -fPIC -o CMakeFiles/volk_obj.dir/volk_32fc_magnitude_32f_a_orc_impl.c.o   -c /opt/local/var/macports/build/_opt_local_var_macports_sources_rsync.macports.org_release_tarballs_ports_science_volk/volk/work/build/lib/volk_32fc_magnitude_32f_a_orc_impl.c
342:info:build [ 70%] Building C object lib/CMakeFiles/volk_obj.dir/volk_32fc_s32fc_multiply_32fc_a_orc_impl.c.o
343:info:build [ 71%] Building C object lib/CMakeFiles/volk_obj.dir/volk_32fc_x2_multiply_32fc_a_orc_impl.c.o
344:info:build cd /opt/local/var/macports/build/_opt_local_var_macports_sources_rsync.macports.org_release_tarballs_ports_science_volk/volk/work/build/lib && /usr/bin/clang -DHAVE_CPUID_H -DHAVE_DLFCN_H -DHAVE_FENV_H -DHAVE_POSIX_MEMALIGN -DHAVE_XGETBV -D_GLIBCXX_USE_CXX11_ABI=1 -I/opt/local/include/orc-0.4 -I/opt/local/var/macports/build/_opt_local_var_macports_sources_rsync.macports.org_release_tarballs_ports_science_volk/volk/work/build/include -I/opt/local/var/macports/build/_opt_local_var_macports_sources_rsync.macports.org_release_tarballs_ports_science_volk/volk/work/volk-1.4/include -I/opt/local/var/macports/build/_opt_local_var_macports_sources_rsync.macports.org_release_tarballs_ports_science_volk/volk/work/volk-1.4/kernels -I/opt/local/var/macports/build/_opt_local_var_macports_sources_rsync.macports.org_release_tarballs_ports_science_volk/volk/work/build/lib -I/opt/local/var/macports/build/_opt_local_var_macports_sources_rsync.macports.org_release_tarballs_ports_science_volk/volk/work/volk-1.4/lib -I/opt/local/include  -pipe -Os -Wall -fvisibility=hidden -DNDEBUG -arch x86_64 -mmacosx-version-min=10.9   -fPIC -o CMakeFiles/volk_obj.dir/volk_32fc_s32fc_multiply_32fc_a_orc_impl.c.o   -c /opt/local/var/macports/build/_opt_local_var_macports_sources_rsync.macports.org_release_tarballs_ports_science_volk/volk/work/build/lib/volk_32fc_s32fc_multiply_32fc_a_orc_impl.c
345:info:build cd /opt/local/var/macports/build/_opt_local_var_macports_sources_rsync.macports.org_release_tarballs_ports_science_volk/volk/work/build/lib && /usr/bin/clang -DHAVE_CPUID_H -DHAVE_DLFCN_H -DHAVE_FENV_H -DHAVE_POSIX_MEMALIGN -DHAVE_XGETBV -D_GLIBCXX_USE_CXX11_ABI=1 -I/opt/local/include/orc-0.4 -I/opt/local/var/macports/build/_opt_local_var_macports_sources_rsync.macports.org_release_tarballs_ports_science_volk/volk/work/build/include -I/opt/local/var/macports/build/_opt_local_var_macports_sources_rsync.macports.org_release_tarballs_ports_science_volk/volk/work/volk-1.4/include -I/opt/local/var/macports/build/_opt_local_var_macports_sources_rsync.macports.org_release_tarballs_ports_science_volk/volk/work/volk-1.4/kernels -I/opt/local/var/macports/build/_opt_local_var_macports_sources_rsync.macports.org_release_tarballs_ports_science_volk/volk/work/build/lib -I/opt/local/var/macports/build/_opt_local_var_macports_sources_rsync.macports.org_release_tarballs_ports_science_volk/volk/work/volk-1.4/lib -I/opt/local/include  -pipe -Os -Wall -fvisibility=hidden -DNDEBUG -arch x86_64 -mmacosx-version-min=10.9   -fPIC -o CMakeFiles/volk_obj.dir/volk_32fc_x2_multiply_32fc_a_orc_impl.c.o   -c /opt/local/var/macports/build/_opt_local_var_macports_sources_rsync.macports.org_release_tarballs_ports_science_volk/volk/work/build/lib/volk_32fc_x2_multiply_32fc_a_orc_impl.c
346:info:build [ 74%] Building C object lib/CMakeFiles/volk_obj.dir/volk_8i_convert_16i_a_orc_impl.c.o
347:info:build [ 74%] Building C object lib/CMakeFiles/volk_obj.dir/volk_32i_x2_and_32i_a_orc_impl.c.o
348:info:build cd /opt/local/var/macports/build/_opt_local_var_macports_sources_rsync.macports.org_release_tarballs_ports_science_volk/volk/work/build/lib && /usr/bin/clang -DHAVE_CPUID_H -DHAVE_DLFCN_H -DHAVE_FENV_H -DHAVE_POSIX_MEMALIGN -DHAVE_XGETBV -D_GLIBCXX_USE_CXX11_ABI=1 -I/opt/local/include/orc-0.4 -I/opt/local/var/macports/build/_opt_local_var_macports_sources_rsync.macports.org_release_tarballs_ports_science_volk/volk/work/build/include -I/opt/local/var/macports/build/_opt_local_var_macports_sources_rsync.macports.org_release_tarballs_ports_science_volk/volk/work/volk-1.4/include -I/opt/local/var/macports/build/_opt_local_var_macports_sources_rsync.macports.org_release_tarballs_ports_science_volk/volk/work/volk-1.4/kernels -I/opt/local/var/macports/build/_opt_local_var_macports_sources_rsync.macports.org_release_tarballs_ports_science_volk/volk/work/build/lib -I/opt/local/var/macports/build/_opt_local_var_macports_sources_rsync.macports.org_release_tarballs_ports_science_volk/volk/work/volk-1.4/lib -I/opt/local/include  -pipe -Os -Wall -fvisibility=hidden -DNDEBUG -arch x86_64 -mmacosx-version-min=10.9   -fPIC -o CMakeFiles/volk_obj.dir/volk_8i_convert_16i_a_orc_impl.c.o   -c /opt/local/var/macports/build/_opt_local_var_macports_sources_rsync.macports.org_release_tarballs_ports_science_volk/volk/work/build/lib/volk_8i_convert_16i_a_orc_impl.c
349:info:build [ 75%] Building C object lib/CMakeFiles/volk_obj.dir/volk_32i_x2_or_32i_a_orc_impl.c.o
350:info:build cd /opt/local/var/macports/build/_opt_local_var_macports_sources_rsync.macports.org_release_tarballs_ports_science_volk/volk/work/build/lib && /usr/bin/clang -DHAVE_CPUID_H -DHAVE_DLFCN_H -DHAVE_FENV_H -DHAVE_POSIX_MEMALIGN -DHAVE_XGETBV -D_GLIBCXX_USE_CXX11_ABI=1 -I/opt/local/include/orc-0.4 -I/opt/local/var/macports/build/_opt_local_var_macports_sources_rsync.macports.org_release_tarballs_ports_science_volk/volk/work/build/include -I/opt/local/var/macports/build/_opt_local_var_macports_sources_rsync.macports.org_release_tarballs_ports_science_volk/volk/work/volk-1.4/include -I/opt/local/var/macports/build/_opt_local_var_macports_sources_rsync.macports.org_release_tarballs_ports_science_volk/volk/work/volk-1.4/kernels -I/opt/local/var/macports/build/_opt_local_var_macports_sources_rsync.macports.org_release_tarballs_ports_science_volk/volk/work/build/lib -I/opt/local/var/macports/build/_opt_local_var_macports_sources_rsync.macports.org_release_tarballs_ports_science_volk/volk/work/volk-1.4/lib -I/opt/local/include  -pipe -Os -Wall -fvisibility=hidden -DNDEBUG -arch x86_64 -mmacosx-version-min=10.9   -fPIC -o CMakeFiles/volk_obj.dir/volk_32i_x2_and_32i_a_orc_impl.c.o   -c /opt/local/var/macports/build/_opt_local_var_macports_sources_rsync.macports.org_release_tarballs_ports_science_volk/volk/work/build/lib/volk_32i_x2_and_32i_a_orc_impl.c
351:info:build cd /opt/local/var/macports/build/_opt_local_var_macports_sources_rsync.macports.org_release_tarballs_ports_science_volk/volk/work/build/lib && /usr/bin/clang -DHAVE_CPUID_H -DHAVE_DLFCN_H -DHAVE_FENV_H -DHAVE_POSIX_MEMALIGN -DHAVE_XGETBV -D_GLIBCXX_USE_CXX11_ABI=1 -I/opt/local/include/orc-0.4 -I/opt/local/var/macports/build/_opt_local_var_macports_sources_rsync.macports.org_release_tarballs_ports_science_volk/volk/work/build/include -I/opt/local/var/macports/build/_opt_local_var_macports_sources_rsync.macports.org_release_tarballs_ports_science_volk/volk/work/volk-1.4/include -I/opt/local/var/macports/build/_opt_local_var_macports_sources_rsync.macports.org_release_tarballs_ports_science_volk/volk/work/volk-1.4/kernels -I/opt/local/var/macports/build/_opt_local_var_macports_sources_rsync.macports.org_release_tarballs_ports_science_volk/volk/work/build/lib -I/opt/local/var/macports/build/_opt_local_var_macports_sources_rsync.macports.org_release_tarballs_ports_science_volk/volk/work/volk-1.4/lib -I/opt/local/include  -pipe -Os -Wall -fvisibility=hidden -DNDEBUG -arch x86_64 -mmacosx-version-min=10.9   -fPIC -o CMakeFiles/volk_obj.dir/volk_32i_x2_or_32i_a_orc_impl.c.o   -c /opt/local/var/macports/build/_opt_local_var_macports_sources_rsync.macports.org_release_tarballs_ports_science_volk/volk/work/build/lib/volk_32i_x2_or_32i_a_orc_impl.c
352:info:build [ 76%] Building C object lib/CMakeFiles/volk_obj.dir/volk_8i_s32f_convert_32f_a_orc_impl.c.o
353:info:build [ 77%] Building C object lib/CMakeFiles/volk_obj.dir/constants.c.o
354:info:build cd /opt/local/var/macports/build/_opt_local_var_macports_sources_rsync.macports.org_release_tarballs_ports_science_volk/volk/work/build/lib && /usr/bin/clang -DHAVE_CPUID_H -DHAVE_DLFCN_H -DHAVE_FENV_H -DHAVE_POSIX_MEMALIGN -DHAVE_XGETBV -D_GLIBCXX_USE_CXX11_ABI=1 -I/opt/local/include/orc-0.4 -I/opt/local/var/macports/build/_opt_local_var_macports_sources_rsync.macports.org_release_tarballs_ports_science_volk/volk/work/build/include -I/opt/local/var/macports/build/_opt_local_var_macports_sources_rsync.macports.org_release_tarballs_ports_science_volk/volk/work/volk-1.4/include -I/opt/local/var/macports/build/_opt_local_var_macports_sources_rsync.macports.org_release_tarballs_ports_science_volk/volk/work/volk-1.4/kernels -I/opt/local/var/macports/build/_opt_local_var_macports_sources_rsync.macports.org_release_tarballs_ports_science_volk/volk/work/build/lib -I/opt/local/var/macports/build/_opt_local_var_macports_sources_rsync.macports.org_release_tarballs_ports_science_volk/volk/work/volk-1.4/lib -I/opt/local/include  -pipe -Os -Wall -fvisibility=hidden -DNDEBUG -arch x86_64 -mmacosx-version-min=10.9   -fPIC -o CMakeFiles/volk_obj.dir/constants.c.o   -c /opt/local/var/macports/build/_opt_local_var_macports_sources_rsync.macports.org_release_tarballs_ports_science_volk/volk/work/build/lib/constants.c
355:info:build cd /opt/local/var/macports/build/_opt_local_var_macports_sources_rsync.macports.org_release_tarballs_ports_science_volk/volk/work/build/lib && /usr/bin/clang -DHAVE_CPUID_H -DHAVE_DLFCN_H -DHAVE_FENV_H -DHAVE_POSIX_MEMALIGN -DHAVE_XGETBV -D_GLIBCXX_USE_CXX11_ABI=1 -I/opt/local/include/orc-0.4 -I/opt/local/var/macports/build/_opt_local_var_macports_sources_rsync.macports.org_release_tarballs_ports_science_volk/volk/work/build/include -I/opt/local/var/macports/build/_opt_local_var_macports_sources_rsync.macports.org_release_tarballs_ports_science_volk/volk/work/volk-1.4/include -I/opt/local/var/macports/build/_opt_local_var_macports_sources_rsync.macports.org_release_tarballs_ports_science_volk/volk/work/volk-1.4/kernels -I/opt/local/var/macports/build/_opt_local_var_macports_sources_rsync.macports.org_release_tarballs_ports_science_volk/volk/work/build/lib -I/opt/local/var/macports/build/_opt_local_var_macports_sources_rsync.macports.org_release_tarballs_ports_science_volk/volk/work/volk-1.4/lib -I/opt/local/include  -pipe -Os -Wall -fvisibility=hidden -DNDEBUG -arch x86_64 -mmacosx-version-min=10.9   -fPIC -o CMakeFiles/volk_obj.dir/volk_8i_s32f_convert_32f_a_orc_impl.c.o   -c /opt/local/var/macports/build/_opt_local_var_macports_sources_rsync.macports.org_release_tarballs_ports_science_volk/volk/work/build/lib/volk_8i_s32f_convert_32f_a_orc_impl.c
356:info:build [ 79%] Building C object lib/CMakeFiles/volk_obj.dir/volk_rank_archs.c.o
357:info:build [ 80%] Building C object lib/CMakeFiles/volk_obj.dir/volk_prefs.c.o
358:info:build cd /opt/local/var/macports/build/_opt_local_var_macports_sources_rsync.macports.org_release_tarballs_ports_science_volk/volk/work/build/lib && /usr/bin/clang -DHAVE_CPUID_H -DHAVE_DLFCN_H -DHAVE_FENV_H -DHAVE_POSIX_MEMALIGN -DHAVE_XGETBV -D_GLIBCXX_USE_CXX11_ABI=1 -I/opt/local/include/orc-0.4 -I/opt/local/var/macports/build/_opt_local_var_macports_sources_rsync.macports.org_release_tarballs_ports_science_volk/volk/work/build/include -I/opt/local/var/macports/build/_opt_local_var_macports_sources_rsync.macports.org_release_tarballs_ports_science_volk/volk/work/volk-1.4/include -I/opt/local/var/macports/build/_opt_local_var_macports_sources_rsync.macports.org_release_tarballs_ports_science_volk/volk/work/volk-1.4/kernels -I/opt/local/var/macports/build/_opt_local_var_macports_sources_rsync.macports.org_release_tarballs_ports_science_volk/volk/work/build/lib -I/opt/local/var/macports/build/_opt_local_var_macports_sources_rsync.macports.org_release_tarballs_ports_science_volk/volk/work/volk-1.4/lib -I/opt/local/include  -pipe -Os -Wall -fvisibility=hidden -DNDEBUG -arch x86_64 -mmacosx-version-min=10.9   -fPIC -o CMakeFiles/volk_obj.dir/volk_rank_archs.c.o   -c /opt/local/var/macports/build/_opt_local_var_macports_sources_rsync.macports.org_release_tarballs_ports_science_volk/volk/work/volk-1.4/lib/volk_rank_archs.c
359:info:build [ 81%] Building C object lib/CMakeFiles/volk_obj.dir/volk_malloc.c.o
360:info:build cd /opt/local/var/macports/build/_opt_local_var_macports_sources_rsync.macports.org_release_tarballs_ports_science_volk/volk/work/build/lib && /usr/bin/clang -DHAVE_CPUID_H -DHAVE_DLFCN_H -DHAVE_FENV_H -DHAVE_POSIX_MEMALIGN -DHAVE_XGETBV -D_GLIBCXX_USE_CXX11_ABI=1 -I/opt/local/include/orc-0.4 -I/opt/local/var/macports/build/_opt_local_var_macports_sources_rsync.macports.org_release_tarballs_ports_science_volk/volk/work/build/include -I/opt/local/var/macports/build/_opt_local_var_macports_sources_rsync.macports.org_release_tarballs_ports_science_volk/volk/work/volk-1.4/include -I/opt/local/var/macports/build/_opt_local_var_macports_sources_rsync.macports.org_release_tarballs_ports_science_volk/volk/work/volk-1.4/kernels -I/opt/local/var/macports/build/_opt_local_var_macports_sources_rsync.macports.org_release_tarballs_ports_science_volk/volk/work/build/lib -I/opt/local/var/macports/build/_opt_local_var_macports_sources_rsync.macports.org_release_tarballs_ports_science_volk/volk/work/volk-1.4/lib -I/opt/local/include  -pipe -Os -Wall -fvisibility=hidden -DNDEBUG -arch x86_64 -mmacosx-version-min=10.9   -fPIC -o CMakeFiles/volk_obj.dir/volk_prefs.c.o   -c /opt/local/var/macports/build/_opt_local_var_macports_sources_rsync.macports.org_release_tarballs_ports_science_volk/volk/work/volk-1.4/lib/volk_prefs.c
361:info:build cd /opt/local/var/macports/build/_opt_local_var_macports_sources_rsync.macports.org_release_tarballs_ports_science_volk/volk/work/build/lib && /usr/bin/clang -DHAVE_CPUID_H -DHAVE_DLFCN_H -DHAVE_FENV_H -DHAVE_POSIX_MEMALIGN -DHAVE_XGETBV -D_GLIBCXX_USE_CXX11_ABI=1 -I/opt/local/include/orc-0.4 -I/opt/local/var/macports/build/_opt_local_var_macports_sources_rsync.macports.org_release_tarballs_ports_science_volk/volk/work/build/include -I/opt/local/var/macports/build/_opt_local_var_macports_sources_rsync.macports.org_release_tarballs_ports_science_volk/volk/work/volk-1.4/include -I/opt/local/var/macports/build/_opt_local_var_macports_sources_rsync.macports.org_release_tarballs_ports_science_volk/volk/work/volk-1.4/kernels -I/opt/local/var/macports/build/_opt_local_var_macports_sources_rsync.macports.org_release_tarballs_ports_science_volk/volk/work/build/lib -I/opt/local/var/macports/build/_opt_local_var_macports_sources_rsync.macports.org_release_tarballs_ports_science_volk/volk/work/volk-1.4/lib -I/opt/local/include  -pipe -Os -Wall -fvisibility=hidden -DNDEBUG -arch x86_64 -mmacosx-version-min=10.9   -fPIC -o CMakeFiles/volk_obj.dir/volk_malloc.c.o   -c /opt/local/var/macports/build/_opt_local_var_macports_sources_rsync.macports.org_release_tarballs_ports_science_volk/volk/work/volk-1.4/lib/volk_malloc.c
362:info:build [ 82%] Building C object lib/CMakeFiles/volk_obj.dir/volk.c.o
363:info:build [ 83%] Building C object lib/CMakeFiles/volk_obj.dir/volk_cpu.c.o
364:info:build cd /opt/local/var/macports/build/_opt_local_var_macports_sources_rsync.macports.org_release_tarballs_ports_science_volk/volk/work/build/lib && /usr/bin/clang -DHAVE_CPUID_H -DHAVE_DLFCN_H -DHAVE_FENV_H -DHAVE_POSIX_MEMALIGN -DHAVE_XGETBV -D_GLIBCXX_USE_CXX11_ABI=1 -DLV_MACHINE_GENERIC_ORC -I/opt/local/include/orc-0.4 -I/opt/local/var/macports/build/_opt_local_var_macports_sources_rsync.macports.org_release_tarballs_ports_science_volk/volk/work/build/include -I/opt/local/var/macports/build/_opt_local_var_macports_sources_rsync.macports.org_release_tarballs_ports_science_volk/volk/work/volk-1.4/include -I/opt/local/var/macports/build/_opt_local_var_macports_sources_rsync.macports.org_release_tarballs_ports_science_volk/volk/work/volk-1.4/kernels -I/opt/local/var/macports/build/_opt_local_var_macports_sources_rsync.macports.org_release_tarballs_ports_science_volk/volk/work/build/lib -I/opt/local/var/macports/build/_opt_local_var_macports_sources_rsync.macports.org_release_tarballs_ports_science_volk/volk/work/volk-1.4/lib -I/opt/local/include  -pipe -Os -Wall -fvisibility=hidden -DNDEBUG -arch x86_64 -mmacosx-version-min=10.9   -fPIC -o CMakeFiles/volk_obj.dir/volk.c.o   -c /opt/local/var/macports/build/_opt_local_var_macports_sources_rsync.macports.org_release_tarballs_ports_science_volk/volk/work/build/lib/volk.c
365:info:build cd /opt/local/var/macports/build/_opt_local_var_macports_sources_rsync.macports.org_release_tarballs_ports_science_volk/volk/work/build/lib && /usr/bin/clang -DHAVE_CPUID_H -DHAVE_DLFCN_H -DHAVE_FENV_H -DHAVE_POSIX_MEMALIGN -DHAVE_XGETBV -D_GLIBCXX_USE_CXX11_ABI=1 -I/opt/local/include/orc-0.4 -I/opt/local/var/macports/build/_opt_local_var_macports_sources_rsync.macports.org_release_tarballs_ports_science_volk/volk/work/build/include -I/opt/local/var/macports/build/_opt_local_var_macports_sources_rsync.macports.org_release_tarballs_ports_science_volk/volk/work/volk-1.4/include -I/opt/local/var/macports/build/_opt_local_var_macports_sources_rsync.macports.org_release_tarballs_ports_science_volk/volk/work/volk-1.4/kernels -I/opt/local/var/macports/build/_opt_local_var_macports_sources_rsync.macports.org_release_tarballs_ports_science_volk/volk/work/build/lib -I/opt/local/var/macports/build/_opt_local_var_macports_sources_rsync.macports.org_release_tarballs_ports_science_volk/volk/work/volk-1.4/lib -I/opt/local/include  -pipe -Os -Wall -fvisibility=hidden -DNDEBUG -arch x86_64 -mmacosx-version-min=10.9   -fPIC -o CMakeFiles/volk_obj.dir/volk_cpu.c.o   -c /opt/local/var/macports/build/_opt_local_var_macports_sources_rsync.macports.org_release_tarballs_ports_science_volk/volk/work/build/lib/volk_cpu.c
366:info:build [ 85%] Building C object lib/CMakeFiles/volk_obj.dir/volk_machines.c.o
367:info:build cd /opt/local/var/macports/build/_opt_local_var_macports_sources_rsync.macports.org_release_tarballs_ports_science_volk/volk/work/build/lib && /usr/bin/clang -DHAVE_CPUID_H -DHAVE_DLFCN_H -DHAVE_FENV_H -DHAVE_POSIX_MEMALIGN -DHAVE_XGETBV -D_GLIBCXX_USE_CXX11_ABI=1 -DLV_MACHINE_GENERIC_ORC -I/opt/local/include/orc-0.4 -I/opt/local/var/macports/build/_opt_local_var_macports_sources_rsync.macports.org_release_tarballs_ports_science_volk/volk/work/build/include -I/opt/local/var/macports/build/_opt_local_var_macports_sources_rsync.macports.org_release_tarballs_ports_science_volk/volk/work/volk-1.4/include -I/opt/local/var/macports/build/_opt_local_var_macports_sources_rsync.macports.org_release_tarballs_ports_science_volk/volk/work/volk-1.4/kernels -I/opt/local/var/macports/build/_opt_local_var_macports_sources_rsync.macports.org_release_tarballs_ports_science_volk/volk/work/build/lib -I/opt/local/var/macports/build/_opt_local_var_macports_sources_rsync.macports.org_release_tarballs_ports_science_volk/volk/work/volk-1.4/lib -I/opt/local/include  -pipe -Os -Wall -fvisibility=hidden -DNDEBUG -arch x86_64 -mmacosx-version-min=10.9   -fPIC -o CMakeFiles/volk_obj.dir/volk_machines.c.o   -c /opt/local/var/macports/build/_opt_local_var_macports_sources_rsync.macports.org_release_tarballs_ports_science_volk/volk/work/build/lib/volk_machines.c
368:info:build [ 86%] Building C object lib/CMakeFiles/volk_obj.dir/volk_machine_generic_orc.c.o
369:info:build cd /opt/local/var/macports/build/_opt_local_var_macports_sources_rsync.macports.org_release_tarballs_ports_science_volk/volk/work/build/lib && /usr/bin/clang -DHAVE_CPUID_H -DHAVE_DLFCN_H -DHAVE_FENV_H -DHAVE_POSIX_MEMALIGN -DHAVE_XGETBV -D_GLIBCXX_USE_CXX11_ABI=1 -I/opt/local/include/orc-0.4 -I/opt/local/var/macports/build/_opt_local_var_macports_sources_rsync.macports.org_release_tarballs_ports_science_volk/volk/work/build/include -I/opt/local/var/macports/build/_opt_local_var_macports_sources_rsync.macports.org_release_tarballs_ports_science_volk/volk/work/volk-1.4/include -I/opt/local/var/macports/build/_opt_local_var_macports_sources_rsync.macports.org_release_tarballs_ports_science_volk/volk/work/volk-1.4/kernels -I/opt/local/var/macports/build/_opt_local_var_macports_sources_rsync.macports.org_release_tarballs_ports_science_volk/volk/work/build/lib -I/opt/local/var/macports/build/_opt_local_var_macports_sources_rsync.macports.org_release_tarballs_ports_science_volk/volk/work/volk-1.4/lib -I/opt/local/include  -pipe -Os -Wall -fvisibility=hidden -DNDEBUG -arch x86_64 -mmacosx-version-min=10.9   -fPIC -o CMakeFiles/volk_obj.dir/volk_machine_generic_orc.c.o   -c /opt/local/var/macports/build/_opt_local_var_macports_sources_rsync.macports.org_release_tarballs_ports_science_volk/volk/work/build/lib/volk_machine_generic_orc.c
370:info:build make[2]: Leaving directory `/opt/local/var/macports/build/_opt_local_var_macports_sources_rsync.macports.org_release_tarballs_ports_science_volk/volk/work/build'
371:info:build [ 86%] Built target volk_obj
372:info:build /Applications/Utilities/Xcode.app/Contents/Developer/usr/bin/make -f lib/CMakeFiles/volk.dir/build.make lib/CMakeFiles/volk.dir/depend
373:info:build make[2]: Entering directory `/opt/local/var/macports/build/_opt_local_var_macports_sources_rsync.macports.org_release_tarballs_ports_science_volk/volk/work/build'
374:info:build cd /opt/local/var/macports/build/_opt_local_var_macports_sources_rsync.macports.org_release_tarballs_ports_science_volk/volk/work/build && /opt/local/bin/cmake -E cmake_depends "Unix Makefiles" /opt/local/var/macports/build/_opt_local_var_macports_sources_rsync.macports.org_release_tarballs_ports_science_volk/volk/work/volk-1.4 /opt/local/var/macports/build/_opt_local_var_macports_sources_rsync.macports.org_release_tarballs_ports_science_volk/volk/work/volk-1.4/lib /opt/local/var/macports/build/_opt_local_var_macports_sources_rsync.macports.org_release_tarballs_ports_science_volk/volk/work/build /opt/local/var/macports/build/_opt_local_var_macports_sources_rsync.macports.org_release_tarballs_ports_science_volk/volk/work/build/lib /opt/local/var/macports/build/_opt_local_var_macports_sources_rsync.macports.org_release_tarballs_ports_science_volk/volk/work/build/lib/CMakeFiles/volk.dir/DependInfo.cmake --color=
375:info:build Dependee "/opt/local/var/macports/build/_opt_local_var_macports_sources_rsync.macports.org_release_tarballs_ports_science_volk/volk/work/build/lib/CMakeFiles/volk.dir/DependInfo.cmake" is newer than depender "/opt/local/var/macports/build/_opt_local_var_macports_sources_rsync.macports.org_release_tarballs_ports_science_volk/volk/work/build/lib/CMakeFiles/volk.dir/depend.internal".
376:info:build Dependee "/opt/local/var/macports/build/_opt_local_var_macports_sources_rsync.macports.org_release_tarballs_ports_science_volk/volk/work/build/lib/CMakeFiles/CMakeDirectoryInformation.cmake" is newer than depender "/opt/local/var/macports/build/_opt_local_var_macports_sources_rsync.macports.org_release_tarballs_ports_science_volk/volk/work/build/lib/CMakeFiles/volk.dir/depend.internal".
377:info:build Scanning dependencies of target volk
378:info:build make[2]: Leaving directory `/opt/local/var/macports/build/_opt_local_var_macports_sources_rsync.macports.org_release_tarballs_ports_science_volk/volk/work/build'
379:info:build /Applications/Utilities/Xcode.app/Contents/Developer/usr/bin/make -f lib/CMakeFiles/volk.dir/build.make lib/CMakeFiles/volk.dir/build
380:info:build make[2]: Entering directory `/opt/local/var/macports/build/_opt_local_var_macports_sources_rsync.macports.org_release_tarballs_ports_science_volk/volk/work/build'
381:info:build [ 87%] Linking C shared library libvolk.dylib
382:info:build cd /opt/local/var/macports/build/_opt_local_var_macports_sources_rsync.macports.org_release_tarballs_ports_science_volk/volk/work/build/lib && /opt/local/bin/cmake -E cmake_link_script CMakeFiles/volk.dir/link.txt --verbose=ON
383:info:build /usr/bin/clang -pipe -Os -Wall -fvisibility=hidden -DNDEBUG -arch x86_64 -mmacosx-version-min=10.9 -dynamiclib -Wl,-headerpad_max_install_names -Wl,-headerpad_max_install_names -compatibility_version 1.4.0 -o libvolk.1.4.dylib -install_name /opt/local/lib/libvolk.1.4.dylib CMakeFiles/volk_obj.dir/volk_16ic_deinterleave_16i_x2_a_orc_impl.c.o CMakeFiles/volk_obj.dir/volk_16ic_deinterleave_real_8i_a_orc_impl.c.o CMakeFiles/volk_obj.dir/volk_16ic_magnitude_16i_a_orc_impl.c.o CMakeFiles/volk_obj.dir/volk_16ic_s32f_deinterleave_32f_x2_a_orc_impl.c.o CMakeFiles/volk_obj.dir/volk_16sc_magnitude_32f_aligned16_orc_impl.c.o CMakeFiles/volk_obj.dir/volk_16u_byteswap_a_orc_impl.c.o CMakeFiles/volk_obj.dir/volk_32f_s32f_multiply_32f_a_orc_impl.c.o CMakeFiles/volk_obj.dir/volk_32f_s32f_normalize_a_orc_impl.c.o CMakeFiles/volk_obj.dir/volk_32f_sqrt_32f_a_orc_impl.c.o CMakeFiles/volk_obj.dir/volk_32f_x2_add_32f_a_orc_impl.c.o CMakeFiles/volk_obj.dir/volk_32f_x2_divide_32f_a_orc_impl.c.o CMakeFiles/volk_obj.dir/volk_32f_x2_dot_prod_32f_a_orc_impl.c.o CMakeFiles/volk_obj.dir/volk_32f_x2_max_32f_a_orc_impl.c.o CMakeFiles/volk_obj.dir/volk_32f_x2_min_32f_a_orc_impl.c.o CMakeFiles/volk_obj.dir/volk_32f_x2_multiply_32f_a_orc_impl.c.o CMakeFiles/volk_obj.dir/volk_32f_x2_subtract_32f_a_orc_impl.c.o CMakeFiles/volk_obj.dir/volk_32fc_32f_multiply_32fc_a_orc_impl.c.o CMakeFiles/volk_obj.dir/volk_32fc_magnitude_32f_a_orc_impl.c.o CMakeFiles/volk_obj.dir/volk_32fc_s32f_magnitude_16i_a_orc_impl.c.o CMakeFiles/volk_obj.dir/volk_32fc_s32fc_multiply_32fc_a_orc_impl.c.o CMakeFiles/volk_obj.dir/volk_32fc_x2_multiply_32fc_a_orc_impl.c.o CMakeFiles/volk_obj.dir/volk_32i_x2_and_32i_a_orc_impl.c.o CMakeFiles/volk_obj.dir/volk_32i_x2_or_32i_a_orc_impl.c.o CMakeFiles/volk_obj.dir/volk_8i_convert_16i_a_orc_impl.c.o CMakeFiles/volk_obj.dir/volk_8i_s32f_convert_32f_a_orc_impl.c.o CMakeFiles/volk_obj.dir/constants.c.o CMakeFiles/volk_obj.dir/volk_prefs.c.o CMakeFiles/volk_obj.dir/volk_rank_archs.c.o CMakeFiles/volk_obj.dir/volk_malloc.c.o CMakeFiles/volk_obj.dir/volk.c.o CMakeFiles/volk_obj.dir/volk_cpu.c.o CMakeFiles/volk_obj.dir/volk_machines.c.o CMakeFiles/volk_obj.dir/volk_machine_generic_orc.c.o -Wl,-rpath,/opt/local/lib /opt/local/lib/liborc-0.4.dylib
384:info:build cd /opt/local/var/macports/build/_opt_local_var_macports_sources_rsync.macports.org_release_tarballs_ports_science_volk/volk/work/build/lib && /opt/local/bin/cmake -E cmake_symlink_library libvolk.1.4.dylib libvolk.1.4.dylib libvolk.dylib
385:info:build make[2]: Leaving directory `/opt/local/var/macports/build/_opt_local_var_macports_sources_rsync.macports.org_release_tarballs_ports_science_volk/volk/work/build'
386:info:build [ 87%] Built target volk
387:info:build /Applications/Utilities/Xcode.app/Contents/Developer/usr/bin/make -f lib/CMakeFiles/volk_test_all.dir/build.make lib/CMakeFiles/volk_test_all.dir/depend
388:info:build /Applications/Utilities/Xcode.app/Contents/Developer/usr/bin/make -f apps/CMakeFiles/volk_profile.dir/build.make apps/CMakeFiles/volk_profile.dir/depend
389:info:build /Applications/Utilities/Xcode.app/Contents/Developer/usr/bin/make -f apps/CMakeFiles/volk-config-info.dir/build.make apps/CMakeFiles/volk-config-info.dir/depend
390:info:build make[2]: Entering directory `/opt/local/var/macports/build/_opt_local_var_macports_sources_rsync.macports.org_release_tarballs_ports_science_volk/volk/work/build'
391:info:build cd /opt/local/var/macports/build/_opt_local_var_macports_sources_rsync.macports.org_release_tarballs_ports_science_volk/volk/work/build && /opt/local/bin/cmake -E cmake_depends "Unix Makefiles" /opt/local/var/macports/build/_opt_local_var_macports_sources_rsync.macports.org_release_tarballs_ports_science_volk/volk/work/volk-1.4 /opt/local/var/macports/build/_opt_local_var_macports_sources_rsync.macports.org_release_tarballs_ports_science_volk/volk/work/volk-1.4/lib /opt/local/var/macports/build/_opt_local_var_macports_sources_rsync.macports.org_release_tarballs_ports_science_volk/volk/work/build /opt/local/var/macports/build/_opt_local_var_macports_sources_rsync.macports.org_release_tarballs_ports_science_volk/volk/work/build/lib /opt/local/var/macports/build/_opt_local_var_macports_sources_rsync.macports.org_release_tarballs_ports_science_volk/volk/work/build/lib/CMakeFiles/volk_test_all.dir/DependInfo.cmake --color=
392:info:build make[2]: Entering directory `/opt/local/var/macports/build/_opt_local_var_macports_sources_rsync.macports.org_release_tarballs_ports_science_volk/volk/work/build'
393:info:build cd /opt/local/var/macports/build/_opt_local_var_macports_sources_rsync.macports.org_release_tarballs_ports_science_volk/volk/work/build && /opt/local/bin/cmake -E cmake_depends "Unix Makefiles" /opt/local/var/macports/build/_opt_local_var_macports_sources_rsync.macports.org_release_tarballs_ports_science_volk/volk/work/volk-1.4 /opt/local/var/macports/build/_opt_local_var_macports_sources_rsync.macports.org_release_tarballs_ports_science_volk/volk/work/volk-1.4/apps /opt/local/var/macports/build/_opt_local_var_macports_sources_rsync.macports.org_release_tarballs_ports_science_volk/volk/work/build /opt/local/var/macports/build/_opt_local_var_macports_sources_rsync.macports.org_release_tarballs_ports_science_volk/volk/work/build/apps /opt/local/var/macports/build/_opt_local_var_macports_sources_rsync.macports.org_release_tarballs_ports_science_volk/volk/work/build/apps/CMakeFiles/volk_profile.dir/DependInfo.cmake --color=
394:info:build make[2]: Entering directory `/opt/local/var/macports/build/_opt_local_var_macports_sources_rsync.macports.org_release_tarballs_ports_science_volk/volk/work/build'
395:info:build cd /opt/local/var/macports/build/_opt_local_var_macports_sources_rsync.macports.org_release_tarballs_ports_science_volk/volk/work/build && /opt/local/bin/cmake -E cmake_depends "Unix Makefiles" /opt/local/var/macports/build/_opt_local_var_macports_sources_rsync.macports.org_release_tarballs_ports_science_volk/volk/work/volk-1.4 /opt/local/var/macports/build/_opt_local_var_macports_sources_rsync.macports.org_release_tarballs_ports_science_volk/volk/work/volk-1.4/apps /opt/local/var/macports/build/_opt_local_var_macports_sources_rsync.macports.org_release_tarballs_ports_science_volk/volk/work/build /opt/local/var/macports/build/_opt_local_var_macports_sources_rsync.macports.org_release_tarballs_ports_science_volk/volk/work/build/apps /opt/local/var/macports/build/_opt_local_var_macports_sources_rsync.macports.org_release_tarballs_ports_science_volk/volk/work/build/apps/CMakeFiles/volk-config-info.dir/DependInfo.cmake --color=
396:info:build Dependee "/opt/local/var/macports/build/_opt_local_var_macports_sources_rsync.macports.org_release_tarballs_ports_science_volk/volk/work/build/lib/CMakeFiles/volk_test_all.dir/DependInfo.cmake" is newer than depender "/opt/local/var/macports/build/_opt_local_var_macports_sources_rsync.macports.org_release_tarballs_ports_science_volk/volk/work/build/lib/CMakeFiles/volk_test_all.dir/depend.internal".
397:info:build Dependee "/opt/local/var/macports/build/_opt_local_var_macports_sources_rsync.macports.org_release_tarballs_ports_science_volk/volk/work/build/lib/CMakeFiles/CMakeDirectoryInformation.cmake" is newer than depender "/opt/local/var/macports/build/_opt_local_var_macports_sources_rsync.macports.org_release_tarballs_ports_science_volk/volk/work/build/lib/CMakeFiles/volk_test_all.dir/depend.internal".
398:info:build Dependee "/opt/local/var/macports/build/_opt_local_var_macports_sources_rsync.macports.org_release_tarballs_ports_science_volk/volk/work/build/apps/CMakeFiles/volk_profile.dir/DependInfo.cmake" is newer than depender "/opt/local/var/macports/build/_opt_local_var_macports_sources_rsync.macports.org_release_tarballs_ports_science_volk/volk/work/build/apps/CMakeFiles/volk_profile.dir/depend.internal".
399:info:build Dependee "/opt/local/var/macports/build/_opt_local_var_macports_sources_rsync.macports.org_release_tarballs_ports_science_volk/volk/work/build/apps/CMakeFiles/CMakeDirectoryInformation.cmake" is newer than depender "/opt/local/var/macports/build/_opt_local_var_macports_sources_rsync.macports.org_release_tarballs_ports_science_volk/volk/work/build/apps/CMakeFiles/volk_profile.dir/depend.internal".
400:info:build Dependee "/opt/local/var/macports/build/_opt_local_var_macports_sources_rsync.macports.org_release_tarballs_ports_science_volk/volk/work/build/apps/CMakeFiles/volk-config-info.dir/DependInfo.cmake" is newer than depender "/opt/local/var/macports/build/_opt_local_var_macports_sources_rsync.macports.org_release_tarballs_ports_science_volk/volk/work/build/apps/CMakeFiles/volk-config-info.dir/depend.internal".
401:info:build Dependee "/opt/local/var/macports/build/_opt_local_var_macports_sources_rsync.macports.org_release_tarballs_ports_science_volk/volk/work/build/apps/CMakeFiles/CMakeDirectoryInformation.cmake" is newer than depender "/opt/local/var/macports/build/_opt_local_var_macports_sources_rsync.macports.org_release_tarballs_ports_science_volk/volk/work/build/apps/CMakeFiles/volk-config-info.dir/depend.internal".
402:info:build Scanning dependencies of target volk-config-info
403:info:build make[2]: Leaving directory `/opt/local/var/macports/build/_opt_local_var_macports_sources_rsync.macports.org_release_tarballs_ports_science_volk/volk/work/build'
404:info:build /Applications/Utilities/Xcode.app/Contents/Developer/usr/bin/make -f apps/CMakeFiles/volk-config-info.dir/build.make apps/CMakeFiles/volk-config-info.dir/build
405:info:build Scanning dependencies of target volk_test_all
406:info:build make[2]: Entering directory `/opt/local/var/macports/build/_opt_local_var_macports_sources_rsync.macports.org_release_tarballs_ports_science_volk/volk/work/build'
407:info:build make[2]: Leaving directory `/opt/local/var/macports/build/_opt_local_var_macports_sources_rsync.macports.org_release_tarballs_ports_science_volk/volk/work/build'
408:info:build /Applications/Utilities/Xcode.app/Contents/Developer/usr/bin/make -f lib/CMakeFiles/volk_test_all.dir/build.make lib/CMakeFiles/volk_test_all.dir/build
409:info:build make[2]: Entering directory `/opt/local/var/macports/build/_opt_local_var_macports_sources_rsync.macports.org_release_tarballs_ports_science_volk/volk/work/build'
410:info:build [ 88%] Building CXX object apps/CMakeFiles/volk-config-info.dir/volk_option_helpers.cc.o
411:info:build [ 90%] Building CXX object apps/CMakeFiles/volk-config-info.dir/volk-config-info.cc.o
412:info:build cd /opt/local/var/macports/build/_opt_local_var_macports_sources_rsync.macports.org_release_tarballs_ports_science_volk/volk/work/build/apps && /usr/bin/clang++  -D_GLIBCXX_USE_CXX11_ABI=1 -I/opt/local/var/macports/build/_opt_local_var_macports_sources_rsync.macports.org_release_tarballs_ports_science_volk/volk/work/volk-1.4/apps -I/opt/local/var/macports/build/_opt_local_var_macports_sources_rsync.macports.org_release_tarballs_ports_science_volk/volk/work/build/apps -I/opt/local/var/macports/build/_opt_local_var_macports_sources_rsync.macports.org_release_tarballs_ports_science_volk/volk/work/volk-1.4/include -I/opt/local/var/macports/build/_opt_local_var_macports_sources_rsync.macports.org_release_tarballs_ports_science_volk/volk/work/build/include -I/opt/local/var/macports/build/_opt_local_var_macports_sources_rsync.macports.org_release_tarballs_ports_science_volk/volk/work/volk-1.4/lib -I/opt/local/var/macports/build/_opt_local_var_macports_sources_rsync.macports.org_release_tarballs_ports_science_volk/volk/work/build/lib -I/opt/local/include  -pipe -Os -stdlib=libc++ -Wall -DNDEBUG -arch x86_64 -mmacosx-version-min=10.9   -o CMakeFiles/volk-config-info.dir/volk_option_helpers.cc.o -c /opt/local/var/macports/build/_opt_local_var_macports_sources_rsync.macports.org_release_tarballs_ports_science_volk/volk/work/volk-1.4/apps/volk_option_helpers.cc
413:info:build cd /opt/local/var/macports/build/_opt_local_var_macports_sources_rsync.macports.org_release_tarballs_ports_science_volk/volk/work/build/apps && /usr/bin/clang++  -D_GLIBCXX_USE_CXX11_ABI=1 -I/opt/local/var/macports/build/_opt_local_var_macports_sources_rsync.macports.org_release_tarballs_ports_science_volk/volk/work/volk-1.4/apps -I/opt/local/var/macports/build/_opt_local_var_macports_sources_rsync.macports.org_release_tarballs_ports_science_volk/volk/work/build/apps -I/opt/local/var/macports/build/_opt_local_var_macports_sources_rsync.macports.org_release_tarballs_ports_science_volk/volk/work/volk-1.4/include -I/opt/local/var/macports/build/_opt_local_var_macports_sources_rsync.macports.org_release_tarballs_ports_science_volk/volk/work/build/include -I/opt/local/var/macports/build/_opt_local_var_macports_sources_rsync.macports.org_release_tarballs_ports_science_volk/volk/work/volk-1.4/lib -I/opt/local/var/macports/build/_opt_local_var_macports_sources_rsync.macports.org_release_tarballs_ports_science_volk/volk/work/build/lib -I/opt/local/include  -pipe -Os -stdlib=libc++ -Wall -DNDEBUG -arch x86_64 -mmacosx-version-min=10.9   -o CMakeFiles/volk-config-info.dir/volk-config-info.cc.o -c /opt/local/var/macports/build/_opt_local_var_macports_sources_rsync.macports.org_release_tarballs_ports_science_volk/volk/work/volk-1.4/apps/volk-config-info.cc
414:info:build [ 91%] Building CXX object lib/CMakeFiles/volk_test_all.dir/testqa.cc.o
415:info:build cd /opt/local/var/macports/build/_opt_local_var_macports_sources_rsync.macports.org_release_tarballs_ports_science_volk/volk/work/build/lib && /usr/bin/clang++  -DHAVE_CPUID_H -DHAVE_DLFCN_H -DHAVE_FENV_H -DHAVE_POSIX_MEMALIGN -DHAVE_XGETBV -D_GLIBCXX_USE_CXX11_ABI=1 -DBOOST_TEST_DYN_LINK -DBOOST_TEST_MAIN -I/opt/local/include/orc-0.4 -I/opt/local/include -I/opt/local/var/macports/build/_opt_local_var_macports_sources_rsync.macports.org_release_tarballs_ports_science_volk/volk/work/build/include -I/opt/local/var/macports/build/_opt_local_var_macports_sources_rsync.macports.org_release_tarballs_ports_science_volk/volk/work/volk-1.4/include  -pipe -Os -stdlib=libc++ -Wall -fvisibility=hidden -DNDEBUG -arch x86_64 -mmacosx-version-min=10.9   -o CMakeFiles/volk_test_all.dir/testqa.cc.o -c /opt/local/var/macports/build/_opt_local_var_macports_sources_rsync.macports.org_release_tarballs_ports_science_volk/volk/work/volk-1.4/lib/testqa.cc
416:info:build [ 92%] Building CXX object lib/CMakeFiles/volk_test_all.dir/qa_utils.cc.o
417:info:build cd /opt/local/var/macports/build/_opt_local_var_macports_sources_rsync.macports.org_release_tarballs_ports_science_volk/volk/work/build/lib && /usr/bin/clang++  -DHAVE_CPUID_H -DHAVE_DLFCN_H -DHAVE_FENV_H -DHAVE_POSIX_MEMALIGN -DHAVE_XGETBV -D_GLIBCXX_USE_CXX11_ABI=1 -I/opt/local/include/orc-0.4 -I/opt/local/include -I/opt/local/var/macports/build/_opt_local_var_macports_sources_rsync.macports.org_release_tarballs_ports_science_volk/volk/work/build/include -I/opt/local/var/macports/build/_opt_local_var_macports_sources_rsync.macports.org_release_tarballs_ports_science_volk/volk/work/volk-1.4/include  -pipe -Os -stdlib=libc++ -Wall -fvisibility=hidden -DNDEBUG -arch x86_64 -mmacosx-version-min=10.9   -o CMakeFiles/volk_test_all.dir/qa_utils.cc.o -c /opt/local/var/macports/build/_opt_local_var_macports_sources_rsync.macports.org_release_tarballs_ports_science_volk/volk/work/volk-1.4/lib/qa_utils.cc
418:info:build In file included from /opt/local/var/macports/build/_opt_local_var_macports_sources_rsync.macports.org_release_tarballs_ports_science_volk/volk/work/volk-1.4/lib/testqa.cc:32:
419:info:build /opt/local/var/macports/build/_opt_local_var_macports_sources_rsync.macports.org_release_tarballs_ports_science_volk/volk/work/volk-1.4/lib/kernel_tests.h:60:8: error: use of undeclared identifier 'volk_32fc_32f_add_32fc_get_func_desc'; did you mean 'volk_32f_x2_add_32f_get_func_desc'?
420:info:build     QA(VOLK_INIT_TEST(volk_32fc_32f_add_32fc,                         test_params))
421:info:build        ^
422:info:build /opt/local/var/macports/build/_opt_local_var_macports_sources_rsync.macports.org_release_tarballs_ports_science_volk/volk/work/volk-1.4/lib/kernel_tests.h:16:22: note: expanded from macro 'VOLK_INIT_TEST'
423:info:build     volk_test_case_t(func##_get_func_desc(), (void(*)())func##_manual, std::string(#func),\
424:info:build                      ^
425:info:build <scratch space>:18:1: note: expanded from here
426:info:build volk_32fc_32f_add_32fc_get_func_desc
427:info:build ^
428:info:build /opt/local/var/macports/build/_opt_local_var_macports_sources_rsync.macports.org_release_tarballs_ports_science_volk/volk/work/volk-1.4/lib/kernel_tests.h:19:39: note: expanded from macro 'QA'
429:info:build #define QA(test) test_cases.push_back(test);
430:info:build                                       ^
431:info:build /opt/local/include/volk/volk.h:857:34: note: 'volk_32f_x2_add_32f_get_func_desc' declared here
432:info:build extern VOLK_API volk_func_desc_t volk_32f_x2_add_32f_get_func_desc(void);
433:info:build                                  ^
434:info:build In file included from /opt/local/var/macports/build/_opt_local_var_macports_sources_rsync.macports.org_release_tarballs_ports_science_volk/volk/work/volk-1.4/lib/testqa.cc:32:
435:info:build /opt/local/var/macports/build/_opt_local_var_macports_sources_rsync.macports.org_release_tarballs_ports_science_volk/volk/work/volk-1.4/lib/kernel_tests.h:60:8: error: use of undeclared identifier 'volk_32fc_32f_add_32fc_manual'
436:info:build     QA(VOLK_INIT_TEST(volk_32fc_32f_add_32fc,                         test_params))
437:info:build        ^
438:info:build /opt/local/var/macports/build/_opt_local_var_macports_sources_rsync.macports.org_release_tarballs_ports_science_volk/volk/work/volk-1.4/lib/kernel_tests.h:16:57: note: expanded from macro 'VOLK_INIT_TEST'
439:info:build     volk_test_case_t(func##_get_func_desc(), (void(*)())func##_manual, std::string(#func),\
440:info:build                                                         ^
441:info:build <scratch space>:19:1: note: expanded from here
442:info:build volk_32fc_32f_add_32fc_manual
443:info:build ^
444:info:build /opt/local/var/macports/build/_opt_local_var_macports_sources_rsync.macports.org_release_tarballs_ports_science_volk/volk/work/volk-1.4/lib/kernel_tests.h:19:39: note: expanded from macro 'QA'
445:info:build #define QA(test) test_cases.push_back(test);
446:info:build                                       ^
447:info:build /opt/local/var/macports/build/_opt_local_var_macports_sources_rsync.macports.org_release_tarballs_ports_science_volk/volk/work/volk-1.4/lib/kernel_tests.h:87:8: error: use of undeclared identifier 'volk_32fc_x2_add_32fc_get_func_desc'; did you mean 'volk_32f_x2_add_32f_get_func_desc'?
448:info:build     QA(VOLK_INIT_TEST(volk_32fc_x2_add_32fc,                          test_params))
449:info:build        ^
450:info:build /opt/local/var/macports/build/_opt_local_var_macports_sources_rsync.macports.org_release_tarballs_ports_science_volk/volk/work/volk-1.4/lib/kernel_tests.h:16:22: note: expanded from macro 'VOLK_INIT_TEST'
451:info:build     volk_test_case_t(func##_get_func_desc(), (void(*)())func##_manual, std::string(#func),\
452:info:build                      ^
453:info:build <scratch space>:19:1: note: expanded from here
454:info:build volk_32fc_x2_add_32fc_get_func_desc
455:info:build ^
456:info:build /opt/local/var/macports/build/_opt_local_var_macports_sources_rsync.macports.org_release_tarballs_ports_science_volk/volk/work/volk-1.4/lib/kernel_tests.h:19:39: note: expanded from macro 'QA'
457:info:build #define QA(test) test_cases.push_back(test);
458:info:build                                       ^
459:info:build /opt/local/include/volk/volk.h:857:34: note: 'volk_32f_x2_add_32f_get_func_desc' declared here
460:info:build extern VOLK_API volk_func_desc_t volk_32f_x2_add_32f_get_func_desc(void);
461:info:build                                  ^
462:info:build Scanning dependencies of target volk_profile
463:info:build make[2]: Leaving directory `/opt/local/var/macports/build/_opt_local_var_macports_sources_rsync.macports.org_release_tarballs_ports_science_volk/volk/work/build'
464:info:build /Applications/Utilities/Xcode.app/Contents/Developer/usr/bin/make -f apps/CMakeFiles/volk_profile.dir/build.make apps/CMakeFiles/volk_profile.dir/build
465:info:build In file included from /opt/local/var/macports/build/_opt_local_var_macports_sources_rsync.macports.org_release_tarballs_ports_science_volk/volk/work/volk-1.4/lib/testqa.cc:32:
466:info:build /opt/local/var/macports/build/_opt_local_var_macports_sources_rsync.macports.org_release_tarballs_ports_science_volk/volk/work/volk-1.4/lib/kernel_tests.h:87:8: error: use of undeclared identifier 'volk_32fc_x2_add_32fc_manual'
467:info:build     QA(VOLK_INIT_TEST(volk_32fc_x2_add_32fc,                          test_params))
468:info:build        ^
469:info:build /opt/local/var/macports/build/_opt_local_var_macports_sources_rsync.macports.org_release_tarballs_ports_science_volk/volk/work/volk-1.4/lib/kernel_tests.h:16:57: note: expanded from macro 'VOLK_INIT_TEST'
470:info:build     volk_test_case_t(func##_get_func_desc(), (void(*)())func##_manual, std::string(#func),\
471:info:build                                                         ^
472:info:build <scratch space>:19:1: note: expanded from here
473:info:build volk_32fc_x2_add_32fc_manual
474:info:build ^
475:info:build /opt/local/var/macports/build/_opt_local_var_macports_sources_rsync.macports.org_release_tarballs_ports_science_volk/volk/work/volk-1.4/lib/kernel_tests.h:19:39: note: expanded from macro 'QA'
476:info:build #define QA(test) test_cases.push_back(test);
477:info:build                                       ^
478:info:build /opt/local/var/macports/build/_opt_local_var_macports_sources_rsync.macports.org_release_tarballs_ports_science_volk/volk/work/volk-1.4/lib/kernel_tests.h:107:8: error: use of undeclared identifier 'volk_32f_64f_multiply_64f_get_func_desc'
479:info:build     QA(VOLK_INIT_TEST(volk_32f_64f_multiply_64f,                      test_params))
480:info:build        ^
481:info:build /opt/local/var/macports/build/_opt_local_var_macports_sources_rsync.macports.org_release_tarballs_ports_science_volk/volk/work/volk-1.4/lib/kernel_tests.h:16:22: note: expanded from macro 'VOLK_INIT_TEST'
482:info:build     volk_test_case_t(func##_get_func_desc(), (void(*)())func##_manual, std::string(#func),\
483:info:build                      ^
484:info:build <scratch space>:42:1: note: expanded from here
485:info:build volk_32f_64f_multiply_64f_get_func_desc
486:info:build ^
487:info:build /opt/local/var/macports/build/_opt_local_var_macports_sources_rsync.macports.org_release_tarballs_ports_science_volk/volk/work/volk-1.4/lib/kernel_tests.h:19:39: note: expanded from macro 'QA'
488:info:build #define QA(test) test_cases.push_back(test);
489:info:build                                       ^
490:info:build /opt/local/var/macports/build/_opt_local_var_macports_sources_rsync.macports.org_release_tarballs_ports_science_volk/volk/work/volk-1.4/lib/kernel_tests.h:108:8: error: use of undeclared identifier 'volk_32f_64f_add_64f_get_func_desc'; did you mean 'volk_32f_x2_add_32f_get_func_desc'?
491:info:build     QA(VOLK_INIT_TEST(volk_32f_64f_add_64f,                           test_params))
492:info:build        ^
493:info:build /opt/local/var/macports/build/_opt_local_var_macports_sources_rsync.macports.org_release_tarballs_ports_science_volk/volk/work/volk-1.4/lib/kernel_tests.h:16:22: note: expanded from macro 'VOLK_INIT_TEST'
494:info:build     volk_test_case_t(func##_get_func_desc(), (void(*)())func##_manual, std::string(#func),\
495:info:build                      ^
496:info:build <scratch space>:43:1: note: expanded from here
497:info:build volk_32f_64f_add_64f_get_func_desc
498:info:build ^
499:info:build /opt/local/var/macports/build/_opt_local_var_macports_sources_rsync.macports.org_release_tarballs_ports_science_volk/volk/work/volk-1.4/lib/kernel_tests.h:19:39: note: expanded from macro 'QA'
500:info:build #define QA(test) test_cases.push_back(test);
501:info:build                                       ^
502:info:build /opt/local/include/volk/volk.h:857:34: note: 'volk_32f_x2_add_32f_get_func_desc' declared here
503:info:build extern VOLK_API volk_func_desc_t volk_32f_x2_add_32f_get_func_desc(void);
504:info:build                                  ^
505:info:build make[2]: Entering directory `/opt/local/var/macports/build/_opt_local_var_macports_sources_rsync.macports.org_release_tarballs_ports_science_volk/volk/work/build'
506:info:build In file included from /opt/local/var/macports/build/_opt_local_var_macports_sources_rsync.macports.org_release_tarballs_ports_science_volk/volk/work/volk-1.4/lib/testqa.cc:32:
507:info:build /opt/local/var/macports/build/_opt_local_var_macports_sources_rsync.macports.org_release_tarballs_ports_science_volk/volk/work/volk-1.4/lib/kernel_tests.h:108:8: error: use of undeclared identifier 'volk_32f_64f_add_64f_manual'
508:info:build     QA(VOLK_INIT_TEST(volk_32f_64f_add_64f,                           test_params))
509:info:build        ^
510:info:build /opt/local/var/macports/build/_opt_local_var_macports_sources_rsync.macports.org_release_tarballs_ports_science_volk/volk/work/volk-1.4/lib/kernel_tests.h:16:57: note: expanded from macro 'VOLK_INIT_TEST'
511:info:build     volk_test_case_t(func##_get_func_desc(), (void(*)())func##_manual, std::string(#func),\
512:info:build                                                         ^
513:info:build <scratch space>:43:1: note: expanded from here
514:info:build volk_32f_64f_add_64f_manual
515:info:build ^
516:info:build /opt/local/var/macports/build/_opt_local_var_macports_sources_rsync.macports.org_release_tarballs_ports_science_volk/volk/work/volk-1.4/lib/kernel_tests.h:19:39: note: expanded from macro 'QA'
517:info:build #define QA(test) test_cases.push_back(test);
518:info:build                                       ^
519:info:build /opt/local/var/macports/build/_opt_local_var_macports_sources_rsync.macports.org_release_tarballs_ports_science_volk/volk/work/volk-1.4/lib/kernel_tests.h:123:8: error: use of undeclared identifier 'volk_64f_x2_multiply_64f_get_func_desc'; did you mean 'volk_32f_x2_multiply_32f_get_func_desc'?
520:info:build     QA(VOLK_INIT_TEST(volk_64f_x2_multiply_64f,                       test_params))
521:info:build        ^
522:info:build /opt/local/var/macports/build/_opt_local_var_macports_sources_rsync.macports.org_release_tarballs_ports_science_volk/volk/work/volk-1.4/lib/kernel_tests.h:16:22: note: expanded from macro 'VOLK_INIT_TEST'
523:info:build     volk_test_case_t(func##_get_func_desc(), (void(*)())func##_manual, std::string(#func),\
524:info:build                      ^
525:info:build <scratch space>:43:1: note: expanded from here
526:info:build volk_64f_x2_multiply_64f_get_func_desc
527:info:build ^
528:info:build /opt/local/var/macports/build/_opt_local_var_macports_sources_rsync.macports.org_release_tarballs_ports_science_volk/volk/work/volk-1.4/lib/kernel_tests.h:19:39: note: expanded from macro 'QA'
529:info:build #define QA(test) test_cases.push_back(test);
530:info:build                                       ^
531:info:build /opt/local/include/volk/volk.h:977:34: note: 'volk_32f_x2_multiply_32f_get_func_desc' declared here
532:info:build extern VOLK_API volk_func_desc_t volk_32f_x2_multiply_32f_get_func_desc(void);
533:info:build                                  ^
534:info:build [ 93%] Building CXX object apps/CMakeFiles/volk_profile.dir/__/lib/qa_utils.cc.o
535:info:build cd /opt/local/var/macports/build/_opt_local_var_macports_sources_rsync.macports.org_release_tarballs_ports_science_volk/volk/work/build/apps && /usr/bin/clang++  -D_GLIBCXX_USE_CXX11_ABI=1 -I/opt/local/var/macports/build/_opt_local_var_macports_sources_rsync.macports.org_release_tarballs_ports_science_volk/volk/work/volk-1.4/apps -I/opt/local/var/macports/build/_opt_local_var_macports_sources_rsync.macports.org_release_tarballs_ports_science_volk/volk/work/build/apps -I/opt/local/var/macports/build/_opt_local_var_macports_sources_rsync.macports.org_release_tarballs_ports_science_volk/volk/work/volk-1.4/include -I/opt/local/var/macports/build/_opt_local_var_macports_sources_rsync.macports.org_release_tarballs_ports_science_volk/volk/work/build/include -I/opt/local/var/macports/build/_opt_local_var_macports_sources_rsync.macports.org_release_tarballs_ports_science_volk/volk/work/volk-1.4/lib -I/opt/local/var/macports/build/_opt_local_var_macports_sources_rsync.macports.org_release_tarballs_ports_science_volk/volk/work/build/lib -I/opt/local/include  -pipe -Os -stdlib=libc++ -Wall -DNDEBUG -arch x86_64 -mmacosx-version-min=10.9   -o CMakeFiles/volk_profile.dir/__/lib/qa_utils.cc.o -c /opt/local/var/macports/build/_opt_local_var_macports_sources_rsync.macports.org_release_tarballs_ports_science_volk/volk/work/volk-1.4/lib/qa_utils.cc
536:info:build [ 95%] Building CXX object apps/CMakeFiles/volk_profile.dir/volk_profile.cc.o
537:info:build cd /opt/local/var/macports/build/_opt_local_var_macports_sources_rsync.macports.org_release_tarballs_ports_science_volk/volk/work/build/apps && /usr/bin/clang++  -D_GLIBCXX_USE_CXX11_ABI=1 -I/opt/local/var/macports/build/_opt_local_var_macports_sources_rsync.macports.org_release_tarballs_ports_science_volk/volk/work/volk-1.4/apps -I/opt/local/var/macports/build/_opt_local_var_macports_sources_rsync.macports.org_release_tarballs_ports_science_volk/volk/work/build/apps -I/opt/local/var/macports/build/_opt_local_var_macports_sources_rsync.macports.org_release_tarballs_ports_science_volk/volk/work/volk-1.4/include -I/opt/local/var/macports/build/_opt_local_var_macports_sources_rsync.macports.org_release_tarballs_ports_science_volk/volk/work/build/include -I/opt/local/var/macports/build/_opt_local_var_macports_sources_rsync.macports.org_release_tarballs_ports_science_volk/volk/work/volk-1.4/lib -I/opt/local/var/macports/build/_opt_local_var_macports_sources_rsync.macports.org_release_tarballs_ports_science_volk/volk/work/build/lib -I/opt/local/include  -pipe -Os -stdlib=libc++ -Wall -DNDEBUG -arch x86_64 -mmacosx-version-min=10.9   -o CMakeFiles/volk_profile.dir/volk_profile.cc.o -c /opt/local/var/macports/build/_opt_local_var_macports_sources_rsync.macports.org_release_tarballs_ports_science_volk/volk/work/volk-1.4/apps/volk_profile.cc
538:info:build [ 96%] Building CXX object apps/CMakeFiles/volk_profile.dir/volk_option_helpers.cc.o
539:info:build cd /opt/local/var/macports/build/_opt_local_var_macports_sources_rsync.macports.org_release_tarballs_ports_science_volk/volk/work/build/apps && /usr/bin/clang++  -D_GLIBCXX_USE_CXX11_ABI=1 -I/opt/local/var/macports/build/_opt_local_var_macports_sources_rsync.macports.org_release_tarballs_ports_science_volk/volk/work/volk-1.4/apps -I/opt/local/var/macports/build/_opt_local_var_macports_sources_rsync.macports.org_release_tarballs_ports_science_volk/volk/work/build/apps -I/opt/local/var/macports/build/_opt_local_var_macports_sources_rsync.macports.org_release_tarballs_ports_science_volk/volk/work/volk-1.4/include -I/opt/local/var/macports/build/_opt_local_var_macports_sources_rsync.macports.org_release_tarballs_ports_science_volk/volk/work/build/include -I/opt/local/var/macports/build/_opt_local_var_macports_sources_rsync.macports.org_release_tarballs_ports_science_volk/volk/work/volk-1.4/lib -I/opt/local/var/macports/build/_opt_local_var_macports_sources_rsync.macports.org_release_tarballs_ports_science_volk/volk/work/build/lib -I/opt/local/include  -pipe -Os -stdlib=libc++ -Wall -DNDEBUG -arch x86_64 -mmacosx-version-min=10.9   -o CMakeFiles/volk_profile.dir/volk_option_helpers.cc.o -c /opt/local/var/macports/build/_opt_local_var_macports_sources_rsync.macports.org_release_tarballs_ports_science_volk/volk/work/volk-1.4/apps/volk_option_helpers.cc
540:info:build In file included from /opt/local/var/macports/build/_opt_local_var_macports_sources_rsync.macports.org_release_tarballs_ports_science_volk/volk/work/volk-1.4/lib/testqa.cc:32:
541:info:build /opt/local/var/macports/build/_opt_local_var_macports_sources_rsync.macports.org_release_tarballs_ports_science_volk/volk/work/volk-1.4/lib/kernel_tests.h:123:8: error: use of undeclared identifier 'volk_64f_x2_multiply_64f_manual'
542:info:build     QA(VOLK_INIT_TEST(volk_64f_x2_multiply_64f,                       test_params))
543:info:build        ^
544:info:build /opt/local/var/macports/build/_opt_local_var_macports_sources_rsync.macports.org_release_tarballs_ports_science_volk/volk/work/volk-1.4/lib/kernel_tests.h:16:57: note: expanded from macro 'VOLK_INIT_TEST'
545:info:build     volk_test_case_t(func##_get_func_desc(), (void(*)())func##_manual, std::string(#func),\
546:info:build                                                         ^
547:info:build <scratch space>:43:1: note: expanded from here
548:info:build volk_64f_x2_multiply_64f_manual
549:info:build ^
550:info:build /opt/local/var/macports/build/_opt_local_var_macports_sources_rsync.macports.org_release_tarballs_ports_science_volk/volk/work/volk-1.4/lib/kernel_tests.h:19:39: note: expanded from macro 'QA'
551:info:build #define QA(test) test_cases.push_back(test);
552:info:build                                       ^
553:info:build /opt/local/var/macports/build/_opt_local_var_macports_sources_rsync.macports.org_release_tarballs_ports_science_volk/volk/work/volk-1.4/lib/kernel_tests.h:124:8: error: use of undeclared identifier 'volk_64f_x2_add_64f_get_func_desc'
554:info:build     QA(VOLK_INIT_TEST(volk_64f_x2_add_64f,                            test_params))
555:info:build        ^
556:info:build /opt/local/var/macports/build/_opt_local_var_macports_sources_rsync.macports.org_release_tarballs_ports_science_volk/volk/work/volk-1.4/lib/kernel_tests.h:16:22: note: expanded from macro 'VOLK_INIT_TEST'
557:info:build     volk_test_case_t(func##_get_func_desc(), (void(*)())func##_manual, std::string(#func),\
558:info:build                      ^
559:info:build <scratch space>:43:1: note: expanded from here
560:info:build volk_64f_x2_add_64f_get_func_desc
561:info:build ^
562:info:build /opt/local/var/macports/build/_opt_local_var_macports_sources_rsync.macports.org_release_tarballs_ports_science_volk/volk/work/volk-1.4/lib/kernel_tests.h:19:39: note: expanded from macro 'QA'
563:info:build #define QA(test) test_cases.push_back(test);
564:info:build                                       ^
565:info:build /opt/local/var/macports/build/_opt_local_var_macports_sources_rsync.macports.org_release_tarballs_ports_science_volk/volk/work/volk-1.4/lib/kernel_tests.h:138:8: error: use of undeclared identifier 'volk_32u_reverse_32u_get_func_desc'
566:info:build     QA(VOLK_INIT_TEST(volk_32u_reverse_32u,                            test_params))
567:info:build        ^
568:info:build /opt/local/var/macports/build/_opt_local_var_macports_sources_rsync.macports.org_release_tarballs_ports_science_volk/volk/work/volk-1.4/lib/kernel_tests.h:16:22: note: expanded from macro 'VOLK_INIT_TEST'
569:info:build     volk_test_case_t(func##_get_func_desc(), (void(*)())func##_manual, std::string(#func),\
570:info:build                      ^
571:info:build <scratch space>:20:1: note: expanded from here
572:info:build volk_32u_reverse_32u_get_func_desc
573:info:build ^
574:info:build /opt/local/var/macports/build/_opt_local_var_macports_sources_rsync.macports.org_release_tarballs_ports_science_volk/volk/work/volk-1.4/lib/kernel_tests.h:19:39: note: expanded from macro 'QA'
575:info:build #define QA(test) test_cases.push_back(test);
576:info:build                                       ^
577:info:build /opt/local/var/macports/build/_opt_local_var_macports_sources_rsync.macports.org_release_tarballs_ports_science_volk/volk/work/volk-1.4/lib/kernel_tests.h:140:8: error: use of undeclared identifier 'volk_32f_s32f_mod_rangepuppet_32f_get_func_desc'; did you mean 'volk_32fc_s32fc_rotatorpuppet_32fc_get_func_desc'?
578:info:build     QA(VOLK_INIT_TEST(volk_32f_s32f_mod_rangepuppet_32f,              test_params))
579:info:build        ^
580:info:build /opt/local/var/macports/build/_opt_local_var_macports_sources_rsync.macports.org_release_tarballs_ports_science_volk/volk/work/volk-1.4/lib/kernel_tests.h:16:22: note: expanded from macro 'VOLK_INIT_TEST'
581:info:build     volk_test_case_t(func##_get_func_desc(), (void(*)())func##_manual, std::string(#func),\
582:info:build                      ^
583:info:build <scratch space>:21:1: note: expanded from here
584:info:build volk_32f_s32f_mod_rangepuppet_32f_get_func_desc
585:info:build ^
586:info:build /opt/local/var/macports/build/_opt_local_var_macports_sources_rsync.macports.org_release_tarballs_ports_science_volk/volk/work/volk-1.4/lib/kernel_tests.h:19:39: note: expanded from macro 'QA'
587:info:build #define QA(test) test_cases.push_back(test);
588:info:build                                       ^
589:info:build /opt/local/include/volk/volk.h:1352:34: note: 'volk_32fc_s32fc_rotatorpuppet_32fc_get_func_desc' declared here
590:info:build extern VOLK_API volk_func_desc_t volk_32fc_s32fc_rotatorpuppet_32fc_get_func_desc(void);
591:info:build                                  ^
592:info:build In file included from /opt/local/var/macports/build/_opt_local_var_macports_sources_rsync.macports.org_release_tarballs_ports_science_volk/volk/work/volk-1.4/lib/testqa.cc:32:
593:info:build /opt/local/var/macports/build/_opt_local_var_macports_sources_rsync.macports.org_release_tarballs_ports_science_volk/volk/work/volk-1.4/lib/kernel_tests.h:140:8: error: use of undeclared identifier 'volk_32f_s32f_mod_rangepuppet_32f_manual'
594:info:build     QA(VOLK_INIT_TEST(volk_32f_s32f_mod_rangepuppet_32f,              test_params))
595:info:build        ^
596:info:build /opt/local/var/macports/build/_opt_local_var_macports_sources_rsync.macports.org_release_tarballs_ports_science_volk/volk/work/volk-1.4/lib/kernel_tests.h:16:57: note: expanded from macro 'VOLK_INIT_TEST'
597:info:build     volk_test_case_t(func##_get_func_desc(), (void(*)())func##_manual, std::string(#func),\
598:info:build                                                         ^
599:info:build <scratch space>:21:1: note: expanded from here
600:info:build volk_32f_s32f_mod_rangepuppet_32f_manual
601:info:build ^
602:info:build /opt/local/var/macports/build/_opt_local_var_macports_sources_rsync.macports.org_release_tarballs_ports_science_volk/volk/work/volk-1.4/lib/kernel_tests.h:19:39: note: expanded from macro 'QA'
603:info:build #define QA(test) test_cases.push_back(test);
604:info:build                                       ^
605:info:build 13 errors generated.
606:info:build make[2]: *** [lib/CMakeFiles/volk_test_all.dir/testqa.cc.o] Error 1
607:info:build make[2]: *** Waiting for unfinished jobs....
608:info:build [ 97%] Linking CXX executable volk-config-info
609:info:build cd /opt/local/var/macports/build/_opt_local_var_macports_sources_rsync.macports.org_release_tarballs_ports_science_volk/volk/work/build/apps && /opt/local/bin/cmake -E cmake_link_script CMakeFiles/volk-config-info.dir/link.txt --verbose=ON
610:info:build /usr/bin/clang++  -pipe -Os -stdlib=libc++ -Wall -DNDEBUG -arch x86_64 -mmacosx-version-min=10.9 -Wl,-search_paths_first -Wl,-headerpad_max_install_names -Wl,-headerpad_max_install_names CMakeFiles/volk-config-info.dir/volk-config-info.cc.o CMakeFiles/volk-config-info.dir/volk_option_helpers.cc.o  -o volk-config-info -Wl,-rpath,/opt/local/lib ../lib/libvolk.1.4.dylib /opt/local/lib/liborc-0.4.dylib
611:info:build make[2]: Leaving directory `/opt/local/var/macports/build/_opt_local_var_macports_sources_rsync.macports.org_release_tarballs_ports_science_volk/volk/work/build'
612:info:build [ 97%] Built target volk-config-info
613:info:build make[2]: Leaving directory `/opt/local/var/macports/build/_opt_local_var_macports_sources_rsync.macports.org_release_tarballs_ports_science_volk/volk/work/build'
614:info:build make[1]: *** [lib/CMakeFiles/volk_test_all.dir/all] Error 2
615:info:build make[1]: *** Waiting for unfinished jobs....
616:info:build [ 98%] Linking CXX executable volk_profile
617:info:build cd /opt/local/var/macports/build/_opt_local_var_macports_sources_rsync.macports.org_release_tarballs_ports_science_volk/volk/work/build/apps && /opt/local/bin/cmake -E cmake_link_script CMakeFiles/volk_profile.dir/link.txt --verbose=ON
618:info:build /usr/bin/clang++  -pipe -Os -stdlib=libc++ -Wall -DNDEBUG -arch x86_64 -mmacosx-version-min=10.9 -Wl,-search_paths_first -Wl,-headerpad_max_install_names -Wl,-headerpad_max_install_names CMakeFiles/volk_profile.dir/volk_profile.cc.o CMakeFiles/volk_profile.dir/__/lib/qa_utils.cc.o CMakeFiles/volk_profile.dir/volk_option_helpers.cc.o  -o volk_profile -Wl,-rpath,/opt/local/lib ../lib/libvolk.1.4.dylib /opt/local/lib/libboost_filesystem-mt.dylib /opt/local/lib/libboost_system-mt.dylib /opt/local/lib/liborc-0.4.dylib
619:info:build make[2]: Leaving directory `/opt/local/var/macports/build/_opt_local_var_macports_sources_rsync.macports.org_release_tarballs_ports_science_volk/volk/work/build'
620:info:build [ 98%] Built target volk_profile
621:info:build make[1]: Leaving directory `/opt/local/var/macports/build/_opt_local_var_macports_sources_rsync.macports.org_release_tarballs_ports_science_volk/volk/work/build'
622:info:build make: *** [all] Error 2
623:info:build make: Leaving directory `/opt/local/var/macports/build/_opt_local_var_macports_sources_rsync.macports.org_release_tarballs_ports_science_volk/volk/work/build'
624:info:build Command failed:  cd "/opt/local/var/macports/build/_opt_local_var_macports_sources_rsync.macports.org_release_tarballs_ports_science_volk/volk/work/build" && /usr/bin/make -j8 -w all VERBOSE=ON
625:info:build Exit code: 2
626:error:build Failed to build volk: command execution failed
627:debug:build Error code: CHILDSTATUS 77825 2
628:debug:build Backtrace: command execution failed
629:debug:build     while executing
630:debug:build "system {*}$notty {*}$nice $fullcmdstring"
631:debug:build     invoked from within
632:debug:build "command_exec build"
633:debug:build     (procedure "portbuild::build_main" line 8)
634:debug:build     invoked from within
635:debug:build "$procedure $targetname"
636:error:build See /opt/local/var/macports/logs/_opt_local_var_macports_sources_rsync.macports.org_release_tarballs_ports_science_volk/volk/main.log for details.