Ticket #56803: bad.log

File bad.log, 233.6 KB (added by mdturnerinoz (Martin D Turner), 2 years ago)
Line 
1version:1
2:debug:sysinfo macOS 10.14 (darwin/18.2.0) arch i386
3:debug:sysinfo MacPorts 2.5.4
4:debug:sysinfo Xcode 10.1
5:debug:sysinfo SDK 10.14
6:debug:sysinfo MACOSX_DEPLOYMENT_TARGET: 10.14
7:msg:main --->  Computing dependencies for pdf2htmlex:info:main .:debug:main pdf2htmlex has no conflicts
8:debug:main Searching for dependency: cmake
9:debug:main Didn't find receipt, going to depspec regex for: cmake
10:debug:main Changing to port directory: /opt/local/var/macports/sources/rsync.macports.org/macports/release/tarballs/ports/devel/cmake
11:debug:main OS darwin/18.2.0 (Mac OS X 10.14) arch i386
12:debug:main Reading variant descriptions from /opt/local/var/macports/sources/rsync.macports.org/macports/release/tarballs/ports/_resources/port1.0/variant_descriptions.conf
13:debug:main Sourcing PortGroup muniversal 1.0 from /opt/local/var/macports/sources/rsync.macports.org/macports/release/tarballs/ports/_resources/port1.0/group/muniversal-1.0.tcl
14:debug:main Sourcing PortGroup compiler_blacklist_versions 1.0 from /opt/local/var/macports/sources/rsync.macports.org/macports/release/tarballs/ports/_resources/port1.0/group/compiler_blacklist_versions-1.0.tcl
15:debug:main compiler clang 1000.11.45.5 not blacklisted because it doesn't match {clang < 500}
16:debug:main Sourcing PortGroup cxx11 1.1 from /opt/local/var/macports/sources/rsync.macports.org/macports/release/tarballs/ports/_resources/port1.0/group/cxx11-1.1.tcl
17:debug:main universal variant already exists, so not adding the default one
18:debug:main Running callback portconfigure::add_automatic_compiler_dependencies
19:debug:main Finished running callback portconfigure::add_automatic_compiler_dependencies
20:debug:main Running callback portbuild::add_automatic_buildsystem_dependencies
21:debug:main Finished running callback portbuild::add_automatic_buildsystem_dependencies
22:debug:main Running callback portstartupitem::add_notes
23:debug:main Finished running callback portstartupitem::add_notes
24:debug:main Searching for dependency: fontforge
25:debug:main Didn't find receipt, going to depspec regex for: fontforge
26:debug:main Changing to port directory: /opt/local/var/macports/sources/rsync.macports.org/macports/release/tarballs/ports/graphics/fontforge
27:debug:main OS darwin/18.2.0 (Mac OS X 10.14) arch i386
28:debug:main Sourcing PortGroup github 1.0 from /opt/local/var/macports/sources/rsync.macports.org/macports/release/tarballs/ports/_resources/port1.0/group/github-1.0.tcl
29:debug:main Re-registering default for livecheck.regex
30:debug:main adding the default universal variant
31:debug:main Reading variant descriptions from /opt/local/var/macports/sources/rsync.macports.org/macports/release/tarballs/ports/_resources/port1.0/variant_descriptions.conf
32:debug:main Executing variant python27 provides python27
33:debug:main Running callback portconfigure::add_automatic_compiler_dependencies
34:debug:main Finished running callback portconfigure::add_automatic_compiler_dependencies
35:debug:main Running callback portbuild::add_automatic_buildsystem_dependencies
36:debug:main Finished running callback portbuild::add_automatic_buildsystem_dependencies
37:debug:main Running callback portstartupitem::add_notes
38:debug:main Finished running callback portstartupitem::add_notes
39:debug:main Searching for dependency: pkgconfig
40:debug:main Didn't find receipt, going to depspec regex for: pkgconfig
41:debug:main Changing to port directory: /opt/local/var/macports/sources/rsync.macports.org/macports/release/tarballs/ports/devel/pkgconfig
42:debug:main OS darwin/18.2.0 (Mac OS X 10.14) arch i386
43:debug:main adding the default universal variant
44:debug:main Reading variant descriptions from /opt/local/var/macports/sources/rsync.macports.org/macports/release/tarballs/ports/_resources/port1.0/variant_descriptions.conf
45:debug:main Running callback portconfigure::add_automatic_compiler_dependencies
46:debug:main Finished running callback portconfigure::add_automatic_compiler_dependencies
47:debug:main Running callback portbuild::add_automatic_buildsystem_dependencies
48:debug:main Finished running callback portbuild::add_automatic_buildsystem_dependencies
49:debug:main Running callback portstartupitem::add_notes
50:debug:main Finished running callback portstartupitem::add_notes
51:debug:main Searching for dependency: poppler
52:debug:main Didn't find receipt, going to depspec regex for: poppler
53:debug:main Changing to port directory: /opt/local/var/macports/sources/rsync.macports.org/macports/release/tarballs/ports/graphics/poppler
54:debug:main OS darwin/18.2.0 (Mac OS X 10.14) arch i386
55:debug:main Sourcing PortGroup compiler_blacklist_versions 1.0 from /opt/local/var/macports/sources/rsync.macports.org/macports/release/tarballs/ports/_resources/port1.0/group/compiler_blacklist_versions-1.0.tcl
56:debug:main Sourcing PortGroup conflicts_build 1.0 from /opt/local/var/macports/sources/rsync.macports.org/macports/release/tarballs/ports/_resources/port1.0/group/conflicts_build-1.0.tcl
57:debug:main Sourcing PortGroup compiler_blacklist_versions 1.0 from /opt/local/var/macports/sources/rsync.macports.org/macports/release/tarballs/ports/_resources/port1.0/group/compiler_blacklist_versions-1.0.tcl
58:debug:main compiler clang 1000.11.45.5 not blacklisted because it doesn't match {clang < 500}
59:debug:main Sourcing PortGroup cxx11 1.1 from /opt/local/var/macports/sources/rsync.macports.org/macports/release/tarballs/ports/_resources/port1.0/group/cxx11-1.1.tcl
60:debug:main Sourcing PortGroup gobject_introspection 1.0 from /opt/local/var/macports/sources/rsync.macports.org/macports/release/tarballs/ports/_resources/port1.0/group/gobject_introspection-1.0.tcl
61:debug:main Re-registering default for destroot.target
62:debug:main Re-registering default for configure.dir
63:debug:main Re-registering default for build.dir
64:debug:main Re-registering default for configure.pre_args
65:debug:main Sourcing PortGroup cmake 1.1 from /opt/local/var/macports/sources/rsync.macports.org/macports/release/tarballs/ports/_resources/port1.0/group/cmake-1.1.tcl
66:debug:main Removing legacy build support
67:debug:main Sourcing PortGroup legacysupport 1.0 from /opt/local/var/macports/sources/rsync.macports.org/macports/release/tarballs/ports/_resources/port1.0/group/legacysupport-1.0.tcl
68:debug:main compiler clang 1000.11.45.5 not blacklisted because it doesn't match {clang < 800.0.38}
69:debug:main adding the default universal variant
70:debug:main Reading variant descriptions from /opt/local/var/macports/sources/rsync.macports.org/macports/release/tarballs/ports/_resources/port1.0/variant_descriptions.conf
71:debug:main Running callback portconfigure::add_automatic_compiler_dependencies
72:debug:main Finished running callback portconfigure::add_automatic_compiler_dependencies
73:debug:main Running callback portbuild::add_automatic_buildsystem_dependencies
74:debug:main Finished running callback portbuild::add_automatic_buildsystem_dependencies
75:debug:main Running callback portstartupitem::add_notes
76:debug:main Finished running callback portstartupitem::add_notes
77:debug:main Running callback add_legacysupport
78:debug:main Removing legacy build support
79:debug:main Finished running callback add_legacysupport
80:debug:main Searching for dependency: poppler-data
81:debug:main Didn't find receipt, going to depspec regex for: poppler-data
82:debug:main Changing to port directory: /opt/local/var/macports/sources/rsync.macports.org/macports/release/tarballs/ports/graphics/poppler-data
83:debug:main OS darwin/18.2.0 (Mac OS X 10.14) arch i386
84:debug:main universal_variant is false, so not adding the default universal variant
85:debug:main Running callback portconfigure::add_automatic_compiler_dependencies
86:debug:main Finished running callback portconfigure::add_automatic_compiler_dependencies
87:debug:main Running callback portbuild::add_automatic_buildsystem_dependencies
88:debug:main Finished running callback portbuild::add_automatic_buildsystem_dependencies
89:debug:main Running callback portstartupitem::add_notes
90:debug:main Finished running callback portstartupitem::add_notes
91:info:main .:debug:main Checking for conflicts against cmake
92:debug:main Searching for dependency: cmake-devel
93:debug:main Didn't find receipt, going to depspec regex for: cmake-devel
94:debug:main Searching for dependency: libcxx
95:debug:main Didn't find receipt, going to depspec regex for: libcxx
96:debug:main Changing to port directory: /opt/local/var/macports/sources/rsync.macports.org/macports/release/tarballs/ports/lang/libcxx
97:debug:main OS darwin/18.2.0 (Mac OS X 10.14) arch i386
98:debug:main Sourcing PortGroup compiler_blacklist_versions 1.0 from /opt/local/var/macports/sources/rsync.macports.org/macports/release/tarballs/ports/_resources/port1.0/group/compiler_blacklist_versions-1.0.tcl
99:debug:main Sourcing PortGroup active_variants 1.1 from /opt/local/var/macports/sources/rsync.macports.org/macports/release/tarballs/ports/_resources/port1.0/group/active_variants-1.1.tcl
100:debug:main universal_variant is false, so not adding the default universal variant
101:debug:main Running callback portconfigure::add_automatic_compiler_dependencies
102:debug:main Finished running callback portconfigure::add_automatic_compiler_dependencies
103:debug:main Running callback portbuild::add_automatic_buildsystem_dependencies
104:debug:main Finished running callback portbuild::add_automatic_buildsystem_dependencies
105:debug:main Running callback portstartupitem::add_notes
106:debug:main Finished running callback portstartupitem::add_notes
107:debug:main Searching for dependency: curl
108:debug:main Found Dependency: receipt exists for curl
109:debug:main Searching for dependency: expat
110:debug:main Found Dependency: receipt exists for expat
111:debug:main Searching for dependency: zlib
112:debug:main Found Dependency: receipt exists for zlib
113:debug:main Searching for dependency: bzip2
114:debug:main Found Dependency: receipt exists for bzip2
115:debug:main Searching for dependency: libarchive
116:debug:main Didn't find receipt, going to depspec regex for: libarchive
117:debug:main Changing to port directory: /opt/local/var/macports/sources/rsync.macports.org/macports/release/tarballs/ports/archivers/libarchive
118:debug:main OS darwin/18.2.0 (Mac OS X 10.14) arch i386
119:debug:main adding the default universal variant
120:debug:main Reading variant descriptions from /opt/local/var/macports/sources/rsync.macports.org/macports/release/tarballs/ports/_resources/port1.0/variant_descriptions.conf
121:debug:main Running callback portconfigure::add_automatic_compiler_dependencies
122:debug:main Finished running callback portconfigure::add_automatic_compiler_dependencies
123:debug:main Running callback portbuild::add_automatic_buildsystem_dependencies
124:debug:main Finished running callback portbuild::add_automatic_buildsystem_dependencies
125:debug:main Running callback portstartupitem::add_notes
126:debug:main Finished running callback portstartupitem::add_notes
127:debug:main Searching for dependency: ncurses
128:debug:main Found Dependency: receipt exists for ncurses
129:debug:main Searching for dependency: libuv
130:debug:main Didn't find receipt, going to depspec regex for: libuv
131:debug:main Changing to port directory: /opt/local/var/macports/sources/rsync.macports.org/macports/release/tarballs/ports/devel/libuv
132:debug:main OS darwin/18.2.0 (Mac OS X 10.14) arch i386
133:debug:main Sourcing PortGroup github 1.0 from /opt/local/var/macports/sources/rsync.macports.org/macports/release/tarballs/ports/_resources/port1.0/group/github-1.0.tcl
134:debug:main Removing legacy build support
135:debug:main Sourcing PortGroup legacysupport 1.0 from /opt/local/var/macports/sources/rsync.macports.org/macports/release/tarballs/ports/_resources/port1.0/group/legacysupport-1.0.tcl
136:debug:main Re-registering default for livecheck.regex
137:debug:main adding the default universal variant
138:debug:main Reading variant descriptions from /opt/local/var/macports/sources/rsync.macports.org/macports/release/tarballs/ports/_resources/port1.0/variant_descriptions.conf
139:debug:main Running callback portconfigure::add_automatic_compiler_dependencies
140:debug:main Finished running callback portconfigure::add_automatic_compiler_dependencies
141:debug:main Running callback portbuild::add_automatic_buildsystem_dependencies
142:debug:main Finished running callback portbuild::add_automatic_buildsystem_dependencies
143:debug:main Running callback portstartupitem::add_notes
144:debug:main Finished running callback portstartupitem::add_notes
145:debug:main Running callback add_legacysupport
146:debug:main Removing legacy build support
147:debug:main Finished running callback add_legacysupport
148:info:main .:debug:main libcxx has no conflicts
149:info:main .:debug:main libarchive has no conflicts
150:debug:main Searching for dependency: libxml2
151:debug:main Didn't find receipt, going to depspec regex for: libxml2
152:debug:main Changing to port directory: /opt/local/var/macports/sources/rsync.macports.org/macports/release/tarballs/ports/textproc/libxml2
153:debug:main OS darwin/18.2.0 (Mac OS X 10.14) arch i386
154:debug:main adding the default universal variant
155:debug:main Reading variant descriptions from /opt/local/var/macports/sources/rsync.macports.org/macports/release/tarballs/ports/_resources/port1.0/variant_descriptions.conf
156:debug:main Running callback portconfigure::add_automatic_compiler_dependencies
157:debug:main Finished running callback portconfigure::add_automatic_compiler_dependencies
158:debug:main Running callback portbuild::add_automatic_buildsystem_dependencies
159:debug:main Finished running callback portbuild::add_automatic_buildsystem_dependencies
160:debug:main Running callback portstartupitem::add_notes
161:debug:main Finished running callback portstartupitem::add_notes
162:debug:main Searching for dependency: xz
163:debug:main Found Dependency: receipt exists for xz
164:debug:main Searching for dependency: lzo2
165:debug:main Didn't find receipt, going to depspec regex for: lzo2
166:debug:main Changing to port directory: /opt/local/var/macports/sources/rsync.macports.org/macports/release/tarballs/ports/archivers/lzo2
167:debug:main OS darwin/18.2.0 (Mac OS X 10.14) arch i386
168:debug:main Reading variant descriptions from /opt/local/var/macports/sources/rsync.macports.org/macports/release/tarballs/ports/_resources/port1.0/variant_descriptions.conf
169:debug:main Sourcing PortGroup muniversal 1.0 from /opt/local/var/macports/sources/rsync.macports.org/macports/release/tarballs/ports/_resources/port1.0/group/muniversal-1.0.tcl
170:debug:main universal variant already exists, so not adding the default one
171:debug:main Running callback portconfigure::add_automatic_compiler_dependencies
172:debug:main Finished running callback portconfigure::add_automatic_compiler_dependencies
173:debug:main Running callback portbuild::add_automatic_buildsystem_dependencies
174:debug:main Finished running callback portbuild::add_automatic_buildsystem_dependencies
175:debug:main Running callback portstartupitem::add_notes
176:debug:main Finished running callback portstartupitem::add_notes
177:debug:main Searching for dependency: libiconv
178:debug:main Found Dependency: receipt exists for libiconv
179:debug:main Searching for dependency: lz4
180:debug:main Didn't find receipt, going to depspec regex for: lz4
181:debug:main Changing to port directory: /opt/local/var/macports/sources/rsync.macports.org/macports/release/tarballs/ports/archivers/lz4
182:debug:main OS darwin/18.2.0 (Mac OS X 10.14) arch i386
183:debug:main Sourcing PortGroup github 1.0 from /opt/local/var/macports/sources/rsync.macports.org/macports/release/tarballs/ports/_resources/port1.0/group/github-1.0.tcl
184:debug:main Reading variant descriptions from /opt/local/var/macports/sources/rsync.macports.org/macports/release/tarballs/ports/_resources/port1.0/variant_descriptions.conf
185:debug:main Sourcing PortGroup muniversal 1.0 from /opt/local/var/macports/sources/rsync.macports.org/macports/release/tarballs/ports/_resources/port1.0/group/muniversal-1.0.tcl
186:debug:main Re-registering default for livecheck.regex
187:debug:main universal variant already exists, so not adding the default one
188:debug:main Running callback portconfigure::add_automatic_compiler_dependencies
189:debug:main Finished running callback portconfigure::add_automatic_compiler_dependencies
190:debug:main Running callback portbuild::add_automatic_buildsystem_dependencies
191:debug:main Finished running callback portbuild::add_automatic_buildsystem_dependencies
192:debug:main Running callback portstartupitem::add_notes
193:debug:main Finished running callback portstartupitem::add_notes
194:debug:main Searching for dependency: zstd
195:debug:main Didn't find receipt, going to depspec regex for: zstd
196:debug:main Changing to port directory: /opt/local/var/macports/sources/rsync.macports.org/macports/release/tarballs/ports/archivers/zstd
197:debug:main OS darwin/18.2.0 (Mac OS X 10.14) arch i386
198:debug:main Sourcing PortGroup github 1.0 from /opt/local/var/macports/sources/rsync.macports.org/macports/release/tarballs/ports/_resources/port1.0/group/github-1.0.tcl
199:debug:main Re-registering default for livecheck.regex
200:debug:main Reading variant descriptions from /opt/local/var/macports/sources/rsync.macports.org/macports/release/tarballs/ports/_resources/port1.0/variant_descriptions.conf
201:debug:main universal variant already exists, so not adding the default one
202:debug:main Running callback portconfigure::add_automatic_compiler_dependencies
203:debug:main Finished running callback portconfigure::add_automatic_compiler_dependencies
204:debug:main Running callback portbuild::add_automatic_buildsystem_dependencies
205:debug:main Finished running callback portbuild::add_automatic_buildsystem_dependencies
206:debug:main Running callback portstartupitem::add_notes
207:debug:main Finished running callback portstartupitem::add_notes
208:info:main .:debug:main libxml2 has no conflicts
209:debug:main Searching for dependency: icu
210:debug:main Didn't find receipt, going to depspec regex for: icu
211:debug:main Changing to port directory: /opt/local/var/macports/sources/rsync.macports.org/macports/release/tarballs/ports/devel/icu
212:debug:main OS darwin/18.2.0 (Mac OS X 10.14) arch i386
213:debug:main Reading variant descriptions from /opt/local/var/macports/sources/rsync.macports.org/macports/release/tarballs/ports/_resources/port1.0/variant_descriptions.conf
214:debug:main Sourcing PortGroup muniversal 1.0 from /opt/local/var/macports/sources/rsync.macports.org/macports/release/tarballs/ports/_resources/port1.0/group/muniversal-1.0.tcl
215:debug:main universal variant already exists, so not adding the default one
216:debug:main Running callback portconfigure::add_automatic_compiler_dependencies
217:debug:main Finished running callback portconfigure::add_automatic_compiler_dependencies
218:debug:main Running callback portbuild::add_automatic_buildsystem_dependencies
219:debug:main Finished running callback portbuild::add_automatic_buildsystem_dependencies
220:debug:main Running callback portstartupitem::add_notes
221:debug:main Finished running callback portstartupitem::add_notes
222:info:main .:debug:main icu has no conflicts
223:info:main .:debug:main lzo2 has no conflicts
224:info:main .:debug:main lz4 has no conflicts
225:info:main .:debug:main zstd has no conflicts
226:info:main .:debug:main Checking for conflicts against libuv
227:debug:main Searching for dependency: libuv-devel
228:debug:main Didn't find receipt, going to depspec regex for: libuv-devel
229:info:main .:debug:main fontforge has no conflicts
230:debug:main Searching for dependency: cairo
231:debug:main Didn't find receipt, going to depspec regex for: cairo
232:debug:main Changing to port directory: /opt/local/var/macports/sources/rsync.macports.org/macports/release/tarballs/ports/graphics/cairo
233:debug:main OS darwin/18.2.0 (Mac OS X 10.14) arch i386
234:debug:main Sourcing PortGroup compiler_blacklist_versions 1.0 from /opt/local/var/macports/sources/rsync.macports.org/macports/release/tarballs/ports/_resources/port1.0/group/compiler_blacklist_versions-1.0.tcl
235:debug:main Reading variant descriptions from /opt/local/var/macports/sources/rsync.macports.org/macports/release/tarballs/ports/_resources/port1.0/variant_descriptions.conf
236:debug:main Sourcing PortGroup muniversal 1.0 from /opt/local/var/macports/sources/rsync.macports.org/macports/release/tarballs/ports/_resources/port1.0/group/muniversal-1.0.tcl
237:debug:main Sourcing PortGroup xcodeversion 1.0 from /opt/local/var/macports/sources/rsync.macports.org/macports/release/tarballs/ports/_resources/port1.0/group/xcodeversion-1.0.tcl
238:debug:main compiler clang 1000.11.45.5 not blacklisted because it doesn't match {clang < 318.0.61}
239:debug:main universal variant already exists, so not adding the default one
240:debug:main Executing variant quartz provides quartz
241:debug:main Executing variant x11 provides x11
242:debug:main Running callback portconfigure::add_automatic_compiler_dependencies
243:debug:main Finished running callback portconfigure::add_automatic_compiler_dependencies
244:debug:main Running callback portbuild::add_automatic_buildsystem_dependencies
245:debug:main Finished running callback portbuild::add_automatic_buildsystem_dependencies
246:debug:main Running callback portstartupitem::add_notes
247:debug:main Finished running callback portstartupitem::add_notes
248:debug:main Searching for dependency: readline
249:debug:main Found Dependency: receipt exists for readline
250:debug:main Searching for dependency: freetype
251:debug:main Didn't find receipt, going to depspec regex for: freetype
252:debug:main Changing to port directory: /opt/local/var/macports/sources/rsync.macports.org/macports/release/tarballs/ports/print/freetype
253:debug:main OS darwin/18.2.0 (Mac OS X 10.14) arch i386
254:debug:main Reading variant descriptions from /opt/local/var/macports/sources/rsync.macports.org/macports/release/tarballs/ports/_resources/port1.0/variant_descriptions.conf
255:debug:main Sourcing PortGroup muniversal 1.0 from /opt/local/var/macports/sources/rsync.macports.org/macports/release/tarballs/ports/_resources/port1.0/group/muniversal-1.0.tcl
256:debug:main universal variant already exists, so not adding the default one
257:debug:main Running callback portconfigure::add_automatic_compiler_dependencies
258:debug:main Finished running callback portconfigure::add_automatic_compiler_dependencies
259:debug:main Running callback portbuild::add_automatic_buildsystem_dependencies
260:debug:main Finished running callback portbuild::add_automatic_buildsystem_dependencies
261:debug:main Running callback portstartupitem::add_notes
262:debug:main Finished running callback portstartupitem::add_notes
263:debug:main Searching for dependency: gettext
264:debug:main Found Dependency: receipt exists for gettext
265:debug:main Searching for dependency: giflib
266:debug:main Didn't find receipt, going to depspec regex for: giflib
267:debug:main Changing to port directory: /opt/local/var/macports/sources/rsync.macports.org/macports/release/tarballs/ports/graphics/giflib
268:debug:main OS darwin/18.2.0 (Mac OS X 10.14) arch i386
269:debug:main Reading variant descriptions from /opt/local/var/macports/sources/rsync.macports.org/macports/release/tarballs/ports/_resources/port1.0/variant_descriptions.conf
270:debug:main adding the default universal variant
271:debug:main Executing variant x11 provides x11
272:debug:main Running callback portconfigure::add_automatic_compiler_dependencies
273:debug:main Finished running callback portconfigure::add_automatic_compiler_dependencies
274:debug:main Running callback portbuild::add_automatic_buildsystem_dependencies
275:debug:main Finished running callback portbuild::add_automatic_buildsystem_dependencies
276:debug:main Running callback portstartupitem::add_notes
277:debug:main Finished running callback portstartupitem::add_notes
278:debug:main Searching for dependency: jpeg
279:debug:main Didn't find receipt, going to depspec regex for: jpeg
280:debug:main Changing to port directory: /opt/local/var/macports/sources/rsync.macports.org/macports/release/tarballs/ports/graphics/jpeg
281:debug:main OS darwin/18.2.0 (Mac OS X 10.14) arch i386
282:debug:main adding the default universal variant
283:debug:main Reading variant descriptions from /opt/local/var/macports/sources/rsync.macports.org/macports/release/tarballs/ports/_resources/port1.0/variant_descriptions.conf
284:debug:main Running callback portconfigure::add_automatic_compiler_dependencies
285:debug:main Finished running callback portconfigure::add_automatic_compiler_dependencies
286:debug:main Running callback portbuild::add_automatic_buildsystem_dependencies
287:debug:main Finished running callback portbuild::add_automatic_buildsystem_dependencies
288:debug:main Running callback portstartupitem::add_notes
289:debug:main Finished running callback portstartupitem::add_notes
290:debug:main Searching for dependency: libpng
291:debug:main Didn't find receipt, going to depspec regex for: libpng
292:debug:main Changing to port directory: /opt/local/var/macports/sources/rsync.macports.org/macports/release/tarballs/ports/graphics/libpng
293:debug:main OS darwin/18.2.0 (Mac OS X 10.14) arch i386
294:debug:main adding the default universal variant
295:debug:main Reading variant descriptions from /opt/local/var/macports/sources/rsync.macports.org/macports/release/tarballs/ports/_resources/port1.0/variant_descriptions.conf
296:debug:main Running callback portconfigure::add_automatic_compiler_dependencies
297:debug:main Finished running callback portconfigure::add_automatic_compiler_dependencies
298:debug:main Running callback portbuild::add_automatic_buildsystem_dependencies
299:debug:main Finished running callback portbuild::add_automatic_buildsystem_dependencies
300:debug:main Running callback portstartupitem::add_notes
301:debug:main Finished running callback portstartupitem::add_notes
302:debug:main Searching for dependency: libspiro
303:debug:main Didn't find receipt, going to depspec regex for: libspiro
304:debug:main Changing to port directory: /opt/local/var/macports/sources/rsync.macports.org/macports/release/tarballs/ports/graphics/libspiro
305:debug:main OS darwin/18.2.0 (Mac OS X 10.14) arch i386
306:debug:main Sourcing PortGroup github 1.0 from /opt/local/var/macports/sources/rsync.macports.org/macports/release/tarballs/ports/_resources/port1.0/group/github-1.0.tcl
307:debug:main Re-registering default for livecheck.regex
308:debug:main adding the default universal variant
309:debug:main Reading variant descriptions from /opt/local/var/macports/sources/rsync.macports.org/macports/release/tarballs/ports/_resources/port1.0/variant_descriptions.conf
310:debug:main Running callback portconfigure::add_automatic_compiler_dependencies
311:debug:main Finished running callback portconfigure::add_automatic_compiler_dependencies
312:debug:main Running callback portbuild::add_automatic_buildsystem_dependencies
313:debug:main Finished running callback portbuild::add_automatic_buildsystem_dependencies
314:debug:main Running callback portstartupitem::add_notes
315:debug:main Finished running callback portstartupitem::add_notes
316:debug:main Searching for dependency: libuninameslist
317:debug:main Didn't find receipt, going to depspec regex for: libuninameslist
318:debug:main Changing to port directory: /opt/local/var/macports/sources/rsync.macports.org/macports/release/tarballs/ports/devel/libuninameslist
319:debug:main OS darwin/18.2.0 (Mac OS X 10.14) arch i386
320:debug:main Sourcing PortGroup github 1.0 from /opt/local/var/macports/sources/rsync.macports.org/macports/release/tarballs/ports/_resources/port1.0/group/github-1.0.tcl
321:debug:main Re-registering default for livecheck.regex
322:debug:main adding the default universal variant
323:debug:main Reading variant descriptions from /opt/local/var/macports/sources/rsync.macports.org/macports/release/tarballs/ports/_resources/port1.0/variant_descriptions.conf
324:debug:main Running callback portconfigure::add_automatic_compiler_dependencies
325:debug:main Finished running callback portconfigure::add_automatic_compiler_dependencies
326:debug:main Running callback portbuild::add_automatic_buildsystem_dependencies
327:debug:main Finished running callback portbuild::add_automatic_buildsystem_dependencies
328:debug:main Running callback portstartupitem::add_notes
329:debug:main Finished running callback portstartupitem::add_notes
330:debug:main Searching for dependency: pango
331:debug:main Didn't find receipt, going to depspec regex for: pango
332:debug:main Changing to port directory: /opt/local/var/macports/sources/rsync.macports.org/macports/release/tarballs/ports/x11/pango
333:debug:main OS darwin/18.2.0 (Mac OS X 10.14) arch i386
334:debug:main Sourcing PortGroup active_variants 1.1 from /opt/local/var/macports/sources/rsync.macports.org/macports/release/tarballs/ports/_resources/port1.0/group/active_variants-1.1.tcl
335:debug:main Sourcing PortGroup gobject_introspection 1.0 from /opt/local/var/macports/sources/rsync.macports.org/macports/release/tarballs/ports/_resources/port1.0/group/gobject_introspection-1.0.tcl
336:debug:main Reading variant descriptions from /opt/local/var/macports/sources/rsync.macports.org/macports/release/tarballs/ports/_resources/port1.0/variant_descriptions.conf
337:debug:main adding the default universal variant
338:debug:main Executing variant quartz provides quartz
339:debug:main Executing variant x11 provides x11
340:debug:main Running callback portconfigure::add_automatic_compiler_dependencies
341:debug:main Finished running callback portconfigure::add_automatic_compiler_dependencies
342:debug:main Running callback portbuild::add_automatic_buildsystem_dependencies
343:debug:main Finished running callback portbuild::add_automatic_buildsystem_dependencies
344:debug:main Running callback portstartupitem::add_notes
345:debug:main Finished running callback portstartupitem::add_notes
346:debug:main Searching for dependency: potrace
347:debug:main Didn't find receipt, going to depspec regex for: potrace
348:debug:main Changing to port directory: /opt/local/var/macports/sources/rsync.macports.org/macports/release/tarballs/ports/graphics/potrace
349:debug:main OS darwin/18.2.0 (Mac OS X 10.14) arch i386
350:debug:main adding the default universal variant
351:debug:main Reading variant descriptions from /opt/local/var/macports/sources/rsync.macports.org/macports/release/tarballs/ports/_resources/port1.0/variant_descriptions.conf
352:debug:main Running callback portconfigure::add_automatic_compiler_dependencies
353:debug:main Finished running callback portconfigure::add_automatic_compiler_dependencies
354:debug:main Running callback portbuild::add_automatic_buildsystem_dependencies
355:debug:main Finished running callback portbuild::add_automatic_buildsystem_dependencies
356:debug:main Running callback portstartupitem::add_notes
357:debug:main Finished running callback portstartupitem::add_notes
358:debug:main Searching for dependency: tiff
359:debug:main Didn't find receipt, going to depspec regex for: tiff
360:debug:main Changing to port directory: /opt/local/var/macports/sources/rsync.macports.org/macports/release/tarballs/ports/graphics/tiff
361:debug:main OS darwin/18.2.0 (Mac OS X 10.14) arch i386
362:debug:main Sourcing PortGroup xcodeversion 1.0 from /opt/local/var/macports/sources/rsync.macports.org/macports/release/tarballs/ports/_resources/port1.0/group/xcodeversion-1.0.tcl
363:debug:main Reading variant descriptions from /opt/local/var/macports/sources/rsync.macports.org/macports/release/tarballs/ports/_resources/port1.0/variant_descriptions.conf
364:debug:main Sourcing PortGroup muniversal 1.0 from /opt/local/var/macports/sources/rsync.macports.org/macports/release/tarballs/ports/_resources/port1.0/group/muniversal-1.0.tcl
365:debug:main universal variant already exists, so not adding the default one
366:debug:main Running callback portconfigure::add_automatic_compiler_dependencies
367:debug:main Finished running callback portconfigure::add_automatic_compiler_dependencies
368:debug:main Running callback portbuild::add_automatic_buildsystem_dependencies
369:debug:main Finished running callback portbuild::add_automatic_buildsystem_dependencies
370:debug:main Running callback portstartupitem::add_notes
371:debug:main Finished running callback portstartupitem::add_notes
372:debug:main Searching for dependency: python27
373:debug:main Found Dependency: receipt exists for python27
374:info:main .:debug:main Checking for conflicts against cairo
375:debug:main Searching for dependency: cairo-devel
376:debug:main Didn't find receipt, going to depspec regex for: cairo-devel
377:debug:main Searching for dependency: libpixman
378:debug:main Didn't find receipt, going to depspec regex for: libpixman
379:debug:main Changing to port directory: /opt/local/var/macports/sources/rsync.macports.org/macports/release/tarballs/ports/graphics/libpixman
380:debug:main OS darwin/18.2.0 (Mac OS X 10.14) arch i386
381:debug:main Sourcing PortGroup compiler_blacklist_versions 1.0 from /opt/local/var/macports/sources/rsync.macports.org/macports/release/tarballs/ports/_resources/port1.0/group/compiler_blacklist_versions-1.0.tcl
382:debug:main Reading variant descriptions from /opt/local/var/macports/sources/rsync.macports.org/macports/release/tarballs/ports/_resources/port1.0/variant_descriptions.conf
383:debug:main Sourcing PortGroup muniversal 1.0 from /opt/local/var/macports/sources/rsync.macports.org/macports/release/tarballs/ports/_resources/port1.0/group/muniversal-1.0.tcl
384:debug:main compiler clang 1000.11.45.5 not blacklisted because it doesn't match {clang < 211.10.1}
385:debug:main universal variant already exists, so not adding the default one
386:debug:main Running callback portconfigure::add_automatic_compiler_dependencies
387:debug:main Finished running callback portconfigure::add_automatic_compiler_dependencies
388:debug:main Running callback portbuild::add_automatic_buildsystem_dependencies
389:debug:main Finished running callback portbuild::add_automatic_buildsystem_dependencies
390:debug:main Running callback portstartupitem::add_notes
391:debug:main Finished running callback portstartupitem::add_notes
392:debug:main Searching for dependency: glib2
393:debug:main Found Dependency: receipt exists for glib2
394:debug:main Searching for dependency: fontconfig
395:debug:main Didn't find receipt, going to depspec regex for: fontconfig
396:debug:main Changing to port directory: /opt/local/var/macports/sources/rsync.macports.org/macports/release/tarballs/ports/graphics/fontconfig
397:debug:main OS darwin/18.2.0 (Mac OS X 10.14) arch i386
398:debug:main Reading variant descriptions from /opt/local/var/macports/sources/rsync.macports.org/macports/release/tarballs/ports/_resources/port1.0/variant_descriptions.conf
399:debug:main Sourcing PortGroup muniversal 1.0 from /opt/local/var/macports/sources/rsync.macports.org/macports/release/tarballs/ports/_resources/port1.0/group/muniversal-1.0.tcl
400:debug:main universal variant already exists, so not adding the default one
401:debug:main Running callback portconfigure::add_automatic_compiler_dependencies
402:debug:main Finished running callback portconfigure::add_automatic_compiler_dependencies
403:debug:main Running callback portbuild::add_automatic_buildsystem_dependencies
404:debug:main Finished running callback portbuild::add_automatic_buildsystem_dependencies
405:debug:main Running callback portstartupitem::add_notes
406:debug:main Finished running callback portstartupitem::add_notes
407:debug:main Searching for dependency: xrender
408:debug:main Didn't find receipt, going to depspec regex for: xrender
409:debug:main Changing to port directory: /opt/local/var/macports/sources/rsync.macports.org/macports/release/tarballs/ports/x11/xrender
410:debug:main OS darwin/18.2.0 (Mac OS X 10.14) arch i386
411:debug:main adding the default universal variant
412:debug:main Reading variant descriptions from /opt/local/var/macports/sources/rsync.macports.org/macports/release/tarballs/ports/_resources/port1.0/variant_descriptions.conf
413:debug:main Running callback portconfigure::add_automatic_compiler_dependencies
414:debug:main Finished running callback portconfigure::add_automatic_compiler_dependencies
415:debug:main Running callback portbuild::add_automatic_buildsystem_dependencies
416:debug:main Finished running callback portbuild::add_automatic_buildsystem_dependencies
417:debug:main Running callback portstartupitem::add_notes
418:debug:main Finished running callback portstartupitem::add_notes
419:debug:main Searching for dependency: xorg-libXext
420:debug:main Didn't find receipt, going to depspec regex for: xorg-libXext
421:debug:main Changing to port directory: /opt/local/var/macports/sources/rsync.macports.org/macports/release/tarballs/ports/x11/xorg-libXext
422:debug:main OS darwin/18.2.0 (Mac OS X 10.14) arch i386
423:debug:main adding the default universal variant
424:debug:main Reading variant descriptions from /opt/local/var/macports/sources/rsync.macports.org/macports/release/tarballs/ports/_resources/port1.0/variant_descriptions.conf
425:debug:main Running callback portconfigure::add_automatic_compiler_dependencies
426:debug:main Finished running callback portconfigure::add_automatic_compiler_dependencies
427:debug:main Running callback portbuild::add_automatic_buildsystem_dependencies
428:debug:main Finished running callback portbuild::add_automatic_buildsystem_dependencies
429:debug:main Running callback portstartupitem::add_notes
430:debug:main Finished running callback portstartupitem::add_notes
431:debug:main Searching for dependency: xorg-xcb-util
432:debug:main Didn't find receipt, going to depspec regex for: xorg-xcb-util
433:debug:main Changing to port directory: /opt/local/var/macports/sources/rsync.macports.org/macports/release/tarballs/ports/x11/xorg-xcb-util
434:debug:main OS darwin/18.2.0 (Mac OS X 10.14) arch i386
435:debug:main adding the default universal variant
436:debug:main Reading variant descriptions from /opt/local/var/macports/sources/rsync.macports.org/macports/release/tarballs/ports/_resources/port1.0/variant_descriptions.conf
437:debug:main Running callback portconfigure::add_automatic_compiler_dependencies
438:debug:main Finished running callback portconfigure::add_automatic_compiler_dependencies
439:debug:main Running callback portbuild::add_automatic_buildsystem_dependencies
440:debug:main Finished running callback portbuild::add_automatic_buildsystem_dependencies
441:debug:main Running callback portstartupitem::add_notes
442:debug:main Finished running callback portstartupitem::add_notes
443:info:main .:debug:main Checking for conflicts against libpixman
444:debug:main Searching for dependency: libpixman-devel
445:debug:main Didn't find receipt, going to depspec regex for: libpixman-devel
446:info:main .:debug:main fontconfig has no conflicts
447:debug:main Searching for dependency: ossp-uuid
448:debug:main Didn't find receipt, going to depspec regex for: ossp-uuid
449:debug:main Changing to port directory: /opt/local/var/macports/sources/rsync.macports.org/macports/release/tarballs/ports/devel/ossp-uuid
450:debug:main OS darwin/18.2.0 (Mac OS X 10.14) arch i386
451:debug:main Reading variant descriptions from /opt/local/var/macports/sources/rsync.macports.org/macports/release/tarballs/ports/_resources/port1.0/variant_descriptions.conf
452:debug:main Sourcing PortGroup muniversal 1.0 from /opt/local/var/macports/sources/rsync.macports.org/macports/release/tarballs/ports/_resources/port1.0/group/muniversal-1.0.tcl
453:debug:main Re-registering default for configure.universal_args
454:debug:main Sourcing PortGroup perl5 1.0 from /opt/local/var/macports/sources/rsync.macports.org/macports/release/tarballs/ports/_resources/port1.0/group/perl5-1.0.tcl
455:debug:main universal variant already exists, so not adding the default one
456:debug:main Executing variant perl5_26 provides perl5_26
457:debug:main Running callback portconfigure::add_automatic_compiler_dependencies
458:debug:main Finished running callback portconfigure::add_automatic_compiler_dependencies
459:debug:main Running callback portbuild::add_automatic_buildsystem_dependencies
460:debug:main Finished running callback portbuild::add_automatic_buildsystem_dependencies
461:debug:main Running callback portstartupitem::add_notes
462:debug:main Finished running callback portstartupitem::add_notes
463:info:main .:debug:main Checking for conflicts against ossp-uuid
464:debug:main Searching for dependency: libuuid
465:debug:main Didn't find receipt, going to depspec regex for: libuuid
466:debug:main Searching for dependency: perl5.26
467:debug:main Found Dependency: receipt exists for perl5.26
468:info:main .:debug:main xrender has no conflicts
469:debug:main Searching for dependency: xorg-libX11
470:debug:main Didn't find receipt, going to depspec regex for: xorg-libX11
471:debug:main Changing to port directory: /opt/local/var/macports/sources/rsync.macports.org/macports/release/tarballs/ports/x11/xorg-libX11
472:debug:main OS darwin/18.2.0 (Mac OS X 10.14) arch i386
473:debug:main adding the default universal variant
474:debug:main Reading variant descriptions from /opt/local/var/macports/sources/rsync.macports.org/macports/release/tarballs/ports/_resources/port1.0/variant_descriptions.conf
475:debug:main Running callback portconfigure::add_automatic_compiler_dependencies
476:debug:main Finished running callback portconfigure::add_automatic_compiler_dependencies
477:debug:main Running callback portbuild::add_automatic_buildsystem_dependencies
478:debug:main Finished running callback portbuild::add_automatic_buildsystem_dependencies
479:debug:main Running callback portstartupitem::add_notes
480:debug:main Finished running callback portstartupitem::add_notes
481:debug:main Searching for dependency: xorg-xorgproto
482:debug:main Didn't find receipt, going to depspec regex for: xorg-xorgproto
483:debug:main Changing to port directory: /opt/local/var/macports/sources/rsync.macports.org/macports/release/tarballs/ports/x11/xorg-xorgproto
484:debug:main OS darwin/18.2.0 (Mac OS X 10.14) arch i386
485:debug:main only one arch supported, so not adding the default universal variant
486:debug:main Running callback portconfigure::add_automatic_compiler_dependencies
487:debug:main Finished running callback portconfigure::add_automatic_compiler_dependencies
488:debug:main Running callback portbuild::add_automatic_buildsystem_dependencies
489:debug:main Finished running callback portbuild::add_automatic_buildsystem_dependencies
490:debug:main Running callback portstartupitem::add_notes
491:debug:main Finished running callback portstartupitem::add_notes
492:info:main .:debug:main xorg-libX11 has no conflicts
493:debug:main Searching for dependency: xorg-libXdmcp
494:debug:main Didn't find receipt, going to depspec regex for: xorg-libXdmcp
495:debug:main Changing to port directory: /opt/local/var/macports/sources/rsync.macports.org/macports/release/tarballs/ports/x11/xorg-libXdmcp
496:debug:main OS darwin/18.2.0 (Mac OS X 10.14) arch i386
497:debug:main adding the default universal variant
498:debug:main Reading variant descriptions from /opt/local/var/macports/sources/rsync.macports.org/macports/release/tarballs/ports/_resources/port1.0/variant_descriptions.conf
499:debug:main Running callback portconfigure::add_automatic_compiler_dependencies
500:debug:main Finished running callback portconfigure::add_automatic_compiler_dependencies
501:debug:main Running callback portbuild::add_automatic_buildsystem_dependencies
502:debug:main Finished running callback portbuild::add_automatic_buildsystem_dependencies
503:debug:main Running callback portstartupitem::add_notes
504:debug:main Finished running callback portstartupitem::add_notes
505:debug:main Searching for dependency: xorg-libXau
506:debug:main Didn't find receipt, going to depspec regex for: xorg-libXau
507:debug:main Changing to port directory: /opt/local/var/macports/sources/rsync.macports.org/macports/release/tarballs/ports/x11/xorg-libXau
508:debug:main OS darwin/18.2.0 (Mac OS X 10.14) arch i386
509:debug:main adding the default universal variant
510:debug:main Reading variant descriptions from /opt/local/var/macports/sources/rsync.macports.org/macports/release/tarballs/ports/_resources/port1.0/variant_descriptions.conf
511:debug:main Running callback portconfigure::add_automatic_compiler_dependencies
512:debug:main Finished running callback portconfigure::add_automatic_compiler_dependencies
513:debug:main Running callback portbuild::add_automatic_buildsystem_dependencies
514:debug:main Finished running callback portbuild::add_automatic_buildsystem_dependencies
515:debug:main Running callback portstartupitem::add_notes
516:debug:main Finished running callback portstartupitem::add_notes
517:debug:main Searching for dependency: xorg-libxcb
518:debug:main Didn't find receipt, going to depspec regex for: xorg-libxcb
519:debug:main Changing to port directory: /opt/local/var/macports/sources/rsync.macports.org/macports/release/tarballs/ports/x11/xorg-libxcb
520:debug:main OS darwin/18.2.0 (Mac OS X 10.14) arch i386
521:debug:main adding the default universal variant
522:debug:main Reading variant descriptions from /opt/local/var/macports/sources/rsync.macports.org/macports/release/tarballs/ports/_resources/port1.0/variant_descriptions.conf
523:debug:main Executing variant python27 provides python27
524:debug:main Running callback portconfigure::add_automatic_compiler_dependencies
525:debug:main Finished running callback portconfigure::add_automatic_compiler_dependencies
526:debug:main Running callback portbuild::add_automatic_buildsystem_dependencies
527:debug:main Finished running callback portbuild::add_automatic_buildsystem_dependencies
528:debug:main Running callback portstartupitem::add_notes
529:debug:main Finished running callback portstartupitem::add_notes
530:info:main .:debug:main xorg-libXdmcp has no conflicts
531:info:main .:debug:main xorg-libXau has no conflicts
532:info:main .:debug:main xorg-libxcb has no conflicts
533:debug:main Searching for dependency: xorg-xcb-proto
534:debug:main Didn't find receipt, going to depspec regex for: xorg-xcb-proto
535:debug:main Changing to port directory: /opt/local/var/macports/sources/rsync.macports.org/macports/release/tarballs/ports/x11/xorg-xcb-proto
536:debug:main OS darwin/18.2.0 (Mac OS X 10.14) arch i386
537:debug:main only one arch supported, so not adding the default universal variant
538:debug:main Executing variant python27 provides python27
539:debug:main Running callback portconfigure::add_automatic_compiler_dependencies
540:debug:main Finished running callback portconfigure::add_automatic_compiler_dependencies
541:debug:main Running callback portbuild::add_automatic_buildsystem_dependencies
542:debug:main Finished running callback portbuild::add_automatic_buildsystem_dependencies
543:debug:main Running callback portstartupitem::add_notes
544:debug:main Finished running callback portstartupitem::add_notes
545:debug:main Searching for dependency: xorg-libpthread-stubs
546:debug:main Didn't find receipt, going to depspec regex for: xorg-libpthread-stubs
547:debug:main Changing to port directory: /opt/local/var/macports/sources/rsync.macports.org/macports/release/tarballs/ports/x11/xorg-libpthread-stubs
548:debug:main OS darwin/18.2.0 (Mac OS X 10.14) arch i386
549:debug:main only one arch supported, so not adding the default universal variant
550:debug:main Running callback portconfigure::add_automatic_compiler_dependencies
551:debug:main Finished running callback portconfigure::add_automatic_compiler_dependencies
552:debug:main Running callback portbuild::add_automatic_buildsystem_dependencies
553:debug:main Finished running callback portbuild::add_automatic_buildsystem_dependencies
554:debug:main Running callback portstartupitem::add_notes
555:debug:main Finished running callback portstartupitem::add_notes
556:info:main .:debug:main xorg-xcb-proto has no conflicts
557:info:main .:debug:main xorg-libpthread-stubs has no conflicts
558:info:main .:debug:main xorg-xorgproto has no conflicts
559:info:main .:debug:main xorg-libXext has no conflicts
560:info:main .:debug:main xorg-xcb-util has no conflicts
561:info:main .:debug:main freetype has no conflicts
562:info:main .:debug:main giflib has no conflicts
563:debug:main Searching for dependency: xorg-libsm
564:debug:main Didn't find receipt, going to depspec regex for: xorg-libsm
565:debug:main Changing to port directory: /opt/local/var/macports/sources/rsync.macports.org/macports/release/tarballs/ports/x11/xorg-libsm
566:debug:main OS darwin/18.2.0 (Mac OS X 10.14) arch i386
567:debug:main adding the default universal variant
568:debug:main Reading variant descriptions from /opt/local/var/macports/sources/rsync.macports.org/macports/release/tarballs/ports/_resources/port1.0/variant_descriptions.conf
569:debug:main Running callback portconfigure::add_automatic_compiler_dependencies
570:debug:main Finished running callback portconfigure::add_automatic_compiler_dependencies
571:debug:main Running callback portbuild::add_automatic_buildsystem_dependencies
572:debug:main Finished running callback portbuild::add_automatic_buildsystem_dependencies
573:debug:main Running callback portstartupitem::add_notes
574:debug:main Finished running callback portstartupitem::add_notes
575:info:main .:debug:main xorg-libsm has no conflicts
576:debug:main Searching for dependency: xorg-libice
577:debug:main Didn't find receipt, going to depspec regex for: xorg-libice
578:debug:main Changing to port directory: /opt/local/var/macports/sources/rsync.macports.org/macports/release/tarballs/ports/x11/xorg-libice
579:debug:main OS darwin/18.2.0 (Mac OS X 10.14) arch i386
580:debug:main adding the default universal variant
581:debug:main Reading variant descriptions from /opt/local/var/macports/sources/rsync.macports.org/macports/release/tarballs/ports/_resources/port1.0/variant_descriptions.conf
582:debug:main Running callback portconfigure::add_automatic_compiler_dependencies
583:debug:main Finished running callback portconfigure::add_automatic_compiler_dependencies
584:debug:main Running callback portbuild::add_automatic_buildsystem_dependencies
585:debug:main Finished running callback portbuild::add_automatic_buildsystem_dependencies
586:debug:main Running callback portstartupitem::add_notes
587:debug:main Finished running callback portstartupitem::add_notes
588:info:main .:debug:main xorg-libice has no conflicts
589:info:main .:debug:main Checking for conflicts against jpeg
590:debug:main Searching for dependency: libjpeg-turbo
591:debug:main Didn't find receipt, going to depspec regex for: libjpeg-turbo
592:debug:main Searching for dependency: mozjpeg
593:debug:main Didn't find receipt, going to depspec regex for: mozjpeg
594:info:main .:debug:main libpng has no conflicts
595:info:main .:debug:main libspiro has no conflicts
596:info:main .:debug:main libuninameslist has no conflicts
597:info:main .:debug:main Checking for conflicts against pango
598:debug:main Searching for dependency: pango-devel
599:debug:main Didn't find receipt, going to depspec regex for: pango-devel
600:debug:main Searching for dependency: fribidi
601:debug:main Didn't find receipt, going to depspec regex for: fribidi
602:debug:main Changing to port directory: /opt/local/var/macports/sources/rsync.macports.org/macports/release/tarballs/ports/textproc/fribidi
603:debug:main OS darwin/18.2.0 (Mac OS X 10.14) arch i386
604:debug:main Sourcing PortGroup github 1.0 from /opt/local/var/macports/sources/rsync.macports.org/macports/release/tarballs/ports/_resources/port1.0/group/github-1.0.tcl
605:debug:main Re-registering default for livecheck.regex
606:debug:main adding the default universal variant
607:debug:main Reading variant descriptions from /opt/local/var/macports/sources/rsync.macports.org/macports/release/tarballs/ports/_resources/port1.0/variant_descriptions.conf
608:debug:main Running callback portconfigure::add_automatic_compiler_dependencies
609:debug:main Finished running callback portconfigure::add_automatic_compiler_dependencies
610:debug:main Running callback portbuild::add_automatic_buildsystem_dependencies
611:debug:main Finished running callback portbuild::add_automatic_buildsystem_dependencies
612:debug:main Running callback portstartupitem::add_notes
613:debug:main Finished running callback portstartupitem::add_notes
614:debug:main Searching for dependency: harfbuzz
615:debug:main Didn't find receipt, going to depspec regex for: harfbuzz
616:debug:main Changing to port directory: /opt/local/var/macports/sources/rsync.macports.org/macports/release/tarballs/ports/graphics/harfbuzz
617:debug:main OS darwin/18.2.0 (Mac OS X 10.14) arch i386
618:debug:main Sourcing PortGroup compiler_blacklist_versions 1.0 from /opt/local/var/macports/sources/rsync.macports.org/macports/release/tarballs/ports/_resources/port1.0/group/compiler_blacklist_versions-1.0.tcl
619:debug:main compiler clang 1000.11.45.5 not blacklisted because it doesn't match {clang < 300}
620:debug:main adding the default universal variant
621:debug:main Reading variant descriptions from /opt/local/var/macports/sources/rsync.macports.org/macports/release/tarballs/ports/_resources/port1.0/variant_descriptions.conf
622:debug:main Running callback portconfigure::add_automatic_compiler_dependencies
623:debug:main Finished running callback portconfigure::add_automatic_compiler_dependencies
624:debug:main Running callback portbuild::add_automatic_buildsystem_dependencies
625:debug:main Finished running callback portbuild::add_automatic_buildsystem_dependencies
626:debug:main Running callback portstartupitem::add_notes
627:debug:main Finished running callback portstartupitem::add_notes
628:debug:main Searching for dependency: gobject-introspection
629:debug:main Didn't find receipt, going to depspec regex for: gobject-introspection
630:debug:main Changing to port directory: /opt/local/var/macports/sources/rsync.macports.org/macports/release/tarballs/ports/gnome/gobject-introspection
631:debug:main OS darwin/18.2.0 (Mac OS X 10.14) arch i386
632:debug:main Sourcing PortGroup active_variants 1.1 from /opt/local/var/macports/sources/rsync.macports.org/macports/release/tarballs/ports/_resources/port1.0/group/active_variants-1.1.tcl
633:debug:main python27 is installed with the following variants:
634:debug:main   required: ucs4, forbidden:
635:debug:main   rejected, because required variant ucs4 is missing
636:debug:main adding the default universal variant
637:debug:main Reading variant descriptions from /opt/local/var/macports/sources/rsync.macports.org/macports/release/tarballs/ports/_resources/port1.0/variant_descriptions.conf
638:debug:main Running callback portconfigure::add_automatic_compiler_dependencies
639:debug:main Finished running callback portconfigure::add_automatic_compiler_dependencies
640:debug:main Running callback portbuild::add_automatic_buildsystem_dependencies
641:debug:main Finished running callback portbuild::add_automatic_buildsystem_dependencies
642:debug:main Running callback portstartupitem::add_notes
643:debug:main Finished running callback portstartupitem::add_notes
644:debug:main Searching for dependency: Xft2
645:debug:main Didn't find receipt, going to depspec regex for: Xft2
646:debug:main Changing to port directory: /opt/local/var/macports/sources/rsync.macports.org/macports/release/tarballs/ports/x11/Xft2
647:debug:main OS darwin/18.2.0 (Mac OS X 10.14) arch i386
648:debug:main adding the default universal variant
649:debug:main Reading variant descriptions from /opt/local/var/macports/sources/rsync.macports.org/macports/release/tarballs/ports/_resources/port1.0/variant_descriptions.conf
650:debug:main Running callback portconfigure::add_automatic_compiler_dependencies
651:debug:main Finished running callback portconfigure::add_automatic_compiler_dependencies
652:debug:main Running callback portbuild::add_automatic_buildsystem_dependencies
653:debug:main Finished running callback portbuild::add_automatic_buildsystem_dependencies
654:debug:main Running callback portstartupitem::add_notes
655:debug:main Finished running callback portstartupitem::add_notes
656:info:main .:debug:main fribidi has no conflicts
657:info:main .:debug:main harfbuzz has no conflicts
658:debug:main Searching for dependency: graphite2
659:debug:main Didn't find receipt, going to depspec regex for: graphite2
660:debug:main Changing to port directory: /opt/local/var/macports/sources/rsync.macports.org/macports/release/tarballs/ports/graphics/graphite2
661:debug:main OS darwin/18.2.0 (Mac OS X 10.14) arch i386
662:debug:main Re-registering default for destroot.target
663:debug:main Re-registering default for configure.dir
664:debug:main Re-registering default for build.dir
665:debug:main Re-registering default for configure.pre_args
666:debug:main Sourcing PortGroup cmake 1.1 from /opt/local/var/macports/sources/rsync.macports.org/macports/release/tarballs/ports/_resources/port1.0/group/cmake-1.1.tcl
667:debug:main Sourcing PortGroup compiler_blacklist_versions 1.0 from /opt/local/var/macports/sources/rsync.macports.org/macports/release/tarballs/ports/_resources/port1.0/group/compiler_blacklist_versions-1.0.tcl
668:debug:main compiler clang 1000.11.45.5 not blacklisted because it doesn't match {clang < 500}
669:debug:main Sourcing PortGroup cxx11 1.1 from /opt/local/var/macports/sources/rsync.macports.org/macports/release/tarballs/ports/_resources/port1.0/group/cxx11-1.1.tcl
670:debug:main Sourcing PortGroup github 1.0 from /opt/local/var/macports/sources/rsync.macports.org/macports/release/tarballs/ports/_resources/port1.0/group/github-1.0.tcl
671:debug:main Re-registering default for livecheck.regex
672:debug:main adding the default universal variant
673:debug:main Reading variant descriptions from /opt/local/var/macports/sources/rsync.macports.org/macports/release/tarballs/ports/_resources/port1.0/variant_descriptions.conf
674:debug:main Running callback portconfigure::add_automatic_compiler_dependencies
675:debug:main Finished running callback portconfigure::add_automatic_compiler_dependencies
676:debug:main Running callback portbuild::add_automatic_buildsystem_dependencies
677:debug:main Finished running callback portbuild::add_automatic_buildsystem_dependencies
678:debug:main Running callback portstartupitem::add_notes
679:debug:main Finished running callback portstartupitem::add_notes
680:info:main .:debug:main graphite2 has no conflicts
681:info:main .:debug:main gobject-introspection has no conflicts
682:debug:main Searching for dependency: libffi
683:debug:main Found Dependency: receipt exists for libffi
684:debug:main Searching for dependency: py27-mako
685:debug:main Didn't find receipt, going to depspec regex for: py27-mako
686:debug:main Changing to port directory: /opt/local/var/macports/sources/rsync.macports.org/macports/release/tarballs/ports/python/py-mako
687:debug:main OS darwin/18.2.0 (Mac OS X 10.14) arch i386
688:debug:main Re-registering default for build.cmd
689:debug:main Re-registering default for destroot.cmd
690:debug:main Re-registering default for destroot.destdir
691:debug:main Sourcing PortGroup python 1.0 from /opt/local/var/macports/sources/rsync.macports.org/macports/release/tarballs/ports/_resources/port1.0/group/python-1.0.tcl
692:debug:main only one arch supported, so not adding the default universal variant
693:debug:main Running callback portconfigure::add_automatic_compiler_dependencies
694:debug:main Finished running callback portconfigure::add_automatic_compiler_dependencies
695:debug:main Running callback portbuild::add_automatic_buildsystem_dependencies
696:debug:main Finished running callback portbuild::add_automatic_buildsystem_dependencies
697:debug:main Running callback portstartupitem::add_notes
698:debug:main Finished running callback portstartupitem::add_notes
699:debug:main Searching for dependency: py27-markdown
700:debug:main Didn't find receipt, going to depspec regex for: py27-markdown
701:debug:main Changing to port directory: /opt/local/var/macports/sources/rsync.macports.org/macports/release/tarballs/ports/python/py-markdown
702:debug:main OS darwin/18.2.0 (Mac OS X 10.14) arch i386
703:debug:main Re-registering default for build.cmd
704:debug:main Re-registering default for destroot.cmd
705:debug:main Re-registering default for destroot.destdir
706:debug:main Sourcing PortGroup python 1.0 from /opt/local/var/macports/sources/rsync.macports.org/macports/release/tarballs/ports/_resources/port1.0/group/python-1.0.tcl
707:debug:main only one arch supported, so not adding the default universal variant
708:debug:main Running callback portconfigure::add_automatic_compiler_dependencies
709:debug:main Finished running callback portconfigure::add_automatic_compiler_dependencies
710:debug:main Running callback portbuild::add_automatic_buildsystem_dependencies
711:debug:main Finished running callback portbuild::add_automatic_buildsystem_dependencies
712:debug:main Running callback portstartupitem::add_notes
713:debug:main Finished running callback portstartupitem::add_notes
714:debug:main Searching for dependency: libtool
715:debug:main Didn't find receipt, going to depspec regex for: libtool
716:debug:main Changing to port directory: /opt/local/var/macports/sources/rsync.macports.org/macports/release/tarballs/ports/devel/libtool
717:debug:main OS darwin/18.2.0 (Mac OS X 10.14) arch i386
718:debug:main adding the default universal variant
719:debug:main Reading variant descriptions from /opt/local/var/macports/sources/rsync.macports.org/macports/release/tarballs/ports/_resources/port1.0/variant_descriptions.conf
720:debug:main Running callback portconfigure::add_automatic_compiler_dependencies
721:debug:main Finished running callback portconfigure::add_automatic_compiler_dependencies
722:debug:main Running callback portbuild::add_automatic_buildsystem_dependencies
723:debug:main Finished running callback portbuild::add_automatic_buildsystem_dependencies
724:debug:main Running callback portstartupitem::add_notes
725:debug:main Finished running callback portstartupitem::add_notes
726:info:main .:debug:main py27-mako has no conflicts
727:debug:main Searching for dependency: py27-setuptools
728:debug:main Didn't find receipt, going to depspec regex for: py27-setuptools
729:debug:main Changing to port directory: /opt/local/var/macports/sources/rsync.macports.org/macports/release/tarballs/ports/python/py-setuptools
730:debug:main OS darwin/18.2.0 (Mac OS X 10.14) arch i386
731:debug:main Re-registering default for build.cmd
732:debug:main Re-registering default for destroot.cmd
733:debug:main Re-registering default for destroot.destdir
734:debug:main Sourcing PortGroup python 1.0 from /opt/local/var/macports/sources/rsync.macports.org/macports/release/tarballs/ports/_resources/port1.0/group/python-1.0.tcl
735:debug:main only one arch supported, so not adding the default universal variant
736:debug:main Running callback portconfigure::add_automatic_compiler_dependencies
737:debug:main Finished running callback portconfigure::add_automatic_compiler_dependencies
738:debug:main Running callback portbuild::add_automatic_buildsystem_dependencies
739:debug:main Finished running callback portbuild::add_automatic_buildsystem_dependencies
740:debug:main Running callback portstartupitem::add_notes
741:debug:main Finished running callback portstartupitem::add_notes
742:debug:main Searching for dependency: py27-beaker
743:debug:main Didn't find receipt, going to depspec regex for: py27-beaker
744:debug:main Changing to port directory: /opt/local/var/macports/sources/rsync.macports.org/macports/release/tarballs/ports/python/py-beaker
745:debug:main OS darwin/18.2.0 (Mac OS X 10.14) arch i386
746:debug:main Re-registering default for build.cmd
747:debug:main Re-registering default for destroot.cmd
748:debug:main Re-registering default for destroot.destdir
749:debug:main Sourcing PortGroup python 1.0 from /opt/local/var/macports/sources/rsync.macports.org/macports/release/tarballs/ports/_resources/port1.0/group/python-1.0.tcl
750:debug:main only one arch supported, so not adding the default universal variant
751:debug:main Running callback portconfigure::add_automatic_compiler_dependencies
752:debug:main Finished running callback portconfigure::add_automatic_compiler_dependencies
753:debug:main Running callback portbuild::add_automatic_buildsystem_dependencies
754:debug:main Finished running callback portbuild::add_automatic_buildsystem_dependencies
755:debug:main Running callback portstartupitem::add_notes
756:debug:main Finished running callback portstartupitem::add_notes
757:debug:main Searching for dependency: py27-markupsafe
758:debug:main Didn't find receipt, going to depspec regex for: py27-markupsafe
759:debug:main Changing to port directory: /opt/local/var/macports/sources/rsync.macports.org/macports/release/tarballs/ports/python/py-markupsafe
760:debug:main OS darwin/18.2.0 (Mac OS X 10.14) arch i386
761:debug:main Re-registering default for build.cmd
762:debug:main Re-registering default for destroot.cmd
763:debug:main Re-registering default for destroot.destdir
764:debug:main Sourcing PortGroup python 1.0 from /opt/local/var/macports/sources/rsync.macports.org/macports/release/tarballs/ports/_resources/port1.0/group/python-1.0.tcl
765:debug:main adding the default universal variant
766:debug:main Reading variant descriptions from /opt/local/var/macports/sources/rsync.macports.org/macports/release/tarballs/ports/_resources/port1.0/variant_descriptions.conf
767:debug:main Running callback portconfigure::add_automatic_compiler_dependencies
768:debug:main Finished running callback portconfigure::add_automatic_compiler_dependencies
769:debug:main Running callback portbuild::add_automatic_buildsystem_dependencies
770:debug:main Finished running callback portbuild::add_automatic_buildsystem_dependencies
771:debug:main Running callback portstartupitem::add_notes
772:debug:main Finished running callback portstartupitem::add_notes
773:info:main .:debug:main py27-setuptools has no conflicts
774:info:main .:debug:main py27-beaker has no conflicts
775:debug:main Searching for dependency: py27-funcsigs
776:debug:main Didn't find receipt, going to depspec regex for: py27-funcsigs
777:debug:main Changing to port directory: /opt/local/var/macports/sources/rsync.macports.org/macports/release/tarballs/ports/python/py-funcsigs
778:debug:main OS darwin/18.2.0 (Mac OS X 10.14) arch i386
779:debug:main Re-registering default for build.cmd
780:debug:main Re-registering default for destroot.cmd
781:debug:main Re-registering default for destroot.destdir
782:debug:main Sourcing PortGroup python 1.0 from /opt/local/var/macports/sources/rsync.macports.org/macports/release/tarballs/ports/_resources/port1.0/group/python-1.0.tcl
783:debug:main only one arch supported, so not adding the default universal variant
784:debug:main Running callback portconfigure::add_automatic_compiler_dependencies
785:debug:main Finished running callback portconfigure::add_automatic_compiler_dependencies
786:debug:main Running callback portbuild::add_automatic_buildsystem_dependencies
787:debug:main Finished running callback portbuild::add_automatic_buildsystem_dependencies
788:debug:main Running callback portstartupitem::add_notes
789:debug:main Finished running callback portstartupitem::add_notes
790:info:main .:debug:main py27-funcsigs has no conflicts
791:info:main .:debug:main py27-markupsafe has no conflicts
792:info:main .:debug:main py27-markdown has no conflicts
793:info:main .:debug:main libtool has no conflicts
794:info:main .:debug:main Xft2 has no conflicts
795:info:main .:debug:main potrace has no conflicts
796:info:main .:debug:main tiff has no conflicts
797:info:main .:debug:main pkgconfig has no conflicts
798:info:main .:debug:main Checking for conflicts against poppler
799:debug:main Searching for dependency: xpdf-tools
800:debug:main Didn't find receipt, going to depspec regex for: xpdf-tools
801:debug:main Searching for dependency: lcms2
802:debug:main Didn't find receipt, going to depspec regex for: lcms2
803:debug:main Changing to port directory: /opt/local/var/macports/sources/rsync.macports.org/macports/release/tarballs/ports/graphics/lcms2
804:debug:main OS darwin/18.2.0 (Mac OS X 10.14) arch i386
805:debug:main Reading variant descriptions from /opt/local/var/macports/sources/rsync.macports.org/macports/release/tarballs/ports/_resources/port1.0/variant_descriptions.conf
806:debug:main Sourcing PortGroup muniversal 1.0 from /opt/local/var/macports/sources/rsync.macports.org/macports/release/tarballs/ports/_resources/port1.0/group/muniversal-1.0.tcl
807:debug:main universal variant already exists, so not adding the default one
808:debug:main Running callback portconfigure::add_automatic_compiler_dependencies
809:debug:main Finished running callback portconfigure::add_automatic_compiler_dependencies
810:debug:main Running callback portbuild::add_automatic_buildsystem_dependencies
811:debug:main Finished running callback portbuild::add_automatic_buildsystem_dependencies
812:debug:main Running callback portstartupitem::add_notes
813:debug:main Finished running callback portstartupitem::add_notes
814:debug:main Searching for dependency: openjpeg
815:debug:main Didn't find receipt, going to depspec regex for: openjpeg
816:debug:main Changing to port directory: /opt/local/var/macports/sources/rsync.macports.org/macports/release/tarballs/ports/graphics/openjpeg
817:debug:main OS darwin/18.2.0 (Mac OS X 10.14) arch i386
818:debug:main Re-registering default for configure.dir
819:debug:main Re-registering default for configure.pre_args
820:debug:main Re-registering default for build.dir
821:debug:main Re-registering default for destroot.target
822:debug:main Sourcing PortGroup cmake 1.0 from /opt/local/var/macports/sources/rsync.macports.org/macports/release/tarballs/ports/_resources/port1.0/group/cmake-1.0.tcl
823:debug:main Sourcing PortGroup github 1.0 from /opt/local/var/macports/sources/rsync.macports.org/macports/release/tarballs/ports/_resources/port1.0/group/github-1.0.tcl
824:debug:main Re-registering default for livecheck.regex
825:debug:main adding the default universal variant
826:debug:main Reading variant descriptions from /opt/local/var/macports/sources/rsync.macports.org/macports/release/tarballs/ports/_resources/port1.0/variant_descriptions.conf
827:debug:main Running callback portconfigure::add_automatic_compiler_dependencies
828:debug:main Finished running callback portconfigure::add_automatic_compiler_dependencies
829:debug:main Running callback portbuild::add_automatic_buildsystem_dependencies
830:debug:main Finished running callback portbuild::add_automatic_buildsystem_dependencies
831:debug:main Running callback portstartupitem::add_notes
832:debug:main Finished running callback portstartupitem::add_notes
833:info:main .:debug:main lcms2 has no conflicts
834:info:main .:debug:main openjpeg has no conflicts
835:debug:main Searching for dependency: jbigkit
836:debug:main Didn't find receipt, going to depspec regex for: jbigkit
837:debug:main Changing to port directory: /opt/local/var/macports/sources/rsync.macports.org/macports/release/tarballs/ports/graphics/jbigkit
838:debug:main OS darwin/18.2.0 (Mac OS X 10.14) arch i386
839:debug:main Reading variant descriptions from /opt/local/var/macports/sources/rsync.macports.org/macports/release/tarballs/ports/_resources/port1.0/variant_descriptions.conf
840:debug:main universal variant already exists, so not adding the default one
841:debug:main Running callback portconfigure::add_automatic_compiler_dependencies
842:debug:main Finished running callback portconfigure::add_automatic_compiler_dependencies
843:debug:main Running callback portbuild::add_automatic_buildsystem_dependencies
844:debug:main Finished running callback portbuild::add_automatic_buildsystem_dependencies
845:debug:main Running callback portstartupitem::add_notes
846:debug:main Finished running callback portstartupitem::add_notes
847:info:main .:debug:main jbigkit has no conflicts
848:info:main .:debug:main poppler-data has no conflicts
849:debug:main Starting logging for icu
850:debug:clean Starting logging for libxml2
851:debug:clean Starting logging for lz4
852:debug:clean Starting logging for lzo2
853:debug:clean Starting logging for zstd
854:debug:clean Starting logging for libarchive
855:debug:clean Starting logging for libcxx
856:debug:clean Starting logging for libuv
857:debug:clean Starting logging for cmake
858:debug:clean Starting logging for libpng
859:debug:clean Starting logging for freetype
860:debug:clean Starting logging for ossp-uuid
861:debug:clean Starting logging for fontconfig
862:debug:clean Starting logging for libpixman
863:debug:clean Starting logging for xorg-xorgproto
864:debug:clean Starting logging for xorg-libXau
865:debug:clean Starting logging for xorg-libXdmcp
866:debug:clean Starting logging for xorg-libpthread-stubs
867:debug:clean Starting logging for xorg-xcb-proto
868:debug:clean Starting logging for xorg-libxcb
869:debug:clean Starting logging for xorg-libX11
870:debug:clean Starting logging for xorg-libXext
871:debug:clean Starting logging for xorg-xcb-util
872:debug:clean Starting logging for xrender
873:debug:clean Starting logging for cairo
874:debug:clean Starting logging for xorg-libice
875:debug:clean Starting logging for xorg-libsm
876:debug:clean Starting logging for giflib
877:debug:clean Starting logging for jpeg
878:debug:clean Starting logging for libspiro
879:debug:clean Starting logging for libuninameslist
880:debug:clean Starting logging for Xft2
881:debug:clean Starting logging for fribidi
882:debug:clean Starting logging for libtool
883:debug:clean Starting logging for py27-funcsigs
884:debug:clean Starting logging for py27-setuptools
885:debug:clean Starting logging for py27-beaker
886:debug:clean Starting logging for py27-markupsafe
887:debug:clean Starting logging for py27-mako
888:debug:clean Starting logging for py27-markdown
889:debug:clean Starting logging for gobject-introspection
890:debug:clean Starting logging for graphite2
891:debug:clean Starting logging for harfbuzz
892:debug:clean Starting logging for pango
893:debug:clean Starting logging for potrace
894:debug:clean Starting logging for tiff
895:debug:clean Starting logging for fontforge
896:debug:clean Starting logging for pkgconfig
897:debug:clean Starting logging for lcms2
898:debug:clean Starting logging for jbigkit
899:debug:clean Starting logging for openjpeg
900:debug:clean Starting logging for poppler-data
901:debug:clean Starting logging for poppler
902:debug:main Executing org.macports.main (pdf2htmlex)
903:debug:main dropping privileges: euid changed to 502, egid changed to 20.
904:debug:archivefetch archivefetch phase started at Sun Jan 27 13:44:04 AEDT 2019
905:msg:archivefetch --->  Fetching archive for pdf2htmlex
906:debug:archivefetch Executing org.macports.archivefetch (pdf2htmlex)
907:debug:archivefetch euid/egid changed to: 0/0
908:debug:archivefetch chowned /opt/local/var/macports/incoming to macports
909:debug:archivefetch euid/egid changed to: 502/20
910:info:archivefetch --->  pdf2htmlex-0.11_23.darwin_18.x86_64.tbz2 doesn't seem to exist in /opt/local/var/macports/incoming/verified
911:msg:archivefetch --->  Attempting to fetch pdf2htmlex-0.11_23.darwin_18.x86_64.tbz2 from http://nou.nc.packages.macports.org/pub/macports/packages.macports.org/pdf2htmlex
912:debug:archivefetch Fetching archive failed: The requested URL returned error: 404 Not Found
913:msg:archivefetch --->  Attempting to fetch pdf2htmlex-0.11_23.darwin_18.x86_64.tbz2 from https://packages.macports.org/pdf2htmlex
914:debug:archivefetch Fetching archive failed: The requested URL returned error: 404 Not Found
915:msg:archivefetch --->  Attempting to fetch pdf2htmlex-0.11_23.darwin_18.x86_64.tbz2 from https://sha.cn.packages.macports.org/macports/packages/pdf2htmlex
916:debug:archivefetch Fetching archive failed: The requested URL returned error: 404 Not Found
917:debug:archivefetch Privilege de-escalation not attempted as not running as root.
918:debug:fetch fetch phase started at Sun Jan 27 13:44:06 AEDT 2019
919:notice:fetch --->  Fetching distfiles for pdf2htmlex
920:debug:fetch elevating privileges for fetch: euid changed to 0, egid changed to 0.
921:debug:fetch dropping privileges: euid changed to 502, egid changed to 20.
922:debug:fetch Executing org.macports.fetch (pdf2htmlex)
923:info:fetch --->  pdf2htmlEX-43e3174cbc.tar.gz does not exist in /opt/local/var/macports/distfiles/pdf2htmlex
924:notice:fetch --->  Attempting to fetch pdf2htmlEX-43e3174cbc.tar.gz from http://aarnet.au.distfiles.macports.org/pub/macports/distfiles/pdf2htmlex
925:debug:fetch Fetching distfile failed: transfer closed with 4406185 bytes remaining to read
926:notice:fetch --->  Attempting to fetch pdf2htmlEX-43e3174cbc.tar.gz from http://nou.nc.distfiles.macports.org/pub/macports/distfiles.macports.org/pdf2htmlex
927:debug:fetch Privilege de-escalation not attempted as not running as root.
928:debug:checksum checksum phase started at Sun Jan 27 13:44:23 AEDT 2019
929:notice:checksum --->  Verifying checksums for pdf2htmlex
930:debug:checksum Executing org.macports.checksum (pdf2htmlex)
931:info:checksum --->  Checksumming pdf2htmlEX-43e3174cbc.tar.gz
932:debug:checksum Calculated (rmd160) is ee5b354ad260398e9408bfe832ae184a61d4a9a3
933:debug:checksum Correct (rmd160) checksum for pdf2htmlEX-43e3174cbc.tar.gz
934:debug:checksum Calculated (sha256) is ff745f8d78bb0dc084d5e9f8eaa6efc8f6ef1e77d6971f3a4722201f29b61f41
935:debug:checksum Correct (sha256) checksum for pdf2htmlEX-43e3174cbc.tar.gz
936:debug:checksum Privilege de-escalation not attempted as not running as root.
937:debug:extract extract phase started at Sun Jan 27 13:44:23 AEDT 2019
938:notice:extract --->  Extracting pdf2htmlex
939:debug:extract Executing org.macports.extract (pdf2htmlex)
940:info:extract --->  Extracting pdf2htmlEX-43e3174cbc.tar.gz
941:debug:extract setting option extract.args to '/opt/local/var/macports/distfiles/pdf2htmlex/pdf2htmlEX-43e3174cbc.tar.gz'
942:debug:extract Environment:
943:debug:extract CC_PRINT_OPTIONS='YES'
944:debug:extract CC_PRINT_OPTIONS_FILE='/opt/local/var/macports/build/_opt_local_var_macports_sources_rsync.macports.org_macports_release_tarballs_ports_textproc_pdf2htmlex/pdf2htmlex/work/.CC_PRINT_OPTIONS'
945:debug:extract CPATH='/opt/local/include'
946:debug:extract LIBRARY_PATH='/opt/local/lib'
947:debug:extract MACOSX_DEPLOYMENT_TARGET='10.14'
948:info:extract Executing:  cd "/opt/local/var/macports/build/_opt_local_var_macports_sources_rsync.macports.org_macports_release_tarballs_ports_textproc_pdf2htmlex/pdf2htmlex/work" && /usr/bin/gzip -dc '/opt/local/var/macports/distfiles/pdf2htmlex/pdf2htmlEX-43e3174cbc.tar.gz' | /usr/bin/tar -xf -
949:debug:extract system:  cd "/opt/local/var/macports/build/_opt_local_var_macports_sources_rsync.macports.org_macports_release_tarballs_ports_textproc_pdf2htmlex/pdf2htmlex/work" && /usr/bin/gzip -dc '/opt/local/var/macports/distfiles/pdf2htmlex/pdf2htmlEX-43e3174cbc.tar.gz' | /usr/bin/tar -xf -
950:debug:extract euid/egid changed to: 0/0
951:debug:extract chowned /opt/local/var/macports/build/_opt_local_var_macports_sources_rsync.macports.org_macports_release_tarballs_ports_textproc_pdf2htmlex/pdf2htmlex/work to macports
952:debug:extract euid/egid changed to: 502/20
953:debug:extract Executing proc-post-org.macports.extract-extract-0
954:debug:extract Privilege de-escalation not attempted as not running as root.
955:debug:patch patch phase started at Sun Jan 27 13:44:23 AEDT 2019
956:debug:patch Executing org.macports.patch (pdf2htmlex)
957:notice:patch --->  Applying patches to pdf2htmlex
958:info:patch --->  Applying patch-poppler-0.31.diff
959:debug:patch Environment:
960:debug:patch CC_PRINT_OPTIONS='YES'
961:debug:patch CC_PRINT_OPTIONS_FILE='/opt/local/var/macports/build/_opt_local_var_macports_sources_rsync.macports.org_macports_release_tarballs_ports_textproc_pdf2htmlex/pdf2htmlex/work/.CC_PRINT_OPTIONS'
962:debug:patch CPATH='/opt/local/include'
963:debug:patch LIBRARY_PATH='/opt/local/lib'
964:debug:patch MACOSX_DEPLOYMENT_TARGET='10.14'
965:info:patch Executing:  cd "/opt/local/var/macports/build/_opt_local_var_macports_sources_rsync.macports.org_macports_release_tarballs_ports_textproc_pdf2htmlex/pdf2htmlex/work/pdf2htmlEX-43e3174cbc" && /usr/bin/patch -p0 < '/opt/local/var/macports/sources/rsync.macports.org/macports/release/tarballs/ports/textproc/pdf2htmlex/files/patch-poppler-0.31.diff'
966:debug:patch system:  cd "/opt/local/var/macports/build/_opt_local_var_macports_sources_rsync.macports.org_macports_release_tarballs_ports_textproc_pdf2htmlex/pdf2htmlex/work/pdf2htmlEX-43e3174cbc" && /usr/bin/patch -p0 < '/opt/local/var/macports/sources/rsync.macports.org/macports/release/tarballs/ports/textproc/pdf2htmlex/files/patch-poppler-0.31.diff'
967:info:patch patching file src/BackgroundRenderer/SplashBackgroundRenderer.h
968:info:patch patching file src/HTMLRenderer/font.cc
969:debug:patch Privilege de-escalation not attempted as not running as root.
970:debug:configure configure phase started at Sun Jan 27 13:44:23 AEDT 2019
971:notice:configure --->  Configuring pdf2htmlex
972:debug:configure Preferred compilers: clang macports-clang-5.0 macports-clang-4.0
973:debug:configure Using compiler 'Xcode Clang'
974:debug:configure Executing proc-pre-org.macports.configure-configure-0
975:debug:configure Executing proc-pre-org.macports.configure-configure-1
976:debug:configure Executing proc-pre-org.macports.configure-configure-2
977:debug:configure Executing org.macports.configure (pdf2htmlex)
978:debug:configure Environment:
979:debug:configure CC='/usr/bin/clang'
980:debug:configure CC_PRINT_OPTIONS='YES'
981:debug:configure CC_PRINT_OPTIONS_FILE='/opt/local/var/macports/build/_opt_local_var_macports_sources_rsync.macports.org_macports_release_tarballs_ports_textproc_pdf2htmlex/pdf2htmlex/work/.CC_PRINT_OPTIONS'
982:debug:configure CFLAGS='-pipe -Os -isysroot/Applications/Xcode.app/Contents/Developer/Platforms/MacOSX.platform/Developer/SDKs/MacOSX10.14.sdk'
983:debug:configure CPATH='/opt/local/include'
984:debug:configure CPPFLAGS='-I/opt/local/include -isysroot/Applications/Xcode.app/Contents/Developer/Platforms/MacOSX.platform/Developer/SDKs/MacOSX10.14.sdk'
985:debug:configure CXX='/usr/bin/clang++'
986:debug:configure CXXFLAGS='-pipe -Os -stdlib=libc++ -isysroot/Applications/Xcode.app/Contents/Developer/Platforms/MacOSX.platform/Developer/SDKs/MacOSX10.14.sdk'
987:debug:configure F77FLAGS='-m64'
988:debug:configure F90FLAGS='-pipe -Os -m64'
989:debug:configure FCFLAGS='-pipe -Os -m64'
990:debug:configure FFLAGS='-pipe -Os'
991:debug:configure INSTALL='/usr/bin/install -c'
992:debug:configure LDFLAGS='-L/opt/local/lib -Wl,-headerpad_max_install_names -Wl,-syslibroot,/Applications/Xcode.app/Contents/Developer/Platforms/MacOSX.platform/Developer/SDKs/MacOSX10.14.sdk'
993:debug:configure LIBRARY_PATH='/opt/local/lib'
994:debug:configure MACOSX_DEPLOYMENT_TARGET='10.14'
995:debug:configure OBJC='/usr/bin/clang'
996:debug:configure OBJCFLAGS='-pipe -Os -isysroot/Applications/Xcode.app/Contents/Developer/Platforms/MacOSX.platform/Developer/SDKs/MacOSX10.14.sdk'
997:debug:configure OBJCXX='/usr/bin/clang++'
998:debug:configure OBJCXXFLAGS='-pipe -Os -stdlib=libc++ -isysroot/Applications/Xcode.app/Contents/Developer/Platforms/MacOSX.platform/Developer/SDKs/MacOSX10.14.sdk'
999:info:configure Executing:  cd "/opt/local/var/macports/build/_opt_local_var_macports_sources_rsync.macports.org_macports_release_tarballs_ports_textproc_pdf2htmlex/pdf2htmlex/work/build" && /opt/local/bin/cmake -DCMAKE_INSTALL_PREFIX='/opt/local' -DCMAKE_BUILD_TYPE=Release -DCMAKE_BUILD_WITH_INSTALL_RPATH=ON -DCMAKE_C_COMPILER="$CC" -DCMAKE_COLOR_MAKEFILE=ON -DCMAKE_CXX_COMPILER="$CXX" -DCMAKE_FIND_FRAMEWORK=LAST -DCMAKE_INSTALL_NAME_DIR=/opt/local/lib -DCMAKE_INSTALL_RPATH=/opt/local/lib -DCMAKE_MODULE_PATH=/opt/local/share/cmake/Modules -DCMAKE_SYSTEM_PREFIX_PATH="/opt/local;/opt/local;/usr" -DCMAKE_VERBOSE_MAKEFILE=ON -DCMAKE_POLICY_DEFAULT_CMP0025=NEW -Wno-dev -DCMAKE_C_FLAGS_RELEASE="-DNDEBUG" -DCMAKE_CXX_FLAGS_RELEASE="-DNDEBUG" -DCMAKE_OSX_ARCHITECTURES="x86_64" -DCMAKE_OSX_DEPLOYMENT_TARGET="10.14" -DCMAKE_OSX_SYSROOT="/Applications/Xcode.app/Contents/Developer/Platforms/MacOSX.platform/Developer/SDKs/MacOSX10.14.sdk" /opt/local/var/macports/build/_opt_local_var_macports_sources_rsync.macports.org_macports_release_tarballs_ports_textproc_pdf2htmlex/pdf2htmlex/work/pdf2htmlEX-43e3174cbc
1000:debug:configure system:  cd "/opt/local/var/macports/build/_opt_local_var_macports_sources_rsync.macports.org_macports_release_tarballs_ports_textproc_pdf2htmlex/pdf2htmlex/work/build" && /opt/local/bin/cmake -DCMAKE_INSTALL_PREFIX='/opt/local' -DCMAKE_BUILD_TYPE=Release -DCMAKE_BUILD_WITH_INSTALL_RPATH=ON -DCMAKE_C_COMPILER="$CC" -DCMAKE_COLOR_MAKEFILE=ON -DCMAKE_CXX_COMPILER="$CXX" -DCMAKE_FIND_FRAMEWORK=LAST -DCMAKE_INSTALL_NAME_DIR=/opt/local/lib -DCMAKE_INSTALL_RPATH=/opt/local/lib -DCMAKE_MODULE_PATH=/opt/local/share/cmake/Modules -DCMAKE_SYSTEM_PREFIX_PATH="/opt/local;/opt/local;/usr" -DCMAKE_VERBOSE_MAKEFILE=ON -DCMAKE_POLICY_DEFAULT_CMP0025=NEW -Wno-dev -DCMAKE_C_FLAGS_RELEASE="-DNDEBUG" -DCMAKE_CXX_FLAGS_RELEASE="-DNDEBUG" -DCMAKE_OSX_ARCHITECTURES="x86_64" -DCMAKE_OSX_DEPLOYMENT_TARGET="10.14" -DCMAKE_OSX_SYSROOT="/Applications/Xcode.app/Contents/Developer/Platforms/MacOSX.platform/Developer/SDKs/MacOSX10.14.sdk" /opt/local/var/macports/build/_opt_local_var_macports_sources_rsync.macports.org_macports_release_tarballs_ports_textproc_pdf2htmlex/pdf2htmlex/work/pdf2htmlEX-43e3174cbc
1001:info:configure -- The C compiler identification is AppleClang 10.0.0.10001145
1002:info:configure -- The CXX compiler identification is AppleClang 10.0.0.10001145
1003:info:configure -- Check for working C compiler: /usr/bin/clang
1004:info:configure -- Check for working C compiler: /usr/bin/clang -- works
1005:info:configure -- Detecting C compiler ABI info
1006:info:configure -- Detecting C compiler ABI info - done
1007:info:configure -- Detecting C compile features
1008:info:configure -- Detecting C compile features - done
1009:info:configure -- Check for working CXX compiler: /usr/bin/clang++
1010:info:configure -- Check for working CXX compiler: /usr/bin/clang++ -- works
1011:info:configure -- Detecting CXX compiler ABI info
1012:info:configure -- Detecting CXX compiler ABI info - done
1013:info:configure -- Detecting CXX compile features
1014:info:configure -- Detecting CXX compile features - done
1015:info:configure -- Found PkgConfig: /opt/local/bin/pkg-config (found version "0.29.2")
1016:info:configure -- Checking for module 'poppler>=0.25.0'
1017:info:configure --   Found poppler, version 0.72.0
1018:info:configure -- Checking for module 'libfontforge>=2.0.0'
1019:info:configure --   Found libfontforge, version 2.0.20170731
1020:info:configure -- Performing Test CXX0X_SUPPORT
1021:info:configure -- Performing Test CXX0X_SUPPORT - Success
1022:info:configure -- Configuring done
1023:info:configure -- Generating done
1024:info:configure -- Build files have been written to: /opt/local/var/macports/build/_opt_local_var_macports_sources_rsync.macports.org_macports_release_tarballs_ports_textproc_pdf2htmlex/pdf2htmlex/work/build
1025:debug:configure Executing proc-post-org.macports.configure-configure-0
1026:debug:configure Privilege de-escalation not attempted as not running as root.
1027:debug:build build phase started at Sun Jan 27 13:44:26 AEDT 2019
1028:notice:build --->  Building pdf2htmlex
1029:debug:build Executing org.macports.build (pdf2htmlex)
1030:debug:build Environment:
1031:debug:build CC_PRINT_OPTIONS='YES'
1032:debug:build CC_PRINT_OPTIONS_FILE='/opt/local/var/macports/build/_opt_local_var_macports_sources_rsync.macports.org_macports_release_tarballs_ports_textproc_pdf2htmlex/pdf2htmlex/work/.CC_PRINT_OPTIONS'
1033:debug:build CPATH='/opt/local/include'
1034:debug:build LIBRARY_PATH='/opt/local/lib'
1035:debug:build MACOSX_DEPLOYMENT_TARGET='10.14'
1036:info:build Executing:  cd "/opt/local/var/macports/build/_opt_local_var_macports_sources_rsync.macports.org_macports_release_tarballs_ports_textproc_pdf2htmlex/pdf2htmlex/work/build" && /usr/bin/make -j12 -w all VERBOSE=ON
1037:debug:build system:  cd "/opt/local/var/macports/build/_opt_local_var_macports_sources_rsync.macports.org_macports_release_tarballs_ports_textproc_pdf2htmlex/pdf2htmlex/work/build" && /usr/bin/make -j12 -w all VERBOSE=ON
1038:info:build make: Entering directory `/opt/local/var/macports/build/_opt_local_var_macports_sources_rsync.macports.org_macports_release_tarballs_ports_textproc_pdf2htmlex/pdf2htmlex/work/build'
1039:info:build /opt/local/bin/cmake -S/opt/local/var/macports/build/_opt_local_var_macports_sources_rsync.macports.org_macports_release_tarballs_ports_textproc_pdf2htmlex/pdf2htmlex/work/pdf2htmlEX-43e3174cbc -B/opt/local/var/macports/build/_opt_local_var_macports_sources_rsync.macports.org_macports_release_tarballs_ports_textproc_pdf2htmlex/pdf2htmlex/work/build --check-build-system CMakeFiles/Makefile.cmake 0
1040:info:build /opt/local/bin/cmake -E cmake_progress_start /opt/local/var/macports/build/_opt_local_var_macports_sources_rsync.macports.org_macports_release_tarballs_ports_textproc_pdf2htmlex/pdf2htmlex/work/build/CMakeFiles /opt/local/var/macports/build/_opt_local_var_macports_sources_rsync.macports.org_macports_release_tarballs_ports_textproc_pdf2htmlex/pdf2htmlex/work/build/CMakeFiles/progress.marks
1041:info:build /Applications/Xcode.app/Contents/Developer/usr/bin/make -f CMakeFiles/Makefile2 all
1042:info:build make[1]: Entering directory `/opt/local/var/macports/build/_opt_local_var_macports_sources_rsync.macports.org_macports_release_tarballs_ports_textproc_pdf2htmlex/pdf2htmlex/work/build'
1043:info:build /Applications/Xcode.app/Contents/Developer/usr/bin/make -f CMakeFiles/pdf2htmlEX_resources.dir/build.make CMakeFiles/pdf2htmlEX_resources.dir/depend
1044:info:build /Applications/Xcode.app/Contents/Developer/usr/bin/make -f CMakeFiles/pdf2htmlEX.dir/build.make CMakeFiles/pdf2htmlEX.dir/depend
1045:info:build make[2]: Entering directory `/opt/local/var/macports/build/_opt_local_var_macports_sources_rsync.macports.org_macports_release_tarballs_ports_textproc_pdf2htmlex/pdf2htmlex/work/build'
1046:info:build cd /opt/local/var/macports/build/_opt_local_var_macports_sources_rsync.macports.org_macports_release_tarballs_ports_textproc_pdf2htmlex/pdf2htmlex/work/build && /opt/local/bin/cmake -E cmake_depends "Unix Makefiles" /opt/local/var/macports/build/_opt_local_var_macports_sources_rsync.macports.org_macports_release_tarballs_ports_textproc_pdf2htmlex/pdf2htmlex/work/pdf2htmlEX-43e3174cbc /opt/local/var/macports/build/_opt_local_var_macports_sources_rsync.macports.org_macports_release_tarballs_ports_textproc_pdf2htmlex/pdf2htmlex/work/pdf2htmlEX-43e3174cbc /opt/local/var/macports/build/_opt_local_var_macports_sources_rsync.macports.org_macports_release_tarballs_ports_textproc_pdf2htmlex/pdf2htmlex/work/build /opt/local/var/macports/build/_opt_local_var_macports_sources_rsync.macports.org_macports_release_tarballs_ports_textproc_pdf2htmlex/pdf2htmlex/work/build /opt/local/var/macports/build/_opt_local_var_macports_sources_rsync.macports.org_macports_release_tarballs_ports_textproc_pdf2htmlex/pdf2htmlex/work/build/CMakeFiles/pdf2htmlEX_resources.dir/DependInfo.cmake --color=
1047:info:build make[2]: Entering directory `/opt/local/var/macports/build/_opt_local_var_macports_sources_rsync.macports.org_macports_release_tarballs_ports_textproc_pdf2htmlex/pdf2htmlex/work/build'
1048:info:build cd /opt/local/var/macports/build/_opt_local_var_macports_sources_rsync.macports.org_macports_release_tarballs_ports_textproc_pdf2htmlex/pdf2htmlex/work/build && /opt/local/bin/cmake -E cmake_depends "Unix Makefiles" /opt/local/var/macports/build/_opt_local_var_macports_sources_rsync.macports.org_macports_release_tarballs_ports_textproc_pdf2htmlex/pdf2htmlex/work/pdf2htmlEX-43e3174cbc /opt/local/var/macports/build/_opt_local_var_macports_sources_rsync.macports.org_macports_release_tarballs_ports_textproc_pdf2htmlex/pdf2htmlex/work/pdf2htmlEX-43e3174cbc /opt/local/var/macports/build/_opt_local_var_macports_sources_rsync.macports.org_macports_release_tarballs_ports_textproc_pdf2htmlex/pdf2htmlex/work/build /opt/local/var/macports/build/_opt_local_var_macports_sources_rsync.macports.org_macports_release_tarballs_ports_textproc_pdf2htmlex/pdf2htmlex/work/build /opt/local/var/macports/build/_opt_local_var_macports_sources_rsync.macports.org_macports_release_tarballs_ports_textproc_pdf2htmlex/pdf2htmlex/work/build/CMakeFiles/pdf2htmlEX.dir/DependInfo.cmake --color=
1049:info:build Dependee "/opt/local/var/macports/build/_opt_local_var_macports_sources_rsync.macports.org_macports_release_tarballs_ports_textproc_pdf2htmlex/pdf2htmlex/work/build/CMakeFiles/pdf2htmlEX_resources.dir/DependInfo.cmake" is newer than depender "/opt/local/var/macports/build/_opt_local_var_macports_sources_rsync.macports.org_macports_release_tarballs_ports_textproc_pdf2htmlex/pdf2htmlex/work/build/CMakeFiles/pdf2htmlEX_resources.dir/depend.internal".
1050:info:build Dependee "/opt/local/var/macports/build/_opt_local_var_macports_sources_rsync.macports.org_macports_release_tarballs_ports_textproc_pdf2htmlex/pdf2htmlex/work/build/CMakeFiles/CMakeDirectoryInformation.cmake" is newer than depender "/opt/local/var/macports/build/_opt_local_var_macports_sources_rsync.macports.org_macports_release_tarballs_ports_textproc_pdf2htmlex/pdf2htmlex/work/build/CMakeFiles/pdf2htmlEX_resources.dir/depend.internal".
1051:info:build Dependee "/opt/local/var/macports/build/_opt_local_var_macports_sources_rsync.macports.org_macports_release_tarballs_ports_textproc_pdf2htmlex/pdf2htmlex/work/build/CMakeFiles/pdf2htmlEX.dir/DependInfo.cmake" is newer than depender "/opt/local/var/macports/build/_opt_local_var_macports_sources_rsync.macports.org_macports_release_tarballs_ports_textproc_pdf2htmlex/pdf2htmlex/work/build/CMakeFiles/pdf2htmlEX.dir/depend.internal".
1052:info:build Dependee "/opt/local/var/macports/build/_opt_local_var_macports_sources_rsync.macports.org_macports_release_tarballs_ports_textproc_pdf2htmlex/pdf2htmlex/work/build/CMakeFiles/CMakeDirectoryInformation.cmake" is newer than depender "/opt/local/var/macports/build/_opt_local_var_macports_sources_rsync.macports.org_macports_release_tarballs_ports_textproc_pdf2htmlex/pdf2htmlex/work/build/CMakeFiles/pdf2htmlEX.dir/depend.internal".
1053:info:build Scanning dependencies of target pdf2htmlEX_resources
1054:info:build make[2]: Leaving directory `/opt/local/var/macports/build/_opt_local_var_macports_sources_rsync.macports.org_macports_release_tarballs_ports_textproc_pdf2htmlex/pdf2htmlex/work/build'
1055:info:build /Applications/Xcode.app/Contents/Developer/usr/bin/make -f CMakeFiles/pdf2htmlEX_resources.dir/build.make CMakeFiles/pdf2htmlEX_resources.dir/build
1056:info:build make[2]: Entering directory `/opt/local/var/macports/build/_opt_local_var_macports_sources_rsync.macports.org_macports_release_tarballs_ports_textproc_pdf2htmlex/pdf2htmlex/work/build'
1057:info:build [  6%] Generating /opt/local/var/macports/build/_opt_local_var_macports_sources_rsync.macports.org_macports_release_tarballs_ports_textproc_pdf2htmlex/pdf2htmlex/work/pdf2htmlEX-43e3174cbc/share/pdf2htmlEX.min.js
1058:info:build [  6%] Generating /opt/local/var/macports/build/_opt_local_var_macports_sources_rsync.macports.org_macports_release_tarballs_ports_textproc_pdf2htmlex/pdf2htmlex/work/pdf2htmlEX-43e3174cbc/share/base.min.css, /opt/local/var/macports/build/_opt_local_var_macports_sources_rsync.macports.org_macports_release_tarballs_ports_textproc_pdf2htmlex/pdf2htmlex/work/pdf2htmlEX-43e3174cbc/share/fancy.min.css
1059:info:build /opt/local/var/macports/build/_opt_local_var_macports_sources_rsync.macports.org_macports_release_tarballs_ports_textproc_pdf2htmlex/pdf2htmlex/work/pdf2htmlEX-43e3174cbc/share/build_js.sh
1060:info:build /opt/local/var/macports/build/_opt_local_var_macports_sources_rsync.macports.org_macports_release_tarballs_ports_textproc_pdf2htmlex/pdf2htmlex/work/pdf2htmlEX-43e3174cbc/share/build_css.sh
1061:info:build Building pdf2htmlEX.min.js with closure-compiler...
1062:info:build Building /opt/local/var/macports/build/_opt_local_var_macports_sources_rsync.macports.org_macports_release_tarballs_ports_textproc_pdf2htmlex/pdf2htmlex/work/pdf2htmlEX-43e3174cbc/share/base.min.css with YUI Compressor
1063:info:build Scanning dependencies of target pdf2htmlEX
1064:info:build make[2]: Leaving directory `/opt/local/var/macports/build/_opt_local_var_macports_sources_rsync.macports.org_macports_release_tarballs_ports_textproc_pdf2htmlex/pdf2htmlex/work/build'
1065:info:build /Applications/Xcode.app/Contents/Developer/usr/bin/make -f CMakeFiles/pdf2htmlEX.dir/build.make CMakeFiles/pdf2htmlEX.dir/build
1066:info:build make[2]: Entering directory `/opt/local/var/macports/build/_opt_local_var_macports_sources_rsync.macports.org_macports_release_tarballs_ports_textproc_pdf2htmlex/pdf2htmlex/work/build'
1067:info:build [ 16%] Building CXX object CMakeFiles/pdf2htmlEX.dir/src/HTMLRenderer/image.cc.o
1068:info:build [ 16%] Building CXX object CMakeFiles/pdf2htmlEX.dir/src/pdf2htmlEX.cc.o
1069:info:build [ 16%] Building CXX object CMakeFiles/pdf2htmlEX.dir/src/HTMLRenderer/draw.cc.o
1070:info:build [ 19%] Building CXX object CMakeFiles/pdf2htmlEX.dir/src/HTMLRenderer/general.cc.o
1071:info:build [ 29%] Building CXX object CMakeFiles/pdf2htmlEX.dir/src/HTMLRenderer/link.cc.o
1072:info:build [ 32%] Building CXX object CMakeFiles/pdf2htmlEX.dir/src/HTMLRenderer/font.cc.o
1073:info:build /usr/bin/clang++   -I/opt/local/var/macports/build/_opt_local_var_macports_sources_rsync.macports.org_macports_release_tarballs_ports_textproc_pdf2htmlex/pdf2htmlex/work/pdf2htmlEX-43e3174cbc/src -I/opt/local/include/poppler -I/opt/local/include/fontforge -I/opt/local/Library/Frameworks/Python.framework/Versions/2.7/include/python2.7 -I/opt/local/include/cairo -I/opt/local/include/glib-2.0 -I/opt/local/lib/glib-2.0/include -I/opt/local/include/pixman-1 -I/opt/local/include/ossp -I/opt/local/include/freetype2 -I/opt/local/include/libpng16  -pipe -Os -stdlib=libc++ -isysroot/Applications/Xcode.app/Contents/Developer/Platforms/MacOSX.platform/Developer/SDKs/MacOSX10.14.sdk -Wall -stdlib=libc++ -std=c++0x -O2 -DNDEBUG -arch x86_64 -isysroot /Applications/Xcode.app/Contents/Developer/Platforms/MacOSX.platform/Developer/SDKs/MacOSX10.14.sdk -mmacosx-version-min=10.14   -o CMakeFiles/pdf2htmlEX.dir/src/HTMLRenderer/image.cc.o -c /opt/local/var/macports/build/_opt_local_var_macports_sources_rsync.macports.org_macports_release_tarballs_ports_textproc_pdf2htmlex/pdf2htmlex/work/pdf2htmlEX-43e3174cbc/src/HTMLRenderer/image.cc
1074:info:build [ 32%] Building CXX object CMakeFiles/pdf2htmlEX.dir/src/HTMLRenderer/state.cc.o
1075:info:build [ 32%] Building CXX object CMakeFiles/pdf2htmlEX.dir/src/HTMLRenderer/outline.cc.o
1076:info:build /usr/bin/clang++   -I/opt/local/var/macports/build/_opt_local_var_macports_sources_rsync.macports.org_macports_release_tarballs_ports_textproc_pdf2htmlex/pdf2htmlex/work/pdf2htmlEX-43e3174cbc/src -I/opt/local/include/poppler -I/opt/local/include/fontforge -I/opt/local/Library/Frameworks/Python.framework/Versions/2.7/include/python2.7 -I/opt/local/include/cairo -I/opt/local/include/glib-2.0 -I/opt/local/lib/glib-2.0/include -I/opt/local/include/pixman-1 -I/opt/local/include/ossp -I/opt/local/include/freetype2 -I/opt/local/include/libpng16  -pipe -Os -stdlib=libc++ -isysroot/Applications/Xcode.app/Contents/Developer/Platforms/MacOSX.platform/Developer/SDKs/MacOSX10.14.sdk -Wall -stdlib=libc++ -std=c++0x -O2 -DNDEBUG -arch x86_64 -isysroot /Applications/Xcode.app/Contents/Developer/Platforms/MacOSX.platform/Developer/SDKs/MacOSX10.14.sdk -mmacosx-version-min=10.14   -o CMakeFiles/pdf2htmlEX.dir/src/HTMLRenderer/general.cc.o -c /opt/local/var/macports/build/_opt_local_var_macports_sources_rsync.macports.org_macports_release_tarballs_ports_textproc_pdf2htmlex/pdf2htmlex/work/pdf2htmlEX-43e3174cbc/src/HTMLRenderer/general.cc
1077:info:build /usr/bin/clang++   -I/opt/local/var/macports/build/_opt_local_var_macports_sources_rsync.macports.org_macports_release_tarballs_ports_textproc_pdf2htmlex/pdf2htmlex/work/pdf2htmlEX-43e3174cbc/src -I/opt/local/include/poppler -I/opt/local/include/fontforge -I/opt/local/Library/Frameworks/Python.framework/Versions/2.7/include/python2.7 -I/opt/local/include/cairo -I/opt/local/include/glib-2.0 -I/opt/local/lib/glib-2.0/include -I/opt/local/include/pixman-1 -I/opt/local/include/ossp -I/opt/local/include/freetype2 -I/opt/local/include/libpng16  -pipe -Os -stdlib=libc++ -isysroot/Applications/Xcode.app/Contents/Developer/Platforms/MacOSX.platform/Developer/SDKs/MacOSX10.14.sdk -Wall -stdlib=libc++ -std=c++0x -O2 -DNDEBUG -arch x86_64 -isysroot /Applications/Xcode.app/Contents/Developer/Platforms/MacOSX.platform/Developer/SDKs/MacOSX10.14.sdk -mmacosx-version-min=10.14   -o CMakeFiles/pdf2htmlEX.dir/src/HTMLRenderer/link.cc.o -c /opt/local/var/macports/build/_opt_local_var_macports_sources_rsync.macports.org_macports_release_tarballs_ports_textproc_pdf2htmlex/pdf2htmlex/work/pdf2htmlEX-43e3174cbc/src/HTMLRenderer/link.cc
1078:info:build [ 35%] Building CXX object CMakeFiles/pdf2htmlEX.dir/src/HTMLRenderer/text.cc.o
1079:info:build /usr/bin/clang++   -I/opt/local/var/macports/build/_opt_local_var_macports_sources_rsync.macports.org_macports_release_tarballs_ports_textproc_pdf2htmlex/pdf2htmlex/work/pdf2htmlEX-43e3174cbc/src -I/opt/local/include/poppler -I/opt/local/include/fontforge -I/opt/local/Library/Frameworks/Python.framework/Versions/2.7/include/python2.7 -I/opt/local/include/cairo -I/opt/local/include/glib-2.0 -I/opt/local/lib/glib-2.0/include -I/opt/local/include/pixman-1 -I/opt/local/include/ossp -I/opt/local/include/freetype2 -I/opt/local/include/libpng16  -pipe -Os -stdlib=libc++ -isysroot/Applications/Xcode.app/Contents/Developer/Platforms/MacOSX.platform/Developer/SDKs/MacOSX10.14.sdk -Wall -stdlib=libc++ -std=c++0x -O2 -DNDEBUG -arch x86_64 -isysroot /Applications/Xcode.app/Contents/Developer/Platforms/MacOSX.platform/Developer/SDKs/MacOSX10.14.sdk -mmacosx-version-min=10.14   -o CMakeFiles/pdf2htmlEX.dir/src/HTMLRenderer/state.cc.o -c /opt/local/var/macports/build/_opt_local_var_macports_sources_rsync.macports.org_macports_release_tarballs_ports_textproc_pdf2htmlex/pdf2htmlex/work/pdf2htmlEX-43e3174cbc/src/HTMLRenderer/state.cc
1080:info:build /usr/bin/clang++   -I/opt/local/var/macports/build/_opt_local_var_macports_sources_rsync.macports.org_macports_release_tarballs_ports_textproc_pdf2htmlex/pdf2htmlex/work/pdf2htmlEX-43e3174cbc/src -I/opt/local/include/poppler -I/opt/local/include/fontforge -I/opt/local/Library/Frameworks/Python.framework/Versions/2.7/include/python2.7 -I/opt/local/include/cairo -I/opt/local/include/glib-2.0 -I/opt/local/lib/glib-2.0/include -I/opt/local/include/pixman-1 -I/opt/local/include/ossp -I/opt/local/include/freetype2 -I/opt/local/include/libpng16  -pipe -Os -stdlib=libc++ -isysroot/Applications/Xcode.app/Contents/Developer/Platforms/MacOSX.platform/Developer/SDKs/MacOSX10.14.sdk -Wall -stdlib=libc++ -std=c++0x -O2 -DNDEBUG -arch x86_64 -isysroot /Applications/Xcode.app/Contents/Developer/Platforms/MacOSX.platform/Developer/SDKs/MacOSX10.14.sdk -mmacosx-version-min=10.14   -o CMakeFiles/pdf2htmlEX.dir/src/HTMLRenderer/outline.cc.o -c /opt/local/var/macports/build/_opt_local_var_macports_sources_rsync.macports.org_macports_release_tarballs_ports_textproc_pdf2htmlex/pdf2htmlex/work/pdf2htmlEX-43e3174cbc/src/HTMLRenderer/outline.cc
1081:info:build /usr/bin/clang++   -I/opt/local/var/macports/build/_opt_local_var_macports_sources_rsync.macports.org_macports_release_tarballs_ports_textproc_pdf2htmlex/pdf2htmlex/work/pdf2htmlEX-43e3174cbc/src -I/opt/local/include/poppler -I/opt/local/include/fontforge -I/opt/local/Library/Frameworks/Python.framework/Versions/2.7/include/python2.7 -I/opt/local/include/cairo -I/opt/local/include/glib-2.0 -I/opt/local/lib/glib-2.0/include -I/opt/local/include/pixman-1 -I/opt/local/include/ossp -I/opt/local/include/freetype2 -I/opt/local/include/libpng16  -pipe -Os -stdlib=libc++ -isysroot/Applications/Xcode.app/Contents/Developer/Platforms/MacOSX.platform/Developer/SDKs/MacOSX10.14.sdk -Wall -stdlib=libc++ -std=c++0x -O2 -DNDEBUG -arch x86_64 -isysroot /Applications/Xcode.app/Contents/Developer/Platforms/MacOSX.platform/Developer/SDKs/MacOSX10.14.sdk -mmacosx-version-min=10.14   -o CMakeFiles/pdf2htmlEX.dir/src/HTMLRenderer/text.cc.o -c /opt/local/var/macports/build/_opt_local_var_macports_sources_rsync.macports.org_macports_release_tarballs_ports_textproc_pdf2htmlex/pdf2htmlex/work/pdf2htmlEX-43e3174cbc/src/HTMLRenderer/text.cc
1082:info:build [ 38%] Building CXX object CMakeFiles/pdf2htmlEX.dir/src/BackgroundRenderer/BackgroundRenderer.cc.o
1083:info:build /usr/bin/clang++   -I/opt/local/var/macports/build/_opt_local_var_macports_sources_rsync.macports.org_macports_release_tarballs_ports_textproc_pdf2htmlex/pdf2htmlex/work/pdf2htmlEX-43e3174cbc/src -I/opt/local/include/poppler -I/opt/local/include/fontforge -I/opt/local/Library/Frameworks/Python.framework/Versions/2.7/include/python2.7 -I/opt/local/include/cairo -I/opt/local/include/glib-2.0 -I/opt/local/lib/glib-2.0/include -I/opt/local/include/pixman-1 -I/opt/local/include/ossp -I/opt/local/include/freetype2 -I/opt/local/include/libpng16  -pipe -Os -stdlib=libc++ -isysroot/Applications/Xcode.app/Contents/Developer/Platforms/MacOSX.platform/Developer/SDKs/MacOSX10.14.sdk -Wall -stdlib=libc++ -std=c++0x -O2 -DNDEBUG -arch x86_64 -isysroot /Applications/Xcode.app/Contents/Developer/Platforms/MacOSX.platform/Developer/SDKs/MacOSX10.14.sdk -mmacosx-version-min=10.14   -o CMakeFiles/pdf2htmlEX.dir/src/HTMLRenderer/font.cc.o -c /opt/local/var/macports/build/_opt_local_var_macports_sources_rsync.macports.org_macports_release_tarballs_ports_textproc_pdf2htmlex/pdf2htmlex/work/pdf2htmlEX-43e3174cbc/src/HTMLRenderer/font.cc
1084:info:build /usr/bin/clang++   -I/opt/local/var/macports/build/_opt_local_var_macports_sources_rsync.macports.org_macports_release_tarballs_ports_textproc_pdf2htmlex/pdf2htmlex/work/pdf2htmlEX-43e3174cbc/src -I/opt/local/include/poppler -I/opt/local/include/fontforge -I/opt/local/Library/Frameworks/Python.framework/Versions/2.7/include/python2.7 -I/opt/local/include/cairo -I/opt/local/include/glib-2.0 -I/opt/local/lib/glib-2.0/include -I/opt/local/include/pixman-1 -I/opt/local/include/ossp -I/opt/local/include/freetype2 -I/opt/local/include/libpng16  -pipe -Os -stdlib=libc++ -isysroot/Applications/Xcode.app/Contents/Developer/Platforms/MacOSX.platform/Developer/SDKs/MacOSX10.14.sdk -Wall -stdlib=libc++ -std=c++0x -O2 -DNDEBUG -arch x86_64 -isysroot /Applications/Xcode.app/Contents/Developer/Platforms/MacOSX.platform/Developer/SDKs/MacOSX10.14.sdk -mmacosx-version-min=10.14   -o CMakeFiles/pdf2htmlEX.dir/src/HTMLRenderer/draw.cc.o -c /opt/local/var/macports/build/_opt_local_var_macports_sources_rsync.macports.org_macports_release_tarballs_ports_textproc_pdf2htmlex/pdf2htmlex/work/pdf2htmlEX-43e3174cbc/src/HTMLRenderer/draw.cc
1085:info:build /usr/bin/clang++   -I/opt/local/var/macports/build/_opt_local_var_macports_sources_rsync.macports.org_macports_release_tarballs_ports_textproc_pdf2htmlex/pdf2htmlex/work/pdf2htmlEX-43e3174cbc/src -I/opt/local/include/poppler -I/opt/local/include/fontforge -I/opt/local/Library/Frameworks/Python.framework/Versions/2.7/include/python2.7 -I/opt/local/include/cairo -I/opt/local/include/glib-2.0 -I/opt/local/lib/glib-2.0/include -I/opt/local/include/pixman-1 -I/opt/local/include/ossp -I/opt/local/include/freetype2 -I/opt/local/include/libpng16  -pipe -Os -stdlib=libc++ -isysroot/Applications/Xcode.app/Contents/Developer/Platforms/MacOSX.platform/Developer/SDKs/MacOSX10.14.sdk -Wall -stdlib=libc++ -std=c++0x -O2 -DNDEBUG -arch x86_64 -isysroot /Applications/Xcode.app/Contents/Developer/Platforms/MacOSX.platform/Developer/SDKs/MacOSX10.14.sdk -mmacosx-version-min=10.14   -o CMakeFiles/pdf2htmlEX.dir/src/BackgroundRenderer/BackgroundRenderer.cc.o -c /opt/local/var/macports/build/_opt_local_var_macports_sources_rsync.macports.org_macports_release_tarballs_ports_textproc_pdf2htmlex/pdf2htmlex/work/pdf2htmlEX-43e3174cbc/src/BackgroundRenderer/BackgroundRenderer.cc
1086:info:build /usr/bin/clang++   -I/opt/local/var/macports/build/_opt_local_var_macports_sources_rsync.macports.org_macports_release_tarballs_ports_textproc_pdf2htmlex/pdf2htmlex/work/pdf2htmlEX-43e3174cbc/src -I/opt/local/include/poppler -I/opt/local/include/fontforge -I/opt/local/Library/Frameworks/Python.framework/Versions/2.7/include/python2.7 -I/opt/local/include/cairo -I/opt/local/include/glib-2.0 -I/opt/local/lib/glib-2.0/include -I/opt/local/include/pixman-1 -I/opt/local/include/ossp -I/opt/local/include/freetype2 -I/opt/local/include/libpng16  -pipe -Os -stdlib=libc++ -isysroot/Applications/Xcode.app/Contents/Developer/Platforms/MacOSX.platform/Developer/SDKs/MacOSX10.14.sdk -Wall -stdlib=libc++ -std=c++0x -O2 -DNDEBUG -arch x86_64 -isysroot /Applications/Xcode.app/Contents/Developer/Platforms/MacOSX.platform/Developer/SDKs/MacOSX10.14.sdk -mmacosx-version-min=10.14   -o CMakeFiles/pdf2htmlEX.dir/src/pdf2htmlEX.cc.o -c /opt/local/var/macports/build/_opt_local_var_macports_sources_rsync.macports.org_macports_release_tarballs_ports_textproc_pdf2htmlex/pdf2htmlex/work/pdf2htmlEX-43e3174cbc/src/pdf2htmlEX.cc
1087:info:build Done.
1088:info:build Building /opt/local/var/macports/build/_opt_local_var_macports_sources_rsync.macports.org_macports_release_tarballs_ports_textproc_pdf2htmlex/pdf2htmlex/work/pdf2htmlEX-43e3174cbc/share/fancy.min.css with YUI Compressor
1089:info:build Done.
1090:info:build [ 41%] Building CXX object CMakeFiles/pdf2htmlEX.dir/src/BackgroundRenderer/SplashBackgroundRenderer.cc.o
1091:info:build /usr/bin/clang++   -I/opt/local/var/macports/build/_opt_local_var_macports_sources_rsync.macports.org_macports_release_tarballs_ports_textproc_pdf2htmlex/pdf2htmlex/work/pdf2htmlEX-43e3174cbc/src -I/opt/local/include/poppler -I/opt/local/include/fontforge -I/opt/local/Library/Frameworks/Python.framework/Versions/2.7/include/python2.7 -I/opt/local/include/cairo -I/opt/local/include/glib-2.0 -I/opt/local/lib/glib-2.0/include -I/opt/local/include/pixman-1 -I/opt/local/include/ossp -I/opt/local/include/freetype2 -I/opt/local/include/libpng16  -pipe -Os -stdlib=libc++ -isysroot/Applications/Xcode.app/Contents/Developer/Platforms/MacOSX.platform/Developer/SDKs/MacOSX10.14.sdk -Wall -stdlib=libc++ -std=c++0x -O2 -DNDEBUG -arch x86_64 -isysroot /Applications/Xcode.app/Contents/Developer/Platforms/MacOSX.platform/Developer/SDKs/MacOSX10.14.sdk -mmacosx-version-min=10.14   -o CMakeFiles/pdf2htmlEX.dir/src/BackgroundRenderer/SplashBackgroundRenderer.cc.o -c /opt/local/var/macports/build/_opt_local_var_macports_sources_rsync.macports.org_macports_release_tarballs_ports_textproc_pdf2htmlex/pdf2htmlex/work/pdf2htmlEX-43e3174cbc/src/BackgroundRenderer/SplashBackgroundRenderer.cc
1092:info:build In file included from /opt/local/var/macports/build/_opt_local_var_macports_sources_rsync.macports.org_macports_release_tarballs_ports_textproc_pdf2htmlex/pdf2htmlex/work/pdf2htmlEX-43e3174cbc/src/HTMLRenderer/outline.cc:15:
1093:info:build In file included from /opt/local/var/macports/build/_opt_local_var_macports_sources_rsync.macports.org_macports_release_tarballs_ports_textproc_pdf2htmlex/pdf2htmlex/work/pdf2htmlEX-43e3174cbc/src/HTMLRenderer/HTMLRenderer.h:26:
1094:info:build /opt/local/var/macports/build/_opt_local_var_macports_sources_rsync.macports.org_macports_release_tarballs_ports_textproc_pdf2htmlex/pdf2htmlex/work/pdf2htmlEX-43e3174cbc/src/Preprocessor.h:33:13: error: unknown type name 'GBool'
1095:info:build     virtual GBool upsideDown() { return gFalse; }
1096:info:build             ^
1097:info:build In file included from /opt/local/var/macports/build/_opt_local_var_macports_sources_rsync.macports.org_macports_release_tarballs_ports_textproc_pdf2htmlex/pdf2htmlex/work/pdf2htmlEX-43e3174cbc/src/HTMLRenderer/draw.cc:16:
1098:info:build In file included from /opt/local/var/macports/build/_opt_local_var_macports_sources_rsync.macports.org_macports_release_tarballs_ports_textproc_pdf2htmlex/pdf2htmlex/work/pdf2htmlEX-43e3174cbc/src/HTMLRenderer/HTMLRenderer.h:26:
1099:info:build /opt/local/var/macports/build/_opt_local_var_macports_sources_rsync.macports.org_macports_release_tarballs_ports_textproc_pdf2htmlex/pdf2htmlex/work/pdf2htmlEX-43e3174cbc/src/Preprocessor.h:33:13: error: unknown type name 'GBool'
1100:info:build     virtual GBool upsideDown() { return gFalse; }
1101:info:build             ^
1102:info:build /opt/local/var/macports/build/_opt_local_var_macports_sources_rsync.macports.org_macports_release_tarballs_ports_textproc_pdf2htmlex/pdf2htmlex/work/pdf2htmlEX-43e3174cbc/src/Preprocessor.h:34:13: error: unknown type name 'GBool'
1103:info:build     virtual GBool useDrawChar() { return gTrue; }
1104:info:build             ^
1105:info:build /opt/local/var/macports/build/_opt_local_var_macports_sources_rsync.macports.org_macports_release_tarballs_ports_textproc_pdf2htmlex/pdf2htmlex/work/pdf2htmlEX-43e3174cbc/src/Preprocessor.h:34:13: error: unknown type name 'GBool'
1106:info:build     virtual GBool useDrawChar() { return gTrue; }
1107:info:build             ^
1108:info:build /opt/local/var/macports/build/_opt_local_var_macports_sources_rsync.macports.org_macports_release_tarballs_ports_textproc_pdf2htmlex/pdf2htmlex/work/pdf2htmlEX-43e3174cbc/src/Preprocessor.h:35:13In file included from /opt/local/var/macports/build/_opt_local_var_macports_sources_rsync.macports.org_macports_release_tarballs_ports_textproc_pdf2htmlex/pdf2htmlex/work/pdf2htmlEX-43e3174cbc/src/HTMLRenderer/text.cc:12:
1109:info:build In file included from /opt/local/var/macports/build/_opt_local_var_macports_sources_rsync.macports.org_macports_release_tarballs_ports_textproc_pdf2htmlex/pdf2htmlex/work/pdf2htmlEX-43e3174cbc/src/HTMLRenderer/HTMLRenderer.h:26:
1110:info:build /opt/local/var/macports/build/_opt_local_var_macports_sources_rsync.macports.org_macports_release_tarballs_ports_textproc_pdf2htmlex/pdf2htmlex/work/pdf2htmlEX-43e3174cbc/src/Preprocessor.h:33:13: error: unknown type name 'GBool'
1111:info:build     virtual GBool upsideDown() { return gFalse; }
1112:info:build             ^
1113:info:build : error: unknown type name 'GBool'
1114:info:build     virtual GBool interpretType3Chars() { return gFalse; }
1115:info:build             ^
1116:info:build In file included from /opt/local/var/macports/build/_opt_local_var_macports_sources_rsync.macports.org_macports_release_tarballs_ports_textproc_pdf2htmlex/pdf2htmlex/work/pdf2htmlEX-43e3174cbc/src/HTMLRenderer/state.cc:12:
1117:info:build In file included from /opt/local/var/macports/build/_opt_local_var_macports_sources_rsync.macports.org_macports_release_tarballs_ports_textproc_pdf2htmlex/pdf2htmlex/work/pdf2htmlEX-43e3174cbc/src/HTMLRenderer/HTMLRenderer.h:26:
1118:info:build /opt/local/var/macports/build/_opt_local_var_macports_sources_rsync.macports.org_macports_release_tarballs_ports_textproc_pdf2htmlex/pdf2htmlex/work/pdf2htmlEX-43e3174cbc/src/Preprocessor.h:33:13: error: unknown type name 'GBool'
1119:info:build     virtual GBool upsideDown() { return gFalse; }
1120:info:build             ^
1121:info:build /opt/local/var/macports/build/_opt_local_var_macports_sources_rsync.macports.org_macports_release_tarballs_ports_textproc_pdf2htmlex/pdf2htmlex/work/pdf2htmlEX-43e3174cbc/src/Preprocessor.h:35:13: error: unknown type name 'GBool'
1122:info:build     virtual GBool interpretType3Chars() { return gFalse; }
1123:info:build             ^
1124:info:build In file included from /opt/local/var/macports/build/_opt_local_var_macports_sources_rsync.macports.org_macports_release_tarballs_ports_textproc_pdf2htmlex/pdf2htmlex/work/pdf2htmlEX-43e3174cbc/src/HTMLRenderer/image.cc:10:
1125:info:build In file included from /opt/local/var/macports/build/_opt_local_var_macports_sources_rsync.macports.org_macports_release_tarballs_ports_textproc_pdf2htmlex/pdf2htmlex/work/pdf2htmlEX-43e3174cbc/src/HTMLRenderer/HTMLRenderer.h:26:
1126:info:build /opt/local/var/macports/build/_opt_local_var_macports_sources_rsync.macports.org_macports_release_tarballs_ports_textproc_pdf2htmlex/pdf2htmlex/work/pdf2htmlEX-43e3174cbc/src/Preprocessor.h:33:13: error: unknown type name 'GBool'
1127:info:build     virtual GBool upsideDown() { return gFalse; }
1128:info:build             ^
1129:info:build /opt/local/var/macports/build/_opt_local_var_macports_sources_rsync.macports.org_macports_release_tarballs_ports_textproc_pdf2htmlex/pdf2htmlex/work/pdf2htmlEX-43e3174cbc/src/Preprocessor.h:34:13: error: unknown type name 'GBool'
1130:info:build     virtual GBool useDrawChar() { return gTrue; }
1131:info:build             ^
1132:info:build /opt/local/var/macports/build/_opt_local_var_macports_sources_rsync.macports.org_macports_release_tarballs_ports_textproc_pdf2htmlex/pdf2htmlex/work/pdf2htmlEX-43e3174cbc/src/Preprocessor.h:36:13: error: unknown type name 'GBool'
1133:info:build     virtual GBool needNonText() { return gFalse; }
1134:info:build             ^
1135:info:build /opt/local/var/macports/build/_opt_local_var_macports_sources_rsync.macports.org_macports_release_tarballs_ports_textproc_pdf2htmlex/pdf2htmlex/work/pdf2htmlEX-43e3174cbc/src/Preprocessor.h:34:13: error: unknown type name 'GBool'
1136:info:build     virtual GBool useDrawChar() { return gTrue; }
1137:info:build             ^
1138:info:build In file included from /opt/local/var/macports/build/_opt_local_var_macports_sources_rsync.macports.org_macports_release_tarballs_ports_textproc_pdf2htmlex/pdf2htmlex/work/pdf2htmlEX-43e3174cbc/src/BackgroundRenderer/BackgroundRenderer.cc:10:
1139:info:build In file included from /opt/local/var/macports/build/_opt_local_var_macports_sources_rsync.macports.org_macports_release_tarballs_ports_textproc_pdf2htmlex/pdf2htmlex/work/pdf2htmlEX-43e3174cbc/src/HTMLRenderer/HTMLRenderer.h:26:
1140:info:build /opt/local/var/macports/build/_opt_local_var_macports_sources_rsync.macports.org_macports_release_tarballs_ports_textproc_pdf2htmlex/pdf2htmlex/work/pdf2htmlEX-43e3174cbc/src/Preprocessor.h:33:13: error: unknown type name 'GBool'
1141:info:build     virtual GBool upsideDown() { return gFalse; }
1142:info:build             ^
1143:info:build /opt/local/var/macports/build/_opt_local_var_macports_sources_rsync.macports.org_macports_release_tarballs_ports_textproc_pdf2htmlex/pdf2htmlex/work/pdf2htmlEX-43e3174cbc/src/Preprocessor.h:36:13: error: unknown type name 'GBool'
1144:info:build     virtual GBool needNonText() { return gFalse; }
1145:info:build             ^
1146:info:build /opt/local/var/macports/build/_opt_local_var_macports_sources_rsync.macports.org_macports_release_tarballs_ports_textproc_pdf2htmlex/pdf2htmlex/work/pdf2htmlEX-43e3174cbc/src/Preprocessor.h:37:13: /opt/local/var/macports/build/_opt_local_var_macports_sources_rsync.macports.org_macports_release_tarballs_ports_textproc_pdf2htmlex/pdf2htmlex/work/pdf2htmlEX-43e3174cbc/src/Preprocessor.h:34:13: errorerror: unknown type name 'GBool'
1147:info:build /opt/local/var/macports/build/_opt_local_var_macports_sources_rsync.macports.org_macports_release_tarballs_ports_textproc_pdf2htmlex/pdf2htmlex/work/pdf2htmlEX-43e3174cbc/src/Preprocessor.h:35:13: error: unknown type name 'GBool'
1148:info:build     virtual GBool interpretType3Chars() { return gFalse; }
1149:info:build             ^
1150:info:build     virtual GBool needClipToCropBox() { return gTrue; }
1151:info:build             ^: unknown type name 'GBool'
1152:info:build     virtual GBool useDrawChar() { return gTrue; }
1153:info:build             ^
1154:info:build /opt/local/var/macports/build/_opt_local_var_macports_sources_rsync.macports.org_macports_release_tarballs_ports_textproc_pdf2htmlex/pdf2htmlex/work/pdf2htmlEX-43e3174cbc/src/Preprocessor.h:35:13: error: unknown type name 'GBool'
1155:info:build     virtual GBool interpretType3Chars() { return gFalse; }
1156:info:build             ^
1157:info:build /opt/local/var/macports/build/_opt_local_var_macports_sources_rsync.macports.org_macports_release_tarballs_ports_textproc_pdf2htmlex/pdf2htmlex/work/pdf2htmlEX-43e3174cbc/src/Preprocessor.h:37:13: error: unknown type name 'GBool'
1158:info:build     virtual GBool needClipToCropBox() { return gTrue; }
1159:info:build             ^
1160:info:build /opt/local/var/macports/build/_opt_local_var_macports_sources_rsync.macports.org_macports_release_tarballs_ports_textproc_pdf2htmlex/pdf2htmlex/work/pdf2htmlEX-43e3174cbc/src/Preprocessor.h:34:13: error/opt/local/var/macports/build/_opt_local_var_macports_sources_rsync.macports.org_macports_release_tarballs_ports_textproc_pdf2htmlex/pdf2htmlex/work/pdf2htmlEX-43e3174cbc/src/Preprocessor.h:35:13/opt/local/var/macports/build/_opt_local_var_macports_sources_rsync.macports.org_macports_release_tarballs_ports_textproc_pdf2htmlex/pdf2htmlex/work/pdf2htmlEX-43e3174cbc/src/Preprocessor.h:36:/opt/local/var/macports/build/_opt_local_var_macports_sources_rsync.macports.org_macports_release_tarballs_ports_textproc_pdf2htmlex/pdf2htmlex/work/pdf2htmlEX-43e3174cbc/src/Preprocessor.h:36:: unknown type name 'GBool'
1161:info:build     virtual GBool useDrawChar() { return gTrue; }
1162:info:build             ^
1163:info:build : 13: error: unknown type name 'GBool'
1164:info:build     virtual GBool needNonText() { return gFalse; }
1165:info:build 13: error: unknown type name 'GBool'
1166:info:build     virtual GBool needNonText() { return gFalse; }
1167:info:build             ^
1168:info:build error: unknown type name 'GBool'
1169:info:build     virtual GBool interpretType3Chars() { return gFalse; }
1170:info:build             ^
1171:info:build             ^
1172:info:build In file included from /opt/local/var/macports/build/_opt_local_var_macports_sources_rsync.macports.org_macports_release_tarballs_ports_textproc_pdf2htmlex/pdf2htmlex/work/pdf2htmlEX-43e3174cbc/src/HTMLRenderer/link.cc:16:
1173:info:build In file included from /opt/local/var/macports/build/_opt_local_var_macports_sources_rsync.macports.org_macports_release_tarballs_ports_textproc_pdf2htmlex/pdf2htmlex/work/pdf2htmlEX-43e3174cbc/src/HTMLRenderer/HTMLRenderer.h:26:
1174:info:build /opt/local/var/macports/build/_opt_local_var_macports_sources_rsync.macports.org_macports_release_tarballs_ports_textproc_pdf2htmlex/pdf2htmlex/work/pdf2htmlEX-43e3174cbc/src/Preprocessor.h:33:13: error: unknown type name 'GBool'
1175:info:build     virtual GBool upsideDown() { return gFalse; }
1176:info:build             ^
1177:info:build /opt/local/var/macports/build/_opt_local_var_macports_sources_rsync.macports.org_macports_release_tarballs_ports_textproc_pdf2htmlex/pdf2htmlex/work/pdf2htmlEX-43e3174cbc/src/Preprocessor.h:35:13: error: unknown type name 'GBool'
1178:info:build     virtual GBool interpretType3Chars() { return gFalse; }
1179:info:build             ^
1180:info:build /opt/local/var/macports/build/_opt_local_var_macports_sources_rsync.macports.org_macports_release_tarballs_ports_textproc_pdf2htmlex/pdf2htmlex/work/pdf2htmlEX-43e3174cbc/src/Preprocessor.h:37:/opt/local/var/macports/build/_opt_local_var_macports_sources_rsync.macports.org_macports_release_tarballs_ports_textproc_pdf2htmlex/pdf2htmlex/work/pdf2htmlEX-43e3174cbc/src/Preprocessor.h:37:13: error: unknown type name 'GBool'
1181:info:build     virtual GBool needClipToCropBox() { return gTrue; }
1182:info:build             ^
1183:info:build 13:/opt/local/var/macports/build/_opt_local_var_macports_sources_rsync.macports.org_macports_release_tarballs_ports_textproc_pdf2htmlex/pdf2htmlex/work/pdf2htmlEX-43e3174cbc/src/Preprocessor.h:36 error: unknown type name 'GBool'
1184:info:build     virtual GBool needClipToCropBox() { return gTrue; }
1185:info:build             ^
1186:info:build /opt/local/var/macports/build/_opt_local_var_macports_sources_rsync.macports.org_macports_release_tarballs_ports_textproc_pdf2htmlex/pdf2htmlex/work/pdf2htmlEX-43e3174cbc/src/Preprocessor.h:34:13: error: unknown type name 'GBool'
1187:info:build     virtual GBool useDrawChar() { return gTrue; }
1188:info:build             ^
1189:info:build :13: error: unknown type name 'GBool'
1190:info:build     virtual GBool needNonText() { return gFalse; }
1191:info:build             ^/opt/local/var/macports/build/_opt_local_var_macports_sources_rsync.macports.org_macports_release_tarballs_ports_textproc_pdf2htmlex/pdf2htmlex/work/pdf2htmlEX-43e3174cbc/src/Preprocessor.h:36:13: error: unknown type name 'GBool'
1192:info:build     virtual GBool needNonText() { return gFalse; }
1193:info:build             ^
1194:info:build /opt/local/var/macports/build/_opt_local_var_macports_sources_rsync.macports.org_macports_release_tarballs_ports_textproc_pdf2htmlex/pdf2htmlex/work/pdf2htmlEX-43e3174cbc/src/Preprocessor.h:37:13: error: unknown type name 'GBool'
1195:info:build     virtual GBool needClipToCropBox() { return gTrue; }
1196:info:build             ^
1197:info:build /opt/local/var/macports/build/_opt_local_var_macports_sources_rsync.macports.org_macports_release_tarballs_ports_textproc_pdf2htmlex/pdf2htmlex/work/pdf2htmlEX-43e3174cbc/src/Preprocessor.h:37:13: error: unknown type name 'GBool'
1198:info:build     virtual GBool needClipToCropBox() { return gTrue; }
1199:info:build             ^
1200:info:build /opt/local/var/macports/build/_opt_local_var_macports_sources_rsync.macports.org_macports_release_tarballs_ports_textproc_pdf2htmlex/pdf2htmlex/work/pdf2htmlEX-43e3174cbc/src/Preprocessor.h:35:13: error: unknown type name 'GBool'
1201:info:build     virtual GBool interpretType3Chars() { return gFalse; }
1202:info:build             ^
1203:info:build /opt/local/var/macports/build/_opt_local_var_macports_sources_rsync.macports.org_macports_release_tarballs_ports_textproc_pdf2htmlex/pdf2htmlex/work/pdf2htmlEX-43e3174cbc/src/Preprocessor.h:36:13: error: unknown type name 'GBool'
1204:info:build     virtual GBool needNonText() { return gFalse; }
1205:info:build             ^
1206:info:build /opt/local/var/macports/build/_opt_local_var_macports_sources_rsync.macports.org_macports_release_tarballs_ports_textproc_pdf2htmlex/pdf2htmlex/work/pdf2htmlEX-43e3174cbc/src/Preprocessor.h:33:In file included from /opt/local/var/macports/build/_opt_local_var_macports_sources_rsync.macports.org_macports_release_tarballs_ports_textproc_pdf2htmlex/pdf2htmlex/work/pdf2htmlEX-43e3174cbc/src/HTMLRenderer/general.cc:18:
1207:info:build 41:In file included from /opt/local/var/macports/build/_opt_local_var_macports_sources_rsync.macports.org_macports_release_tarballs_ports_textproc_pdf2htmlex/pdf2htmlex/work/pdf2htmlEX-43e3174cbc/src/HTMLRenderer/HTMLRenderer.h:26:
1208:info:build /opt/local/var/macports/build/_opt_local_var_macports_sources_rsync.macports.org_macports_release_tarballs_ports_textproc_pdf2htmlex/pdf2htmlex/work/pdf2htmlEX-43e3174cbc/src/Preprocessor.h:33:13: error: unknown type name 'GBool'
1209:info:build     virtual GBool upsideDown() { return gFalse; }
1210:info:build             ^
1211:info:build /opt/local/var/macports/build/_opt_local_var_macports_sources_rsync.macports.org_macports_release_tarballs_ports_textproc_pdf2htmlex/pdf2htmlex/work/pdf2htmlEX-43e3174cbc/src/Preprocessor.h:37: error: use of undeclared identifier 'gFalse'; did you mean 'false'?
1212:info:build 13: error: unknown type name 'GBool'
1213:info:build     virtual GBool needClipToCropBox() { return gTrue; }
1214:info:build             ^
1215:info:build /opt/local/var/macports/build/_opt_local_var_macports_sources_rsync.macports.org_macports_release_tarballs_ports_textproc_pdf2htmlex/pdf2htmlex/work/pdf2htmlEX-43e3174cbc/src/Preprocessor.h:33:41: error: use of undeclared identifier 'gFalse'; did you mean 'false'?
1216:info:build     virtual GBool upsideDown() { return gFalse; }
1217:info:build                                         ^~~~~~
1218:info:build                                         false
1219:info:build     virtual GBool upsideDown() { return gFalse; }
1220:info:build                                         ^~~~~~
1221:info:build                                         false
1222:info:build /opt/local/var/macports/build/_opt_local_var_macports_sources_rsync.macports.org_macports_release_tarballs_ports_textproc_pdf2htmlex/pdf2htmlex/work/pdf2htmlEX-43e3174cbc/src/Preprocessor.h:34:42: error: use of undeclared identifier 'gTrue'; did you mean 'true'?
1223:info:build     virtual GBool useDrawChar() { return gTrue; }
1224:info:build                                          ^~~~~
1225:info:build                                          true
1226:info:build /opt/local/var/macports/build/_opt_local_var_macports_sources_rsync.macports.org_macports_release_tarballs_ports_textproc_pdf2htmlex/pdf2htmlex/work/pdf2htmlEX-43e3174cbc/src/Preprocessor.h:34:42/opt/local/var/macports/build/_opt_local_var_macports_sources_rsync.macports.org_macports_release_tarballs_ports_textproc_pdf2htmlex/pdf2htmlex/work/pdf2htmlEX-43e3174cbc/src/Preprocessor.h:34:13: error: use of undeclared identifier 'gTrue'; did you mean 'true'?
1227:info:build     virtual GBool useDrawChar() { return gTrue; }
1228:info:build                                          ^~~~~
1229:info:build                                          true
1230:info:build : error: unknown type name 'GBool'
1231:info:build     virtual GBool useDrawChar() { return gTrue; }
1232:info:build             ^
1233:info:build /opt/local/var/macports/build/_opt_local_var_macports_sources_rsync.macports.org_macports_release_tarballs_ports_textproc_pdf2htmlex/pdf2htmlex/work/pdf2htmlEX-43e3174cbc/src/Preprocessor.h:35:50: error: use of undeclared identifier 'gFalse'; did you mean 'false'?
1234:info:build     virtual GBool interpretType3Chars() { return gFalse; }
1235:info:build                                                  ^~~~~~
1236:info:build                                                  false
1237:info:build /opt/local/var/macports/build/_opt_local_var_macports_sources_rsync.macports.org_macports_release_tarballs_ports_textproc_pdf2htmlex/pdf2htmlex/work/pdf2htmlEX-43e3174cbc/src/Preprocessor.h:33:41: error: use of undeclared identifier 'gFalse'; did you mean 'false'?
1238:info:build     virtual GBool upsideDown() { return gFalse; }
1239:info:build                                         ^~~~~~
1240:info:build                                         false
1241:info:build /opt/local/var/macports/build/_opt_local_var_macports_sources_rsync.macports.org_macports_release_tarballs_ports_textproc_pdf2htmlex/pdf2htmlex/work/pdf2htmlEX-43e3174cbc/src/Preprocessor.h/opt/local/var/macports/build/_opt_local_var_macports_sources_rsync.macports.org_macports_release_tarballs_ports_textproc_pdf2htmlex/pdf2htmlex/work/pdf2htmlEX-43e3174cbc/src/Preprocessor.h:33:41:35:50: error: /opt/local/var/macports/build/_opt_local_var_macports_sources_rsync.macports.org_macports_release_tarballs_ports_textproc_pdf2htmlex/pdf2htmlex/work/pdf2htmlEX-43e3174cbc/src/Preprocessor.h: error: :use of undeclared identifier 'gFalse'; did you mean 'false'?33use of undeclared identifier 'gFalse'; did you mean 'false'?
1242:info:build     virtual GBool upsideDown() { return gFalse; }
1243:info:build                                         ^~~~~~
1244:info:build                                         false
1245:info:build     virtual GBool interpretType3Chars() { return gFalse; }
1246:info:build                                                  ^~~~~~
1247:info:build                                                  false
1248:info:build :41: error: use of undeclared identifier 'gFalse'; did you mean 'false'?/opt/local/var/macports/build/_opt_local_var_macports_sources_rsync.macports.org_macports_release_tarballs_ports_textproc_pdf2htmlex/pdf2htmlex/work/pdf2htmlEX-43e3174cbc/src/Preprocessor.h:35:
1249:info:build     virtual GBool upsideDown() { return gFalse; }
1250:info:build                                         ^~~~~~
1251:info:build                                         false13: error: unknown type name 'GBool'
1252:info:build     virtual GBool interpretType3Chars() { return gFalse; }
1253:info:build             ^
1254:info:build /opt/local/var/macports/build/_opt_local_var_macports_sources_rsync.macports.org_macports_release_tarballs_ports_textproc_pdf2htmlex/pdf2htmlex/work/pdf2htmlEX-43e3174cbc/src/Preprocessor.h:36:42: error: use of undeclared identifier 'gFalse'; did you mean 'false'?
1255:info:build     virtual GBool needNonText() { return gFalse; }
1256:info:build                                          ^~~~~~
1257:info:build                                          false
1258:info:build /opt/local/var/macports/build/_opt_local_var_macports_sources_rsync.macports.org_macports_release_tarballs_ports_textproc_pdf2htmlex/pdf2htmlex/work/pdf2htmlEX-43e3174cbc/src/Preprocessor.h:33:41: error: use of undeclared identifier 'gFalse'; did you mean 'false'?
1259:info:build /opt/local/var/macports/build/_opt_local_var_macports_sources_rsync.macports.org_macports_release_tarballs_ports_textproc_pdf2htmlex/pdf2htmlex/work/pdf2htmlEX-43e3174cbc/src/Preprocessor.h:34:42: error/opt/local/var/macports/build/_opt_local_var_macports_sources_rsync.macports.org_macports_release_tarballs_ports_textproc_pdf2htmlex/pdf2htmlex/work/pdf2htmlEX-43e3174cbc/src/Preprocessor.h:34:42: error: use of undeclared identifier 'gTrue'; did you mean 'true'?
1260:info:build     virtual GBool useDrawChar() { return gTrue; }
1261:info:build                                          ^~~~~
1262:info:build                                          true
1263:info:build     virtual GBool upsideDown() { return gFalse; }
1264:info:build                                         ^~~~~~
1265:info:build                                         false
1266:info:build : use of undeclared identifier 'gTrue'; did you mean 'true'?
1267:info:build     virtual GBool useDrawChar() { return gTrue; }
1268:info:build                                          ^~~~~
1269:info:build                                          true
1270:info:build /opt/local/var/macports/build/_opt_local_var_macports_sources_rsync.macports.org_macports_release_tarballs_ports_textproc_pdf2htmlex/pdf2htmlex/work/pdf2htmlEX-43e3174cbc/src/Preprocessor.h:34:42: error: use of undeclared identifier 'gTrue'; did you mean 'true'?
1271:info:build     virtual GBool useDrawChar() { return gTrue; }
1272:info:build                                          ^~~~~
1273:info:build                                          true
1274:info:build /opt/local/var/macports/build/_opt_local_var_macports_sources_rsync.macports.org_macports_release_tarballs_ports_textproc_pdf2htmlex/pdf2htmlex/work/pdf2htmlEX-43e3174cbc/src/Preprocessor.h:36:13: error: unknown type name 'GBool'
1275:info:build     virtual GBool needNonText() { return gFalse; }
1276:info:build             ^
1277:info:build /opt/local/var/macports/build/_opt_local_var_macports_sources_rsync.macports.org_macports_release_tarballs_ports_textproc_pdf2htmlex/pdf2htmlex/work/pdf2htmlEX-43e3174cbc/src/Preprocessor.h:36:42: error: use of undeclared identifier 'gFalse'; did you mean 'false'?
1278:info:build     virtual GBool needNonText() { return gFalse; }
1279:info:build                                          ^~~~~~
1280:info:build                                          false
1281:info:build /opt/local/var/macports/build/_opt_local_var_macports_sources_rsync.macports.org_macports_release_tarballs_ports_textproc_pdf2htmlex/pdf2htmlex/work/pdf2htmlEX-43e3174cbc/src/Preprocessor.h:37:48: error: use of undeclared identifier 'gTrue'; did you mean 'true'?
1282:info:build     virtual GBool needClipToCropBox() { return gTrue; }
1283:info:build                                                ^~~~~
1284:info:build                                                true
1285:info:build /opt/local/var/macports/build/_opt_local_var_macports_sources_rsync.macports.org_macports_release_tarballs_ports_textproc_pdf2htmlex/pdf2htmlex/work/pdf2htmlEX-43e3174cbc/src/Preprocessor.h:35:50: error: use of undeclared identifier 'gFalse'; did you mean 'false'?
1286:info:build     virtual GBool interpretType3Chars() { return gFalse; }
1287:info:build                                                  ^~~~~~
1288:info:build                                                  false
1289:info:build /opt/local/var/macports/build/_opt_local_var_macports_sources_rsync.macports.org_macports_release_tarballs_ports_textproc_pdf2htmlex/pdf2htmlex/work/pdf2htmlEX-43e3174cbc/src/Preprocessor.h:35:50: error: use of undeclared identifier 'gFalse'; did you mean 'false'?
1290:info:build     virtual GBool interpretType3Chars() { return gFalse; }
1291:info:build                                                  ^~~~~~In file included from /opt/local/var/macports/build/_opt_local_var_macports_sources_rsync.macports.org_macports_release_tarballs_ports_textproc_pdf2htmlex/pdf2htmlex/work/pdf2htmlEX-43e3174cbc/src/HTMLRenderer/outline.cc:15:
1292:info:build In file included from /opt/local/var/macports/build/_opt_local_var_macports_sources_rsync.macports.org_macports_release_tarballs_ports_textproc_pdf2htmlex/pdf2htmlex/work/pdf2htmlEX-43e3174cbc/src/HTMLRenderer/HTMLRenderer.h:27:
1293:info:build /opt/local/var/macports/build/_opt_local_var_macports_sources_rsync.macports.org_macports_release_tarballs_ports_textproc_pdf2htmlex/pdf2htmlex/work/pdf2htmlEX-43e3174cbc/src/Preprocessor.h:34:42: error
1294:info:build                                                  false
1295:info:build /opt/local/var/macports/build/_opt_local_var_macports_sources_rsync.macports.org_macports_release_tarballs_ports_textproc_pdf2htmlex/pdf2htmlex/work/pdf2htmlEX-43e3174cbc/src/StringFormatter.h:: use of undeclared identifier 'gTrue'; did you mean 'true'?
1296:info:build     virtual GBool useDrawChar() { return gTrue; }
1297:info:build                                          ^~~~~
1298:info:build                                          true
1299:info:build /opt/local/var/macports/build/_opt_local_var_macports_sources_rsync.macports.org_macports_release_tarballs_ports_textproc_pdf2htmlex/pdf2htmlex/work/pdf2htmlEX-43e3174cbc/src/Preprocessor.h:35:50:37:12: warning: class 'GuardedPointer' was previously declared as a struct [-Wmismatched-tags]
1300:info:build     friend class GuardedPointer;
1301:info:build            ^
1302:info:build /opt/local/var/macports/build/_opt_local_var_macports_sources_rsync.macports.org_macports_release_tarballs_ports_textproc_pdf2htmlex/pdf2htmlex/work/pdf2htmlEX-43e3174cbc/src/StringFormatter.h:19:12: note: previous use is here
1303:info:build     struct GuardedPointer
1304:info:build            ^
1305:info:build /opt/local/var/macports/build/_opt_local_var_macports_sources_rsync.macports.org_macports_release_tarballs_ports_textproc_pdf2htmlex/pdf2htmlex/work/pdf2htmlEX-43e3174cbc/src/StringFormatter.h:37:12: note: did you mean struct here?
1306:info:build     friend class GuardedPointer;
1307:info:build            ^~~~~
1308:info:build            struct
1309:info:build  error: /opt/local/var/macports/build/_opt_local_var_macports_sources_rsync.macports.org_macports_release_tarballs_ports_textproc_pdf2htmlex/pdf2htmlex/work/pdf2htmlEX-43e3174cbc/src/Preprocessor.h:37use of undeclared identifier 'gFalse'; did you mean 'false'?
1310:info:build     virtual GBool interpretType3Chars() { return gFalse; }
1311:info:build                                                  ^~~~~~
1312:info:build                                                  false
1313:info:build /opt/local/var/macports/build/_opt_local_var_macports_sources_rsync.macports.org_macports_release_tarballs_ports_textproc_pdf2htmlex/pdf2htmlex/work/pdf2htmlEX-43e3174cbc/src/Preprocessor.h:37::13: error: unknown type name 'GBool'
1314:info:build     virtual GBool needClipToCropBox() { return gTrue; }
1315:info:build             ^
1316:info:build 48: error: use of undeclared identifier 'gTrue'; did you mean 'true'?
1317:info:build     virtual GBool needClipToCropBox() { return gTrue; }
1318:info:build                                                ^~~~~
1319:info:build                                                true
1320:info:build In file included from /opt/local/var/macports/build/_opt_local_var_macports_sources_rsync.macports.org_macports_release_tarballs_ports_textproc_pdf2htmlex/pdf2htmlex/work/pdf2htmlEX-43e3174cbc/src/HTMLRenderer/draw.cc:16:
1321:info:build In file included from /opt/local/var/macports/build/_opt_local_var_macports_sources_rsync.macports.org_macports_release_tarballs_ports_textproc_pdf2htmlex/pdf2htmlex/work/pdf2htmlEX-43e3174cbc/src/HTMLRenderer/HTMLRenderer.h:27:
1322:info:build /opt/local/var/macports/build/_opt_local_var_macports_sources_rsync.macports.org_macports_release_tarballs_ports_textproc_pdf2htmlex/pdf2htmlex/work/pdf2htmlEX-43e3174cbc/src/StringFormatter.h:37:12: warning: class 'GuardedPointer' was previously declared as a struct [-Wmismatched-tags]
1323:info:build     friend class GuardedPointer;In file included from
1324:info:build /opt/local/var/macports/build/_opt_local_var_macports_sources_rsync.macports.org_macports_release_tarballs_ports_textproc_pdf2htmlex/pdf2htmlex/work/pdf2htmlEX-43e3174cbc/src/pdf2htmlEX.cc:34:
1325:info:build In file included from /opt/local/var/macports/build/_opt_local_var_macports_sources_rsync.macports.org_macports_release_tarballs_ports_textproc_pdf2htmlex/pdf2htmlex/work/pdf2htmlEX-43e3174cbc/src/HTMLRenderer/HTMLRenderer.h:26:
1326:info:build /opt/local/var/macports/build/_opt_local_var_macports_sources_rsync.macports.org_macports_release_tarballs_ports_textproc_pdf2htmlex/pdf2htmlex/work/pdf2htmlEX-43e3174cbc/src/Preprocessor.h:33:13: error: unknown type name 'GBool'
1327:info:build            ^
1328:info:build /opt/local/var/macports/build/_opt_local_var_macports_sources_rsync.macports.org_macports_release_tarballs_ports_textproc_pdf2htmlex/pdf2htmlex/work/pdf2htmlEX-43e3174cbc/src/StringFormatter.h:19    virtual GBool upsideDown() { return gFalse; }
1329:info:build             ^
1330:info:build :12: note: previous use is here
1331:info:build     struct GuardedPointer
1332:info:build            ^
1333:info:build /opt/local/var/macports/build/_opt_local_var_macports_sources_rsync.macports.org_macports_release_tarballs_ports_textproc_pdf2htmlex/pdf2htmlex/work/pdf2htmlEX-43e3174cbc/src/StringFormatter.h:37:12: note: did you mean struct here?
1334:info:build     friend class GuardedPointer;
1335:info:build            ^~~~~
1336:info:build            struct
1337:info:build /opt/local/var/macports/build/_opt_local_var_macports_sources_rsync.macports.org_macports_release_tarballs_ports_textproc_pdf2htmlex/pdf2htmlex/work/pdf2htmlEX-43e3174cbc/src/Preprocessor.h:36:42: error: use of undeclared identifier 'gFalse'; did you mean 'false'?
1338:info:build /opt/local/var/macports/build/_opt_local_var_macports_sources_rsync.macports.org_macports_release_tarballs_ports_textproc_pdf2htmlex/pdf2htmlex/work/pdf2htmlEX-43e3174cbc/src/Preprocessor.h:35:50:    virtual GBool needNonText() { return gFalse; }
1339:info:build                                          ^~~~~~
1340:info:build                                          false
1341:info:build error: use of undeclared identifier 'gFalse'; did you mean 'false'?
1342:info:build     virtual GBool interpretType3Chars() { return gFalse; }
1343:info:build                                                  ^~~~~~
1344:info:build                                                  false
1345:info:build /opt/local/var/macports/build/_opt_local_var_macports_sources_rsync.macports.org_macports_release_tarballs_ports_textproc_pdf2htmlex/pdf2htmlex/work/pdf2htmlEX-43e3174cbc/src/Preprocessor.h:36:42: error: use of undeclared identifier 'gFalse'; did you mean 'false'?
1346:info:build     virtual GBool needNonText() { return gFalse; }
1347:info:build                                          ^~~~~~
1348:info:build                                          false
1349:info:build /opt/local/var/macports/build/_opt_local_var_macports_sources_rsync.macports.org_macports_release_tarballs_ports_textproc_pdf2htmlex/pdf2htmlex/work/pdf2htmlEX-43e3174cbc/src/Preprocessor.h:36:42: error: use of undeclared identifier 'gFalse'; did you mean 'false'?
1350:info:build     virtual GBool needNonText() { return gFalse; }
1351:info:build                                          ^~~~~~
1352:info:build                                          false
1353:info:build /opt/local/var/macports/build/_opt_local_var_macports_sources_rsync.macports.org_macports_release_tarballs_ports_textproc_pdf2htmlex/pdf2htmlex/work/pdf2htmlEX-43e3174cbc/src/Preprocessor.h:33:41: error: use of undeclared identifier 'gFalse'; did you mean 'false'?
1354:info:build     virtual GBool upsideDown() { return gFalse; }
1355:info:build                                         ^~~~~~
1356:info:build                                         false
1357:info:build /opt/local/var/macports/build/_opt_local_var_macports_sources_rsync.macports.org_macports_release_tarballs_ports_textproc_pdf2htmlex/pdf2htmlex/work/pdf2htmlEX-43e3174cbc/src/Preprocessor.h:34:13: error: unknown type name 'GBool'
1358:info:build     virtual GBool useDrawChar() { return gTrue; }
1359:info:build             ^
1360:info:build /opt/local/var/macports/build/_opt_local_var_macports_sources_rsync.macports.org_macports_release_tarballs_ports_textproc_pdf2htmlex/pdf2htmlex/work/pdf2htmlEX-43e3174cbc/src/Preprocessor.h:36:42: error: use of undeclared identifier 'gFalse'; did you mean 'false'?/opt/local/var/macports/build/_opt_local_var_macports_sources_rsync.macports.org_macports_release_tarballs_ports_textproc_pdf2htmlex/pdf2htmlex/work/pdf2htmlEX-43e3174cbc/src/Preprocessor.h:37:48: error: use of undeclared identifier 'gTrue'; did you mean 'true'?
1361:info:build     virtual GBool needClipToCropBox() { return gTrue; }
1362:info:build                                                ^~~~~
1363:info:build                                                true
1364:info:build     virtual GBool needNonText() { return gFalse; }
1365:info:build In file included from                                          ^~~~~~/opt/local/var/macports/build/_opt_local_var_macports_sources_rsync.macports.org_macports_release_tarballs_ports_textproc_pdf2htmlex/pdf2htmlex/work/pdf2htmlEX-43e3174cbc/src/HTMLRenderer/text.cc:12:
1366:info:build In file included from /opt/local/var/macports/build/_opt_local_var_macports_sources_rsync.macports.org_macports_release_tarballs_ports_textproc_pdf2htmlex/pdf2htmlex/work/pdf2htmlEX-43e3174cbc/src/HTMLRenderer/HTMLRenderer.h:27:
1367:info:build /opt/local/var/macports/build/_opt_local_var_macports_sources_rsync.macports.org_macports_release_tarballs_ports_textproc_pdf2htmlex/pdf2htmlex/work/pdf2htmlEX-43e3174cbc/src/StringFormatter.h:37:12: warning: class 'GuardedPointer' was previously declared as a struct [-Wmismatched-tags]
1368:info:build     friend class GuardedPointer;
1369:info:build            ^
1370:info:build /opt/local/var/macports/build/_opt_local_var_macports_sources_rsync.macports.org_macports_release_tarballs_ports_textproc_pdf2htmlex/pdf2htmlex/work/pdf2htmlEX-43e3174cbc/src/StringFormatter.h:19:12: note: previous use is here
1371:info:build     struct GuardedPointer
1372:info:build            ^
1373:info:build /opt/local/var/macports/build/_opt_local_var_macports_sources_rsync.macports.org_macports_release_tarballs_ports_textproc_pdf2htmlex/pdf2htmlex/work/pdf2htmlEX-43e3174cbc/src/StringFormatter.h:37:12: note: did you mean struct here?
1374:info:build     friend class GuardedPointer;
1375:info:build            ^~~~~
1376:info:build            struct
1377:info:build                                          false/opt/local/var/macports/build/_opt_local_var_macports_sources_rsync.macports.org_macports_release_tarballs_ports_textproc_pdf2htmlex/pdf2htmlex/work/pdf2htmlEX-43e3174cbc/src/Preprocessor.h:37:48:
1378:info:build error: use of undeclared identifier 'gTrue'; did you mean 'true'?
1379:info:build     virtual GBool needClipToCropBox() { return gTrue; }
1380:info:build                                                ^~~~~
1381:info:build                                                true
1382:info:build In file included from /opt/local/var/macports/build/_opt_local_var_macports_sources_rsync.macports.org_macports_release_tarballs_ports_textproc_pdf2htmlex/pdf2htmlex/work/pdf2htmlEX-43e3174cbc/src/HTMLRenderer/state.cc:12:
1383:info:build In file included from /opt/local/var/macports/build/_opt_local_var_macports_sources_rsync.macports.org_macports_release_tarballs_ports_textproc_pdf2htmlex/pdf2htmlex/work/pdf2htmlEX-43e3174cbc/src/HTMLRenderer/HTMLRenderer.h:27:
1384:info:build /opt/local/var/macports/build/_opt_local_var_macports_sources_rsync.macports.org_macports_release_tarballs_ports_textproc_pdf2htmlex/pdf2htmlex/work/pdf2htmlEX-43e3174cbc/src/StringFormatter.h:37:12: warning: class 'GuardedPointer' was previously declared as a struct [-Wmismatched-tags]
1385:info:build     friend class GuardedPointer;
1386:info:build            ^
1387:info:build /opt/local/var/macports/build/_opt_local_var_macports_sources_rsync.macports.org_macports_release_tarballs_ports_textproc_pdf2htmlex/pdf2htmlex/work/pdf2htmlEX-43e3174cbc/src/StringFormatter.h:19:12: note: previous use is here
1388:info:build     struct GuardedPointer
1389:info:build            ^
1390:info:build /opt/local/var/macports/build/_opt_local_var_macports_sources_rsync.macports.org_macports_release_tarballs_ports_textproc_pdf2htmlex/pdf2htmlex/work/pdf2htmlEX-43e3174cbc/src/StringFormatter.h:37:12: note: did you mean struct here?
1391:info:build     friend class GuardedPointer;
1392:info:build            ^~~~~
1393:info:build            struct
1394:info:build /opt/local/var/macports/build/_opt_local_var_macports_sources_rsync.macports.org_macports_release_tarballs_ports_textproc_pdf2htmlex/pdf2htmlex/work/pdf2htmlEX-43e3174cbc/src/Preprocessor.h:34:42: error: use of undeclared identifier 'gTrue'; did you mean 'true'?
1395:info:build     virtual GBool useDrawChar() { return gTrue; }
1396:info:build                                          ^~~~~
1397:info:build                                          true
1398:info:build /opt/local/var/macports/build/_opt_local_var_macports_sources_rsync.macports.org_macports_release_tarballs_ports_textproc_pdf2htmlex/pdf2htmlex/work/pdf2htmlEX-43e3174cbc/src/Preprocessor.h:37:48: error: use of undeclared identifier 'gTrue'; did you mean 'true'?
1399:info:build     virtual GBool needClipToCropBox() { return gTrue; }
1400:info:build                                                ^~~~~
1401:info:build                                                true
1402:info:build In file included from /opt/local/var/macports/build/_opt_local_var_macports_sources_rsync.macports.org_macports_release_tarballs_ports_textproc_pdf2htmlex/pdf2htmlex/work/pdf2htmlEX-43e3174cbc/src/HTMLRenderer/image.cc:/opt/local/var/macports/build/_opt_local_var_macports_sources_rsync.macports.org_macports_release_tarballs_ports_textproc_pdf2htmlex/pdf2htmlex/work/pdf2htmlEX-43e3174cbc/src/Preprocessor.h:37:48: error: use of undeclared identifier 'gTrue'; did you mean 'true'?
1403:info:build     virtual GBool needClipToCropBox() { return gTrue; }
1404:info:build                                                ^~~~~
1405:info:build                                                true
1406:info:build In file included from /opt/local/var/macports/build/_opt_local_var_macports_sources_rsync.macports.org_macports_release_tarballs_ports_textproc_pdf2htmlex/pdf2htmlex/work/pdf2htmlEX-43e3174cbc/src/BackgroundRenderer/BackgroundRenderer.cc:10:
1407:info:build In file included from /opt/local/var/macports/build/_opt_local_var_macports_sources_rsync.macports.org_macports_release_tarballs_ports_textproc_pdf2htmlex/pdf2htmlex/work/pdf2htmlEX-43e3174cbc/src/HTMLRenderer/HTMLRenderer.h:27:
1408:info:build /opt/local/var/macports/build/_opt_local_var_macports_sources_rsync.macports.org_macports_release_tarballs_ports_textproc_pdf2htmlex/pdf2htmlex/work/pdf2htmlEX-43e3174cbc/src/StringFormatter.h:37:12: warning: class 'GuardedPointer' was previously declared as a struct [-Wmismatched-tags]
1409:info:build     friend class GuardedPointer;
1410:info:build            ^
1411:info:build /opt/local/var/macports/build/_opt_local_var_macports_sources_rsync.macports.org_macports_release_tarballs_ports_textproc_pdf2htmlex/pdf2htmlex/work/pdf2htmlEX-43e3174cbc/src/StringFormatter.h:19:12: note: previous use is here
1412:info:build     struct GuardedPointer
1413:info:build            ^
1414:info:build /opt/local/var/macports/build/_opt_local_var_macports_sources_rsync.macports.org_macports_release_tarballs_ports_textproc_pdf2htmlex/pdf2htmlex/work/pdf2htmlEX-43e3174cbc/src/StringFormatter.h:37:12: note: did you mean struct here?
1415:info:build     friend class GuardedPointer;
1416:info:build            ^~~~~
1417:info:build            struct
1418:info:build 10:
1419:info:build In file included from /opt/local/var/macports/build/_opt_local_var_macports_sources_rsync.macports.org_macports_release_tarballs_ports_textproc_pdf2htmlex/pdf2htmlex/work/pdf2htmlEX-43e3174cbc/src/HTMLRenderer/HTMLRenderer.h:27:
1420:info:build /opt/local/var/macports/build/_opt_local_var_macports_sources_rsync.macports.org_macports_release_tarballs_ports_textproc_pdf2htmlex/pdf2htmlex/work/pdf2htmlEX-43e3174cbc/src/StringFormatter.h:37:12: warning: class 'GuardedPointer' was previously declared as a struct [-Wmismatched-tags]
1421:info:build     friend class GuardedPointer;
1422:info:build            ^
1423:info:build /opt/local/var/macports/build/_opt_local_var_macports_sources_rsync.macports.org_macports_release_tarballs_ports_textproc_pdf2htmlex/pdf2htmlex/work/pdf2htmlEX-43e3174cbc/src/StringFormatter.h:19:12: note: previous use is here
1424:info:build     struct GuardedPointer
1425:info:build            ^
1426:info:build /opt/local/var/macports/build/_opt_local_var_macports_sources_rsync.macports.org_macports_release_tarballs_ports_textproc_pdf2htmlex/pdf2htmlex/work/pdf2htmlEX-43e3174cbc/src/StringFormatter.h:37:12: note: did you mean struct here?
1427:info:build     friend class GuardedPointer;
1428:info:build            ^~~~~
1429:info:build            struct
1430:info:build /opt/local/var/macports/build/_opt_local_var_macports_sources_rsync.macports.org_macports_release_tarballs_ports_textproc_pdf2htmlex/pdf2htmlex/work/pdf2htmlEX-43e3174cbc/src/Preprocessor.h:35:13: error: unknown type name 'GBool'
1431:info:build     virtual GBool interpretType3Chars() { return gFalse; }
1432:info:build             ^
1433:info:build /opt/local/var/macports/build/_opt_local_var_macports_sources_rsync.macports.org_macports_release_tarballs_ports_textproc_pdf2htmlex/pdf2htmlex/work/pdf2htmlEX-43e3174cbc/src/Preprocessor.h:35:50: error: use of undeclared identifier 'gFalse'; did you mean 'false'?
1434:info:build     virtual GBool interpretType3Chars() { return gFalse; }
1435:info:build                                                  ^~~~~~
1436:info:build                                                  false
1437:info:build /opt/local/var/macports/build/_opt_local_var_macports_sources_rsync.macports.org_macports_release_tarballs_ports_textproc_pdf2htmlex/pdf2htmlex/work/pdf2htmlEX-43e3174cbc/src/Preprocessor.h:36:42/opt/local/var/macports/build/_opt_local_var_macports_sources_rsync.macports.org_macports_release_tarballs_ports_textproc_pdf2htmlex/pdf2htmlex/work/pdf2htmlEX-43e3174cbc/src/Preprocessor.h:36:13: error: unknown type name 'GBool'
1438:info:build     virtual GBool needNonText() { return gFalse; }
1439:info:build             ^
1440:info:build : error: use of undeclared identifier 'gFalse'; did you mean 'false'?
1441:info:build     virtual GBool needNonText() { return gFalse; }
1442:info:build                                          ^~~~~~
1443:info:build                                          false
1444:info:build In file included from /opt/local/var/macports/build/_opt_local_var_macports_sources_rsync.macports.org_macports_release_tarballs_ports_textproc_pdf2htmlex/pdf2htmlex/work/pdf2htmlEX-43e3174cbc/src/HTMLRenderer/font.cc:21:
1445:info:build In file included from /opt/local/var/macports/build/_opt_local_var_macports_sources_rsync.macports.org_macports_release_tarballs_ports_textproc_pdf2htmlex/pdf2htmlex/work/pdf2htmlEX-43e3174cbc/src/Preprocessor.h:33:41: error/opt/local/var/macports/build/_opt_local_var_macports_sources_rsync.macports.org_macports_release_tarballs_ports_textproc_pdf2htmlex/pdf2htmlex/work/pdf2htmlEX-43e3174cbc/src/Preprocessor.h:37:48: error: use of undeclared identifier 'gTrue'; did you mean 'true'?
1446:info:build     virtual GBool needClipToCropBox() { return gTrue; }
1447:info:build                                                ^~~~~
1448:info:build                                                true
1449:info:build : use of undeclared identifier 'gFalse'; did you mean 'false'?
1450:info:build     virtual GBool upsideDown() { return gFalse; }
1451:info:build                                         ^~~~~~
1452:info:build                                         false
1453:info:build /opt/local/var/macports/build/_opt_local_var_macports_sources_rsync.macports.org_macports_release_tarballs_ports_textproc_pdf2htmlex/pdf2htmlex/work/pdf2htmlEX-43e3174cbc/src/HTMLRenderer/HTMLRenderer.h:26:
1454:info:build /opt/local/var/macports/build/_opt_local_var_macports_sources_rsync.macports.org_macports_release_tarballs_ports_textproc_pdf2htmlex/pdf2htmlex/work/pdf2htmlEX-43e3174cbc/src/Preprocessor.h:33:13: error: unknown type name 'GBool'
1455:info:build     virtual GBool upsideDown() { return gFalse; }
1456:info:build             ^
1457:info:build In file included from /opt/local/var/macports/build/_opt_local_var_macports_sources_rsync.macports.org_macports_release_tarballs_ports_textproc_pdf2htmlex/pdf2htmlex/work/pdf2htmlEX-43e3174cbc/src/HTMLRenderer/link.cc:16/opt/local/var/macports/build/_opt_local_var_macports_sources_rsync.macports.org_macports_release_tarballs_ports_textproc_pdf2htmlex/pdf2htmlex/work/pdf2htmlEX-43e3174cbc/src/Preprocessor.h:37:13: error: unknown type name 'GBool'
1458:info:build     virtual GBool needClipToCropBox() { return gTrue; }
1459:info:build             ^
1460:info:build :
1461:info:build In file included from /opt/local/var/macports/build/_opt_local_var_macports_sources_rsync.macports.org_macports_release_tarballs_ports_textproc_pdf2htmlex/pdf2htmlex/work/pdf2htmlEX-43e3174cbc/src/HTMLRenderer/HTMLRenderer.h:27:
1462:info:build /opt/local/var/macports/build/_opt_local_var_macports_sources_rsync.macports.org_macports_release_tarballs_ports_textproc_pdf2htmlex/pdf2htmlex/work/pdf2htmlEX-43e3174cbc/src/StringFormatter.h:37:12: warning: class 'GuardedPointer' was previously declared as a struct [-Wmismatched-tags]
1463:info:build     friend class GuardedPointer;
1464:info:build            ^
1465:info:build /opt/local/var/macports/build/_opt_local_var_macports_sources_rsync.macports.org_macports_release_tarballs_ports_textproc_pdf2htmlex/pdf2htmlex/work/pdf2htmlEX-43e3174cbc/src/StringFormatter.h:19:12: note: previous use is here
1466:info:build     struct GuardedPointer
1467:info:build            ^
1468:info:build /opt/local/var/macports/build/_opt_local_var_macports_sources_rsync.macports.org_macports_release_tarballs_ports_textproc_pdf2htmlex/pdf2htmlex/work/pdf2htmlEX-43e3174cbc/src/StringFormatter.h:37:12: note: did you mean struct here?
1469:info:build     friend class GuardedPointer;
1470:info:build            ^~~~~
1471:info:build            struct
1472:info:build /opt/local/var/macports/build/_opt_local_var_macports_sources_rsync.macports.org_macports_release_tarballs_ports_textproc_pdf2htmlex/pdf2htmlex/work/pdf2htmlEX-43e3174cbc/src/Preprocessor.h:34:13: error: unknown type name 'GBool'
1473:info:build     virtual GBool useDrawChar() { return gTrue; }
1474:info:build             ^
1475:info:build /opt/local/var/macports/build/_opt_local_var_macports_sources_rsync.macports.org_macports_release_tarballs_ports_textproc_pdf2htmlex/pdf2htmlex/work/pdf2htmlEX-43e3174cbc/src/Preprocessor.h:34:42: error: use of undeclared identifier 'gTrue'; did you mean 'true'?
1476:info:build     virtual GBool useDrawChar() { return gTrue; }
1477:info:build                                          ^~~~~
1478:info:build                                          true
1479:info:build /opt/local/var/macports/build/_opt_local_var_macports_sources_rsync.macports.org_macports_release_tarballs_ports_textproc_pdf2htmlex/pdf2htmlex/work/pdf2htmlEX-43e3174cbc/src/Preprocessor.h:35:13: error: unknown type name 'GBool'
1480:info:build     virtual GBool interpretType3Chars() { return gFalse; }
1481:info:build             ^
1482:info:build /opt/local/var/macports/build/_opt_local_var_macports_sources_rsync.macports.org_macports_release_tarballs_ports_textproc_pdf2htmlex/pdf2htmlex/work/pdf2htmlEX-43e3174cbc/src/Preprocessor.h:35:50: error: use of undeclared identifier 'gFalse'; did you mean 'false'?
1483:info:build     virtual GBool interpretType3Chars() { return gFalse; }
1484:info:build                                                  ^~~~~~
1485:info:build                                                  false
1486:info:build /opt/local/var/macports/build/_opt_local_var_macports_sources_rsync.macports.org_macports_release_tarballs_ports_textproc_pdf2htmlex/pdf2htmlex/work/pdf2htmlEX-43e3174cbc/src/Preprocessor.h:36:13: error: unknown type name 'GBool'
1487:info:build     virtual GBool needNonText() { return gFalse; }
1488:info:build             ^
1489:info:build /opt/local/var/macports/build/_opt_local_var_macports_sources_rsync.macports.org_macports_release_tarballs_ports_textproc_pdf2htmlex/pdf2htmlex/work/pdf2htmlEX-43e3174cbc/src/Preprocessor.h:36:42: error: use of undeclared identifier 'gFalse'; did you mean 'false'?
1490:info:build     virtual GBool needNonText() { return gFalse; }
1491:info:build                                          ^~~~~~
1492:info:build                                          false
1493:info:build /opt/local/var/macports/build/_opt_local_var_macports_sources_rsync.macports.org_macports_release_tarballs_ports_textproc_pdf2htmlex/pdf2htmlex/work/pdf2htmlEX-43e3174cbc/src/Preprocessor.h:37:13: error: unknown type name 'GBool'
1494:info:build     virtual GBool needClipToCropBox() { return gTrue; }
1495:info:build             ^
1496:info:build /opt/local/var/macports/build/_opt_local_var_macports_sources_rsync.macports.org_macports_release_tarballs_ports_textproc_pdf2htmlex/pdf2htmlex/work/pdf2htmlEX-43e3174cbc/src/Preprocessor.h:37:48: error: use of undeclared identifier 'gTrue'; did you mean 'true'?
1497:info:build     virtual GBool needClipToCropBox() { return gTrue; }
1498:info:build                                                ^~~~~
1499:info:build                                                true
1500:info:build In file included from /opt/local/var/macports/build/_opt_local_var_macports_sources_rsync.macports.org_macports_release_tarballs_ports_textproc_pdf2htmlex/pdf2htmlex/work/pdf2htmlEX-43e3174cbc/src/HTMLRenderer/general.cc:18:
1501:info:build In file included from /opt/local/var/macports/build/_opt_local_var_macports_sources_rsync.macports.org_macports_release_tarballs_ports_textproc_pdf2htmlex/pdf2htmlex/work/pdf2htmlEX-43e3174cbc/src/HTMLRenderer/HTMLRenderer.h:27:
1502:info:build /opt/local/var/macports/build/_opt_local_var_macports_sources_rsync.macports.org_macports_release_tarballs_ports_textproc_pdf2htmlex/pdf2htmlex/work/pdf2htmlEX-43e3174cbc/src/StringFormatter.h:37:12: warning: class 'GuardedPointer' was previously declared as a struct [-Wmismatched-tags]
1503:info:build     friend class GuardedPointer;
1504:info:build            ^
1505:info:build /opt/local/var/macports/build/_opt_local_var_macports_sources_rsync.macports.org_macports_release_tarballs_ports_textproc_pdf2htmlex/pdf2htmlex/work/pdf2htmlEX-43e3174cbc/src/StringFormatter.h:19:12: note: previous use is here
1506:info:build     struct GuardedPointer
1507:info:build            ^
1508:info:build /opt/local/var/macports/build/_opt_local_var_macports_sources_rsync.macports.org_macports_release_tarballs_ports_textproc_pdf2htmlex/pdf2htmlex/work/pdf2htmlEX-43e3174cbc/src/StringFormatter.h:37:12: note: did you mean struct here?
1509:info:build     friend class GuardedPointer;
1510:info:build            ^~~~~
1511:info:build            struct
1512:info:build /opt/local/var/macports/build/_opt_local_var_macports_sources_rsync.macports.org_macports_release_tarballs_ports_textproc_pdf2htmlex/pdf2htmlex/work/pdf2htmlEX-43e3174cbc/src/Preprocessor.h:33:41: error: use of undeclared identifier 'gFalse'; did you mean 'false'?
1513:info:build     virtual GBool upsideDown() { return gFalse; }
1514:info:build                                         ^~~~~~
1515:info:build                                         false
1516:info:build /opt/local/var/macports/build/_opt_local_var_macports_sources_rsync.macports.org_macports_release_tarballs_ports_textproc_pdf2htmlex/pdf2htmlex/work/pdf2htmlEX-43e3174cbc/src/Preprocessor.h:34:42: error: use of undeclared identifier 'gTrue'; did you mean 'true'?
1517:info:build     virtual GBool useDrawChar() { return gTrue; }
1518:info:build                                          ^~~~~
1519:info:build                                          true
1520:info:build /opt/local/var/macports/build/_opt_local_var_macports_sources_rsync.macports.org_macports_release_tarballs_ports_textproc_pdf2htmlex/pdf2htmlex/work/pdf2htmlEX-43e3174cbc/src/Preprocessor.h:35:50: error: use of undeclared identifier 'gFalse'; did you mean 'false'?
1521:info:build     virtual GBool interpretType3Chars() { return gFalse; }
1522:info:build                                                  ^~~~~~
1523:info:build                                                  false
1524:info:build /opt/local/var/macports/build/_opt_local_var_macports_sources_rsync.macports.org_macports_release_tarballs_ports_textproc_pdf2htmlex/pdf2htmlex/work/pdf2htmlEX-43e3174cbc/src/Preprocessor.h:36:42: error: use of undeclared identifier 'gFalse'; did you mean 'false'?
1525:info:build     virtual GBool needNonText() { return gFalse; }
1526:info:build                                          ^~~~~~
1527:info:build                                          false
1528:info:build /opt/local/var/macports/build/_opt_local_var_macports_sources_rsync.macports.org_macports_release_tarballs_ports_textproc_pdf2htmlex/pdf2htmlex/work/pdf2htmlEX-43e3174cbc/src/Preprocessor.h:33:41: error: use of undeclared identifier 'gFalse'; did you mean 'false'?
1529:info:build     virtual GBool upsideDown() { return gFalse; }
1530:info:build                                         ^~~~~~
1531:info:build                                         false
1532:info:build /opt/local/var/macports/build/_opt_local_var_macports_sources_rsync.macports.org_macports_release_tarballs_ports_textproc_pdf2htmlex/pdf2htmlex/work/pdf2htmlEX-43e3174cbc/src/Preprocessor.h:37:48: error: use of undeclared identifier 'gTrue'; did you mean 'true'?
1533:info:build     virtual GBool needClipToCropBox() { return gTrue; }
1534:info:build                                                ^~~~~
1535:info:build                                                true
1536:info:build In file included from /opt/local/var/macports/build/_opt_local_var_macports_sources_rsync.macports.org_macports_release_tarballs_ports_textproc_pdf2htmlex/pdf2htmlex/work/pdf2htmlEX-43e3174cbc/src/pdf2htmlEX.cc:34:
1537:info:build In file included from /opt/local/var/macports/build/_opt_local_var_macports_sources_rsync.macports.org_macports_release_tarballs_ports_textproc_pdf2htmlex/pdf2htmlex/work/pdf2htmlEX-43e3174cbc/src/HTMLRenderer/HTMLRenderer.h:27:
1538:info:build /opt/local/var/macports/build/_opt_local_var_macports_sources_rsync.macports.org_macports_release_tarballs_ports_textproc_pdf2htmlex/pdf2htmlex/work/pdf2htmlEX-43e3174cbc/src/StringFormatter.h:37:12: warning: class 'GuardedPointer' was previously declared as a struct [-Wmismatched-tags]
1539:info:build     friend class GuardedPointer;
1540:info:build            ^
1541:info:build /opt/local/var/macports/build/_opt_local_var_macports_sources_rsync.macports.org_macports_release_tarballs_ports_textproc_pdf2htmlex/pdf2htmlex/work/pdf2htmlEX-43e3174cbc/src/StringFormatter.h:19:12: note: previous use is here
1542:info:build     struct GuardedPointer
1543:info:build            ^
1544:info:build /opt/local/var/macports/build/_opt_local_var_macports_sources_rsync.macports.org_macports_release_tarballs_ports_textproc_pdf2htmlex/pdf2htmlex/work/pdf2htmlEX-43e3174cbc/src/StringFormatter.h:37:12: note: did you mean struct here?
1545:info:build     friend class GuardedPointer;
1546:info:build            ^~~~~
1547:info:build            struct
1548:info:build /opt/local/var/macports/build/_opt_local_var_macports_sources_rsync.macports.org_macports_release_tarballs_ports_textproc_pdf2htmlex/pdf2htmlex/work/pdf2htmlEX-43e3174cbc/src/Preprocessor.h:34:42: error: use of undeclared identifier 'gTrue'; did you mean 'true'?
1549:info:build     virtual GBool useDrawChar() { return gTrue; }
1550:info:build                                          ^~~~~
1551:info:build                                          true
1552:info:build /opt/local/var/macports/build/_opt_local_var_macports_sources_rsync.macports.org_macports_release_tarballs_ports_textproc_pdf2htmlex/pdf2htmlex/work/pdf2htmlEX-43e3174cbc/src/Preprocessor.h:35:50: error: use of undeclared identifier 'gFalse'; did you mean 'false'?
1553:info:build     virtual GBool interpretType3Chars() { return gFalse; }
1554:info:build                                                  ^~~~~~
1555:info:build                                                  false
1556:info:build /opt/local/var/macports/build/_opt_local_var_macports_sources_rsync.macports.org_macports_release_tarballs_ports_textproc_pdf2htmlex/pdf2htmlex/work/pdf2htmlEX-43e3174cbc/src/Preprocessor.h:36:42: error: use of undeclared identifier 'gFalse'; did you mean 'false'?
1557:info:build     virtual GBool needNonText() { return gFalse; }
1558:info:build                                          ^~~~~~
1559:info:build                                          false
1560:info:build /opt/local/var/macports/build/_opt_local_var_macports_sources_rsync.macports.org_macports_release_tarballs_ports_textproc_pdf2htmlex/pdf2htmlex/work/pdf2htmlEX-43e3174cbc/src/Preprocessor.h:37:48: error: use of undeclared identifier 'gTrue'; did you mean 'true'?
1561:info:build     virtual GBool needClipToCropBox() { return gTrue; }
1562:info:build                                                ^~~~~
1563:info:build                                                true
1564:info:build In file included from /opt/local/var/macports/build/_opt_local_var_macports_sources_rsync.macports.org_macports_release_tarballs_ports_textproc_pdf2htmlex/pdf2htmlex/work/pdf2htmlEX-43e3174cbc/src/HTMLRenderer/font.cc:21:
1565:info:build In file included from /opt/local/var/macports/build/_opt_local_var_macports_sources_rsync.macports.org_macports_release_tarballs_ports_textproc_pdf2htmlex/pdf2htmlex/work/pdf2htmlEX-43e3174cbc/src/HTMLRenderer/HTMLRenderer.h:27:
1566:info:build /opt/local/var/macports/build/_opt_local_var_macports_sources_rsync.macports.org_macports_release_tarballs_ports_textproc_pdf2htmlex/pdf2htmlex/work/pdf2htmlEX-43e3174cbc/src/StringFormatter.h:37:12: warning: class 'GuardedPointer' was previously declared as a struct [-Wmismatched-tags]
1567:info:build     friend class GuardedPointer;
1568:info:build            ^
1569:info:build /opt/local/var/macports/build/_opt_local_var_macports_sources_rsync.macports.org_macports_release_tarballs_ports_textproc_pdf2htmlex/pdf2htmlex/work/pdf2htmlEX-43e3174cbc/src/StringFormatter.h:19:12: note: previous use is here
1570:info:build     struct GuardedPointer
1571:info:build            ^
1572:info:build /opt/local/var/macports/build/_opt_local_var_macports_sources_rsync.macports.org_macports_release_tarballs_ports_textproc_pdf2htmlex/pdf2htmlex/work/pdf2htmlEX-43e3174cbc/src/StringFormatter.h:37:12: note: did you mean struct here?
1573:info:build     friend class GuardedPointer;
1574:info:build            ^~~~~
1575:info:build            struct
1576:info:build In file included from /opt/local/var/macports/build/_opt_local_var_macports_sources_rsync.macports.org_macports_release_tarballs_ports_textproc_pdf2htmlex/pdf2htmlex/work/pdf2htmlEX-43e3174cbc/src/HTMLRenderer/outline.cc:15:
1577:info:build In file included from /opt/local/var/macports/build/_opt_local_var_macports_sources_rsync.macports.org_macports_release_tarballs_ports_textproc_pdf2htmlex/pdf2htmlex/work/pdf2htmlEX-43e3174cbc/src/HTMLRenderer/HTMLRenderer.h:33:
1578:info:build /opt/local/var/macports/build/_opt_local_var_macports_sources_rsync.macports.org_macports_release_tarballs_ports_textproc_pdf2htmlex/pdf2htmlex/work/pdf2htmlEX-43e3174cbc/src/BackgroundRenderer/BackgroundRenderer.h:18:1: warning: class 'Param' was previously declared as a struct [-Wmismatched-tags]
1579:info:build class Param;
1580:info:build ^
1581:info:build /opt/local/var/macports/build/_opt_local_var_macports_sources_rsync.macports.org_macports_release_tarballs_ports_textproc_pdf2htmlex/pdf2htmlex/work/pdf2htmlEX-43e3174cbc/src/Param.h:16:8: note: previous use is here
1582:info:build struct Param
1583:info:build        ^
1584:info:build /opt/local/var/macports/build/_opt_local_var_macports_sources_rsync.macports.org_macports_release_tarballs_ports_textproc_pdf2htmlex/pdf2htmlex/work/pdf2htmlEX-43e3174cbc/src/BackgroundRenderer/BackgroundRenderer.h:18:1: note: did you mean struct here?
1585:info:build class Param;
1586:info:build ^~~~~
1587:info:build struct
1588:info:build In file included from /opt/local/var/macports/build/_opt_local_var_macports_sources_rsync.macports.org_macports_release_tarballs_ports_textproc_pdf2htmlex/pdf2htmlex/work/pdf2htmlEX-43e3174cbc/src/HTMLRenderer/draw.cc:16:
1589:info:build In file included from /opt/local/var/macports/build/_opt_local_var_macports_sources_rsync.macports.org_macports_release_tarballs_ports_textproc_pdf2htmlex/pdf2htmlex/work/pdf2htmlEX-43e3174cbc/src/HTMLRenderer/HTMLRenderer.h:33:
1590:info:build /opt/local/var/macports/build/_opt_local_var_macports_sources_rsync.macports.org_macports_release_tarballs_ports_textproc_pdf2htmlex/pdf2htmlex/work/pdf2htmlEX-43e3174cbc/src/BackgroundRenderer/BackgroundRenderer.h:18:1: warning: class 'Param' was previously declared as a struct [-Wmismatched-tags]
1591:info:build class Param;
1592:info:build ^
1593:info:build /opt/local/var/macports/build/_opt_local_var_macports_sources_rsync.macports.org_macports_release_tarballs_ports_textproc_pdf2htmlex/pdf2htmlex/work/pdf2htmlEX-43e3174cbc/src/Param.h:16:8: note: previous use is here
1594:info:build struct Param
1595:info:build        ^
1596:info:build /opt/local/var/macports/build/_opt_local_var_macports_sources_rsync.macports.org_macports_release_tarballs_ports_textproc_pdf2htmlex/pdf2htmlex/work/pdf2htmlEX-43e3174cbc/src/BackgroundRenderer/BackgroundRenderer.h:18:1: note: did you mean struct here?
1597:info:build class Param;
1598:info:build ^~~~~
1599:info:build struct
1600:info:build In file included from /opt/local/var/macports/build/_opt_local_var_macports_sources_rsync.macports.org_macports_release_tarballs_ports_textproc_pdf2htmlex/pdf2htmlex/work/pdf2htmlEX-43e3174cbc/src/HTMLRenderer/image.cc:10:
1601:info:build In file included from /opt/local/var/macports/build/_opt_local_var_macports_sources_rsync.macports.org_macports_release_tarballs_ports_textproc_pdf2htmlex/pdf2htmlex/work/pdf2htmlEX-43e3174cbc/src/HTMLRenderer/HTMLRenderer.h:33:
1602:info:build /opt/local/var/macports/build/_opt_local_var_macports_sources_rsync.macports.org_macports_release_tarballs_ports_textproc_pdf2htmlex/pdf2htmlex/work/pdf2htmlEX-43e3174cbc/src/BackgroundRenderer/BackgroundRenderer.h:18:1: warning: class 'Param' was previously declared as a struct [-Wmismatched-tags]
1603:info:build class Param;
1604:info:build ^
1605:info:build /opt/local/var/macports/build/_opt_local_var_macports_sources_rsync.macports.org_macports_release_tarballs_ports_textproc_pdf2htmlex/pdf2htmlex/work/pdf2htmlEX-43e3174cbc/src/Param.h:16:In file included from /opt/local/var/macports/build/_opt_local_var_macports_sources_rsync.macports.org_macports_release_tarballs_ports_textproc_pdf2htmlex/pdf2htmlex/work/pdf2htmlEX-43e3174cbc/src/HTMLRenderer/outline.cc:8: 15:
1606:info:build /opt/local/var/macports/build/_opt_local_var_macports_sources_rsync.macports.org_macports_release_tarballs_ports_textproc_pdf2htmlex/pdf2htmlex/work/pdf2htmlEX-43e3174cbc/src/HTMLRenderer/HTMLRenderer.h:54:13: error: unknown type name 'GBool'
1607:info:build     virtual GBool upsideDown() { return gFalse; }
1608:info:build             ^
1609:info:build note: In file included from /opt/local/var/macports/build/_opt_local_var_macports_sources_rsync.macports.org_macports_release_tarballs_ports_textproc_pdf2htmlex/pdf2htmlex/work/pdf2htmlEX-43e3174cbc/src/HTMLRenderer/text.cc:12:
1610:info:build In file included from /opt/local/var/macports/build/_opt_local_var_macports_sources_rsync.macports.org_macports_release_tarballs_ports_textproc_pdf2htmlex/pdf2htmlex/work/pdf2htmlEX-43e3174cbc/src/HTMLRenderer/HTMLRenderer.h:33:
1611:info:build /opt/local/var/macports/build/_opt_local_var_macports_sources_rsync.macports.org_macports_release_tarballs_ports_textproc_pdf2htmlex/pdf2htmlex/work/pdf2htmlEX-43e3174cbc/src/BackgroundRenderer/BackgroundRenderer.h:18:1: warning: class 'Param' was previously declared as a struct [-Wmismatched-tags]
1612:info:build class Param;
1613:info:build ^
1614:info:build /opt/local/var/macports/build/_opt_local_var_macports_sources_rsync.macports.org_macports_release_tarballs_ports_textproc_pdf2htmlex/pdf2htmlex/work/pdf2htmlEX-43e3174cbc/src/Param.h:16:8: noteIn file included from /opt/local/var/macports/build/_opt_local_var_macports_sources_rsync.macports.org_macports_release_tarballs_ports_textproc_pdf2htmlex/pdf2htmlex/work/pdf2htmlEX-43e3174cbc/src/HTMLRenderer/draw.cc:16:
1615:info:build /opt/local/var/macports/build/_opt_local_var_macports_sources_rsync.macports.org_macports_release_tarballs_ports_textproc_pdf2htmlex/pdf2htmlex/work/pdf2htmlEX-43e3174cbc/src/HTMLRenderer/HTMLRenderer.h:: previous use is here
1616:info:build struct Param
1617:info:build        ^
1618:info:build /opt/local/var/macports/build/_opt_local_var_macports_sources_rsync.macports.org_macports_release_tarballs_ports_textproc_pdf2htmlex/pdf2htmlex/work/pdf2htmlEX-43e3174cbc/src/BackgroundRenderer/BackgroundRenderer.h:18:1: note: did you mean struct here?
1619:info:build class Param;
1620:info:build ^~~~~
1621:info:build struct
1622:info:build previous use is here
1623:info:build struct Param
1624:info:build        ^
1625:info:build /opt/local/var/macports/build/_opt_local_var_macports_sources_rsync.macports.org_macports_release_tarballs_ports_textproc_pdf2htmlex/pdf2htmlex/work/pdf2htmlEX-43e3174cbc/src/BackgroundRenderer/BackgroundRenderer.h:18:1: note: did you mean struct here?
1626:info:build class Param;
1627:info:build ^~~~~
1628:info:build struct
1629:info:build 54In file included from /opt/local/var/macports/build/_opt_local_var_macports_sources_rsync.macports.org_macports_release_tarballs_ports_textproc_pdf2htmlex/pdf2htmlex/work/pdf2htmlEX-43e3174cbc/src/HTMLRenderer/state.cc:12:13: error: unknown type name 'GBool'
1630:info:build     virtual GBool upsideDown() { return gFalse; }
1631:info:build             ^
1632:info:build :
1633:info:build In file included from /opt/local/var/macports/build/_opt_local_var_macports_sources_rsync.macports.org_macports_release_tarballs_ports_textproc_pdf2htmlex/pdf2htmlex/work/pdf2htmlEX-43e3174cbc/src/HTMLRenderer/HTMLRenderer.h:33:
1634:info:build /opt/local/var/macports/build/_opt_local_var_macports_sources_rsync.macports.org_macports_release_tarballs_ports_textproc_pdf2htmlex/pdf2htmlex/work/pdf2htmlEX-43e3174cbc/src/BackgroundRenderer/BackgroundRenderer.h:18:1: warning: class 'Param' was previously declared as a struct [-Wmismatched-tags]
1635:info:build class Param;
1636:info:build ^
1637:info:build /opt/local/var/macports/build/_opt_local_var_macports_sources_rsync.macports.org_macports_release_tarballs_ports_textproc_pdf2htmlex/pdf2htmlex/work/pdf2htmlEX-43e3174cbc/src/Param.h:16:8: note: previous use is here
1638:info:build struct Param
1639:info:build        ^
1640:info:build /opt/local/var/macports/build/_opt_local_var_macports_sources_rsync.macports.org_macports_release_tarballs_ports_textproc_pdf2htmlex/pdf2htmlex/work/pdf2htmlEX-43e3174cbc/src/BackgroundRenderer/BackgroundRenderer.h:18:1: note: did you mean struct here?
1641:info:build class Param;
1642:info:build ^~~~~
1643:info:build struct
1644:info:build In file included from /opt/local/var/macports/build/_opt_local_var_macports_sources_rsync.macports.org_macports_release_tarballs_ports_textproc_pdf2htmlex/pdf2htmlex/work/pdf2htmlEX-43e3174cbc/src/BackgroundRenderer/BackgroundRenderer.cc:10:
1645:info:build In file included from /opt/local/var/macports/build/_opt_local_var_macports_sources_rsync.macports.org_macports_release_tarballs_ports_textproc_pdf2htmlex/pdf2htmlex/work/pdf2htmlEX-43e3174cbc/src/HTMLRenderer/HTMLRenderer.h/opt/local/var/macports/build/_opt_local_var_macports_sources_rsync.macports.org_macports_release_tarballs_ports_textproc_pdf2htmlex/pdf2htmlex/work/pdf2htmlEX-43e3174cbc/src/HTMLRenderer/HTMLRenderer.h:57:13:33:
1646:info:build /opt/local/var/macports/build/_opt_local_var_macports_sources_rsync.macports.org_macports_release_tarballs_ports_textproc_pdf2htmlex/pdf2htmlex/work/pdf2htmlEX-43e3174cbc/src/BackgroundRenderer/BackgroundRenderer.h:18:1: warning: class 'Param' was previously declared as a struct [-Wmismatched-tags]
1647:info:build class Param;
1648:info:build ^
1649:info:build /opt/local/var/macports/build/_opt_local_var_macports_sources_rsync.macports.org_macports_release_tarballs_ports_textproc_pdf2htmlex/pdf2htmlex/work/pdf2htmlEX-43e3174cbc/src/Param.h:16:8: note: previous use is here
1650:info:build struct Param
1651:info:build        ^
1652:info:build /opt/local/var/macports/build/_opt_local_var_macports_sources_rsync.macports.org_macports_release_tarballs_ports_textproc_pdf2htmlex/pdf2htmlex/work/pdf2htmlEX-43e3174cbc/src/BackgroundRenderer/BackgroundRenderer.h:18:1: note: did you mean struct here?
1653:info:build class Param;
1654:info:build ^~~~~
1655:info:build struct
1656:info:build In file included from /opt/local/var/macports/build/_opt_local_var_macports_sources_rsync.macports.org_macports_release_tarballs_ports_textproc_pdf2htmlex/pdf2htmlex/work/pdf2htmlEX-43e3174cbc/src/HTMLRenderer/image.cc:10:
1657:info:build : error: unknown type name 'GBool'
1658:info:build     virtual GBool useDrawChar() { return gFalse; }
1659:info:build             ^
1660:info:build /opt/local/var/macports/build/_opt_local_var_macports_sources_rsync.macports.org_macports_release_tarballs_ports_textproc_pdf2htmlex/pdf2htmlex/work/pdf2htmlEX-43e3174cbc/src/HTMLRenderer/HTMLRenderer.h:54:13:In file included from /opt/local/var/macports/build/_opt_local_var_macports_sources_rsync.macports.org_macports_release_tarballs_ports_textproc_pdf2htmlex/pdf2htmlex/work/pdf2htmlEX-43e3174cbc/src/HTMLRenderer/text.cc:/opt/local/var/macports/build/_opt_local_var_macports_sources_rsync.macports.org_macports_release_tarballs_ports_textproc_pdf2htmlex/pdf2htmlex/work/pdf2htmlEX-43e3174cbc/src/HTMLRenderer/HTMLRenderer.h:57: error: 13: error: unknown type name 'GBool'
1661:info:build unknown type name 'GBool'    virtual GBool useDrawChar() { return gFalse; }
1662:info:build             ^
1663:info:build     virtual GBool upsideDown() { return gFalse; }
1664:info:build             ^12:
1665:info:build /opt/local/var/macports/build/_opt_local_var_macports_sources_rsync.macports.org_macports_release_tarballs_ports_textproc_pdf2htmlex/pdf2htmlex/work/pdf2htmlEX-43e3174cbc/src/HTMLRenderer/HTMLRenderer.h:54:13: error: unknown type name 'GBool'
1666:info:build     virtual GBool upsideDown() { return gFalse; }
1667:info:build             ^
1668:info:build In file included from /opt/local/var/macports/build/_opt_local_var_macports_sources_rsync.macports.org_macports_release_tarballs_ports_textproc_pdf2htmlex/pdf2htmlex/work/pdf2htmlEX-43e3174cbc/src/HTMLRenderer/state.cc:12:
1669:info:build /opt/local/var/macports/build/_opt_local_var_macports_sources_rsync.macports.org_macports_release_tarballs_ports_textproc_pdf2htmlex/pdf2htmlex/work/pdf2htmlEX-43e3174cbc/src/HTMLRenderer/HTMLRenderer.h:54:13: error: unknown type name 'GBool'
1670:info:build     virtual GBool upsideDown() { return gFalse; }
1671:info:build             ^
1672:info:build /opt/local/var/macports/build/_opt_local_var_macports_sources_rsync.macports.org_macports_release_tarballs_ports_textproc_pdf2htmlex/pdf2htmlex/work/pdf2htmlEX-43e3174cbc/src/HTMLRenderer/HTMLRenderer.h:62:13: error: unknown type name 'GBool'
1673:info:build     virtual GBool useShadedFills(int type) { return (type == 2) ? gTrue: gFalse; }
1674:info:build             ^
1675:info:build /opt/local/var/macports/build/_opt_local_var_macports_sources_rsync.macports.org_macports_release_tarballs_ports_textproc_pdf2htmlex/pdf2htmlex/work/pdf2htmlEX-43e3174cbc/src/HTMLRenderer/HTMLRenderer.h:62:/opt/local/var/macports/build/_opt_local_var_macports_sources_rsync.macports.org_macports_release_tarballs_ports_textproc_pdf2htmlex/pdf2htmlex/work/pdf2htmlEX-43e3174cbc/src/HTMLRenderer/HTMLRenderer.h:57:13: error: unknown type name 'GBool'
1676:info:build     virtual GBool useDrawChar() { return gFalse; }
1677:info:build             ^
1678:info:build In file included from /opt/local/var/macports/build/_opt_local_var_macports_sources_rsync.macports.org_macports_release_tarballs_ports_textproc_pdf2htmlex/pdf2htmlex/work/pdf2htmlEX-43e3174cbc/src/BackgroundRenderer/BackgroundRenderer.cc:10:
1679:info:build 13: error: unknown type name 'GBool'
1680:info:build     virtual GBool useShadedFills(int type) { return (type == 2) ? gTrue: gFalse; }
1681:info:build             ^/opt/local/var/macports/build/_opt_local_var_macports_sources_rsync.macports.org_macports_release_tarballs_ports_textproc_pdf2htmlex/pdf2htmlex/work/pdf2htmlEX-43e3174cbc/src/HTMLRenderer/HTMLRenderer.h:54:13: error: unknown type name 'GBool'
1682:info:build     virtual GBool upsideDown() { return gFalse; }
1683:info:build             ^
1684:info:build /opt/local/var/macports/build/_opt_local_var_macports_sources_rsync.macports.org_macports_release_tarballs_ports_textproc_pdf2htmlex/pdf2htmlex/work/pdf2htmlEX-43e3174cbc/src/HTMLRenderer/HTMLRenderer.h:57:13: error: unknown type name 'GBool'
1685:info:build     virtual GBool useDrawChar() { return gFalse; }
1686:info:build             ^
1687:info:build /opt/local/var/macports/build/_opt_local_var_macports_sources_rsync.macports.org_macports_release_tarballs_ports_textproc_pdf2htmlex/pdf2htmlex/work/pdf2htmlEX-43e3174cbc/src/HTMLRenderer/HTMLRenderer.h:66:13: error: unknown type name 'GBool'
1688:info:build     virtual GBool interpretType3Chars() { return gFalse; }
1689:info:build             ^
1690:info:build /opt/local/var/macports/build/_opt_local_var_macports_sources_rsync.macports.org_macports_release_tarballs_ports_textproc_pdf2htmlex/pdf2htmlex/work/pdf2htmlEX-43e3174cbc/src/HTMLRenderer/HTMLRenderer.h:57:13In file included from /opt/local/var/macports/build/_opt_local_var_macports_sources_rsync.macports.org_macports_release_tarballs_ports_textproc_pdf2htmlex/pdf2htmlex/work/pdf2htmlEX-43e3174cbc/src/HTMLRenderer/link.cc:16: error:
1691:info:build In file included from /opt/local/var/macports/build/_opt_local_var_macports_sources_rsync.macports.org_macports_release_tarballs_ports_textproc_pdf2htmlex/pdf2htmlex/work/pdf2htmlEX-43e3174cbc/src/HTMLRenderer/HTMLRenderer.h:33:
1692:info:build /opt/local/var/macports/build/_opt_local_var_macports_sources_rsync.macports.org_macports_release_tarballs_ports_textproc_pdf2htmlex/pdf2htmlex/work/pdf2htmlEX-43e3174cbc/src/BackgroundRenderer/BackgroundRenderer.h:18:1: warning: class 'Param' was previously declared as a struct [-Wmismatched-tags]
1693:info:build class Param;
1694:info:build ^
1695:info:build /opt/local/var/macports/build/_opt_local_var_macports_sources_rsync.macports.org_macports_release_tarballs_ports_textproc_pdf2htmlex/pdf2htmlex/work/pdf2htmlEX-43e3174cbc/src/Param.h:16: unknown type name 'GBool'
1696:info:build     virtual GBool useDrawChar() { return gFalse; }
1697:info:build             ^
1698:info:build :8: note: previous use is here
1699:info:build struct Param
1700:info:build        ^
1701:info:build /opt/local/var/macports/build/_opt_local_var_macports_sources_rsync.macports.org_macports_release_tarballs_ports_textproc_pdf2htmlex/pdf2htmlex/work/pdf2htmlEX-43e3174cbc/src/BackgroundRenderer/BackgroundRenderer.h:18:1: note: did you mean struct here?
1702:info:build class Param;
1703:info:build ^~~~~
1704:info:build struct
1705:info:build /opt/local/var/macports/build/_opt_local_var_macports_sources_rsync.macports.org_macports_release_tarballs_ports_textproc_pdf2htmlex/pdf2htmlex/work/pdf2htmlEX-43e3174cbc/src/HTMLRenderer/HTMLRenderer.h:57:13: error: unknown type name 'GBool'
1706:info:build     virtual GBool useDrawChar() { return gFalse; }
1707:info:build             ^
1708:info:build /opt/local/var/macports/build/_opt_local_var_macports_sources_rsync.macports.org_macports_release_tarballs_ports_textproc_pdf2htmlex/pdf2htmlex/work/pdf2htmlEX-43e3174cbc/src/HTMLRenderer/HTMLRenderer.h:66:/opt/local/var/macports/build/_opt_local_var_macports_sources_rsync.macports.org_macports_release_tarballs_ports_textproc_pdf2htmlex/pdf2htmlex/work/pdf2htmlEX-43e3174cbc/src/HTMLRenderer/HTMLRenderer.h:62/opt/local/var/macports/build/_opt_local_var_macports_sources_rsync.macports.org_macports_release_tarballs_ports_textproc_pdf2htmlex/pdf2htmlex/work/pdf2htmlEX-43e3174cbc/src/HTMLRenderer/HTMLRenderer.h:62:1313: error: unknown type name 'GBool'
1709:info:build     virtual GBool useShadedFills(int type) { return (type == 2) ? gTrue: gFalse; }
1710:info:build             ^
1711:info:build : error: unknown type name 'GBool'
1712:info:build     virtual GBool interpretType3Chars() { return gFalse; }
1713:info:build             ^
1714:info:build :13: error: unknown type name 'GBool'
1715:info:build     virtual GBool useShadedFills(int type) { return (type == 2) ? gTrue: gFalse; }
1716:info:build             ^
1717:info:build /opt/local/var/macports/build/_opt_local_var_macports_sources_rsync.macports.org_macports_release_tarballs_ports_textproc_pdf2htmlex/pdf2htmlex/work/pdf2htmlEX-43e3174cbc/src/HTMLRenderer/HTMLRenderer.h:69:13: error: unknown type name 'GBool'
1718:info:build     virtual GBool needNonText() { return (param.process_nontext) ? gTrue: gFalse; }
1719:info:build             ^
1720:info:build /opt/local/var/macports/build/_opt_local_var_macports_sources_rsync.macports.org_macports_release_tarballs_ports_textproc_pdf2htmlex/pdf2htmlex/work/pdf2htmlEX-43e3174cbc/src/HTMLRenderer/HTMLRenderer.h:62:13: /opt/local/var/macports/build/_opt_local_var_macports_sources_rsync.macports.org_macports_release_tarballs_ports_textproc_pdf2htmlex/pdf2htmlex/work/pdf2htmlEX-43e3174cbc/src/HTMLRenderer/HTMLRenderer.h:62:13: error: In file included from /opt/local/var/macports/build/_opt_local_var_macports_sources_rsync.macports.org_macports_release_tarballs_ports_textproc_pdf2htmlex/pdf2htmlex/work/pdf2htmlEX-43e3174cbc/src/HTMLRenderer/link.cc:16:
1721:info:build /opt/local/var/macports/build/_opt_local_var_macports_sources_rsync.macports.org_macports_release_tarballs_ports_textproc_pdf2htmlex/pdf2htmlex/work/pdf2htmlEX-43e3174cbc/src/HTMLRenderer/HTMLRenderer.h:54:13unknown type name 'GBool':
1722:info:build  error: unknown type name 'GBool'
1723:info:build     virtual GBool upsideDown() { return gFalse; }
1724:info:build             ^
1725:info:build     virtual GBool useShadedFills(int type) { return (type == 2) ? gTrue: gFalse; }
1726:info:build             ^
1727:info:build /opt/local/var/macports/build/_opt_local_var_macports_sources_rsync.macports.org_macports_release_tarballs_ports_textproc_pdf2htmlex/pdf2htmlex/work/pdf2htmlEX-43e3174cbc/src/HTMLRenderer/HTMLRenderer.h:69:13: error: unknown type name 'GBool'
1728:info:build     virtual GBool needNonText() { return (param.process_nontext) ? gTrue: gFalse; }
1729:info:build             ^
1730:info:build /opt/local/var/macports/build/_opt_local_var_macports_sources_rsync.macports.org_macports_release_tarballs_ports_textproc_pdf2htmlex/pdf2htmlex/work/pdf2htmlEX-43e3174cbc/src/HTMLRenderer/HTMLRenderer.h:66:13: error: unknown type name 'GBool'
1731:info:build     virtual GBool interpretType3Chars() { return gFalse; }
1732:info:build             ^
1733:info:build error: unknown type name 'GBool'
1734:info:build     virtual GBool useShadedFills(int type) { return (type == 2) ? gTrue: gFalse; }
1735:info:build             ^/opt/local/var/macports/build/_opt_local_var_macports_sources_rsync.macports.org_macports_release_tarballs_ports_textproc_pdf2htmlex/pdf2htmlex/work/pdf2htmlEX-43e3174cbc/src/HTMLRenderer/HTMLRenderer.h:73:13: error:
1736:info:build unknown type name 'GBool'
1737:info:build     virtual GBool needClipToCropBox() { return gTrue; }
1738:info:build             ^
1739:info:build /opt/local/var/macports/build/_opt_local_var_macports_sources_rsync.macports.org_macports_release_tarballs_ports_textproc_pdf2htmlex/pdf2htmlex/work/pdf2htmlEX-43e3174cbc/src/HTMLRenderer/HTMLRenderer.h:66:13: error: unknown type name 'GBool'
1740:info:build     virtual GBool interpretType3Chars() { return gFalse; }
1741:info:build             ^
1742:info:build /opt/local/var/macports/build/_opt_local_var_macports_sources_rsync.macports.org_macports_release_tarballs_ports_textproc_pdf2htmlex/pdf2htmlex/work/pdf2htmlEX-43e3174cbc/src/HTMLRenderer/HTMLRenderer.h:66:13: error: unknown type name 'GBool'
1743:info:build     virtual GBool interpretType3Chars() { return gFalse; }
1744:info:build             ^
1745:info:build /opt/local/var/macports/build/_opt_local_var_macports_sources_rsync.macports.org_macports_release_tarballs_ports_textproc_pdf2htmlex/pdf2htmlex/work/pdf2htmlEX-43e3174cbc/src/HTMLRenderer/HTMLRenderer.h:57:13:/opt/local/var/macports/build/_opt_local_var_macports_sources_rsync.macports.org_macports_release_tarballs_ports_textproc_pdf2htmlex/pdf2htmlex/work/pdf2htmlEX-43e3174cbc/src/HTMLRenderer/HTMLRenderer.h:73: 13: error: unknown type name 'GBool'
1746:info:build error: unknown type name 'GBool'
1747:info:build     virtual GBool needClipToCropBox() { return gTrue; }
1748:info:build             ^
1749:info:build     virtual GBool useDrawChar() { return gFalse; }
1750:info:build             ^
1751:info:build /opt/local/var/macports/build/_opt_local_var_macports_sources_rsync.macports.org_macports_release_tarballs_ports_textproc_pdf2htmlex/pdf2htmlex/work/pdf2htmlEX-43e3174cbc/src/HTMLRenderer/HTMLRenderer.h:66:13: error: unknown type name 'GBool'
1752:info:build     virtual GBool interpretType3Chars() { return gFalse; }
1753:info:build             ^
1754:info:build /opt/local/var/macports/build/_opt_local_var_macports_sources_rsync.macports.org_macports_release_tarballs_ports_textproc_pdf2htmlex/pdf2htmlex/work/pdf2htmlEX-43e3174cbc/src/HTMLRenderer/HTMLRenderer.h:69:13: error: unknown type name 'GBool'
1755:info:build     virtual GBool needNonText() { return (param.process_nontext) ? gTrue: gFalse; }
1756:info:build             ^
1757:info:build /opt/local/var/macports/build/_opt_local_var_macports_sources_rsync.macports.org_macports_release_tarballs_ports_textproc_pdf2htmlex/pdf2htmlex/work/pdf2htmlEX-43e3174cbc/src/HTMLRenderer/HTMLRenderer.h:69:13: error: unknown type name 'GBool'
1758:info:build     virtual GBool needNonText() { return (param.process_nontext) ? gTrue: gFalse; }
1759:info:build             ^
1760:info:build In file included from /opt/local/var/macports/build/_opt_local_var_macports_sources_rsync.macports.org_macports_release_tarballs_ports_textproc_pdf2htmlex/pdf2htmlex/work/pdf2htmlEX-43e3174cbc/src/HTMLRenderer/general.cc:18:
1761:info:build /opt/local/var/macports/build/_opt_local_var_macports_sources_rsync.macports.org_macports_release_tarballs_ports_textproc_pdf2htmlex/pdf2htmlex/work/pdf2htmlEX-43e3174cbc/src/HTMLRenderer/HTMLRenderer.h:126:126In file included from /opt/local/var/macports/build/_opt_local_var_macports_sources_rsync.macports.org_macports_release_tarballs_ports_textproc_pdf2htmlex/pdf2htmlex/work/pdf2htmlEX-43e3174cbc/src/HTMLRenderer/HTMLRenderer.h:33:
1762:info:build /opt/local/var/macports/build/_opt_local_var_macports_sources_rsync.macports.org_macports_release_tarballs_ports_textproc_pdf2htmlex/pdf2htmlex/work/pdf2htmlEX-43e3174cbc/src/BackgroundRenderer/BackgroundRenderer.h:18:1: warning: class 'Param' was previously declared as a struct [-Wmismatched-tags]
1763:info:build class Param;
1764:info:build ^
1765:info:build /opt/local/var/macports/build/_opt_local_var_macports_sources_rsync.macports.org_macports_release_tarballs_ports_textproc_pdf2htmlex/pdf2htmlex/work/pdf2htmlEX-43e3174cbc/src/Param.h:16:8: note: previous use is here
1766:info:build struct Param
1767:info:build        ^
1768:info:build /opt/local/var/macports/build/_opt_local_var_macports_sources_rsync.macports.org_macports_release_tarballs_ports_textproc_pdf2htmlex/pdf2htmlex/work/pdf2htmlEX-43e3174cbc/src/BackgroundRenderer/BackgroundRenderer.h:18:1: note: did you mean struct here?
1769:info:build class Param;
1770:info:build ^~~~~
1771:info:build struct
1772:info:build : error: unknown type name 'GBool'
1773:info:build     virtual void drawImage(GfxState * state, Object * ref, Stream * str, int width, int height, GfxImageColorMap * colorMap, GBool interpolate, int *maskColors, GBool inlineImg);
1774:info:build                                                                                                                              ^
1775:info:build /opt/local/var/macports/build/_opt_local_var_macports_sources_rsync.macports.org_macports_release_tarballs_ports_textproc_pdf2htmlex/pdf2htmlex/work/pdf2htmlEX-43e3174cbc/src/HTMLRenderer/HTMLRenderer.h/opt/local/var/macports/build/_opt_local_var_macports_sources_rsync.macports.org_macports_release_tarballs_ports_textproc_pdf2htmlex/pdf2htmlex/work/pdf2htmlEX-43e3174cbc/src/HTMLRenderer/HTMLRenderer.h::69:6213:: error: unknown type name 'GBool'
1776:info:build 13: error: unknown type name 'GBool'
1777:info:build     virtual GBool needNonText() { return (param.process_nontext) ? gTrue: gFalse; }
1778:info:build             ^
1779:info:build     virtual GBool useShadedFills(int type) { return (type == 2) ? gTrue: gFalse; }
1780:info:build             ^
1781:info:build /opt/local/var/macports/build/_opt_local_var_macports_sources_rsync.macports.org_macports_release_tarballs_ports_textproc_pdf2htmlex/pdf2htmlex/work/pdf2htmlEX-43e3174cbc/src/HTMLRenderer/HTMLRenderer.h:69:13: error: unknown type name 'GBool'
1782:info:build     virtual GBool needNonText() { return (param.process_nontext) ? gTrue: gFalse; }
1783:info:build             ^
1784:info:build /opt/local/var/macports/build/_opt_local_var_macports_sources_rsync.macports.org_macports_release_tarballs_ports_textproc_pdf2htmlex/pdf2htmlex/work/pdf2htmlEX-43e3174cbc/src/HTMLRenderer/HTMLRenderer.h:126:126: error: unknown type name 'GBool'
1785:info:build     virtual void drawImage(GfxState * state, Object * ref, Stream * str, int width, int height, GfxImageColorMap * colorMap, GBool interpolate, int *maskColors, GBool inlineImg);
1786:info:build                                                                                                                              ^
1787:info:build /opt/local/var/macports/build/_opt_local_var_macports_sources_rsync.macports.org_macports_release_tarballs_ports_textproc_pdf2htmlex/pdf2htmlex/work/pdf2htmlEX-43e3174cbc/src/HTMLRenderer/HTMLRenderer.h:73:13: error: unknown type name 'GBool'
1788:info:build     virtual GBool needClipToCropBox() { return gTrue; }
1789:info:build             ^
1790:info:build /opt/local/var/macports/build/_opt_local_var_macports_sources_rsync.macports.org_macports_release_tarballs_ports_textproc_pdf2htmlex/pdf2htmlex/work/pdf2htmlEX-43e3174cbc/src/HTMLRenderer/HTMLRenderer.h:73:13: error: unknown type name 'GBool'
1791:info:build     virtual GBool needClipToCropBox() { return gTrue; }
1792:info:build             ^
1793:info:build /opt/local/var/macports/build/_opt_local_var_macports_sources_rsync.macports.org_macports_release_tarballs_ports_textproc_pdf2htmlex/pdf2htmlex/work/pdf2htmlEX-43e3174cbc/src/HTMLRenderer/HTMLRenderer.h:73:13: error: unknown type name 'GBool'
1794:info:build     virtual GBool needClipToCropBox() { return gTrue; }
1795:info:build             ^
1796:info:build /opt/local/var/macports/build/_opt_local_var_macports_sources_rsync.macports.org_macports_release_tarballs_ports_textproc_pdf2htmlex/pdf2htmlex/work/pdf2htmlEX-43e3174cbc/src/HTMLRenderer/HTMLRenderer.h:66:13: error: unknown type name 'GBool'
1797:info:build     virtual GBool interpretType3Chars() { return gFalse; }
1798:info:build             ^
1799:info:build /opt/local/var/macports/build/_opt_local_var_macports_sources_rsync.macports.org_macports_release_tarballs_ports_textproc_pdf2htmlex/pdf2htmlex/work/pdf2htmlEX-43e3174cbc/src/HTMLRenderer/HTMLRenderer.h:126:162: error: unknown type name 'GBool'
1800:info:build     virtual void drawImage(GfxState * state, Object * ref, Stream * str, int width, int height, GfxImageColorMap * colorMap, GBool interpolate, int *maskColors, GBool inlineImg);
1801:info:build /opt/local/var/macports/build/_opt_local_var_macports_sources_rsync.macports.org_macports_release_tarballs_ports_textproc_pdf2htmlex/pdf2htmlex/work/pdf2htmlEX-43e3174cbc/src/HTMLRenderer/HTMLRenderer.h:73:13:                                                                                                                                                                 ^
1802:info:build In file included from /opt/local/var/macports/build/_opt_local_var_macports_sources_rsync.macports.org_macports_release_tarballs_ports_textproc_pdf2htmlex/pdf2htmlex/work/pdf2htmlEX-43e3174cbc/src/HTMLRenderer/general.cc:18:
1803:info:build /opt/local/var/macports/build/_opt_local_var_macports_sources_rsync.macports.org_macports_release_tarballs_ports_textproc_pdf2htmlex/pdf2htmlex/work/pdf2htmlEX-43e3174cbc/src/HTMLRenderer/HTMLRenderer.h:54:13: error: unknown type name 'GBool'
1804:info:build     virtual GBool upsideDown() { return gFalse; }
1805:info:build             ^
1806:info:build /opt/local/var/macports/build/_opt_local_var_macports_sources_rsync.macports.org_macports_release_tarballs_ports_textproc_pdf2htmlex/pdf2htmlex/work/pdf2htmlEX-43e3174cbc/src/HTMLRenderer/HTMLRenderer.h:126:162 error: unknown type name 'GBool'
1807:info:build     virtual GBool needClipToCropBox() { return gTrue; }
1808:info:build /opt/local/var/macports/build/_opt_local_var_macports_sources_rsync.macports.org_macports_release_tarballs_ports_textproc_pdf2htmlex/pdf2htmlex/work/pdf2htmlEX-43e3174cbc/src/HTMLRenderer/HTMLRenderer.h            ^
1809:info:build :126:126: error: unknown type name 'GBool'
1810:info:build     virtual void drawImage(GfxState * state, Object * ref, Stream * str, int width, int height, GfxImageColorMap * colorMap, GBool interpolate, int *maskColors, GBool inlineImg);
1811:info:build                                                                                                                              ^
1812:info:build : error: unknown type name 'GBool'
1813:info:build     virtual void drawImage(GfxState * state, Object * ref, Stream * str, int width, int height, GfxImageColorMap * colorMap, GBool interpolate, int *maskColors, GBool inlineImg);
1814:info:build                                                                                                                                                                  ^
1815:info:build /opt/local/var/macports/build/_opt_local_var_macports_sources_rsync.macports.org_macports_release_tarballs_ports_textproc_pdf2htmlex/pdf2htmlex/work/pdf2htmlEX-43e3174cbc/src/HTMLRenderer/HTMLRenderer.h:126:126/opt/local/var/macports/build/_opt_local_var_macports_sources_rsync.macports.org_macports_release_tarballs_ports_textproc_pdf2htmlex/pdf2htmlex/work/pdf2htmlEX-43e3174cbc/src/HTMLRenderer/HTMLRenderer.h:126:126: error: unknown type name 'GBool'
1816:info:build     virtual void drawImage(GfxState * state, Object * ref, Stream * str, int width, int height, GfxImageColorMap * colorMap, GBool interpolate, int *maskColors, GBool inlineImg);
1817:info:build                                                                                                                              ^
1818:info:build : error: unknown type name 'GBool'
1819:info:build     virtual void drawImage(GfxState * state, Object * ref, Stream * str, int width, int height, GfxImageColorMap * colorMap, GBool interpolate, int *maskColors, GBool inlineImg);
1820:info:build                                                                                                                              ^/opt/local/var/macports/build/_opt_local_var_macports_sources_rsync.macports.org_macports_release_tarballs_ports_textproc_pdf2htmlex/pdf2htmlex/work/pdf2htmlEX-43e3174cbc/src/HTMLRenderer/HTMLRenderer.h:130:13: error: unknown type name 'GBool'
1821:info:build     virtual GBool axialShadedFill(GfxState *state, GfxAxialShading *shading, double tMin, double tMax);
1822:info:build             ^
1823:info:build /opt/local/var/macports/build/_opt_local_var_macports_sources_rsync.macports.org_macports_release_tarballs_ports_textproc_pdf2htmlex/pdf2htmlex/work/pdf2htmlEX-43e3174cbc/src/HTMLRenderer/HTMLRenderer.h:126:126: error: unknown type name 'GBool'
1824:info:build     virtual void drawImage(GfxState * state, Object * ref, Stream * str, int width, int height, GfxImageColorMap * colorMap, GBool interpolate, int *maskColors, GBool inlineImg);
1825:info:build                                                                                                                              ^
1826:info:build /opt/local/var/macports/build/_opt_local_var_macports_sources_rsync.macports.org_macports_release_tarballs_ports_textproc_pdf2htmlex/pdf2htmlex/work/pdf2htmlEX-43e3174cbc/src/HTMLRenderer/HTMLRenderer.h:130:13: error: unknown type name 'GBool'
1827:info:build     virtual GBool axialShadedFill(GfxState *state, GfxAxialShading *shading, double tMin, double tMax);
1828:info:build             ^
1829:info:build /opt/local/var/macports/build/_opt_local_var_macports_sources_rsync.macports.org_macports_release_tarballs_ports_textproc_pdf2htmlex/pdf2htmlex/work/pdf2htmlEX-43e3174cbc/src/HTMLRenderer/HTMLRenderer.h:69:/opt/local/var/macports/build/_opt_local_var_macports_sources_rsync.macports.org_macports_release_tarballs_ports_textproc_pdf2htmlex/pdf2htmlex/work/pdf2htmlEX-43e3174cbc/src/HTMLRenderer/HTMLRenderer.h:126:162: error: unknown type name 'GBool'
1830:info:build     virtual void drawImage(GfxState * state, Object * ref, Stream * str, int width, int height, GfxImageColorMap * colorMap, GBool interpolate, int *maskColors, GBool inlineImg);
1831:info:build /opt/local/var/macports/build/_opt_local_var_macports_sources_rsync.macports.org_macports_release_tarballs_ports_textproc_pdf2htmlex/pdf2htmlex/work/pdf2htmlEX-43e3174cbc/src/HTMLRenderer/HTMLRenderer.h:57:13: error: unknown type name 'GBool'
1832:info:build     virtual GBool useDrawChar() { return gFalse; }
1833:info:build             ^
1834:info:build 13:                                                                                                                                                                 ^
1835:info:build  error: unknown type name 'GBool'
1836:info:build     virtual GBool needNonText() { return (param.process_nontext) ? gTrue: gFalse; }
1837:info:build             ^
1838:info:build /opt/local/var/macports/build/_opt_local_var_macports_sources_rsync.macports.org_macports_release_tarballs_ports_textproc_pdf2htmlex/pdf2htmlex/work/pdf2htmlEX-43e3174cbc/src/HTMLRenderer/HTMLRenderer.h:126:/opt/local/var/macports/build/_opt_local_var_macports_sources_rsync.macports.org_macports_release_tarballs_ports_textproc_pdf2htmlex/pdf2htmlex/work/pdf2htmlEX-43e3174cbc/src/HTMLRenderer/HTMLRenderer.h:126:162:/opt/local/var/macports/build/_opt_local_var_macports_sources_rsync.macports.org_macports_release_tarballs_ports_textproc_pdf2htmlex/pdf2htmlex/work/pdf2htmlEX-43e3174cbc/src/HTMLRenderer/HTMLRenderer.h:126:162: error: unknown type name 'GBool'
1839:info:build     virtual void drawImage(GfxState * state, Object * ref, Stream * str, int width, int height, GfxImageColorMap * colorMap, GBool interpolate, int *maskColors, GBool inlineImg);
1840:info:build                                                                                                                                                                  ^
1841:info:build 162: error: unknown type name 'GBool'
1842:info:build     virtual void drawImage(GfxState * state, Object * ref, Stream * str, int width, int height, GfxImageColorMap * colorMap, GBool interpolate, int *maskColors, GBool inlineImg);
1843:info:build                                                                                                                                                                  ^ error: unknown type name 'GBool'
1844:info:build     virtual void drawImage(GfxState * state, Object * ref, Stream * str, int width, int height, GfxImageColorMap * colorMap, GBool interpolate, int *maskColors, GBool inlineImg);
1845:info:build                                                                                                                                                                  ^
1846:info:build /opt/local/var/macports/build/_opt_local_var_macports_sources_rsync.macports.org_macports_release_tarballs_ports_textproc_pdf2htmlex/pdf2htmlex/work/pdf2htmlEX-43e3174cbc/src/HTMLRenderer/HTMLRenderer.h:62:13: error: unknown type name 'GBool'
1847:info:build     virtual GBool useShadedFills(int type) { return (type == 2) ? gTrue: gFalse; }
1848:info:build             ^
1849:info:build /opt/local/var/macports/build/_opt_local_var_macports_sources_rsync.macports.org_macports_release_tarballs_ports_textproc_pdf2htmlex/pdf2htmlex/work/pdf2htmlEX-43e3174cbc/src/HTMLRenderer/HTMLRenderer.h:130:13: error: unknown type name 'GBool'
1850:info:build     virtual GBool axialShadedFill(GfxState *state, GfxAxialShading *shading, double tMin, double tMax);
1851:info:build             ^
1852:info:build In file included from /opt/local/var/macports/build/_opt_local_var_macports_sources_rsync.macports.org_macports_release_tarballs_ports_textproc_pdf2htmlex/pdf2htmlex/work/pdf2htmlEX-43e3174cbc/src/pdf2htmlEX.cc:34:
1853:info:build In file included from /opt/local/var/macports/build/_opt_local_var_macports_sources_rsync.macports.org_macports_release_tarballs_ports_textproc_pdf2htmlex/pdf2htmlex/work/pdf2htmlEX-43e3174cbc/src/HTMLRenderer/HTMLRenderer.h/opt/local/var/macports/build/_opt_local_var_macports_sources_rsync.macports.org_macports_release_tarballs_ports_textproc_pdf2htmlex/pdf2htmlex/work/pdf2htmlEX-43e3174cbc/src/HTMLRenderer/HTMLRenderer.h:73:13: error:33:
1854:info:build /opt/local/var/macports/build/_opt_local_var_macports_sources_rsync.macports.org_macports_release_tarballs_ports_textproc_pdf2htmlex/pdf2htmlex/work/pdf2htmlEX-43e3174cbc/src/BackgroundRenderer/BackgroundRenderer.h:18:1: warning: class 'Param' was previously declared as a struct [-Wmismatched-tags]
1855:info:build class Param;
1856:info:build ^
1857:info:build /opt/local/var/macports/build/_opt_local_var_macports_sources_rsync.macports.org_macports_release_tarballs_ports_textproc_pdf2htmlex/pdf2htmlex/work/pdf2htmlEX-43e3174cbc/src/Param.h:16:8: note: previous use is here
1858:info:build struct Param
1859:info:build        ^
1860:info:build /opt/local/var/macports/build/_opt_local_var_macports_sources_rsync.macports.org_macports_release_tarballs_ports_textproc_pdf2htmlex/pdf2htmlex/work/pdf2htmlEX-43e3174cbc/src/BackgroundRenderer/BackgroundRenderer.h:18: unknown type name 'GBool'
1861:info:build     virtual GBool needClipToCropBox() { return gTrue; }
1862:info:build             ^
1863:info:build /opt/local/var/macports/build/_opt_local_var_macports_sources_rsync.macports.org_macports_release_tarballs_ports_textproc_pdf2htmlex/pdf2htmlex/work/pdf2htmlEX-43e3174cbc/src/HTMLRenderer/HTMLRenderer.h::1:/opt/local/var/macports/build/_opt_local_var_macports_sources_rsync.macports.org_macports_release_tarballs_ports_textproc_pdf2htmlex/pdf2htmlex/work/pdf2htmlEX-43e3174cbc/src/HTMLRenderer/HTMLRenderer.h:130:13: error: unknown type name 'GBool'
1864:info:build     virtual GBool axialShadedFill(GfxState *state, GfxAxialShading *shading, double tMin, double tMax);
1865:info:build             ^
1866:info:build 130:13: error: unknown type name 'GBool'
1867:info:build     virtual GBool axialShadedFill(GfxState *state, GfxAxialShading *shading, double tMin, double tMax);
1868:info:build             ^
1869:info:build  note: did you mean struct here?
1870:info:build class Param;
1871:info:build ^~~~~
1872:info:build struct
1873:info:build /opt/local/var/macports/build/_opt_local_var_macports_sources_rsync.macports.org_macports_release_tarballs_ports_textproc_pdf2htmlex/pdf2htmlex/work/pdf2htmlEX-43e3174cbc/src/HTMLRenderer/HTMLRenderer.h:130:fatal error: too many errors emitted, stopping now [-ferror-limit=]
1874:info:build /opt/local/var/macports/build/_opt_local_var_macports_sources_rsync.macports.org_macports_release_tarballs_ports_textproc_pdf2htmlex/pdf2htmlex/work/pdf2htmlEX-43e3174cbc/src/HTMLRenderer/HTMLRenderer.h:66:1313:/opt/local/var/macports/build/_opt_local_var_macports_sources_rsync.macports.org_macports_release_tarballs_ports_textproc_pdf2htmlex/pdf2htmlex/work/pdf2htmlEX-43e3174cbc/src/HTMLRenderer/HTMLRenderer.h:126: error: unknown type name 'GBool'fatal error: too many errors emitted, stopping now [-ferror-limit=]
1875:info:build : error: unknown type name 'GBool'
1876:info:build     virtual GBool interpretType3Chars() { return gFalse; }
1877:info:build             ^
1878:info:build 126: error: unknown type name 'GBool'
1879:info:build     virtual void drawImage(GfxState * state, Object * ref, Stream * str, int width, int height, GfxImageColorMap * colorMap, GBool interpolate, int *maskColors, GBool inlineImg);
1880:info:build                                                                                                                              ^
1881:info:build     virtual GBool axialShadedFill(GfxState *state, GfxAxialShading *shading, double tMin, double tMax);
1882:info:build             ^
1883:info:build 2 warnings and 20 errors generated.
1884:info:build In file included from /opt/local/var/macports/build/_opt_local_var_macports_sources_rsync.macports.org_macports_release_tarballs_ports_textproc_pdf2htmlex/pdf2htmlex/work/pdf2htmlEX-43e3174cbc/src/pdf2htmlEX.cc:34:
1885:info:build /opt/local/var/macports/build/_opt_local_var_macports_sources_rsync.macports.org_macports_release_tarballs_ports_textproc_pdf2htmlex/pdf2htmlex/work/pdf2htmlEX-43e3174cbc/src/HTMLRenderer/HTMLRenderer.h:54:13: error: unknown type name 'GBool'
1886:info:build     virtual GBool upsideDown() { return gFalse; }
1887:info:build             ^
1888:info:build fatal error: too many errors emitted, stopping now [-ferror-limit=]
1889:info:build /opt/local/var/macports/build/_opt_local_var_macports_sources_rsync.macports.org_macports_release_tarballs_ports_textproc_pdf2htmlex/pdf2htmlex/work/pdf2htmlEX-43e3174cbc/src/HTMLRenderer/HTMLRenderer.h:126:162: error: unknown type name 'GBool'
1890:info:build 2 warnings and 20 errors generated.
1891:info:build     virtual void drawImage(GfxState * state, Object * ref, Stream * str, int width, int height, GfxImageColorMap * colorMap, GBool interpolate, int *maskColors, GBool inlineImg);
1892:info:build                                                                                                                                                                  ^
1893:info:build /opt/local/var/macports/build/_opt_local_var_macports_sources_rsync.macports.org_macports_release_tarballs_ports_textproc_pdf2htmlex/pdf2htmlex/work/pdf2htmlEX-43e3174cbc/src/HTMLRenderer/HTMLRenderer.h:69:13: error: unknown type name 'GBool'
1894:info:build     virtual GBool needNonText() { return (param.process_nontext) ? gTrue: gFalse; }
1895:info:build             ^
1896:info:build fatal error: too many errors emitted, stopping now [-ferror-limit=]
1897:info:build 2 warnings and 20 errors generated.
1898:info:build make[2]: *** [CMakeFiles/pdf2htmlEX.dir/src/HTMLRenderer/outline.cc.o] Error 1
1899:info:build make[2]: *** Waiting for unfinished jobs....
1900:info:build fatal error: too many errors emitted, stopping now [-ferror-limit=]
1901:info:build /opt/local/var/macports/build/_opt_local_var_macports_sources_rsync.macports.org_macports_release_tarballs_ports_textproc_pdf2htmlex/pdf2htmlex/work/pdf2htmlEX-43e3174cbc/src/HTMLRenderer/HTMLRenderer.h:130:13: error: unknown type name 'GBool'
1902:info:build     virtual GBool axialShadedFill(GfxState *state, GfxAxialShading *shading, double tMin, double tMax);
1903:info:build             ^
1904:info:build make[2]: *** [CMakeFiles/pdf2htmlEX.dir/src/HTMLRenderer/draw.cc.o] Error 1
1905:info:build 2 warnings and 20 errors generated.
1906:info:build /opt/local/var/macports/build/_opt_local_var_macports_sources_rsync.macports.org_macports_release_tarballs_ports_textproc_pdf2htmlex/pdf2htmlex/work/pdf2htmlEX-43e3174cbc/src/HTMLRenderer/HTMLRenderer.h:57:13: error: unknown type name 'GBool'
1907:info:build     virtual GBool useDrawChar() { return gFalse; }
1908:info:build             ^
1909:info:build make[2]: *** [CMakeFiles/pdf2htmlEX.dir/src/HTMLRenderer/text.cc.o] Error 1
1910:info:build In file included from /opt/local/var/macports/build/_opt_local_var_macports_sources_rsync.macports.org_macports_release_tarballs_ports_textproc_pdf2htmlex/pdf2htmlex/work/pdf2htmlEX-43e3174cbc/src/HTMLRenderer/font.cc:21:
1911:info:build In file included from /opt/local/var/macports/build/_opt_local_var_macports_sources_rsync.macports.org_macports_release_tarballs_ports_textproc_pdf2htmlex/pdf2htmlex/work/pdf2htmlEX-43e3174cbc/src/HTMLRenderer/HTMLRenderer.h:33:
1912:info:build /opt/local/var/macports/build/_opt_local_var_macports_sources_rsync.macports.org_macports_release_tarballs_ports_textproc_pdf2htmlex/pdf2htmlex/work/pdf2htmlEX-43e3174cbc/src/BackgroundRenderer/BackgroundRenderer.h:18:1: warning: class 'Param' was previously declared as a struct [-Wmismatched-tags]
1913:info:build class Param;
1914:info:build ^
1915:info:build /opt/local/var/macports/build/_opt_local_var_macports_sources_rsync.macports.org_macports_release_tarballs_ports_textproc_pdf2htmlex/pdf2htmlex/work/pdf2htmlEX-43e3174cbc/src/Param.h:16:8: note: previous use is here
1916:info:build struct Param
1917:info:build        ^
1918:info:build /opt/local/var/macports/build/_opt_local_var_macports_sources_rsync.macports.org_macports_release_tarballs_ports_textproc_pdf2htmlex/pdf2htmlex/work/pdf2htmlEX-43e3174cbc/src/BackgroundRenderer/BackgroundRenderer.h:18:1: note: did you mean struct here?
1919:info:build class Param;
1920:info:build ^~~~~
1921:info:build struct
1922:info:build /opt/local/var/macports/build/_opt_local_var_macports_sources_rsync.macports.org_macports_release_tarballs_ports_textproc_pdf2htmlex/pdf2htmlex/work/pdf2htmlEX-43e3174cbc/src/HTMLRenderer/HTMLRenderer.h:73:13: error: unknown type name 'GBool'
1923:info:build     virtual GBool needClipToCropBox() { return gTrue; }
1924:info:build             ^
1925:info:build fatal error: too many errors emitted, stopping now [-ferror-limit=]
1926:info:build 2 warnings and 20 errors generated.
1927:info:build make[2]: *** [CMakeFiles/pdf2htmlEX.dir/src/HTMLRenderer/image.cc.o] Error 1
1928:info:build /opt/local/var/macports/build/_opt_local_var_macports_sources_rsync.macports.org_macports_release_tarballs_ports_textproc_pdf2htmlex/pdf2htmlex/work/pdf2htmlEX-43e3174cbc/src/HTMLRenderer/HTMLRenderer.h:62:13: error: unknown type name 'GBool'
1929:info:build     virtual GBool useShadedFills(int type) { return (type == 2) ? gTrue: gFalse; }
1930:info:build             ^
1931:info:build In file included from /opt/local/var/macports/build/_opt_local_var_macports_sources_rsync.macports.org_macports_release_tarballs_ports_textproc_pdf2htmlex/pdf2htmlex/work/pdf2htmlEX-43e3174cbc/src/HTMLRenderer/font.cc:21:
1932:info:build /opt/local/var/macports/build/_opt_local_var_macports_sources_rsync.macports.org_macports_release_tarballs_ports_textproc_pdf2htmlex/pdf2htmlex/work/pdf2htmlEX-43e3174cbc/src/HTMLRenderer/HTMLRenderer.h:54:13: error: unknown type name 'GBool'
1933:info:build     virtual GBool upsideDown() { return gFalse; }
1934:info:build             ^
1935:info:build make[2]: *** [CMakeFiles/pdf2htmlEX.dir/src/HTMLRenderer/state.cc.o] Error 1
1936:info:build /opt/local/var/macports/build/_opt_local_var_macports_sources_rsync.macports.org_macports_release_tarballs_ports_textproc_pdf2htmlex/pdf2htmlex/work/pdf2htmlEX-43e3174cbc/src/HTMLRenderer/HTMLRenderer.h:126:126: error: unknown type name 'GBool'
1937:info:build     virtual void drawImage(GfxState * state, Object * ref, Stream * str, int width, int height, GfxImageColorMap * colorMap, GBool interpolate, int *maskColors, GBool inlineImg);
1938:info:build                                                                                                                              ^
1939:info:build fatal error: too many errors emitted, stopping now [-ferror-limit=]
1940:info:build 2 warnings and 20 errors generated.
1941:info:build /opt/local/var/macports/build/_opt_local_var_macports_sources_rsync.macports.org_macports_release_tarballs_ports_textproc_pdf2htmlex/pdf2htmlex/work/pdf2htmlEX-43e3174cbc/src/HTMLRenderer/HTMLRenderer.h:66:13: error: unknown type name 'GBool'
1942:info:build     virtual GBool interpretType3Chars() { return gFalse; }
1943:info:build             ^
1944:info:build /opt/local/var/macports/build/_opt_local_var_macports_sources_rsync.macports.org_macports_release_tarballs_ports_textproc_pdf2htmlex/pdf2htmlex/work/pdf2htmlEX-43e3174cbc/src/HTMLRenderer/HTMLRenderer.h:57:13: error: unknown type name 'GBool'
1945:info:build     virtual GBool useDrawChar() { return gFalse; }
1946:info:build             ^
1947:info:build /opt/local/var/macports/build/_opt_local_var_macports_sources_rsync.macports.org_macports_release_tarballs_ports_textproc_pdf2htmlex/pdf2htmlex/work/pdf2htmlEX-43e3174cbc/src/HTMLRenderer/HTMLRenderer.h:126:162: error: unknown type name 'GBool'
1948:info:build     virtual void drawImage(GfxState * state, Object * ref, Stream * str, int width, int height, GfxImageColorMap * colorMap, GBool interpolate, int *maskColors, GBool inlineImg);
1949:info:build                                                                                                                                                                  ^
1950:info:build 2 warnings and 20 errors generated.
1951:info:build make[2]: *** [CMakeFiles/pdf2htmlEX.dir/src/BackgroundRenderer/BackgroundRenderer.cc.o] Error 1
1952:info:build /opt/local/var/macports/build/_opt_local_var_macports_sources_rsync.macports.org_macports_release_tarballs_ports_textproc_pdf2htmlex/pdf2htmlex/work/pdf2htmlEX-43e3174cbc/src/HTMLRenderer/HTMLRenderer.h:69:13: error: unknown type name 'GBool'
1953:info:build     virtual GBool needNonText() { return (param.process_nontext) ? gTrue: gFalse; }
1954:info:build             ^
1955:info:build /opt/local/var/macports/build/_opt_local_var_macports_sources_rsync.macports.org_macports_release_tarballs_ports_textproc_pdf2htmlex/pdf2htmlex/work/pdf2htmlEX-43e3174cbc/src/HTMLRenderer/HTMLRenderer.h:62:13: error: unknown type name 'GBool'
1956:info:build     virtual GBool useShadedFills(int type) { return (type == 2) ? gTrue: gFalse; }
1957:info:build             ^
1958:info:build /opt/local/var/macports/build/_opt_local_var_macports_sources_rsync.macports.org_macports_release_tarballs_ports_textproc_pdf2htmlex/pdf2htmlex/work/pdf2htmlEX-43e3174cbc/src/HTMLRenderer/HTMLRenderer.h:130:13: error: unknown type name 'GBool'
1959:info:build     virtual GBool axialShadedFill(GfxState *state, GfxAxialShading *shading, double tMin, double tMax);
1960:info:build             ^
1961:info:build make[2]: *** [CMakeFiles/pdf2htmlEX.dir/src/HTMLRenderer/link.cc.o] Error 1
1962:info:build /opt/local/var/macports/build/_opt_local_var_macports_sources_rsync.macports.org_macports_release_tarballs_ports_textproc_pdf2htmlex/pdf2htmlex/work/pdf2htmlEX-43e3174cbc/src/HTMLRenderer/HTMLRenderer.h:73:13: error: unknown type name 'GBool'
1963:info:build     virtual GBool needClipToCropBox() { return gTrue; }
1964:info:build             ^
1965:info:build /opt/local/var/macports/build/_opt_local_var_macports_sources_rsync.macports.org_macports_release_tarballs_ports_textproc_pdf2htmlex/pdf2htmlex/work/pdf2htmlEX-43e3174cbc/src/HTMLRenderer/HTMLRenderer.h:66:13: error: unknown type name 'GBool'
1966:info:build     virtual GBool interpretType3Chars() { return gFalse; }
1967:info:build             ^
1968:info:build /opt/local/var/macports/build/_opt_local_var_macports_sources_rsync.macports.org_macports_release_tarballs_ports_textproc_pdf2htmlex/pdf2htmlex/work/pdf2htmlEX-43e3174cbc/src/HTMLRenderer/HTMLRenderer.h:126:126: error: unknown type name 'GBool'
1969:info:build     virtual void drawImage(GfxState * state, Object * ref, Stream * str, int width, int height, GfxImageColorMap * colorMap, GBool interpolate, int *maskColors, GBool inlineImg);
1970:info:build                                                                                                                              ^
1971:info:build /opt/local/var/macports/build/_opt_local_var_macports_sources_rsync.macports.org_macports_release_tarballs_ports_textproc_pdf2htmlex/pdf2htmlex/work/pdf2htmlEX-43e3174cbc/src/HTMLRenderer/HTMLRenderer.h:69:13: error: unknown type name 'GBool'
1972:info:build     virtual GBool needNonText() { return (param.process_nontext) ? gTrue: gFalse; }
1973:info:build             ^
1974:info:build /opt/local/var/macports/build/_opt_local_var_macports_sources_rsync.macports.org_macports_release_tarballs_ports_textproc_pdf2htmlex/pdf2htmlex/work/pdf2htmlEX-43e3174cbc/src/HTMLRenderer/HTMLRenderer.h:126:162: error: unknown type name 'GBool'
1975:info:build     virtual void drawImage(GfxState * state, Object * ref, Stream * str, int width, int height, GfxImageColorMap * colorMap, GBool interpolate, int *maskColors, GBool inlineImg);
1976:info:build                                                                                                                                                                  ^
1977:info:build fatal error: too many errors emitted, stopping now [-ferror-limit=]
1978:info:build /opt/local/var/macports/build/_opt_local_var_macports_sources_rsync.macports.org_macports_release_tarballs_ports_textproc_pdf2htmlex/pdf2htmlex/work/pdf2htmlEX-43e3174cbc/src/HTMLRenderer/HTMLRenderer.h:130:13: error: unknown type name 'GBool'
1979:info:build     virtual GBool axialShadedFill(GfxState *state, GfxAxialShading *shading, double tMin, double tMax);
1980:info:build             ^
1981:info:build /opt/local/var/macports/build/_opt_local_var_macports_sources_rsync.macports.org_macports_release_tarballs_ports_textproc_pdf2htmlex/pdf2htmlex/work/pdf2htmlEX-43e3174cbc/src/HTMLRenderer/HTMLRenderer.h:73:13: error: unknown type name 'GBool'
1982:info:build     virtual GBool needClipToCropBox() { return gTrue; }
1983:info:build             ^
1984:info:build 2 warnings and 20 errors generated.
1985:info:build /opt/local/var/macports/build/_opt_local_var_macports_sources_rsync.macports.org_macports_release_tarballs_ports_textproc_pdf2htmlex/pdf2htmlex/work/pdf2htmlEX-43e3174cbc/src/HTMLRenderer/HTMLRenderer.h:126:126: error: unknown type name 'GBool'
1986:info:build     virtual void drawImage(GfxState * state, Object * ref, Stream * str, int width, int height, GfxImageColorMap * colorMap, GBool interpolate, int *maskColors, GBool inlineImg);
1987:info:build                                                                                                                              ^
1988:info:build make[2]: *** [CMakeFiles/pdf2htmlEX.dir/src/HTMLRenderer/general.cc.o] Error 1
1989:info:build /opt/local/var/macports/build/_opt_local_var_macports_sources_rsync.macports.org_macports_release_tarballs_ports_textproc_pdf2htmlex/pdf2htmlex/work/pdf2htmlEX-43e3174cbc/src/HTMLRenderer/HTMLRenderer.h:126:162: error: unknown type name 'GBool'
1990:info:build     virtual void drawImage(GfxState * state, Object * ref, Stream * str, int width, int height, GfxImageColorMap * colorMap, GBool interpolate, int *maskColors, GBool inlineImg);
1991:info:build                                                                                                                                                                  ^
1992:info:build fatal error: too many errors emitted, stopping now [-ferror-limit=]
1993:info:build /opt/local/var/macports/build/_opt_local_var_macports_sources_rsync.macports.org_macports_release_tarballs_ports_textproc_pdf2htmlex/pdf2htmlex/work/pdf2htmlEX-43e3174cbc/src/HTMLRenderer/HTMLRenderer.h:130:13: error: unknown type name 'GBool'
1994:info:build     virtual GBool axialShadedFill(GfxState *state, GfxAxialShading *shading, double tMin, double tMax);
1995:info:build             ^
1996:info:build 2 warnings and 20 errors generated.
1997:info:build make[2]: *** [CMakeFiles/pdf2htmlEX.dir/src/pdf2htmlEX.cc.o] Error 1
1998:info:build fatal error: too many errors emitted, stopping now [-ferror-limit=]
1999:info:build 2 warnings and 20 errors generated.
2000:info:build make[2]: *** [CMakeFiles/pdf2htmlEX.dir/src/HTMLRenderer/font.cc.o] Error 1
2001:info:build In file included from /opt/local/var/macports/build/_opt_local_var_macports_sources_rsync.macports.org_macports_release_tarballs_ports_textproc_pdf2htmlex/pdf2htmlex/work/pdf2htmlEX-43e3174cbc/src/BackgroundRenderer/SplashBackgroundRenderer.cc:20:
2002:info:build In file included from /opt/local/var/macports/build/_opt_local_var_macports_sources_rsync.macports.org_macports_release_tarballs_ports_textproc_pdf2htmlex/pdf2htmlex/work/pdf2htmlEX-43e3174cbc/src/BackgroundRenderer/SplashBackgroundRenderer.h:20:
2003:info:build In file included from /opt/local/var/macports/build/_opt_local_var_macports_sources_rsync.macports.org_macports_release_tarballs_ports_textproc_pdf2htmlex/pdf2htmlex/work/pdf2htmlEX-43e3174cbc/src/HTMLRenderer/HTMLRenderer.h:26:
2004:info:build /opt/local/var/macports/build/_opt_local_var_macports_sources_rsync.macports.org_macports_release_tarballs_ports_textproc_pdf2htmlex/pdf2htmlex/work/pdf2htmlEX-43e3174cbc/src/Preprocessor.h:33:13: error: unknown type name 'GBool'
2005:info:build     virtual GBool upsideDown() { return gFalse; }
2006:info:build             ^
2007:info:build /opt/local/var/macports/build/_opt_local_var_macports_sources_rsync.macports.org_macports_release_tarballs_ports_textproc_pdf2htmlex/pdf2htmlex/work/pdf2htmlEX-43e3174cbc/src/Preprocessor.h:34:13: error: unknown type name 'GBool'
2008:info:build     virtual GBool useDrawChar() { return gTrue; }
2009:info:build             ^
2010:info:build /opt/local/var/macports/build/_opt_local_var_macports_sources_rsync.macports.org_macports_release_tarballs_ports_textproc_pdf2htmlex/pdf2htmlex/work/pdf2htmlEX-43e3174cbc/src/Preprocessor.h:35:13: error: unknown type name 'GBool'
2011:info:build     virtual GBool interpretType3Chars() { return gFalse; }
2012:info:build             ^
2013:info:build /opt/local/var/macports/build/_opt_local_var_macports_sources_rsync.macports.org_macports_release_tarballs_ports_textproc_pdf2htmlex/pdf2htmlex/work/pdf2htmlEX-43e3174cbc/src/Preprocessor.h:36:13: error: unknown type name 'GBool'
2014:info:build     virtual GBool needNonText() { return gFalse; }
2015:info:build             ^
2016:info:build /opt/local/var/macports/build/_opt_local_var_macports_sources_rsync.macports.org_macports_release_tarballs_ports_textproc_pdf2htmlex/pdf2htmlex/work/pdf2htmlEX-43e3174cbc/src/Preprocessor.h:37:13: error: unknown type name 'GBool'
2017:info:build     virtual GBool needClipToCropBox() { return gTrue; }
2018:info:build             ^
2019:info:build /opt/local/var/macports/build/_opt_local_var_macports_sources_rsync.macports.org_macports_release_tarballs_ports_textproc_pdf2htmlex/pdf2htmlex/work/pdf2htmlEX-43e3174cbc/src/Preprocessor.h:33:41: error: use of undeclared identifier 'gFalse'; did you mean 'false'?
2020:info:build     virtual GBool upsideDown() { return gFalse; }
2021:info:build                                         ^~~~~~
2022:info:build                                         false
2023:info:build /opt/local/var/macports/build/_opt_local_var_macports_sources_rsync.macports.org_macports_release_tarballs_ports_textproc_pdf2htmlex/pdf2htmlex/work/pdf2htmlEX-43e3174cbc/src/Preprocessor.h:34:42: error: use of undeclared identifier 'gTrue'; did you mean 'true'?
2024:info:build     virtual GBool useDrawChar() { return gTrue; }
2025:info:build                                          ^~~~~
2026:info:build                                          true
2027:info:build /opt/local/var/macports/build/_opt_local_var_macports_sources_rsync.macports.org_macports_release_tarballs_ports_textproc_pdf2htmlex/pdf2htmlex/work/pdf2htmlEX-43e3174cbc/src/Preprocessor.h:35:50: error: use of undeclared identifier 'gFalse'; did you mean 'false'?
2028:info:build     virtual GBool interpretType3Chars() { return gFalse; }
2029:info:build                                                  ^~~~~~
2030:info:build                                                  false
2031:info:build /opt/local/var/macports/build/_opt_local_var_macports_sources_rsync.macports.org_macports_release_tarballs_ports_textproc_pdf2htmlex/pdf2htmlex/work/pdf2htmlEX-43e3174cbc/src/Preprocessor.h:36:42: error: use of undeclared identifier 'gFalse'; did you mean 'false'?
2032:info:build     virtual GBool needNonText() { return gFalse; }
2033:info:build                                          ^~~~~~
2034:info:build                                          false
2035:info:build /opt/local/var/macports/build/_opt_local_var_macports_sources_rsync.macports.org_macports_release_tarballs_ports_textproc_pdf2htmlex/pdf2htmlex/work/pdf2htmlEX-43e3174cbc/src/Preprocessor.h:37:48: error: use of undeclared identifier 'gTrue'; did you mean 'true'?
2036:info:build     virtual GBool needClipToCropBox() { return gTrue; }
2037:info:build                                                ^~~~~
2038:info:build                                                true
2039:info:build In file included from /opt/local/var/macports/build/_opt_local_var_macports_sources_rsync.macports.org_macports_release_tarballs_ports_textproc_pdf2htmlex/pdf2htmlex/work/pdf2htmlEX-43e3174cbc/src/BackgroundRenderer/SplashBackgroundRenderer.cc:20:
2040:info:build In file included from /opt/local/var/macports/build/_opt_local_var_macports_sources_rsync.macports.org_macports_release_tarballs_ports_textproc_pdf2htmlex/pdf2htmlex/work/pdf2htmlEX-43e3174cbc/src/BackgroundRenderer/SplashBackgroundRenderer.h:20:
2041:info:build In file included from /opt/local/var/macports/build/_opt_local_var_macports_sources_rsync.macports.org_macports_release_tarballs_ports_textproc_pdf2htmlex/pdf2htmlex/work/pdf2htmlEX-43e3174cbc/src/HTMLRenderer/HTMLRenderer.h:27:
2042:info:build /opt/local/var/macports/build/_opt_local_var_macports_sources_rsync.macports.org_macports_release_tarballs_ports_textproc_pdf2htmlex/pdf2htmlex/work/pdf2htmlEX-43e3174cbc/src/StringFormatter.h:37:12: warning: class 'GuardedPointer' was previously declared as a struct [-Wmismatched-tags]
2043:info:build     friend class GuardedPointer;
2044:info:build            ^
2045:info:build /opt/local/var/macports/build/_opt_local_var_macports_sources_rsync.macports.org_macports_release_tarballs_ports_textproc_pdf2htmlex/pdf2htmlex/work/pdf2htmlEX-43e3174cbc/src/StringFormatter.h:19:12: note: previous use is here
2046:info:build     struct GuardedPointer
2047:info:build            ^
2048:info:build /opt/local/var/macports/build/_opt_local_var_macports_sources_rsync.macports.org_macports_release_tarballs_ports_textproc_pdf2htmlex/pdf2htmlex/work/pdf2htmlEX-43e3174cbc/src/StringFormatter.h:37:12: note: did you mean struct here?
2049:info:build     friend class GuardedPointer;
2050:info:build            ^~~~~
2051:info:build            struct
2052:info:build In file included from /opt/local/var/macports/build/_opt_local_var_macports_sources_rsync.macports.org_macports_release_tarballs_ports_textproc_pdf2htmlex/pdf2htmlex/work/pdf2htmlEX-43e3174cbc/src/BackgroundRenderer/SplashBackgroundRenderer.cc:20:
2053:info:build In file included from /opt/local/var/macports/build/_opt_local_var_macports_sources_rsync.macports.org_macports_release_tarballs_ports_textproc_pdf2htmlex/pdf2htmlex/work/pdf2htmlEX-43e3174cbc/src/BackgroundRenderer/SplashBackgroundRenderer.h:20:
2054:info:build In file included from /opt/local/var/macports/build/_opt_local_var_macports_sources_rsync.macports.org_macports_release_tarballs_ports_textproc_pdf2htmlex/pdf2htmlex/work/pdf2htmlEX-43e3174cbc/src/HTMLRenderer/HTMLRenderer.h:33:
2055:info:build /opt/local/var/macports/build/_opt_local_var_macports_sources_rsync.macports.org_macports_release_tarballs_ports_textproc_pdf2htmlex/pdf2htmlex/work/pdf2htmlEX-43e3174cbc/src/BackgroundRenderer/BackgroundRenderer.h:18:1: warning: class 'Param' was previously declared as a struct [-Wmismatched-tags]
2056:info:build class Param;
2057:info:build ^
2058:info:build /opt/local/var/macports/build/_opt_local_var_macports_sources_rsync.macports.org_macports_release_tarballs_ports_textproc_pdf2htmlex/pdf2htmlex/work/pdf2htmlEX-43e3174cbc/src/Param.h:16:8: note: previous use is here
2059:info:build struct Param
2060:info:build        ^
2061:info:build /opt/local/var/macports/build/_opt_local_var_macports_sources_rsync.macports.org_macports_release_tarballs_ports_textproc_pdf2htmlex/pdf2htmlex/work/pdf2htmlEX-43e3174cbc/src/BackgroundRenderer/BackgroundRenderer.h:18:1: note: did you mean struct here?
2062:info:build class Param;
2063:info:build ^~~~~
2064:info:build struct
2065:info:build In file included from /opt/local/var/macports/build/_opt_local_var_macports_sources_rsync.macports.org_macports_release_tarballs_ports_textproc_pdf2htmlex/pdf2htmlex/work/pdf2htmlEX-43e3174cbc/src/BackgroundRenderer/SplashBackgroundRenderer.cc:20:
2066:info:build In file included from /opt/local/var/macports/build/_opt_local_var_macports_sources_rsync.macports.org_macports_release_tarballs_ports_textproc_pdf2htmlex/pdf2htmlex/work/pdf2htmlEX-43e3174cbc/src/BackgroundRenderer/SplashBackgroundRenderer.h:20:
2067:info:build /opt/local/var/macports/build/_opt_local_var_macports_sources_rsync.macports.org_macports_release_tarballs_ports_textproc_pdf2htmlex/pdf2htmlex/work/pdf2htmlEX-43e3174cbc/src/HTMLRenderer/HTMLRenderer.h:54:13: error: unknown type name 'GBool'
2068:info:build     virtual GBool upsideDown() { return gFalse; }
2069:info:build             ^
2070:info:build /opt/local/var/macports/build/_opt_local_var_macports_sources_rsync.macports.org_macports_release_tarballs_ports_textproc_pdf2htmlex/pdf2htmlex/work/pdf2htmlEX-43e3174cbc/src/HTMLRenderer/HTMLRenderer.h:57:13: error: unknown type name 'GBool'
2071:info:build     virtual GBool useDrawChar() { return gFalse; }
2072:info:build             ^
2073:info:build /opt/local/var/macports/build/_opt_local_var_macports_sources_rsync.macports.org_macports_release_tarballs_ports_textproc_pdf2htmlex/pdf2htmlex/work/pdf2htmlEX-43e3174cbc/src/HTMLRenderer/HTMLRenderer.h:62:13: error: unknown type name 'GBool'
2074:info:build     virtual GBool useShadedFills(int type) { return (type == 2) ? gTrue: gFalse; }
2075:info:build             ^
2076:info:build /opt/local/var/macports/build/_opt_local_var_macports_sources_rsync.macports.org_macports_release_tarballs_ports_textproc_pdf2htmlex/pdf2htmlex/work/pdf2htmlEX-43e3174cbc/src/HTMLRenderer/HTMLRenderer.h:66:13: error: unknown type name 'GBool'
2077:info:build     virtual GBool interpretType3Chars() { return gFalse; }
2078:info:build             ^
2079:info:build /opt/local/var/macports/build/_opt_local_var_macports_sources_rsync.macports.org_macports_release_tarballs_ports_textproc_pdf2htmlex/pdf2htmlex/work/pdf2htmlEX-43e3174cbc/src/HTMLRenderer/HTMLRenderer.h:69:13: error: unknown type name 'GBool'
2080:info:build     virtual GBool needNonText() { return (param.process_nontext) ? gTrue: gFalse; }
2081:info:build             ^
2082:info:build /opt/local/var/macports/build/_opt_local_var_macports_sources_rsync.macports.org_macports_release_tarballs_ports_textproc_pdf2htmlex/pdf2htmlex/work/pdf2htmlEX-43e3174cbc/src/HTMLRenderer/HTMLRenderer.h:73:13: error: unknown type name 'GBool'
2083:info:build     virtual GBool needClipToCropBox() { return gTrue; }
2084:info:build             ^
2085:info:build /opt/local/var/macports/build/_opt_local_var_macports_sources_rsync.macports.org_macports_release_tarballs_ports_textproc_pdf2htmlex/pdf2htmlex/work/pdf2htmlEX-43e3174cbc/src/HTMLRenderer/HTMLRenderer.h:126:126: error: unknown type name 'GBool'
2086:info:build     virtual void drawImage(GfxState * state, Object * ref, Stream * str, int width, int height, GfxImageColorMap * colorMap, GBool interpolate, int *maskColors, GBool inlineImg);
2087:info:build                                                                                                                              ^
2088:info:build /opt/local/var/macports/build/_opt_local_var_macports_sources_rsync.macports.org_macports_release_tarballs_ports_textproc_pdf2htmlex/pdf2htmlex/work/pdf2htmlEX-43e3174cbc/src/HTMLRenderer/HTMLRenderer.h:126:162: error: unknown type name 'GBool'
2089:info:build     virtual void drawImage(GfxState * state, Object * ref, Stream * str, int width, int height, GfxImageColorMap * colorMap, GBool interpolate, int *maskColors, GBool inlineImg);
2090:info:build                                                                                                                                                                  ^
2091:info:build /opt/local/var/macports/build/_opt_local_var_macports_sources_rsync.macports.org_macports_release_tarballs_ports_textproc_pdf2htmlex/pdf2htmlex/work/pdf2htmlEX-43e3174cbc/src/HTMLRenderer/HTMLRenderer.h:130:13: error: unknown type name 'GBool'
2092:info:build     virtual GBool axialShadedFill(GfxState *state, GfxAxialShading *shading, double tMin, double tMax);
2093:info:build             ^
2094:info:build fatal error: too many errors emitted, stopping now [-ferror-limit=]
2095:info:build 2 warnings and 20 errors generated.
2096:info:build make[2]: *** [CMakeFiles/pdf2htmlEX.dir/src/BackgroundRenderer/SplashBackgroundRenderer.cc.o] Error 1
2097:info:build make[2]: Leaving directory `/opt/local/var/macports/build/_opt_local_var_macports_sources_rsync.macports.org_macports_release_tarballs_ports_textproc_pdf2htmlex/pdf2htmlex/work/build'
2098:info:build make[1]: *** [CMakeFiles/pdf2htmlEX.dir/all] Error 2
2099:info:build make[1]: *** Waiting for unfinished jobs....
2100:info:build Done.
2101:info:build make[2]: Leaving directory `/opt/local/var/macports/build/_opt_local_var_macports_sources_rsync.macports.org_macports_release_tarballs_ports_textproc_pdf2htmlex/pdf2htmlex/work/build'
2102:info:build [ 41%] Built target pdf2htmlEX_resources
2103:info:build make[1]: Leaving directory `/opt/local/var/macports/build/_opt_local_var_macports_sources_rsync.macports.org_macports_release_tarballs_ports_textproc_pdf2htmlex/pdf2htmlex/work/build'
2104:info:build make: *** [all] Error 2
2105:info:build make: Leaving directory `/opt/local/var/macports/build/_opt_local_var_macports_sources_rsync.macports.org_macports_release_tarballs_ports_textproc_pdf2htmlex/pdf2htmlex/work/build'
2106:info:build Command failed:  cd "/opt/local/var/macports/build/_opt_local_var_macports_sources_rsync.macports.org_macports_release_tarballs_ports_textproc_pdf2htmlex/pdf2htmlex/work/build" && /usr/bin/make -j12 -w all VERBOSE=ON
2107:info:build Exit code: 2
2108:error:build Failed to build pdf2htmlex: command execution failed
2109:debug:build Error code: CHILDSTATUS 45542 2
2110:debug:build Backtrace: command execution failed
2111:debug:build     while executing
2112:debug:build "system {*}$notty {*}$nice $fullcmdstring"
2113:debug:build     invoked from within
2114:debug:build "command_exec build"
2115:debug:build     (procedure "portbuild::build_main" line 8)
2116:debug:build     invoked from within
2117:debug:build "$procedure $targetname"
2118:error:build See /opt/local/var/macports/logs/_opt_local_var_macports_sources_rsync.macports.org_macports_release_tarballs_ports_textproc_pdf2htmlex/pdf2htmlex/main.log for details.