Ticket #56887: main.log

File main.log, 162.8 KB (added by btywoniuk (Bart), 5 years ago)

Error log main.log

Line 
1version:1
2:debug:sysinfo macOS 10.13 (darwin/17.7.0) arch i386
3:debug:sysinfo MacPorts 2.5.3
4:debug:sysinfo Xcode 9.3
5:debug:sysinfo SDK 10.13
6:debug:sysinfo MACOSX_DEPLOYMENT_TARGET: 10.13
7:msg:clean --->  Computing dependencies for msp430-gdb:info:clean .:debug:clean Checking for conflicts against msp430-gdb
8:debug:clean Searching for dependency: msp430-gdb-devel
9:debug:clean Didn't find receipt, going to depspec regex for: msp430-gdb-devel
10:debug:clean Searching for dependency: mspdebug
11:debug:clean Didn't find receipt, going to depspec regex for: mspdebug
12:debug:clean Changing to port directory: /opt/local/var/macports/sources/rsync.macports.org/release/tarballs/ports/devel/mspdebug
13:debug:clean OS darwin/17.7.0 (Mac OS X 10.13) arch i386
14:debug:clean Reading variant descriptions from /opt/local/var/macports/sources/rsync.macports.org/release/tarballs/ports/_resources/port1.0/variant_descriptions.conf
15:debug:clean universal variant already exists, so not adding the default one
16:debug:clean Running callback portconfigure::add_automatic_compiler_dependencies
17:debug:clean Finished running callback portconfigure::add_automatic_compiler_dependencies
18:debug:clean Running callback portbuild::add_automatic_buildsystem_dependencies
19:debug:clean Finished running callback portbuild::add_automatic_buildsystem_dependencies
20:debug:clean Running callback portstartupitem::add_notes
21:debug:clean Finished running callback portstartupitem::add_notes
22:info:clean .:debug:clean mspdebug has no conflicts
23:debug:clean Searching for dependency: libusb-compat
24:debug:clean Found Dependency: receipt exists for libusb-compat
25:debug:clean Starting logging for mspdebug
26:debug:main Executing org.macports.main (msp430-gdb)
27:debug:main dropping privileges: euid changed to 502, egid changed to 501.
28:debug:archivefetch archivefetch phase started at Mon Jul 30 08:02:57 CEST 2018
29:msg:archivefetch --->  Fetching archive for msp430-gdb
30:debug:archivefetch Executing org.macports.archivefetch (msp430-gdb)
31:debug:archivefetch euid/egid changed to: 0/0
32:debug:archivefetch chowned /opt/local/var/macports/incoming to macports
33:debug:archivefetch euid/egid changed to: 502/501
34:info:archivefetch --->  msp430-gdb-7.2a-20111205_0.darwin_17.x86_64.tbz2 doesn't seem to exist in /opt/local/var/macports/incoming/verified
35:msg:archivefetch --->  Attempting to fetch msp430-gdb-7.2a-20111205_0.darwin_17.x86_64.tbz2 from http://fco.it.packages.macports.org/mirrors/macports-packages/msp430-gdb
36:debug:archivefetch Fetching archive failed: The requested URL returned error: 404 Not Found
37:msg:archivefetch --->  Attempting to fetch msp430-gdb-7.2a-20111205_0.darwin_17.x86_64.tbz2 from https://packages.macports.org/msp430-gdb
38:debug:archivefetch Fetching archive failed: The requested URL returned error: 404 Not Found
39:msg:archivefetch --->  Attempting to fetch msp430-gdb-7.2a-20111205_0.darwin_17.x86_64.tbz2 from http://nue.de.packages.macports.org/msp430-gdb
40:debug:archivefetch Fetching archive failed: The requested URL returned error: 404 Not Found
41:debug:archivefetch Privilege de-escalation not attempted as not running as root.
42:debug:fetch fetch phase started at Mon Jul 30 08:02:57 CEST 2018
43:notice:fetch --->  Fetching distfiles for msp430-gdb
44:debug:fetch elevating privileges for fetch: euid changed to 0, egid changed to 0.
45:debug:fetch dropping privileges: euid changed to 502, egid changed to 501.
46:debug:fetch Executing org.macports.fetch (msp430-gdb)
47:info:fetch --->  msp430-gdb-7.2a-20111205.patch does not exist in /opt/local/var/macports/distfiles/msp430-gdb
48:notice:fetch --->  Attempting to fetch msp430-gdb-7.2a-20111205.patch from http://netassist.dl.sourceforge.net/project/mspgcc/Patches/gdb-7.2a/
49:info:fetch --->  gdb-7.2a.tar.bz2 does not exist in /opt/local/var/macports/distfiles/msp430-gdb
50:notice:fetch --->  Attempting to fetch gdb-7.2a.tar.bz2 from ftp://ftp.lip6.fr/pub/gnu/gdb
51:debug:fetch Privilege de-escalation not attempted as not running as root.
52:debug:checksum checksum phase started at Mon Jul 30 08:13:51 CEST 2018
53:notice:checksum --->  Verifying checksums for msp430-gdb
54:debug:checksum Executing org.macports.checksum (msp430-gdb)
55:info:checksum --->  Checksumming msp430-gdb-7.2a-20111205.patch
56:debug:checksum Calculated (rmd160) is 84fd86c8cee99575eb7db409d113f1e5bc71d7f2
57:debug:checksum Correct (rmd160) checksum for msp430-gdb-7.2a-20111205.patch
58:debug:checksum Calculated (sha256) is b70b54df5e00d24a3a5b744545a87ce656bdc88546081c6ffabefbc4d6c42956
59:debug:checksum Correct (sha256) checksum for msp430-gdb-7.2a-20111205.patch
60:info:checksum --->  Checksumming gdb-7.2a.tar.bz2
61:debug:checksum Calculated (rmd160) is b5821fafe6920dfd30b73606bbf819b8296dfb4e
62:debug:checksum Correct (rmd160) checksum for gdb-7.2a.tar.bz2
63:debug:checksum Calculated (sha256) is 3c24dde332e33bfe2d5980c726d76224ebf8304278112a07bf701f8d2145d9bc
64:debug:checksum Correct (sha256) checksum for gdb-7.2a.tar.bz2
65:debug:checksum Privilege de-escalation not attempted as not running as root.
66:debug:extract extract phase started at Mon Jul 30 08:13:51 CEST 2018
67:notice:extract --->  Extracting msp430-gdb
68:debug:extract setting option extract.cmd to /usr/bin/bzip2
69:debug:extract Executing org.macports.extract (msp430-gdb)
70:info:extract --->  Extracting gdb-7.2a.tar.bz2
71:debug:extract setting option extract.args to '/opt/local/var/macports/distfiles/msp430-gdb/gdb-7.2a.tar.bz2'
72:debug:extract Environment:
73:debug:extract CC_PRINT_OPTIONS='YES'
74:debug:extract CC_PRINT_OPTIONS_FILE='/opt/local/var/macports/build/_opt_local_var_macports_sources_rsync.macports.org_release_tarballs_ports_cross_msp430-gdb/msp430-gdb/work/.CC_PRINT_OPTIONS'
75:debug:extract CPATH='/opt/local/include'
76:debug:extract LIBRARY_PATH='/opt/local/lib'
77:debug:extract MACOSX_DEPLOYMENT_TARGET='10.13'
78:info:extract Executing:  cd "/opt/local/var/macports/build/_opt_local_var_macports_sources_rsync.macports.org_release_tarballs_ports_cross_msp430-gdb/msp430-gdb/work" && /usr/bin/bzip2 -dc '/opt/local/var/macports/distfiles/msp430-gdb/gdb-7.2a.tar.bz2' | /usr/bin/tar -xf -
79:debug:extract system:  cd "/opt/local/var/macports/build/_opt_local_var_macports_sources_rsync.macports.org_release_tarballs_ports_cross_msp430-gdb/msp430-gdb/work" && /usr/bin/bzip2 -dc '/opt/local/var/macports/distfiles/msp430-gdb/gdb-7.2a.tar.bz2' | /usr/bin/tar -xf -
80:debug:extract euid/egid changed to: 0/0
81:debug:extract chowned /opt/local/var/macports/build/_opt_local_var_macports_sources_rsync.macports.org_release_tarballs_ports_cross_msp430-gdb/msp430-gdb/work to macports
82:debug:extract euid/egid changed to: 502/501
83:debug:extract Privilege de-escalation not attempted as not running as root.
84:debug:patch patch phase started at Mon Jul 30 08:13:59 CEST 2018
85:debug:patch Executing org.macports.patch (msp430-gdb)
86:notice:patch --->  Applying patches to msp430-gdb
87:info:patch --->  Applying msp430-gdb-7.2a-20111205.patch
88:debug:patch Environment:
89:debug:patch CC_PRINT_OPTIONS='YES'
90:debug:patch CC_PRINT_OPTIONS_FILE='/opt/local/var/macports/build/_opt_local_var_macports_sources_rsync.macports.org_release_tarballs_ports_cross_msp430-gdb/msp430-gdb/work/.CC_PRINT_OPTIONS'
91:debug:patch CPATH='/opt/local/include'
92:debug:patch LIBRARY_PATH='/opt/local/lib'
93:debug:patch MACOSX_DEPLOYMENT_TARGET='10.13'
94:info:patch Executing:  cd "/opt/local/var/macports/build/_opt_local_var_macports_sources_rsync.macports.org_release_tarballs_ports_cross_msp430-gdb/msp430-gdb/work/gdb-7.2" && /usr/bin/patch -p1 < '/opt/local/var/macports/distfiles/msp430-gdb/msp430-gdb-7.2a-20111205.patch'
95:debug:patch system:  cd "/opt/local/var/macports/build/_opt_local_var_macports_sources_rsync.macports.org_release_tarballs_ports_cross_msp430-gdb/msp430-gdb/work/gdb-7.2" && /usr/bin/patch -p1 < '/opt/local/var/macports/distfiles/msp430-gdb/msp430-gdb-7.2a-20111205.patch'
96:info:patch patching file bfd/archures.c
97:info:patch patching file bfd/bfd-in2.h
98:info:patch patching file bfd/cpu-msp430.c
99:info:patch patching file bfd/elf32-msp430.c
100:info:patch patching file bfd/libbfd.h
101:info:patch patching file bfd/reloc.c
102:info:patch patching file gdb/configure.tgt
103:info:patch patching file gdb/msp430-tdep.c
104:info:patch patching file include/elf/msp430.h
105:info:patch patching file include/opcode/msp430.h
106:info:patch patching file opcodes/msp430-dis.c
107:info:patch patching file sim/configure
108:info:patch patching file sim/configure.tgt
109:info:patch patching file sim/msp430/Makefile.in
110:info:patch patching file sim/msp430/config.in
111:info:patch patching file sim/msp430/configure
112:info:patch patching file sim/msp430/configure.ac
113:info:patch patching file sim/msp430/interp.c
114:info:patch patching file sim/msp430/msp430-alu.c
115:info:patch patching file sim/msp430/stamp-h
116:info:patch patching file sim/msp430/sysdep.h
117:info:patch patching file sim/msp430/targ-map.c
118:info:patch patching file sim/msp430/targ-vals.h
119:debug:patch Privilege de-escalation not attempted as not running as root.
120:debug:configure configure phase started at Mon Jul 30 08:13:59 CEST 2018
121:notice:configure --->  Configuring msp430-gdb
122:warn:configure All compilers are either blacklisted or unavailable; defaulting to first fallback option
123:debug:configure Preferred compilers: clang macports-clang-5.0 macports-clang-4.0
124:debug:configure Using compiler 'Xcode Clang'
125:debug:configure Executing org.macports.configure (msp430-gdb)
126:warn:configure All compilers are either blacklisted or unavailable; defaulting to first fallback option
127:warn:configure All compilers are either blacklisted or unavailable; defaulting to first fallback option
128:warn:configure All compilers are either blacklisted or unavailable; defaulting to first fallback option
129:warn:configure All compilers are either blacklisted or unavailable; defaulting to first fallback option
130:warn:configure All compilers are either blacklisted or unavailable; defaulting to first fallback option
131:warn:configure All compilers are either blacklisted or unavailable; defaulting to first fallback option
132:warn:configure All compilers are either blacklisted or unavailable; defaulting to first fallback option
133:warn:configure All compilers are either blacklisted or unavailable; defaulting to first fallback option
134:warn:configure All compilers are either blacklisted or unavailable; defaulting to first fallback option
135:warn:configure All compilers are either blacklisted or unavailable; defaulting to first fallback option
136:warn:configure All compilers are either blacklisted or unavailable; defaulting to first fallback option
137:warn:configure All compilers are either blacklisted or unavailable; defaulting to first fallback option
138:warn:configure All compilers are either blacklisted or unavailable; defaulting to first fallback option
139:warn:configure All compilers are either blacklisted or unavailable; defaulting to first fallback option
140:warn:configure All compilers are either blacklisted or unavailable; defaulting to first fallback option
141:warn:configure All compilers are either blacklisted or unavailable; defaulting to first fallback option
142:warn:configure All compilers are either blacklisted or unavailable; defaulting to first fallback option
143:warn:configure All compilers are either blacklisted or unavailable; defaulting to first fallback option
144:warn:configure All compilers are either blacklisted or unavailable; defaulting to first fallback option
145:warn:configure All compilers are either blacklisted or unavailable; defaulting to first fallback option
146:warn:configure All compilers are either blacklisted or unavailable; defaulting to first fallback option
147:warn:configure All compilers are either blacklisted or unavailable; defaulting to first fallback option
148:warn:configure All compilers are either blacklisted or unavailable; defaulting to first fallback option
149:warn:configure All compilers are either blacklisted or unavailable; defaulting to first fallback option
150:warn:configure All compilers are either blacklisted or unavailable; defaulting to first fallback option
151:warn:configure All compilers are either blacklisted or unavailable; defaulting to first fallback option
152:warn:configure All compilers are either blacklisted or unavailable; defaulting to first fallback option
153:warn:configure All compilers are either blacklisted or unavailable; defaulting to first fallback option
154:warn:configure All compilers are either blacklisted or unavailable; defaulting to first fallback option
155:warn:configure All compilers are either blacklisted or unavailable; defaulting to first fallback option
156:warn:configure All compilers are either blacklisted or unavailable; defaulting to first fallback option
157:debug:configure Environment:
158:debug:configure CC='/usr/bin/clang'
159:debug:configure CC_PRINT_OPTIONS='YES'
160:debug:configure CC_PRINT_OPTIONS_FILE='/opt/local/var/macports/build/_opt_local_var_macports_sources_rsync.macports.org_release_tarballs_ports_cross_msp430-gdb/msp430-gdb/work/.CC_PRINT_OPTIONS'
161:debug:configure CFLAGS='-I/opt/local/include -pipe -Os -arch x86_64'
162:debug:configure CPATH='/opt/local/include'
163:debug:configure CPPFLAGS='-I/opt/local/include'
164:debug:configure CXX='/usr/bin/clang++'
165:debug:configure CXXFLAGS='-pipe -Os -stdlib=libc++ -arch x86_64'
166:debug:configure F77FLAGS='-m64'
167:debug:configure F90FLAGS='-pipe -Os -m64'
168:debug:configure FCFLAGS='-pipe -Os -m64'
169:debug:configure FFLAGS='-pipe -Os'
170:debug:configure INSTALL='/usr/bin/install -c'
171:debug:configure LDFLAGS='-L/opt/local/lib -Wl,-headerpad_max_install_names -arch x86_64'
172:debug:configure LIBRARY_PATH='/opt/local/lib'
173:debug:configure MACOSX_DEPLOYMENT_TARGET='10.13'
174:debug:configure OBJC='/usr/bin/clang'
175:debug:configure OBJCFLAGS='-pipe -Os -arch x86_64'
176:debug:configure OBJCXX='/usr/bin/clang++'
177:debug:configure OBJCXXFLAGS='-pipe -Os -stdlib=libc++ -arch x86_64'
178:info:configure Executing:  cd "/opt/local/var/macports/build/_opt_local_var_macports_sources_rsync.macports.org_release_tarballs_ports_cross_msp430-gdb/msp430-gdb/work/gdb-7.2" && ./configure --prefix=/opt/local --target=msp430 --disable-Werror
179:debug:configure system:  cd "/opt/local/var/macports/build/_opt_local_var_macports_sources_rsync.macports.org_release_tarballs_ports_cross_msp430-gdb/msp430-gdb/work/gdb-7.2" && ./configure --prefix=/opt/local --target=msp430 --disable-Werror
180:info:configure checking build system type... x86_64-apple-darwin17.7.0
181:info:configure checking host system type... x86_64-apple-darwin17.7.0
182:info:configure checking target system type... msp430-unknown-none
183:info:configure checking for a BSD-compatible install... /usr/bin/install -c
184:info:configure checking whether ln works... yes
185:info:configure checking whether ln -s works... yes
186:info:configure checking for a sed that does not truncate output... /opt/local/bin/gsed
187:info:configure checking for gawk... gawk
188:info:configure checking for gcc... /usr/bin/clang
189:info:configure checking for C compiler default output file name... a.out
190:info:configure checking whether the C compiler works... yes
191:info:configure checking whether we are cross compiling... no
192:info:configure checking for suffix of executables...
193:info:configure checking for suffix of object files... o
194:info:configure checking whether we are using the GNU C compiler... yes
195:info:configure checking whether /usr/bin/clang accepts -g... yes
196:info:configure checking for /usr/bin/clang option to accept ISO C89... none needed
197:info:configure checking whether we are using the GNU C++ compiler... yes
198:info:configure checking whether /usr/bin/clang++ accepts -g... yes
199:info:configure checking for gnatbind... no
200:info:configure checking for gnatmake... no
201:info:configure checking whether compiler driver understands Ada... no
202:info:configure checking how to compare bootstrapped objects... cmp --ignore-initial=16 $$f1 $$f2
203:info:configure checking for objdir... .libs
204:info:configure checking for version 0.10 (or later revision) of PPL... no
205:info:configure checking how to run the C preprocessor... /usr/bin/clang -E
206:info:configure checking for grep that handles long lines and -e... /opt/local/bin/grep
207:info:configure checking for egrep... /opt/local/bin/grep -E
208:info:configure checking for ANSI C header files... yes
209:info:configure checking for sys/types.h... yes
210:info:configure checking for sys/stat.h... yes
211:info:configure checking for stdlib.h... yes
212:info:configure checking for string.h... yes
213:info:configure checking for memory.h... yes
214:info:configure checking for strings.h... yes
215:info:configure checking for inttypes.h... yes
216:info:configure checking for stdint.h... yes
217:info:configure checking for unistd.h... yes
218:info:configure checking libelf.h usability... no
219:info:configure checking libelf.h presence... no
220:info:configure checking for libelf.h... no
221:info:configure checking gelf.h usability... no
222:info:configure checking gelf.h presence... no
223:info:configure checking for gelf.h... no
224:info:configure checking libelf/libelf.h usability... no
225:info:configure checking libelf/libelf.h presence... no
226:info:configure checking for libelf/libelf.h... no
227:info:configure checking libelf/gelf.h usability... no
228:info:configure checking libelf/gelf.h presence... no
229:info:configure checking for libelf/gelf.h... no
230:info:configure checking for default BUILD_CONFIG...
231:info:configure checking for bison... bison -y
232:info:configure checking for bison... bison
233:info:configure checking for gm4... gm4
234:info:configure checking for flex... flex
235:info:configure checking for flex... flex
236:info:configure checking for makeinfo... makeinfo
237:info:configure makeinfo: warning: error loading ./Config: Can't locate ./Config at /opt/local/bin/makeinfo line 395.
238:info:configure checking for expect... expect
239:info:configure checking for runtest... no
240:info:configure checking for ar... ar
241:info:configure checking for as... as
242:info:configure checking for dlltool... no
243:info:configure checking for ld... (cached) /Applications/Xcode.app/Contents/Developer/Toolchains/XcodeDefault.xctoolchain/usr/bin/ld
244:info:configure checking for lipo... lipo
245:info:configure checking for nm... nm
246:info:configure checking for ranlib... ranlib
247:info:configure checking for strip... strip
248:info:configure checking for windres... no
249:info:configure checking for windmc... no
250:info:configure checking for objcopy... no
251:info:configure checking for objdump... objdump
252:info:configure checking for msp430-cc... no
253:info:configure checking for msp430-gcc... msp430-gcc
254:info:configure checking for msp430-c++... msp430-c++
255:info:configure checking for msp430-gcc... msp430-gcc
256:info:configure checking for msp430-gcj... no
257:info:configure checking for msp430-gfortran... no
258:info:configure checking for msp430-ar... msp430-ar
259:info:configure checking for msp430-as... msp430-as
260:info:configure checking for msp430-dlltool... no
261:info:configure checking for msp430-ld... msp430-ld
262:info:configure checking for msp430-lipo... no
263:info:configure checking for msp430-nm... msp430-nm
264:info:configure checking for msp430-objdump... msp430-objdump
265:info:configure checking for msp430-ranlib... msp430-ranlib
266:info:configure checking for msp430-strip... msp430-strip
267:info:configure checking for msp430-windres... no
268:info:configure checking for msp430-windmc... no
269:info:configure checking where to find the target ar... pre-installed
270:info:configure checking where to find the target as... pre-installed
271:info:configure checking where to find the target cc... pre-installed
272:info:configure checking where to find the target c++... pre-installed
273:info:configure checking where to find the target c++ for libstdc++... pre-installed
274:info:configure checking where to find the target dlltool... pre-installed
275:info:configure checking where to find the target gcc... pre-installed
276:info:configure checking where to find the target gcj... pre-installed
277:info:configure checking where to find the target gfortran... pre-installed
278:info:configure checking where to find the target ld... pre-installed
279:info:configure checking where to find the target lipo... pre-installed
280:info:configure checking where to find the target nm... pre-installed
281:info:configure checking where to find the target objdump... pre-installed
282:info:configure checking where to find the target ranlib... pre-installed
283:info:configure checking where to find the target strip... pre-installed
284:info:configure checking where to find the target windres... pre-installed
285:info:configure checking where to find the target windmc... pre-installed
286:info:configure checking whether to enable maintainer-specific portions of Makefiles... no
287:info:configure checking whether -fkeep-inline-functions is supported... yes
288:info:configure configure: creating ./config.status
289:info:configure config.status: creating Makefile
290:debug:configure Privilege de-escalation not attempted as not running as root.
291:debug:build build phase started at Mon Jul 30 08:14:09 CEST 2018
292:notice:build --->  Building msp430-gdb
293:debug:build Executing org.macports.build (msp430-gdb)
294:debug:build Environment:
295:debug:build CC_PRINT_OPTIONS='YES'
296:debug:build CC_PRINT_OPTIONS_FILE='/opt/local/var/macports/build/_opt_local_var_macports_sources_rsync.macports.org_release_tarballs_ports_cross_msp430-gdb/msp430-gdb/work/.CC_PRINT_OPTIONS'
297:debug:build CFLAGS='-I/opt/local/include'
298:debug:build CPATH='/opt/local/include'
299:debug:build LIBRARY_PATH='/opt/local/lib'
300:debug:build MACOSX_DEPLOYMENT_TARGET='10.13'
301:info:build Executing:  cd "/opt/local/var/macports/build/_opt_local_var_macports_sources_rsync.macports.org_release_tarballs_ports_cross_msp430-gdb/msp430-gdb/work/gdb-7.2" && /usr/bin/make -j4 -w all
302:debug:build system:  cd "/opt/local/var/macports/build/_opt_local_var_macports_sources_rsync.macports.org_release_tarballs_ports_cross_msp430-gdb/msp430-gdb/work/gdb-7.2" && /usr/bin/make -j4 -w all
303:info:build make: Entering directory `/opt/local/var/macports/build/_opt_local_var_macports_sources_rsync.macports.org_release_tarballs_ports_cross_msp430-gdb/msp430-gdb/work/gdb-7.2'
304:info:build make[1]: Entering directory `/opt/local/var/macports/build/_opt_local_var_macports_sources_rsync.macports.org_release_tarballs_ports_cross_msp430-gdb/msp430-gdb/work/gdb-7.2'
305:info:build Configuring in ./intl
306:info:build Configuring in ./libiberty
307:info:build Configuring in ./libdecnumber
308:info:build Configuring in ./etc
309:info:build configure: creating cache ./config.cache
310:info:build configure: creating cache ./config.cache
311:info:build checking whether /Applications/Xcode.app/Contents/Developer/usr/bin/make sets $(MAKE)... checking whether to enable maintainer-specific portions of Makefiles... configure: creating cache ./config.cache
312:info:build no
313:info:build checking for makeinfo... makeinfo --split-size=5000000
314:info:build checking whether /Applications/Xcode.app/Contents/Developer/usr/bin/make sets $(MAKE)... configure: creating cache ./config.cache
315:info:build checking for a BSD-compatible install... /usr/bin/install -c
316:info:build yes
317:info:build checking for a BSD-compatible install... /usr/bin/install -c
318:info:build checking whether NLS is requested... yes
319:info:build yes
320:info:build checking for x86_64-apple-darwin17.7.0-gcc... /usr/bin/clang
321:info:build checking for msgfmt... configure: updating cache ./config.cache
322:info:build configure: creating ./config.status
323:info:build /opt/local/bin/msgfmt
324:info:build checking for gmsgfmt... /opt/local/bin/msgfmt
325:info:build checking for xgettext... /opt/local/bin/xgettext
326:info:build checking for C compiler default output file name... checking for msgmerge... /opt/local/bin/msgmerge
327:info:build a.out
328:info:build checking whether the C compiler works... yes
329:info:build checking whether we are cross compiling... no
330:info:build checking for suffix of executables... checking for x86_64-apple-darwin17.7.0-gcc... /usr/bin/clang
331:info:build checking for suffix of object files... o
332:info:build checking whether we are using the GNU C compiler... config.status: creating Makefile
333:info:build checking for C compiler default output file name... yes
334:info:build checking whether /usr/bin/clang accepts -g... makeinfo: warning: error loading ./Config: Can't locate ./Config at /opt/local/bin/makeinfo line 395.
335:info:build checking for perl... perl
336:info:build checking build system type... yes
337:info:build checking for /usr/bin/clang option to accept ISO C89... a.out
338:info:build checking whether the C compiler works... yes
339:info:build x86_64-apple-darwin17.7.0
340:info:build checking host system type... checking whether we are cross compiling... no
341:info:build checking for suffix of executables... make[1]: Nothing to be done for `all-target'.
342:info:build x86_64-apple-darwin17.7.0
343:info:build checking for x86_64-apple-darwin17.7.0-ar... ar
344:info:build checking for x86_64-apple-darwin17.7.0-ranlib... ranlib
345:info:build checking for x86_64-apple-darwin17.7.0-gcc... /usr/bin/clang
346:info:build Configuring in ./readline
347:info:build none needed
348:info:build checking for x86_64-apple-darwin17.7.0-ranlib... ranlib
349:info:build checking for aclocal... aclocal
350:info:build checking for autoconf... autoconf
351:info:build checking for autoheader... autoheader
352:info:build checking for suffix of object files... checking whether /usr/bin/clang supports -W... yes
353:info:build o
354:info:build checking whether we are using the GNU C compiler... checking whether /usr/bin/clang supports -Wall... yes
355:info:build yes
356:info:build checking whether /usr/bin/clang accepts -g... checking whether /usr/bin/clang supports -Wwrite-strings... checking for C compiler default output file name... yes
357:info:build checking for /usr/bin/clang option to accept ISO C89... yes
358:info:build checking whether /usr/bin/clang supports -Wstrict-prototypes... a.out
359:info:build checking whether the C compiler works... yes
360:info:build checking whether we are cross compiling... no
361:info:build checking for suffix of executables... yes
362:info:build checking whether /usr/bin/clang supports -Wmissing-prototypes... none needed
363:info:build yes
364:info:build checking build system type... checking for suffix of object files... checking whether /usr/bin/clang supports -Wold-style-definition... configure: creating cache ./config.cache
365:info:build x86_64-apple-darwin17.7.0
366:info:build checking host system type... checking build system type... yes
367:info:build o
368:info:build checking whether we are using the GNU C compiler... checking whether /usr/bin/clang supports -Wmissing-format-attribute... x86_64-apple-darwin17.7.0
369:info:build checking for x86_64-apple-darwin17.7.0-ranlib... ranlib
370:info:build checking for library containing strerror... x86_64-apple-darwin17.7.0
371:info:build checking host system type... yes
372:info:build yes
373:info:build checking whether /usr/bin/clang accepts -g... x86_64-apple-darwin17.7.0
374:info:build Beginning configuration for readline-5.1 for x86_64-apple-darwin17.7.0
375:info:build checking whether /Applications/Xcode.app/Contents/Developer/usr/bin/make sets $(MAKE)... checking whether /usr/bin/clang supports -Wcast-qual... yes
376:info:build checking for x86_64-apple-darwin17.7.0-gcc... /usr/bin/clang
377:info:build yes
378:info:build checking for /usr/bin/clang option to accept ISO C89... yes
379:info:build checking whether /usr/bin/clang supports -pedantic -Wno-long-long... none required
380:info:build checking how to run the C preprocessor... yes
381:info:build checking how to run the C preprocessor... none needed
382:info:build checking for special C compiler options needed for large files... no
383:info:build checking for _FILE_OFFSET_BITS value needed for large files... checking for C compiler default output file name... /usr/bin/clang -E
384:info:build no
385:info:build checking how to run the C preprocessor... /usr/bin/clang -E
386:info:build a.out
387:info:build checking whether the C compiler works... yes
388:info:build checking whether we are cross compiling... no
389:info:build checking for suffix of executables... checking for grep that handles long lines and -e...
390:info:build checking for suffix of object files... /usr/bin/clang -E
391:info:build /opt/local/bin/grep
392:info:build checking for egrep... checking for grep that handles long lines and -e... /opt/local/bin/grep -E
393:info:build checking for ANSI C header files... /opt/local/bin/grep
394:info:build checking for egrep... o
395:info:build checking whether we are using the GNU C compiler... /opt/local/bin/grep -E
396:info:build checking for ANSI C header files... yes
397:info:build checking whether /usr/bin/clang accepts -g... checking whether /usr/bin/clang supports -W... yes
398:info:build checking for /usr/bin/clang option to accept ISO C89... yes
399:info:build checking whether /usr/bin/clang supports -Wall... yes
400:info:build checking whether /usr/bin/clang supports -Wwrite-strings... none needed
401:info:build checking how to run the C preprocessor... yes
402:info:build checking whether /usr/bin/clang supports -Wc++-compat... yes
403:info:build checking for an ANSI C-conforming const... yes
404:info:build checking whether /usr/bin/clang supports -Wstrict-prototypes... /usr/bin/clang -E
405:info:build yes
406:info:build yes
407:info:build checking for inline... checking for sys/types.h... yes
408:info:build checking whether /usr/bin/clang supports -pedantic ... inline
409:info:build checking for sys/types.h... yes
410:info:build checking whether /usr/bin/clang and cc understand -c and -o together... checking for grep that handles long lines and -e... yes
411:info:build /opt/local/bin/grep
412:info:build checking for egrep... checking for sys/stat.h... /opt/local/bin/grep -E
413:info:build checking for ANSI C header files... yes
414:info:build checking for sys/stat.h... yes
415:info:build checking for stdlib.h... yes
416:info:build yes
417:info:build checking for an ANSI C-conforming const... checking for stdlib.h... yes
418:info:build yes
419:info:build checking for inline... checking for string.h... inline
420:info:build checking for grep that handles long lines and -e... yes
421:info:build /opt/local/bin/grep
422:info:build checking for egrep... checking for string.h... /opt/local/bin/grep -E
423:info:build checking for ANSI C header files... yes
424:info:build checking for memory.h... yes
425:info:build checking for sys/types.h... yes
426:info:build checking for memory.h... yes
427:info:build checking for strings.h... yes
428:info:build yes
429:info:build checking for sys/stat.h... checking for strings.h... yes
430:info:build checking for inttypes.h... yes
431:info:build yes
432:info:build checking for stdlib.h... checking for inttypes.h... yes
433:info:build yes
434:info:build checking for stdint.h... yes
435:info:build checking for sys/types.h... yes
436:info:build checking for string.h... checking for stdint.h... yes
437:info:build checking for sys/stat.h... yes
438:info:build checking for unistd.h... yes
439:info:build yes
440:info:build yes
441:info:build checking for memory.h... checking for unistd.h... checking for stdlib.h... yes
442:info:build yes
443:info:build yes
444:info:build checking ctype.h usability... checking for strings.h... checking for string.h... yes
445:info:build checking for off_t... yes
446:info:build yes
447:info:build checking ctype.h presence... yes
448:info:build checking for memory.h... checking for inttypes.h... yes
449:info:build checking for ctype.h... yes
450:info:build checking stddef.h usability... yes
451:info:build checking for strings.h... yes
452:info:build checking for stdint.h... yes
453:info:build yes
454:info:build checking for size_t... yes
455:info:build checking stddef.h presence... checking for inttypes.h... yes
456:info:build checking for stddef.h... yes
457:info:build checking for string.h... yes
458:info:build (cached) yes
459:info:build yes
460:info:build checking for unistd.h... checking stdio.h usability... checking for stdint.h... yes
461:info:build checking for unistd.h... yes
462:info:build yes
463:info:build checking stdio.h presence... checking minix/config.h usability... yes
464:info:build checking for working alloca.h... yes
465:info:build yes
466:info:build checking for stdio.h... yes
467:info:build checking whether byte ordering is bigendian... looking for a compliant stdint.h in stdint.h, checking for uintmax_t... yes
468:info:build checking for alloca... no
469:info:build checking minix/config.h presence... yes
470:info:build checking for stdlib.h... (cached) yes
471:info:build no
472:info:build checking for minix/config.h... no
473:info:build checking whether it is safe to define __EXTENSIONS__... checking for unistd.h... (cached) yes
474:info:build yes
475:info:build checking for uintptr_t... checking for getpagesize... yes
476:info:build checking whether /usr/bin/clang needs -traditional... no
477:info:build checking for a BSD-compatible install... /usr/bin/install -c
478:info:build yes
479:info:build checking for working mmap... checking for sys/file.h... yes
480:info:build checking for int_least32_t... no
481:info:build checking for a BSD-compatible install... /usr/bin/install -c
482:info:build checking for ar... ar
483:info:build checking for x86_64-apple-darwin17.7.0-ranlib... ranlib
484:info:build checking for an ANSI C-conforming const... yes
485:info:build checking for sys/param.h... yes
486:info:build checking for function prototypes... yes
487:info:build checking whether char is unsigned... yes
488:info:build yes
489:info:build checking whether we are using the GNU C Library 2.1 or newer... checking for limits.h... no
490:info:build checking whether integer division by zero raises SIGFPE... yes
491:info:build checking for int_fast32_t... yes
492:info:build no
493:info:build checking return type of signal handlers... checking for stdlib.h... (cached) yes
494:info:build checking for malloc.h... no
495:info:build checking for inttypes.h... void
496:info:build no
497:info:build checking for size_t... checking for string.h... (cached) yes
498:info:build yes
499:info:build checking for uint64_t... checking for unistd.h... (cached) yes
500:info:build yes
501:info:build checking for stdint.h... checking for strings.h... (cached) yes
502:info:build checking for sys/time.h... yes
503:info:build checking for unsigned long long... yes
504:info:build yes
505:info:build checking for time.h... checking what to include in gstdint.h... stdint.h (already complete)
506:info:build checking for an ANSI C-conforming const... yes
507:info:build checking for inttypes.h... yes
508:info:build checking for ssize_t... yes
509:info:build yes
510:info:build checking for off_t... checking for sys/resource.h... yes
511:info:build checking whether the inttypes.h PRIxNN macros are broken... yes
512:info:build checking for sys/stat.h... (cached) yes
513:info:build checking for sys/mman.h... no
514:info:build checking for ld used by GCC... yes
515:info:build checking for fcntl.h... /Applications/Xcode.app/Contents/Developer/Toolchains/XcodeDefault.xctoolchain/usr/bin/ld
516:info:build checking if the linker (/Applications/Xcode.app/Contents/Developer/Toolchains/XcodeDefault.xctoolchain/usr/bin/ld) is GNU ld... yes
517:info:build checking for ANSI C header files... (cached) yes
518:info:build checking whether stat file-mode macros are broken... yes
519:info:build checking size of int... yes
520:info:build checking for alloca.h... no
521:info:build checking for dirent.h that defines DIR... yes
522:info:build checking for sys/pstat.h... 4
523:info:build checking size of long... yes
524:info:build checking for library containing opendir... no
525:info:build checking for sys/sysmp.h... no
526:info:build checking for shared library run path origin... none required
527:info:build checking for fcntl... no
528:info:build 8
529:info:build checking for sys/sysinfo.h... checking for ANSI C header files... (cached) yes
530:info:build done
531:info:build checking build system type... checking argz.h usability... yes
532:info:build x86_64-apple-darwin17.7.0
533:info:build checking host system type... no
534:info:build checking for kill... checking for machine/hal_sysinfo.h... x86_64-apple-darwin17.7.0
535:info:build checking target system type... msp430-unknown-none
536:info:build checking for decimal floating point... dpd
537:info:build checking whether byte ordering is bigendian... yes
538:info:build no
539:info:build checking for sys/table.h... no
540:info:build checking argz.h presence... checking for lstat... no
541:info:build checking for argz.h... no
542:info:build no
543:info:build checking limits.h usability... checking for sys/sysctl.h... yes
544:info:build checking for memmove... yes
545:info:build yes
546:info:build checking limits.h presence... checking for sys/systemcfg.h... yes
547:info:build checking for limits.h... yes
548:info:build no
549:info:build yes
550:info:build checking locale.h usability... checking for putenv... no
551:info:build checking for stdint.h... (cached) yes
552:info:build configure: updating cache ./config.cache
553:info:build configure: creating ./config.status
554:info:build checking for stdio_ext.h... yes
555:info:build yes
556:info:build checking locale.h presence... checking for select... no
557:info:build checking for sys/wait.h that is POSIX.1 compatible... yes
558:info:build checking for locale.h... yes
559:info:build checking nl_types.h usability... yes
560:info:build checking for setenv... yes
561:info:build checking whether time.h and sys/time.h may both be included... yes
562:info:build checking nl_types.h presence... yes
563:info:build yes
564:info:build checking whether errno must be declared... yes
565:info:build checking for nl_types.h... yes
566:info:build checking for setlocale... checking malloc.h usability... no
567:info:build checking size of int... yes
568:info:build config.status: creating Makefile
569:info:build checking for strcasecmp... no
570:info:build checking malloc.h presence... config.status: creating config.h
571:info:build 4
572:info:build checking for a 64-bit type... no
573:info:build checking for malloc.h... no
574:info:build checking stddef.h usability... config.status: executing gstdint.h commands
575:info:build yes
576:info:build checking for strpbrk... uint64_t
577:info:build checking for intptr_t... yes
578:info:build checking stddef.h presence... yes
579:info:build checking for stddef.h... yes
580:info:build yes
581:info:build checking for stdlib.h... (cached) yes
582:info:build checking for tcgetattr... checking for string.h... (cached) yes
583:info:build checking for unistd.h... (cached) yes
584:info:build checking sys/param.h usability... make[2]: Entering directory `/opt/local/var/macports/build/_opt_local_var_macports_sources_rsync.macports.org_release_tarballs_ports_cross_msp430-gdb/msp430-gdb/work/gdb-7.2/etc'
585:info:build for f in standards.info configure.info; do \
586:info:build       if test -f ./`echo $f | sed -e 's/.info$/.texi/'`; then \
587:info:build         if /Applications/Xcode.app/Contents/Developer/usr/bin/make "MAKEINFO=makeinfo --split-size=5000000 --split-size=5000000" $f; then \
588:info:build           true; \
589:info:build         else \
590:info:build           exit 1; \
591:info:build         fi; \
592:info:build       fi; \
593:info:build     done
594:info:build make[3]: Entering directory `/opt/local/var/macports/build/_opt_local_var_macports_sources_rsync.macports.org_release_tarballs_ports_cross_msp430-gdb/msp430-gdb/work/gdb-7.2/etc'
595:info:build make[3]: `standards.info' is up to date.
596:info:build make[3]: Leaving directory `/opt/local/var/macports/build/_opt_local_var_macports_sources_rsync.macports.org_release_tarballs_ports_cross_msp430-gdb/msp430-gdb/work/gdb-7.2/etc'
597:info:build yes
598:info:build make[3]: Entering directory `/opt/local/var/macports/build/_opt_local_var_macports_sources_rsync.macports.org_release_tarballs_ports_cross_msp430-gdb/msp430-gdb/work/gdb-7.2/etc'
599:info:build make[3]: `configure.info' is up to date.
600:info:build make[3]: Leaving directory `/opt/local/var/macports/build/_opt_local_var_macports_sources_rsync.macports.org_release_tarballs_ports_cross_msp430-gdb/msp430-gdb/work/gdb-7.2/etc'
601:info:build make[2]: Leaving directory `/opt/local/var/macports/build/_opt_local_var_macports_sources_rsync.macports.org_release_tarballs_ports_cross_msp430-gdb/msp430-gdb/work/gdb-7.2/etc'
602:info:build yes
603:info:build checking for uintptr_t... checking for vsnprintf... yes
604:info:build checking sys/param.h presence... make[2]: Entering directory `/opt/local/var/macports/build/_opt_local_var_macports_sources_rsync.macports.org_release_tarballs_ports_cross_msp430-gdb/msp430-gdb/work/gdb-7.2/libdecnumber'
605:info:build source='decNumber.c' object='decNumber.o' libtool=no /usr/bin/clang  -I. -I.  -I/opt/local/include -pipe -Os -arch x86_64 -W -Wall -Wwrite-strings -Wstrict-prototypes -Wmissing-prototypes -Wold-style-definition -Wmissing-format-attribute -Wcast-qual -pedantic -Wno-long-long  -I. -I.  -c decNumber.c
606:info:build yes
607:info:build yes
608:info:build checking for sys/param.h... yes
609:info:build checking for isascii... checking for feof_unlocked... yes
610:info:build checking for pid_t... yes
611:info:build yes
612:info:build checking for isxdigit... checking for fgets_unlocked... no
613:info:build yes
614:info:build checking for getc_unlocked... checking for getpwent... yes
615:info:build checking for library containing strerror... yes
616:info:build yes
617:info:build checking for getcwd... checking for getpwnam... none required
618:info:build yes
619:info:build checking for asprintf... yes
620:info:build checking for getegid... checking for getpwuid... yes
621:info:build yes
622:info:build checking for atexit... yes
623:info:build checking for geteuid... checking for working strcoll... yes
624:info:build yes
625:info:build checking for basename... checking for getgid... yes
626:info:build checking fcntl.h usability... yes
627:info:build yes
628:info:build checking for bcmp... checking for getuid... yes
629:info:build checking fcntl.h presence... yes
630:info:build yes
631:info:build checking for bcopy... yes
632:info:build checking for fcntl.h... yes
633:info:build checking for mempcpy... checking for unistd.h... (cached) yes
634:info:build checking for stdlib.h... (cached) yes
635:info:build checking varargs.h usability... yes
636:info:build checking for bsearch... no
637:info:build checking for munmap... yes
638:info:build no
639:info:build checking varargs.h presence... checking for bzero... yes
640:info:build checking for putenv... no
641:info:build checking for varargs.h... no
642:info:build checking stdarg.h usability... yes
643:info:build yes
644:info:build checking for calloc... checking for setenv... yes
645:info:build checking stdarg.h presence... yes
646:info:build checking for stdarg.h... yes
647:info:build yes
648:info:build checking for string.h... (cached) yes
649:info:build checking for setlocale... checking for strings.h... (cached) yes
650:info:build yes
651:info:build checking for clock... checking limits.h usability... yes
652:info:build checking for stpcpy... yes
653:info:build yes
654:info:build checking limits.h presence... checking for ffs... yes
655:info:build checking for limits.h... yes
656:info:build source='decContext.c' object='decContext.o' libtool=no /usr/bin/clang  -I. -I.  -I/opt/local/include -pipe -Os -arch x86_64 -W -Wall -Wwrite-strings -Wstrict-prototypes -Wmissing-prototypes -Wold-style-definition -Wmissing-format-attribute -Wcast-qual -pedantic -Wno-long-long  -I. -I.  -c decContext.c
657:info:build checking locale.h usability... yes
658:info:build yes
659:info:build checking for getcwd... checking for strcasecmp... yes
660:info:build checking locale.h presence... source='dpd/decimal32.c' object='decimal32.o' libtool=no /usr/bin/clang  -I. -I.  -I/opt/local/include -pipe -Os -arch x86_64 -W -Wall -Wwrite-strings -Wstrict-prototypes -Wmissing-prototypes -Wold-style-definition -Wmissing-format-attribute -Wcast-qual -pedantic -Wno-long-long  -I. -I.  -c ./dpd/decimal32.c
661:info:build yes
662:info:build checking for locale.h... yes
663:info:build yes
664:info:build checking pwd.h usability... checking for getpagesize... yes
665:info:build checking for strdup... yes
666:info:build yes
667:info:build checking pwd.h presence... source='dpd/decimal64.c' object='decimal64.o' libtool=no /usr/bin/clang  -I. -I.  -I/opt/local/include -pipe -Os -arch x86_64 -W -Wall -Wwrite-strings -Wstrict-prototypes -Wmissing-prototypes -Wold-style-definition -Wmissing-format-attribute -Wcast-qual -pedantic -Wno-long-long  -I. -I.  -c ./dpd/decimal64.c
668:info:build checking for gettimeofday... yes
669:info:build checking for pwd.h... yes
670:info:build yes
671:info:build checking for memory.h... (cached) yes
672:info:build checking for strtoul... checking termcap.h usability... yes
673:info:build checking for index... yes
674:info:build yes
675:info:build checking termcap.h presence... checking for tsearch... source='dpd/decimal128.c' object='decimal128.o' libtool=no /usr/bin/clang  -I. -I.  -I/opt/local/include -pipe -Os -arch x86_64 -W -Wall -Wwrite-strings -Wstrict-prototypes -Wmissing-prototypes -Wold-style-definition -Wmissing-format-attribute -Wcast-qual -pedantic -Wno-long-long  -I. -I.  -c ./dpd/decimal128.c
676:info:build yes
677:info:build checking for termcap.h... yes
678:info:build yes
679:info:build checking termios.h usability... checking for insque... yes
680:info:build checking for __argz_count... yes
681:info:build checking termios.h presence... yes
682:info:build checking for memchr... yes
683:info:build checking for termios.h... yes
684:info:build rm -f libdecnumber.a
685:info:build ar cru libdecnumber.a decNumber.o decContext.o decimal32.o decimal64.o decimal128.o
686:info:build no
687:info:build checking termio.h usability... checking for __argz_stringify... yes
688:info:build ranlib libdecnumber.a
689:info:build checking for memcmp... no
690:info:build checking termio.h presence... no
691:info:build checking for __argz_next... make[2]: Leaving directory `/opt/local/var/macports/build/_opt_local_var_macports_sources_rsync.macports.org_release_tarballs_ports_cross_msp430-gdb/msp430-gdb/work/gdb-7.2/libdecnumber'
692:info:build no
693:info:build checking for termio.h... no
694:info:build checking sys/pte.h usability... yes
695:info:build checking for memcpy... no
696:info:build checking for __fsetlocking... no
697:info:build checking sys/pte.h presence... yes
698:info:build checking for memmem... no
699:info:build checking for iconv... no
700:info:build checking for sys/pte.h... no
701:info:build checking sys/stream.h usability... yes
702:info:build checking for memmove... no
703:info:build checking sys/stream.h presence... yes
704:info:build no
705:info:build checking for sys/stream.h... no
706:info:build checking sys/select.h usability... checking for mempcpy... yes
707:info:build checking how to link with libiconv... -liconv
708:info:build checking for iconv declaration... yes
709:info:build checking sys/select.h presence... no
710:info:build install-shextern size_t iconv (iconv_t cd, char * *inbuf, size_t *inbytesleft, char * *outbuf, size_t *outbytesleft);
711:info:build yes
712:info:build checking for sys/select.h... yes
713:info:build checking for nl_langinfo and CODESET... checking for memset... checking sys/file.h usability... yes
714:info:build checking for LC_MESSAGES... yes
715:info:build checking sys/file.h presence... yes
716:info:build checking for mkstemps... yes
717:info:build checking for bison... bison
718:info:build checking version of bison... yes
719:info:build checking for sys/file.h... yes
720:info:build checking for sys/ptem.h... 3.0.5, ok
721:info:build checking whether NLS is requested... yes
722:info:build checking whether included gettext is requested... no
723:info:build checking for GNU gettext in libc... yes
724:info:build checking for putenv... no
725:info:build checking for type of signal functions... yes
726:info:build no
727:info:build checking for random... checking for GNU gettext in libintl... posix
728:info:build checking if signal handlers must be reinstalled when invoked... yes
729:info:build yes
730:info:build checking whether to use NLS... yes
731:info:build checking where the gettext function comes from... external libintl
732:info:build checking how to link with libintl... -lintl
733:info:build checking for aclocal... aclocal
734:info:build checking for autoconf... autoconf
735:info:build checking for autoheader... autoheader
736:info:build checking for rename... configure: updating cache ./config.cache
737:info:build no
738:info:build checking for presence of POSIX-style sigsetjmp/siglongjmp... configure: creating ./config.status
739:info:build yes
740:info:build checking for rindex... present
741:info:build checking for lstat... yes
742:info:build checking for setenv... yes
743:info:build checking whether or not strcoll and strcmp differ... yes
744:info:build checking for snprintf... config.status: creating Makefile
745:info:build no
746:info:build checking whether the ctype macros accept non-ascii characters... config.status: creating config.intl
747:info:build yes
748:info:build checking for sigsetmask... config.status: creating config.h
749:info:build yes
750:info:build checking whether getpw functions are declared in pwd.h... yes
751:info:build config.status: executing default-1 commands
752:info:build checking for stpcpy... yes
753:info:build checking whether termios.h defines TIOCGWINSZ... yes
754:info:build checking whether signal handlers are of type void... Configuring in ./sim
755:info:build yes
756:info:build checking for stpncpy... yes
757:info:build checking for TIOCSTAT in sys/ioctl.h... make[2]: Entering directory `/opt/local/var/macports/build/_opt_local_var_macports_sources_rsync.macports.org_release_tarballs_ports_cross_msp430-gdb/msp430-gdb/work/gdb-7.2/intl'
758:info:build make[2]: Nothing to be done for `all'.
759:info:build make[2]: Leaving directory `/opt/local/var/macports/build/_opt_local_var_macports_sources_rsync.macports.org_release_tarballs_ports_cross_msp430-gdb/msp430-gdb/work/gdb-7.2/intl'
760:info:build yes
761:info:build checking for FIONREAD in sys/ioctl.h... yes
762:info:build checking for strcasecmp... yes
763:info:build checking for speed_t in sys/types.h... no
764:info:build checking for struct winsize in sys/ioctl.h and termios.h... yes
765:info:build configure: creating cache ./config.cache
766:info:build checking for x86_64-apple-darwin17.7.0-gcc... /usr/bin/clang
767:info:build checking for strchr... sys/ioctl.h
768:info:build checking for struct dirent.d_ino... checking for C compiler default output file name... yes
769:info:build yes
770:info:build checking for struct dirent.d_fileno... checking for strdup... a.out
771:info:build checking whether the C compiler works... yes
772:info:build checking whether we are cross compiling... no
773:info:build checking for suffix of executables... yes
774:info:build checking for tgetent... yes
775:info:build checking for suffix of object files... checking for strncasecmp... o
776:info:build checking whether we are using the GNU C compiler... no
777:info:build checking for tgetent in -ltermcap... yes
778:info:build checking whether /usr/bin/clang accepts -g... yes
779:info:build checking for strndup... yes
780:info:build checking which library has the termcap functions... using libtermcap
781:info:build checking wctype.h usability... yes
782:info:build checking for /usr/bin/clang option to accept ISO C89... yes
783:info:build checking wctype.h presence... none needed
784:info:build checking for a BSD-compatible install... /usr/bin/install -c
785:info:build checking for x86_64-apple-darwin17.7.0-ar... ar
786:info:build checking for x86_64-apple-darwin17.7.0-ranlib... ranlib
787:info:build yes
788:info:build checking for strrchr... checking build system type... yes
789:info:build checking for wctype.h... yes
790:info:build checking wchar.h usability... x86_64-apple-darwin17.7.0
791:info:build checking host system type... x86_64-apple-darwin17.7.0
792:info:build checking target system type... yes
793:info:build checking wchar.h presence... msp430-unknown-none
794:info:build checking for x86_64-apple-darwin17.7.0-gcc... (cached) /usr/bin/clang
795:info:build yes
796:info:build checking for strstr... yes
797:info:build checking for wchar.h... yes
798:info:build checking langinfo.h usability... checking whether we are using the GNU C compiler... (cached) yes
799:info:build checking whether /usr/bin/clang accepts -g... (cached) yes
800:info:build checking for /usr/bin/clang option to accept ISO C89... (cached) none needed
801:info:build checking for x86_64-apple-darwin17.7.0-ranlib... (cached) ranlib
802:info:build yes
803:info:build yes
804:info:build checking langinfo.h presence... configure: updating cache ./config.cache
805:info:build checking for strtod... configure: creating ./config.status
806:info:build yes
807:info:build checking for langinfo.h... yes
808:info:build checking for mbsrtowcs... yes
809:info:build checking for strtol... yes
810:info:build checking for mbrtowc... yes
811:info:build yes
812:info:build checking for mbrlen... checking for strtoul... yes
813:info:build yes
814:info:build checking for wctomb... checking for strverscmp... config.status: creating Makefile
815:info:build yes
816:info:build checking for wcwidth... === configuring in msp430 (/opt/local/var/macports/build/_opt_local_var_macports_sources_rsync.macports.org_release_tarballs_ports_cross_msp430-gdb/msp430-gdb/work/gdb-7.2/sim/msp430)
817:info:build configure: running /bin/sh ./configure --disable-option-checking '--prefix=/opt/local'  '--with-system-zlib' '--disable-Werror' '--program-transform-name=s&^&msp430-&' '--build=x86_64-apple-darwin17.7.0' '--host=x86_64-apple-darwin17.7.0' '--target=msp430' 'build_alias=x86_64-apple-darwin17.7.0' 'host_alias=x86_64-apple-darwin17.7.0' 'target_alias=msp430' 'CC=/usr/bin/clang' 'CFLAGS=-I/opt/local/include -pipe -Os -arch x86_64' 'LDFLAGS= -L/opt/local/lib -Wl,-headerpad_max_install_names -arch x86_64' --cache-file=.././config.cache --srcdir=.
818:info:build no
819:info:build checking for tmpnam... yes
820:info:build checking for wcsdup... yes
821:info:build checking for vasprintf... yes
822:info:build checking for mbstate_t... yes
823:info:build yes
824:info:build checking for nl_langinfo and CODESET... checking for vfprintf... yes
825:info:build checking configuration for building shared libraries... supported
826:info:build configure: loading cache .././config.cache
827:info:build yes
828:info:build checking build system type... (cached) x86_64-apple-darwin17.7.0
829:info:build checking host system type... (cached) x86_64-apple-darwin17.7.0
830:info:build checking target system type... (cached) msp430-unknown-none
831:info:build checking for x86_64-apple-darwin17.7.0-gcc... (cached) /usr/bin/clang
832:info:build checking for vprintf... configure: updating cache ./config.cache
833:info:build configure: creating ./config.status
834:info:build yes
835:info:build checking for C compiler default output file name... checking for vsnprintf... a.out
836:info:build checking whether the C compiler works... yes
837:info:build checking whether we are cross compiling... no
838:info:build checking for suffix of executables... yes
839:info:build checking for vsprintf...
840:info:build checking for suffix of object files... (cached) o
841:info:build checking whether we are using the GNU C compiler... (cached) yes
842:info:build checking whether /usr/bin/clang accepts -g... (cached) yes
843:info:build checking for /usr/bin/clang option to accept ISO C89... (cached) none needed
844:info:build checking for a BSD-compatible install... /usr/bin/install -c
845:info:build checking for x86_64-apple-darwin17.7.0-ranlib... (cached) ranlib
846:info:build checking whether NLS is requested... yes
847:info:build checking for catalogs to be installed...
848:info:build checking how to run the C preprocessor... config.status: creating Makefile
849:info:build yes
850:info:build /usr/bin/clang -E
851:info:build checking for waitpid... config.status: creating doc/Makefile
852:info:build config.status: creating examples/Makefile
853:info:build yes
854:info:build checking whether alloca needs Cray hooks... checking for grep that handles long lines and -e... /opt/local/bin/grep
855:info:build checking for egrep... no
856:info:build checking stack direction for C alloca... config.status: creating shlib/Makefile
857:info:build /opt/local/bin/grep -E
858:info:build checking for ANSI C header files... config.status: creating config.h
859:info:build -1
860:info:build checking for vfork.h... config.status: executing default commands
861:info:build no
862:info:build checking for fork... yes
863:info:build make[2]: Entering directory `/opt/local/var/macports/build/_opt_local_var_macports_sources_rsync.macports.org_release_tarballs_ports_cross_msp430-gdb/msp430-gdb/work/gdb-7.2/readline'
864:info:build rm -f readline.o
865:info:build rm -f vi_mode.o
866:info:build /usr/bin/clang -c -DHAVE_CONFIG_H    -I. -I. -DRL_LIBRARY_VERSION='"5.1"' -I/opt/local/include -pipe -Os -arch x86_64 readline.c
867:info:build /usr/bin/clang -c -DHAVE_CONFIG_H    -I. -I. -DRL_LIBRARY_VERSION='"5.1"' -I/opt/local/include -pipe -Os -arch x86_64 vi_mode.c
868:info:build checking for vfork... yes
869:info:build checking for sys/types.h... yes
870:info:build checking for working fork... yes
871:info:build checking for sys/stat.h... rm -f funmap.o
872:info:build /usr/bin/clang -c -DHAVE_CONFIG_H    -I. -I. -DRL_LIBRARY_VERSION='"5.1"' -I/opt/local/include -pipe -Os -arch x86_64 funmap.c
873:info:build yes
874:info:build yes
875:info:build checking for working vfork... (cached) yes
876:info:build checking for _doprnt... checking for stdlib.h... rm -f keymaps.o
877:info:build /usr/bin/clang -c -DHAVE_CONFIG_H    -I. -I. -DRL_LIBRARY_VERSION='"5.1"' -I/opt/local/include -pipe -Os -arch x86_64 keymaps.c
878:info:build yes
879:info:build no
880:info:build checking for sys_errlist... checking for string.h... rm -f parens.o
881:info:build /usr/bin/clang -c -DHAVE_CONFIG_H    -I. -I. -DRL_LIBRARY_VERSION='"5.1"' -I/opt/local/include -pipe -Os -arch x86_64 parens.c
882:info:build rm -f search.o
883:info:build /usr/bin/clang -c -DHAVE_CONFIG_H    -I. -I. -DRL_LIBRARY_VERSION='"5.1"' -I/opt/local/include -pipe -Os -arch x86_64 search.c
884:info:build yes
885:info:build yes
886:info:build checking for sys_nerr... checking for memory.h... rm -f rltty.o
887:info:build /usr/bin/clang -c -DHAVE_CONFIG_H    -I. -I. -DRL_LIBRARY_VERSION='"5.1"' -I/opt/local/include -pipe -Os -arch x86_64 rltty.c
888:info:build yes
889:info:build checking for sys_siglist... yes
890:info:build rm -f complete.o
891:info:build checking for strings.h... /usr/bin/clang -c -DHAVE_CONFIG_H    -I. -I. -DRL_LIBRARY_VERSION='"5.1"' -I/opt/local/include -pipe -Os -arch x86_64 complete.c
892:info:build rltty.c:150:7: warning: implicit declaration of function 'ioctl' is invalid in C99 [-Wimplicit-function-declaration]
893:info:build   if (ioctl (tty, TIOCGWINSZ, &w) == 0)
894:info:build       ^
895:info:build yes
896:info:build checking for external symbol _system_configuration... yes
897:info:build complete.c:886:23: warning: using the result of an assignment as a condition without parentheses [-Wparentheses]
898:info:build       while (rl_point = MB_PREVCHAR (rl_line_buffer, rl_point, MB_FIND_ANY))
899:info:build              ~~~~~~~~~^~~~~~~~~~~~~~~~~~~~~~~~~~~~~~~~~~~~~~~~~~~~~~~~~~~~~
900:info:build complete.c:886:23: note: place parentheses around the assignment to silence this warning
901:info:build       while (rl_point = MB_PREVCHAR (rl_line_buffer, rl_point, MB_FIND_ANY))
902:info:build                       ^
903:info:build              (                                                             )
904:info:build complete.c:886:23: note: use '==' to turn this assignment into an equality comparison
905:info:build       while (rl_point = MB_PREVCHAR (rl_line_buffer, rl_point, MB_FIND_ANY))
906:info:build                       ^
907:info:build                       ==
908:info:build complete.c:1816:17: warning: using the result of an assignment as a condition without parentheses [-Wparentheses]
909:info:build   while (string = (*entry_function) (text, matches))
910:info:build          ~~~~~~~^~~~~~~~~~~~~~~~~~~~~~~~~~~~~~~~~~~
911:info:build complete.c:1816:17: note: place parentheses around the assignment to silence this warning
912:info:build   while (string = (*entry_function) (text, matches))
913:info:build                 ^
914:info:build          (                                         )
915:info:build complete.c:1816:17: note: use '==' to turn this assignment into an equality comparison
916:info:build   while (string = (*entry_function) (text, matches))
917:info:build                 ^
918:info:build                 ==
919:info:build complete.c:1867:16: warning: using the result of an assignment as a condition without parentheses [-Wparentheses]
920:info:build   while (entry = getpwent ())
921:info:build          ~~~~~~^~~~~~~~~~~~~
922:info:build complete.c:1867:16: note: place parentheses around the assignment to silence this warning
923:info:build   while (entry = getpwent ())
924:info:build                ^
925:info:build          (                  )
926:info:build complete.c:1867:16: note: use '==' to turn this assignment into an equality comparison
927:info:build   while (entry = getpwent ())
928:info:build                ^
929:info:build                ==
930:info:build 1 warning generated.
931:info:build checking for inttypes.h... rm -f bind.o
932:info:build /usr/bin/clang -c -DHAVE_CONFIG_H    -I. -I. -DRL_LIBRARY_VERSION='"5.1"' -I/opt/local/include -pipe -Os -arch x86_64 bind.c
933:info:build no
934:info:build checking for getrusage... bind.c:442:21: warning: using the result of an assignment as a condition without parentheses [-Wparentheses]
935:info:build   for (i = l = 0; c = seq[i]; i++)
936:info:build                   ~~^~~~~~~~
937:info:build bind.c:442:21: note: place parentheses around the assignment to silence this warning
938:info:build   for (i = l = 0; c = seq[i]; i++)
939:info:build                     ^
940:info:build                   (         )
941:info:build bind.c:442:21: note: use '==' to turn this assignment into an equality comparison
942:info:build   for (i = l = 0; c = seq[i]; i++)
943:info:build                     ^
944:info:build                     ==
945:info:build yes
946:info:build bind.c:1157:21: warning: using the result of an assignment as a condition without parentheses [-Wparentheses]
947:info:build       for (i = 1; c = string[i]; i++)
948:info:build                   ~~^~~~~~~~~~~
949:info:build bind.c:1157:21: note: place parentheses around the assignment to silence this warning
950:info:build       for (i = 1; c = string[i]; i++)
951:info:build                     ^
952:info:build                   (            )
953:info:build bind.c:1157:21: note: use '==' to turn this assignment into an equality comparison
954:info:build       for (i = 1; c = string[i]; i++)
955:info:build                     ^
956:info:build                     ==
957:info:build bind.c:1248:25: warning: using the result of an assignment as a condition without parentheses [-Wparentheses]
958:info:build       for (passc = 0; c = string[i]; i++)
959:info:build                       ~~^~~~~~~~~~~
960:info:build bind.c:1248:25: note: place parentheses around the assignment to silence this warning
961:info:build       for (passc = 0; c = string[i]; i++)
962:info:build                         ^
963:info:build                       (            )
964:info:build bind.c:1248:25: note: use '==' to turn this assignment into an equality comparison
965:info:build       for (passc = 0; c = string[i]; i++)
966:info:build                         ^
967:info:build                         ==
968:info:build bind.c:2018:20: warning: using the result of an assignment as a condition without parentheses [-Wparentheses]
969:info:build   for (i = 0; name = names[i]; i++)
970:info:build               ~~~~~^~~~~~~~~~
971:info:build bind.c:2018:20: note: place parentheses around the assignment to silence this warning
972:info:build   for (i = 0; name = names[i]; i++)
973:info:build                    ^
974:info:build               (              )
975:info:build bind.c:2018:20: note: use '==' to turn this assignment into an equality comparison
976:info:build   for (i = 0; name = names[i]; i++)
977:info:build                    ^
978:info:build                    ==
979:info:build checking for stdint.h... yes
980:info:build checking for on_exit... yes
981:info:build checking for unistd.h... no
982:info:build checking for psignal... 3 warnings generated.
983:info:build rm -f isearch.o
984:info:build /usr/bin/clang -c -DHAVE_CONFIG_H    -I. -I. -DRL_LIBRARY_VERSION='"5.1"' -I/opt/local/include -pipe -Os -arch x86_64 isearch.c
985:info:build yes
986:info:build checking for stdlib.h... (cached) yes
987:info:build checking for string.h... (cached) yes
988:info:build yes
989:info:build checking for strings.h... (cached) yes
990:info:build checking for strerror... checking for unistd.h... (cached) yes
991:info:build checking time.h usability... yes
992:info:build rm -f display.o
993:info:build /usr/bin/clang -c -DHAVE_CONFIG_H    -I. -I. -DRL_LIBRARY_VERSION='"5.1"' -I/opt/local/include -pipe -Os -arch x86_64 display.c
994:info:build yes
995:info:build checking time.h presence... checking for strsignal... 4 warnings generated.
996:info:build rm -f signals.o
997:info:build /usr/bin/clang -c -DHAVE_CONFIG_H    -I. -I. -DRL_LIBRARY_VERSION='"5.1"' -I/opt/local/include -pipe -Os -arch x86_64 signals.c
998:info:build yes
999:info:build checking for time.h... yes
1000:info:build display.c:468:3: warning: implicit declaration of function '_rl_block_sigint' is invalid in C99 [-Wimplicit-function-declaration]
1001:info:build   _rl_block_sigint ();
1002:info:build   ^
1003:info:build display.c:1147:3: warning: implicit declaration of function '_rl_release_sigint' is invalid in C99 [-Wimplicit-function-declaration]
1004:info:build   _rl_release_sigint ();
1005:info:build   ^
1006:info:build checking sys/time.h usability... yes
1007:info:build checking for sysconf... rm -f util.o
1008:info:build /usr/bin/clang -c -DHAVE_CONFIG_H    -I. -I. -DRL_LIBRARY_VERSION='"5.1"' -I/opt/local/include -pipe -Os -arch x86_64 util.c
1009:info:build yes
1010:info:build checking sys/time.h presence... yes
1011:info:build checking for times... yes
1012:info:build checking for sys/time.h... yes
1013:info:build checking sys/resource.h usability... rm -f kill.o
1014:info:build /usr/bin/clang -c -DHAVE_CONFIG_H    -I. -I. -DRL_LIBRARY_VERSION='"5.1"' -I/opt/local/include -pipe -Os -arch x86_64 kill.c
1015:info:build yes
1016:info:build checking for sbrk... yes
1017:info:build checking sys/resource.h presence... yes
1018:info:build checking for sys/resource.h... yes
1019:info:build yes
1020:info:build checking fcntl.h usability... checking for gettimeofday... (cached) yes
1021:info:build checking for realpath... rm -f undo.o
1022:info:build /usr/bin/clang -c -DHAVE_CONFIG_H    -I. -I. -DRL_LIBRARY_VERSION='"5.1"' -I/opt/local/include -pipe -Os -arch x86_64 undo.c
1023:info:build 2 warnings generated.
1024:info:build rm -f macro.o
1025:info:build yes
1026:info:build checking fcntl.h presence... /usr/bin/clang -c -DHAVE_CONFIG_H    -I. -I. -DRL_LIBRARY_VERSION='"5.1"' -I/opt/local/include -pipe -Os -arch x86_64 macro.c
1027:info:build yes
1028:info:build checking for canonicalize_file_name... yes
1029:info:build checking for fcntl.h... yes
1030:info:build rm -f input.o
1031:info:build /usr/bin/clang -c -DHAVE_CONFIG_H    -I. -I. -DRL_LIBRARY_VERSION='"5.1"' -I/opt/local/include -pipe -Os -arch x86_64 input.c
1032:info:build checking fpu_control.h usability... rm -f callback.o
1033:info:build /usr/bin/clang -c -DHAVE_CONFIG_H    -I. -I. -DRL_LIBRARY_VERSION='"5.1"' -I/opt/local/include -pipe -Os -arch x86_64 callback.c
1034:info:build input.c:427:13: warning: using the result of an assignment as a condition without parentheses [-Wparentheses]
1035:info:build       if (c = _rl_next_macro_key ())
1036:info:build           ~~^~~~~~~~~~~~~~~~~~~~~~~
1037:info:build input.c:427:13: note: place parentheses around the assignment to silence this warning
1038:info:build       if (c = _rl_next_macro_key ())
1039:info:build             ^
1040:info:build           (                        )
1041:info:build input.c:427:13: note: use '==' to turn this assignment into an equality comparison
1042:info:build       if (c = _rl_next_macro_key ())
1043:info:build             ^
1044:info:build             ==
1045:info:build no
1046:info:build checking for pstat_getstatic... no
1047:info:build checking fpu_control.h presence... 1 warning generated.
1048:info:build rm -f terminal.o
1049:info:build rm -f text.o
1050:info:build /usr/bin/clang -c -DHAVE_CONFIG_H    -I. -I. -DRL_LIBRARY_VERSION='"5.1"' -I/opt/local/include -pipe -Os -arch x86_64 terminal.c
1051:info:build /usr/bin/clang -c -DHAVE_CONFIG_H    -I. -I. -DRL_LIBRARY_VERSION='"5.1"' -I/opt/local/include -pipe -Os -arch x86_64 text.c
1052:info:build no
1053:info:build checking for fpu_control.h... no
1054:info:build no
1055:info:build checking dlfcn.h usability... checking for pstat_getdynamic... terminal.c:214:7: warning: implicit declaration of function 'ioctl' is invalid in C99 [-Wimplicit-function-declaration]
1056:info:build   if (ioctl (tty, TIOCGWINSZ, &window_size) == 0)
1057:info:build       ^
1058:info:build yes
1059:info:build checking dlfcn.h presence... no
1060:info:build 1 warning generated.
1061:info:build checking for sysmp... rm -f nls.o
1062:info:build /usr/bin/clang -c -DHAVE_CONFIG_H    -I. -I. -DRL_LIBRARY_VERSION='"5.1"' -I/opt/local/include -pipe -Os -arch x86_64 nls.c
1063:info:build yes
1064:info:build checking for dlfcn.h... yes
1065:info:build checking errno.h usability... rm -f misc.o
1066:info:build /usr/bin/clang -c -DHAVE_CONFIG_H    -I. -I. -DRL_LIBRARY_VERSION='"5.1"' -I/opt/local/include -pipe -Os -arch x86_64 misc.c
1067:info:build no
1068:info:build checking for getsysinfo... yes
1069:info:build checking errno.h presence... rm -f compat.o
1070:info:build /usr/bin/clang -c -DHAVE_CONFIG_H    -I. -I. -DRL_LIBRARY_VERSION='"5.1"' -I/opt/local/include -pipe -Os -arch x86_64 compat.c
1071:info:build yes
1072:info:build checking for errno.h... yes
1073:info:build misc.c:215:1: warning: control may reach end of non-void function [-Wreturn-type]
1074:info:build }
1075:info:build ^
1076:info:build checking for sys/stat.h... (cached) yes
1077:info:build checking for getrusage... rm -f xmalloc.o
1078:info:build /usr/bin/clang -c -DHAVE_CONFIG_H    -I. -I. -DRL_LIBRARY_VERSION='"5.1"' -I/opt/local/include -pipe -Os -arch x86_64 xmalloc.c
1079:info:build no
1080:info:build checking for table... 1 warning generated.
1081:info:build rm -f history.o
1082:info:build /usr/bin/clang -c -DHAVE_CONFIG_H    -I. -I. -DRL_LIBRARY_VERSION='"5.1"' -I/opt/local/include -pipe -Os -arch x86_64 history.c
1083:info:build yes
1084:info:build rm -f histexpand.o
1085:info:build /usr/bin/clang -c -DHAVE_CONFIG_H    -I. -I. -DRL_LIBRARY_VERSION='"5.1"' -I/opt/local/include -pipe -Os -arch x86_64 histexpand.c
1086:info:build checking for time... no
1087:info:build checking for sysctl... histexpand.c:208:27: warning: using the result of an assignment as a condition without parentheses [-Wparentheses]
1088:info:build   for (local_index = i; c = string[i]; i++)
1089:info:build                         ~~^~~~~~~~~~~
1090:info:build histexpand.c:208:27: note: place parentheses around the assignment to silence this warning
1091:info:build   for (local_index = i; c = string[i]; i++)
1092:info:build                           ^
1093:info:build                         (            )
1094:info:build histexpand.c:208:27: note: use '==' to turn this assignment into an equality comparison
1095:info:build   for (local_index = i; c = string[i]; i++)
1096:info:build                           ^
1097:info:build                           ==
1098:info:build yes
1099:info:build rm -f histfile.o
1100:info:build /usr/bin/clang -c -DHAVE_CONFIG_H    -I. -I. -DRL_LIBRARY_VERSION='"5.1"' -I/opt/local/include -pipe -Os -arch x86_64 histfile.c
1101:info:build checking for sigaction... yes
1102:info:build checking for wait3... yes
1103:info:build checking for __setfpucw... yes
1104:info:build rm -f histsearch.o
1105:info:build /usr/bin/clang -c -DHAVE_CONFIG_H    -I. -I. -DRL_LIBRARY_VERSION='"5.1"' -I/opt/local/include -pipe -Os -arch x86_64 histsearch.c
1106:info:build checking for wait4... no
1107:info:build checking for bind in -lsocket... yes
1108:info:build rm -f shell.o
1109:info:build /usr/bin/clang -c -DHAVE_CONFIG_H    -I. -I. -DRL_LIBRARY_VERSION='"5.1"' -I/opt/local/include -pipe -Os -arch x86_64 shell.c
1110:info:build checking for __fsetlocking... no
1111:info:build checking for gethostbyname in -lnsl... 1 warning generated.
1112:info:build rm -f mbutil.o
1113:info:build /usr/bin/clang -c -DHAVE_CONFIG_H    -I. -I. -DRL_LIBRARY_VERSION='"5.1"' -I/opt/local/include -pipe -Os -arch x86_64 mbutil.c
1114:info:build rm -f tilde.o
1115:info:build /usr/bin/clang -DHAVE_CONFIG_H    -I. -I. -DRL_LIBRARY_VERSION='"5.1"' -I/opt/local/include -pipe -Os -arch x86_64 -DREADLINE_LIBRARY -c ./tilde.c
1116:info:build no
1117:info:build checking whether basename is declared... no
1118:info:build checking for library containing zlibVersion... ./tilde.c:199:14: warning: using the result of an assignment as a condition without parentheses [-Wparentheses]
1119:info:build   if (result = strchr (string, '~'))
1120:info:build       ~~~~~~~^~~~~~~~~~~~~~~~~~~~~~
1121:info:build ./tilde.c:199:14: note: place parentheses around the assignment to silence this warning
1122:info:build   if (result = strchr (string, '~'))
1123:info:build              ^
1124:info:build       (                            )
1125:info:build ./tilde.c:199:14: note: use '==' to turn this assignment into an equality comparison
1126:info:build   if (result = strchr (string, '~'))
1127:info:build              ^
1128:info:build              ==
1129:info:build 1 warning generated.
1130:info:build rm -f libreadline.a
1131:info:build rm -f libhistory.a
1132:info:build ar cr libreadline.a readline.o vi_mode.o funmap.o keymaps.o parens.o search.o rltty.o complete.o bind.o isearch.o display.o signals.o util.o kill.o undo.o macro.o input.o callback.o terminal.o text.o nls.o misc.o compat.o xmalloc.o history.o histexpand.o histfile.o histsearch.o shell.o mbutil.o tilde.o
1133:info:build ar cr libhistory.a history.o histexpand.o histfile.o histsearch.o shell.o mbutil.o xmalloc.o
1134:info:build no
1135:info:build checking whether ffs is declared... -lz
1136:info:build checking zlib.h usability... test -n "ranlib" && ranlib libreadline.a
1137:info:build test -n "ranlib" && ranlib libhistory.a
1138:info:build yes
1139:info:build checking whether asprintf is declared... make[2]: Leaving directory `/opt/local/var/macports/build/_opt_local_var_macports_sources_rsync.macports.org_release_tarballs_ports_cross_msp430-gdb/msp430-gdb/work/gdb-7.2/readline'
1140:info:build yes
1141:info:build checking zlib.h presence... yes
1142:info:build checking whether vasprintf is declared... yes
1143:info:build checking for zlib.h... yes
1144:info:build checking return type of signal handlers... yes
1145:info:build checking whether snprintf is declared... void
1146:info:build configure: updating cache .././config.cache
1147:info:build yes
1148:info:build configure: creating ./config.status
1149:info:build checking whether vsnprintf is declared... yes
1150:info:build checking whether calloc is declared... yes
1151:info:build checking whether getenv is declared... yes
1152:info:build config.status: creating Makefile.sim
1153:info:build checking whether getopt is declared... config.status: creating Make-common.sim
1154:info:build yes
1155:info:build config.status: creating .gdbinit
1156:info:build checking whether malloc is declared... config.status: creating config.h
1157:info:build config.status: linking ../common/tconfig.in to tconfig.h
1158:info:build config.status: linking ../common/nltvals.def to targ-vals.def
1159:info:build yes
1160:info:build config.status: executing Makefile commands
1161:info:build Merging Makefile.sim+Make-common.sim into Makefile ...
1162:info:build checking whether realloc is declared... config.status: executing stamp-h commands
1163:info:build yes
1164:info:build === configuring in testsuite (/opt/local/var/macports/build/_opt_local_var_macports_sources_rsync.macports.org_release_tarballs_ports_cross_msp430-gdb/msp430-gdb/work/gdb-7.2/sim/testsuite)
1165:info:build configure: running /bin/sh ./configure --disable-option-checking '--prefix=/opt/local'  '--with-system-zlib' '--disable-Werror' '--program-transform-name=s&^&msp430-&' '--build=x86_64-apple-darwin17.7.0' '--host=x86_64-apple-darwin17.7.0' '--target=msp430' 'build_alias=x86_64-apple-darwin17.7.0' 'host_alias=x86_64-apple-darwin17.7.0' 'target_alias=msp430' 'CC=/usr/bin/clang' 'CFLAGS=-I/opt/local/include -pipe -Os -arch x86_64' 'LDFLAGS= -L/opt/local/lib -Wl,-headerpad_max_install_names -arch x86_64' --cache-file=.././config.cache --srcdir=.
1166:info:build checking whether sbrk is declared... yes
1167:info:build checking whether strverscmp is declared... no
1168:info:build checking whether canonicalize_file_name must be declared... configure: loading cache .././config.cache
1169:info:build checking build system type... (cached) x86_64-apple-darwin17.7.0
1170:info:build checking host system type... (cached) x86_64-apple-darwin17.7.0
1171:info:build checking target system type... (cached) msp430-unknown-none
1172:info:build yes
1173:info:build checking for stdlib.h... (cached) yes
1174:info:build configure: creating ./config.status
1175:info:build checking for unistd.h... (cached) yes
1176:info:build checking for getpagesize... (cached) yes
1177:info:build checking for working mmap... yes
1178:info:build checking for working strncmp... yes
1179:info:build config.status: creating Makefile
1180:info:build configure: updating cache ./config.cache
1181:info:build configure: creating ./config.status
1182:info:build === configuring in common (/opt/local/var/macports/build/_opt_local_var_macports_sources_rsync.macports.org_release_tarballs_ports_cross_msp430-gdb/msp430-gdb/work/gdb-7.2/sim/common)
1183:info:build configure: running /bin/sh ./configure --disable-option-checking '--prefix=/opt/local'  '--with-system-zlib' '--disable-Werror' '--program-transform-name=s&^&msp430-&' '--build=x86_64-apple-darwin17.7.0' '--host=x86_64-apple-darwin17.7.0' '--target=msp430' 'build_alias=x86_64-apple-darwin17.7.0' 'host_alias=x86_64-apple-darwin17.7.0' 'target_alias=msp430' 'CC=/usr/bin/clang' 'CFLAGS=-I/opt/local/include -pipe -Os -arch x86_64' 'LDFLAGS= -L/opt/local/lib -Wl,-headerpad_max_install_names -arch x86_64' --cache-file=.././config.cache --srcdir=.
1184:info:build config.status: creating Makefile
1185:info:build configure: loading cache .././config.cache
1186:info:build checking build system type... (cached) x86_64-apple-darwin17.7.0
1187:info:build checking host system type... (cached) x86_64-apple-darwin17.7.0
1188:info:build checking target system type... (cached) msp430-unknown-none
1189:info:build checking for x86_64-apple-darwin17.7.0-gcc... (cached) /usr/bin/clang
1190:info:build config.status: creating testsuite/Makefile
1191:info:build config.status: creating config.h
1192:info:build config.status: executing default commands
1193:info:build checking for C compiler default output file name... a.out
1194:info:build checking whether the C compiler works... yes
1195:info:build checking whether we are cross compiling... no
1196:info:build checking for suffix of executables... Configuring in ./bfd
1197:info:build Configuring in ./opcodes
1198:info:build checking for suffix of object files... (cached) o
1199:info:build checking whether we are using the GNU C compiler... (cached) yes
1200:info:build checking whether /usr/bin/clang accepts -g... (cached) yes
1201:info:build checking for /usr/bin/clang option to accept ISO C89... (cached) none needed
1202:info:build checking for a BSD-compatible install... /usr/bin/install -c
1203:info:build checking for x86_64-apple-darwin17.7.0-ranlib... (cached) ranlib
1204:info:build checking whether NLS is requested... yes
1205:info:build checking for catalogs to be installed...
1206:info:build checking how to run the C preprocessor... (cached) /usr/bin/clang -E
1207:info:build make[2]: Entering directory `/opt/local/var/macports/build/_opt_local_var_macports_sources_rsync.macports.org_release_tarballs_ports_cross_msp430-gdb/msp430-gdb/work/gdb-7.2/libiberty'
1208:info:build if [ x"" != x ] && [ ! -d pic ]; then \
1209:info:build       mkdir pic; \
1210:info:build     else true; fi
1211:info:build touch stamp-picdir
1212:info:build echo ./regex.o ./cplus-dem.o ./cp-demangle.o ./md5.o ./sha1.o ./alloca.o ./argv.o ./choose-temp.o ./concat.o ./cp-demint.o ./crc32.o ./dyn-string.o ./fdmatch.o ./fibheap.o ./filename_cmp.o ./floatformat.o ./fnmatch.o ./fopen_unlocked.o ./getopt.o ./getopt1.o ./getpwd.o ./getruntime.o ./hashtab.o ./hex.o ./lbasename.o ./lrealpath.o ./make-relative-prefix.o ./make-temp-file.o ./objalloc.o ./obstack.o ./partition.o ./pexecute.o ./physmem.o ./pex-common.o ./pex-one.o ./pex-unix.o ./safe-ctype.o ./sort.o ./spaces.o ./splay-tree.o ./strerror.o ./strsignal.o ./unlink-if-ordinary.o ./xatexit.o ./xexit.o ./xmalloc.o ./xmemdup.o ./xstrdup.o ./xstrerror.o ./xstrndup.o > required-list
1213:info:build make[3]: Entering directory `/opt/local/var/macports/build/_opt_local_var_macports_sources_rsync.macports.org_release_tarballs_ports_cross_msp430-gdb/msp430-gdb/work/gdb-7.2/libiberty/testsuite'
1214:info:build make[3]: Nothing to be done for `all'.
1215:info:build make[3]: Leaving directory `/opt/local/var/macports/build/_opt_local_var_macports_sources_rsync.macports.org_release_tarballs_ports_cross_msp430-gdb/msp430-gdb/work/gdb-7.2/libiberty/testsuite'
1216:info:build if [ x"" != x ]; then \
1217:info:build       /usr/bin/clang -c -DHAVE_CONFIG_H -I/opt/local/include -pipe -Os -arch x86_64  -I. -I./../include  -W -Wall -Wwrite-strings -Wc++-compat -Wstrict-prototypes -pedantic   ./regex.c -o pic/regex.o; \
1218:info:build     else true; fi
1219:info:build /usr/bin/clang -c -DHAVE_CONFIG_H -I/opt/local/include -pipe -Os -arch x86_64  -I. -I./../include  -W -Wall -Wwrite-strings -Wc++-compat -Wstrict-prototypes -pedantic  ./regex.c -o regex.o
1220:info:build checking for grep that handles long lines and -e... (cached) /opt/local/bin/grep
1221:info:build checking for egrep... (cached) /opt/local/bin/grep -E
1222:info:build checking for ANSI C header files... (cached) yes
1223:info:build checking for sys/types.h... (cached) yes
1224:info:build checking for sys/stat.h... (cached) yes
1225:info:build checking for stdlib.h... (cached) yes
1226:info:build checking for string.h... (cached) yes
1227:info:build checking for memory.h... (cached) yes
1228:info:build checking for strings.h... (cached) yes
1229:info:build checking for inttypes.h... (cached) yes
1230:info:build configure: creating cache ./config.cache
1231:info:build configure: creating cache ./config.cache
1232:info:build checking for stdint.h... (cached) yes
1233:info:build checking build system type... checking build system type... checking for unistd.h... (cached) yes
1234:info:build x86_64-apple-darwin17.7.0
1235:info:build checking for stdlib.h... x86_64-apple-darwin17.7.0
1236:info:build (cached) checking host system type... yes
1237:info:build checking host system type... checking for string.h... (cached) yes
1238:info:build x86_64-apple-darwin17.7.0
1239:info:build x86_64-apple-darwin17.7.0
1240:info:build checking target system type... checking target system type... checking for strings.h... (cached) yes
1241:info:build checking for unistd.h... (cached) yes
1242:info:build msp430-unknown-none
1243:info:build msp430-unknown-none
1244:info:build checking for x86_64-apple-darwin17.7.0-gcc... checking for x86_64-apple-darwin17.7.0-gcc... /usr/bin/clang
1245:info:build /usr/bin/clang
1246:info:build checking for time.h... (cached) yes
1247:info:build checking for sys/time.h... (cached) yes
1248:info:build checking for sys/resource.h... (cached) yes
1249:info:build checking for fcntl.h... (cached) yes
1250:info:build checking for fpu_control.h... (cached) no
1251:info:build checking for C compiler default output file name... checking for C compiler default output file name... checking for dlfcn.h... (cached) yes
1252:info:build checking for errno.h... (cached) yes
1253:info:build checking for sys/stat.h... (cached) yes
1254:info:build checking for getrusage... (cached) yes
1255:info:build a.out
1256:info:build checking whether the C compiler works... a.out
1257:info:build checking whether the C compiler works... yes
1258:info:build yes
1259:info:build checking whether we are cross compiling... no
1260:info:build checking for suffix of executables... checking whether we are cross compiling... no
1261:info:build checking for suffix of executables... checking for time... (cached) yes
1262:info:build checking for sigaction... (cached) yes
1263:info:build checking for __setfpucw... (cached) no
1264:info:build checking for bind in -lsocket... (cached) no
1265:info:build checking for gethostbyname in -lnsl... (cached) no
1266:info:build checking for library containing zlibVersion... (cached) -lz
1267:info:build checking for zlib.h... (cached) yes
1268:info:build checking for suffix of object files...
1269:info:build checking for suffix of object files... checking return type of signal handlers... (cached) void
1270:info:build checking for stdlib.h... (cached) yes
1271:info:build checking for string.h... (cached) yes
1272:info:build o
1273:info:build checking whether we are using the GNU C compiler... o
1274:info:build checking whether we are using the GNU C compiler... checking for strings.h... (cached) yes
1275:info:build checking for time.h... (cached) yes
1276:info:build checking sys/times.h usability... yes
1277:info:build checking whether /usr/bin/clang accepts -g... yes
1278:info:build checking whether /usr/bin/clang accepts -g... yes
1279:info:build checking for /usr/bin/clang option to accept ISO C89... yes
1280:info:build checking for /usr/bin/clang option to accept ISO C89... yes
1281:info:build checking sys/times.h presence... yes
1282:info:build checking for sys/times.h... yes
1283:info:build none needed
1284:info:build checking for library containing strerror... none needed
1285:info:build checking for library containing strerror... checking for sys/stat.h... (cached) yes
1286:info:build checking sys/mman.h usability... none required
1287:info:build none required
1288:info:build checking for a BSD-compatible install... /usr/bin/install -c
1289:info:build checking whether build environment is sane... yes
1290:info:build checking sys/mman.h presence... checking for a BSD-compatible install... /usr/bin/install -c
1291:info:build checking whether build environment is sane... yes
1292:info:build checking for sys/mman.h... yes
1293:info:build checking for mmap... yes
1294:info:build checking for munmap... yes
1295:info:build checking for lstat... yes
1296:info:build checking for truncate... yes
1297:info:build checking for ftruncate... yes
1298:info:build checking for struct stat.st_dev... yes
1299:info:build checking for struct stat.st_ino... yes
1300:info:build checking for struct stat.st_mode... yes
1301:info:build checking for struct stat.st_nlink... if [ x"" != x ]; then \
1302:info:build       /usr/bin/clang -c -DHAVE_CONFIG_H -I/opt/local/include -pipe -Os -arch x86_64  -I. -I./../include  -W -Wall -Wwrite-strings -Wc++-compat -Wstrict-prototypes -pedantic   ./cplus-dem.c -o pic/cplus-dem.o; \
1303:info:build     else true; fi
1304:info:build /usr/bin/clang -c -DHAVE_CONFIG_H -I/opt/local/include -pipe -Os -arch x86_64  -I. -I./../include  -W -Wall -Wwrite-strings -Wc++-compat -Wstrict-prototypes -pedantic  ./cplus-dem.c -o cplus-dem.o
1305:info:build yes
1306:info:build checking for struct stat.st_uid... yes
1307:info:build checking for struct stat.st_gid... yes
1308:info:build checking for struct stat.st_rdev... yes
1309:info:build checking for struct stat.st_size... yes
1310:info:build checking for struct stat.st_blksize... yes
1311:info:build checking for struct stat.st_blocks... yes
1312:info:build checking for struct stat.st_atime... yes
1313:info:build yes
1314:info:build checking for a thread-safe mkdir -p... checking for a thread-safe mkdir -p... /opt/local/bin/gmkdir -p
1315:info:build checking for gawk... gawk
1316:info:build checking whether /Applications/Xcode.app/Contents/Developer/usr/bin/make sets $(MAKE)... /opt/local/bin/gmkdir -p
1317:info:build checking for gawk... gawk
1318:info:build checking whether /Applications/Xcode.app/Contents/Developer/usr/bin/make sets $(MAKE)... yes
1319:info:build yes
1320:info:build yes
1321:info:build checking for struct stat.st_mtime... checking for style of include used by /Applications/Xcode.app/Contents/Developer/usr/bin/make... checking for style of include used by /Applications/Xcode.app/Contents/Developer/usr/bin/make... GNU
1322:info:build GNU
1323:info:build checking dependency style of /usr/bin/clang... checking dependency style of /usr/bin/clang... yes
1324:info:build checking for struct stat.st_ctime... yes
1325:info:build checking for socklen_t... if [ x"" != x ]; then \
1326:info:build       /usr/bin/clang -c -DHAVE_CONFIG_H -I/opt/local/include -pipe -Os -arch x86_64  -I. -I./../include  -W -Wall -Wwrite-strings -Wc++-compat -Wstrict-prototypes -pedantic   ./cp-demangle.c -o pic/cp-demangle.o; \
1327:info:build     else true; fi
1328:info:build /usr/bin/clang -c -DHAVE_CONFIG_H -I/opt/local/include -pipe -Os -arch x86_64  -I. -I./../include  -W -Wall -Wwrite-strings -Wc++-compat -Wstrict-prototypes -pedantic  ./cp-demangle.c -o cp-demangle.o
1329:info:build gcc3
1330:info:build checking for x86_64-apple-darwin17.7.0-ar... ar
1331:info:build checking for x86_64-apple-darwin17.7.0-ranlib... ranlib
1332:info:build checking for x86_64-apple-darwin17.7.0-gcc... (cached) /usr/bin/clang
1333:info:build gcc3
1334:info:build checking for x86_64-apple-darwin17.7.0-gcc... (cached) /usr/bin/clang
1335:info:build yes
1336:info:build checking whether we are using the GNU C compiler... (cached) yes
1337:info:build checking whether /usr/bin/clang accepts -g... (cached) yes
1338:info:build checking for /usr/bin/clang option to accept ISO C89... (cached) none needed
1339:info:build checking how to run the C preprocessor... checking whether we are using the GNU C compiler... (cached) yes
1340:info:build checking whether /usr/bin/clang accepts -g... (cached) yes
1341:info:build checking for /usr/bin/clang option to accept ISO C89... (cached) none needed
1342:info:build checking how to run the C preprocessor... configure: updating cache .././config.cache
1343:info:build configure: creating ./config.status
1344:info:build /usr/bin/clang -E
1345:info:build /usr/bin/clang -E
1346:info:build checking for grep that handles long lines and -e... checking for grep that handles long lines and -e... /opt/local/bin/grep
1347:info:build checking for egrep... /opt/local/bin/grep
1348:info:build checking for egrep... /opt/local/bin/grep -E
1349:info:build checking for ANSI C header files... /opt/local/bin/grep -E
1350:info:build checking for ANSI C header files... config.status: creating Makefile
1351:info:build config.status: creating cconfig.h
1352:info:build config.status: executing default commands
1353:info:build === configuring in igen (/opt/local/var/macports/build/_opt_local_var_macports_sources_rsync.macports.org_release_tarballs_ports_cross_msp430-gdb/msp430-gdb/work/gdb-7.2/sim/igen)
1354:info:build yes
1355:info:build configure: running /bin/sh ./configure --disable-option-checking '--prefix=/opt/local'  '--with-system-zlib' '--disable-Werror' '--program-transform-name=s&^&msp430-&' '--build=x86_64-apple-darwin17.7.0' '--host=x86_64-apple-darwin17.7.0' '--target=msp430' 'build_alias=x86_64-apple-darwin17.7.0' 'host_alias=x86_64-apple-darwin17.7.0' 'target_alias=msp430' 'CC=/usr/bin/clang' 'CFLAGS=-I/opt/local/include -pipe -Os -arch x86_64' 'LDFLAGS= -L/opt/local/lib -Wl,-headerpad_max_install_names -arch x86_64' --cache-file=.././config.cache --srcdir=.
1356:info:build checking for sys/types.h... yes
1357:info:build checking for sys/types.h... yes
1358:info:build yes
1359:info:build checking for sys/stat.h... checking for sys/stat.h... yes
1360:info:build yes
1361:info:build checking for stdlib.h... checking for stdlib.h... yes
1362:info:build checking for string.h... yes
1363:info:build checking for string.h... configure: loading cache .././config.cache
1364:info:build checking for a BSD-compatible install... /usr/bin/install -c
1365:info:build checking for x86_64-apple-darwin17.7.0-gcc... (cached) /usr/bin/clang
1366:info:build yes
1367:info:build if [ x"" != x ]; then \
1368:info:build       /usr/bin/clang -c -DHAVE_CONFIG_H -I/opt/local/include -pipe -Os -arch x86_64  -I. -I./../include  -W -Wall -Wwrite-strings -Wc++-compat -Wstrict-prototypes -pedantic   ./md5.c -o pic/md5.o; \
1369:info:build     else true; fi
1370:info:build checking for memory.h... /usr/bin/clang -c -DHAVE_CONFIG_H -I/opt/local/include -pipe -Os -arch x86_64  -I. -I./../include  -W -Wall -Wwrite-strings -Wc++-compat -Wstrict-prototypes -pedantic  ./md5.c -o md5.o
1371:info:build yes
1372:info:build checking for memory.h... ./md5.c:65:22: warning: declaration of 'struct md5_ctx' will not be visible outside of this function [-Wvisibility]
1373:info:build md5_init_ctx (struct md5_ctx *ctx)
1374:info:build                      ^
1375:info:build ./md5.c:67:6: error: incomplete definition of type 'struct md5_ctx'
1376:info:build   ctx->A = (md5_uint32) 0x67452301;
1377:info:build   ~~~^
1378:info:build ./md5.c:65:22: note: forward declaration of 'struct md5_ctx'
1379:info:build md5_init_ctx (struct md5_ctx *ctx)
1380:info:build                      ^
1381:info:build ./md5.c:67:13: error: use of undeclared identifier 'md5_uint32'
1382:info:build   ctx->A = (md5_uint32) 0x67452301;
1383:info:build             ^
1384:info:build ./md5.c:68:6: error: incomplete definition of type 'struct md5_ctx'
1385:info:build   ctx->B = (md5_uint32) 0xefcdab89;
1386:info:build   ~~~^
1387:info:build ./md5.c:65:22: note: forward declaration of 'struct md5_ctx'
1388:info:build md5_init_ctx (struct md5_ctx *ctx)
1389:info:build                      ^
1390:info:build ./md5.c:68:13: error: use of undeclared identifier 'md5_uint32'
1391:info:build   ctx->B = (md5_uint32) 0xefcdab89;
1392:info:build             ^
1393:info:build ./md5.c:69:6: error: incomplete definition of type 'struct md5_ctx'
1394:info:build   ctx->C = (md5_uint32) 0x98badcfe;
1395:info:build   ~~~^
1396:info:build ./md5.c:65:22: note: forward declaration of 'struct md5_ctx'
1397:info:build md5_init_ctx (struct md5_ctx *ctx)
1398:info:build                      ^
1399:info:build ./md5.c:69:13: error: use of undeclared identifier 'md5_uint32'
1400:info:build   ctx->C = (md5_uint32) 0x98badcfe;
1401:info:build             ^
1402:info:build ./md5.c:70:6: error: incomplete definition of type 'struct md5_ctx'
1403:info:build   ctx->D = (md5_uint32) 0x10325476;
1404:info:build   ~~~^
1405:info:build ./md5.c:65:22: note: forward declaration of 'struct md5_ctx'
1406:info:build md5_init_ctx (struct md5_ctx *ctx)
1407:info:build                      ^
1408:info:build ./md5.c:70:13: error: use of undeclared identifier 'md5_uint32'
1409:info:build   ctx->D = (md5_uint32) 0x10325476;
1410:info:build             ^
1411:info:build ./md5.c:72:6: error: incomplete definition of type 'struct md5_ctx'
1412:info:build   ctx->total[0] = ctx->total[1] = 0;
1413:info:build   ~~~^
1414:info:build ./md5.c:65:22: note: forward declaration of 'struct md5_ctx'
1415:info:build md5_init_ctx (struct md5_ctx *ctx)
1416:info:build                      ^
1417:info:build ./md5.c:72:22: error: incomplete definition of type 'struct md5_ctx'
1418:info:build   ctx->total[0] = ctx->total[1] = 0;
1419:info:build                   ~~~^
1420:info:build ./md5.c:65:22: note: forward declaration of 'struct md5_ctx'
1421:info:build md5_init_ctx (struct md5_ctx *ctx)
1422:info:build                      ^
1423:info:build ./md5.c:73:6: error: incomplete definition of type 'struct md5_ctx'
1424:info:build   ctx->buflen = 0;
1425:info:build   ~~~^
1426:info:build ./md5.c:65:22: note: forward declaration of 'struct md5_ctx'
1427:info:build md5_init_ctx (struct md5_ctx *ctx)
1428:info:build                      ^
1429:info:build ./md5.c:82:28: warning: declaration of 'struct md5_ctx' will not be visible outside of this function [-Wvisibility]
1430:info:build md5_read_ctx (const struct md5_ctx *ctx, void *resbuf)
1431:info:build                            ^
1432:info:build ./md5.c:84:17: error: expected expression
1433:info:build   ((md5_uint32 *) resbuf)[0] = SWAP (ctx->A);
1434:info:build checking for C compiler default output file name...                 ^
1435:info:build ./md5.c:84:5: error: use of undeclared identifier 'md5_uint32'
1436:info:build   ((md5_uint32 *) resbuf)[0] = SWAP (ctx->A);
1437:info:build     ^
1438:info:build ./md5.c:84:41: error: incomplete definition of type 'struct md5_ctx'
1439:info:build   ((md5_uint32 *) resbuf)[0] = SWAP (ctx->A);
1440:info:build                                      ~~~^
1441:info:build ./md5.c:53:19: note: expanded from macro 'SWAP'
1442:info:build # define SWAP(n) (n)
1443:info:build                   ^
1444:info:build ./md5.c:82:28: note: forward declaration of 'struct md5_ctx'
1445:info:build md5_read_ctx (const struct md5_ctx *ctx, void *resbuf)
1446:info:build                            ^
1447:info:build ./md5.c:85:17: error: expected expression
1448:info:build   ((md5_uint32 *) resbuf)[1] = SWAP (ctx->B);
1449:info:build                 ^
1450:info:build ./md5.c:85:5: error: use of undeclared identifier 'md5_uint32'
1451:info:build   ((md5_uint32 *) resbuf)[1] = SWAP (ctx->B);
1452:info:build     ^
1453:info:build ./md5.c:85:41: error: incomplete definition of type 'struct md5_ctx'
1454:info:build   ((md5_uint32 *) resbuf)[1] = SWAP (ctx->B);
1455:info:build                                      ~~~^
1456:info:build ./md5.c:53:19: note: expanded from macro 'SWAP'
1457:info:build # define SWAP(n) (n)
1458:info:build                   ^
1459:info:build ./md5.c:82:28: note: forward declaration of 'struct md5_ctx'
1460:info:build md5_read_ctx (const struct md5_ctx *ctx, void *resbuf)
1461:info:build                            ^
1462:info:build ./md5.c:86:17: error: expected expression
1463:info:build   ((md5_uint32 *) resbuf)[2] = SWAP (ctx->C);
1464:info:build                 ^
1465:info:build ./md5.c:86:5: error: use of undeclared identifier 'md5_uint32'
1466:info:build   ((md5_uint32 *) resbuf)[2] = SWAP (ctx->C);
1467:info:build     ^
1468:info:build fatal error: too many errors emitted, stopping now [-ferror-limit=]
1469:info:build 2 warnings and 20 errors generated.
1470:info:build yes
1471:info:build make[2]: *** [md5.o] Error 1
1472:info:build make[2]: Leaving directory `/opt/local/var/macports/build/_opt_local_var_macports_sources_rsync.macports.org_release_tarballs_ports_cross_msp430-gdb/msp430-gdb/work/gdb-7.2/libiberty'
1473:info:build make[1]: *** [all-libiberty] Error 2
1474:info:build make[1]: *** Waiting for unfinished jobs....
1475:info:build checking for strings.h... yes
1476:info:build checking for strings.h... a.out
1477:info:build checking whether the C compiler works... yes
1478:info:build checking whether we are cross compiling... no
1479:info:build checking for suffix of executables... yes
1480:info:build checking for inttypes.h... yes
1481:info:build checking for inttypes.h... checking for suffix of object files... (cached) o
1482:info:build checking whether we are using the GNU C compiler... (cached) yes
1483:info:build checking whether /usr/bin/clang accepts -g... (cached) yes
1484:info:build checking for /usr/bin/clang option to accept ISO C89... (cached) none needed
1485:info:build checking compiler warning flags... yes
1486:info:build yes
1487:info:build checking for stdint.h... checking for stdint.h... yes
1488:info:build checking for unistd.h... yes
1489:info:build checking for unistd.h... yes
1490:info:build checking minix/config.h usability... yes
1491:info:build checking minix/config.h usability... no
1492:info:build checking minix/config.h presence...  -Wimplicit -Wreturn-type -Wcomment -Wtrigraphs -Wformat -Wparentheses -Wpointer-arith -Wuninitialized
1493:info:build no
1494:info:build checking minix/config.h presence... checking build system type... (cached) x86_64-apple-darwin17.7.0
1495:info:build checking host system type... (cached) x86_64-apple-darwin17.7.0
1496:info:build checking target system type... (cached) msp430-unknown-none
1497:info:build checking how to run the C preprocessor... (cached) /usr/bin/clang -E
1498:info:build no
1499:info:build checking for minix/config.h... no
1500:info:build checking whether it is safe to define __EXTENSIONS__... no
1501:info:build checking for minix/config.h... no
1502:info:build checking whether it is safe to define __EXTENSIONS__... yes
1503:info:build checking how to print strings... checking for grep that handles long lines and -e... (cached) /opt/local/bin/grep
1504:info:build printf
1505:info:build checking for egrep... checking for a sed that does not truncate output... (cached) /opt/local/bin/grep -E
1506:info:build checking for ANSI C header files... (cached) yes
1507:info:build /opt/local/bin/gsed
1508:info:build checking for sys/types.h... (cached) yes
1509:info:build checking for fgrep... yes
1510:info:build checking for x86_64-apple-darwin17.7.0-ar... ar
1511:info:build checking for x86_64-apple-darwin17.7.0-ranlib... ranlib
1512:info:build checking how to print strings... printf
1513:info:build checking for a sed that does not truncate output... checking for sys/stat.h... (cached) yes
1514:info:build /opt/local/bin/grep -F
1515:info:build /opt/local/bin/gsed
1516:info:build checking for ld used by /usr/bin/clang... checking for fgrep... checking for stdlib.h... (cached) yes
1517:info:build /opt/local/bin/grep -F
1518:info:build checking for ld used by /usr/bin/clang... checking for string.h... (cached) yes
1519:info:build checking for memory.h... (cached) yes
1520:info:build /Applications/Xcode.app/Contents/Developer/Toolchains/XcodeDefault.xctoolchain/usr/bin/ld
1521:info:build checking if the linker (/Applications/Xcode.app/Contents/Developer/Toolchains/XcodeDefault.xctoolchain/usr/bin/ld) is GNU ld... checking for strings.h... (cached) yes
1522:info:build no
1523:info:build checking for BSD- or MS-compatible name lister (nm)... nm
1524:info:build checking the name lister (nm) interface... checking for inttypes.h... (cached) yes
1525:info:build /Applications/Xcode.app/Contents/Developer/Toolchains/XcodeDefault.xctoolchain/usr/bin/ld
1526:info:build checking if the linker (/Applications/Xcode.app/Contents/Developer/Toolchains/XcodeDefault.xctoolchain/usr/bin/ld) is GNU ld... checking for stdint.h... (cached) yes
1527:info:build no
1528:info:build checking for BSD- or MS-compatible name lister (nm)... nm
1529:info:build checking the name lister (nm) interface... checking for unistd.h... (cached) yes
1530:info:build checking for stdlib.h... (cached) yes
1531:info:build checking for string.h... (cached) yes
1532:info:build checking for strings.h... (cached) yes
1533:info:build checking for sys/stat.h... (cached) yes
1534:info:build checking for sys/types.h... (cached) yes
1535:info:build checking for unistd.h... (cached) yes
1536:info:build checking for dirent.h that defines DIR... BSD nm
1537:info:build checking whether ln -s works... BSD nm
1538:info:build yes
1539:info:build checking whether ln -s works... checking the maximum length of command line arguments... yes
1540:info:build checking the maximum length of command line arguments... 196608
1541:info:build checking whether the shell understands some XSI constructs... 196608
1542:info:build checking whether the shell understands some XSI constructs... yes
1543:info:build yes
1544:info:build checking whether the shell understands "+="... checking whether the shell understands "+="... yes
1545:info:build yes
1546:info:build checking for /Applications/Xcode.app/Contents/Developer/Toolchains/XcodeDefault.xctoolchain/usr/bin/ld option to reload object files... checking for /Applications/Xcode.app/Contents/Developer/Toolchains/XcodeDefault.xctoolchain/usr/bin/ld option to reload object files... -r
1547:info:build -r
1548:info:build checking for x86_64-apple-darwin17.7.0-objdump... checking for x86_64-apple-darwin17.7.0-objdump... objdump
1549:info:build objdump
1550:info:build checking how to recognize dependent libraries... checking how to recognize dependent libraries... pass_all
1551:info:build pass_all
1552:info:build checking for x86_64-apple-darwin17.7.0-ar... (cached) checking for x86_64-apple-darwin17.7.0-ar... (cached) ar
1553:info:build ar
1554:info:build checking for x86_64-apple-darwin17.7.0-strip... checking for x86_64-apple-darwin17.7.0-strip... no
1555:info:build no
1556:info:build checking for strip... checking for strip... strip
1557:info:build strip
1558:info:build checking for x86_64-apple-darwin17.7.0-ranlib... checking for x86_64-apple-darwin17.7.0-ranlib... (cached) (cached) ranlib
1559:info:build ranlib
1560:info:build checking command to parse nm output from /usr/bin/clang object... checking command to parse nm output from /usr/bin/clang object... yes
1561:info:build checking for library containing opendir... none required
1562:info:build checking for x86_64-apple-darwin17.7.0-ranlib... (cached) ranlib
1563:info:build configure: updating cache .././config.cache
1564:info:build configure: creating ./config.status
1565:info:build ok
1566:info:build ok
1567:info:build checking for x86_64-apple-darwin17.7.0-dsymutil... checking for x86_64-apple-darwin17.7.0-dsymutil... no
1568:info:build checking for dsymutil... no
1569:info:build checking for dsymutil... dsymutil
1570:info:build checking for x86_64-apple-darwin17.7.0-nmedit... dsymutil
1571:info:build checking for x86_64-apple-darwin17.7.0-nmedit... no
1572:info:build checking for nmedit... no
1573:info:build checking for nmedit... nmedit
1574:info:build nmedit
1575:info:build checking for x86_64-apple-darwin17.7.0-lipo... checking for x86_64-apple-darwin17.7.0-lipo... no
1576:info:build no
1577:info:build checking for lipo... checking for lipo... lipo
1578:info:build lipo
1579:info:build checking for x86_64-apple-darwin17.7.0-otool... checking for x86_64-apple-darwin17.7.0-otool... no
1580:info:build no
1581:info:build checking for otool... checking for otool... otool
1582:info:build otool
1583:info:build checking for x86_64-apple-darwin17.7.0-otool64... checking for x86_64-apple-darwin17.7.0-otool64... no
1584:info:build checking for otool64... no
1585:info:build checking for otool64... no
1586:info:build no
1587:info:build checking for -single_module linker flag... checking for -single_module linker flag... yes
1588:info:build checking for -exported_symbols_list linker flag... yes
1589:info:build checking for -exported_symbols_list linker flag... config.status: creating Makefile
1590:info:build config.status: creating config.h
1591:info:build yes
1592:info:build yes
1593:info:build checking for -force_load linker flag... checking for -force_load linker flag... config.status: executing default commands
1594:info:build yes
1595:info:build yes
1596:info:build checking for dlfcn.h... checking for dlfcn.h... yes
1597:info:build yes
1598:info:build checking for objdir... checking for objdir... .libs
1599:info:build .libs
1600:info:build checking if /usr/bin/clang supports -fno-rtti -fno-exceptions... checking if /usr/bin/clang supports -fno-rtti -fno-exceptions... yes
1601:info:build yes
1602:info:build checking for /usr/bin/clang option to produce PIC... checking for /usr/bin/clang option to produce PIC... -fno-common -DPIC
1603:info:build -fno-common -DPIC
1604:info:build checking if /usr/bin/clang PIC flag -fno-common -DPIC works... checking if /usr/bin/clang PIC flag -fno-common -DPIC works... yes
1605:info:build yes
1606:info:build checking if /usr/bin/clang static flag -static works... checking if /usr/bin/clang static flag -static works... no
1607:info:build checking if /usr/bin/clang supports -c -o file.o... no
1608:info:build checking if /usr/bin/clang supports -c -o file.o... yes
1609:info:build checking if /usr/bin/clang supports -c -o file.o... yes
1610:info:build (cached) checking if /usr/bin/clang supports -c -o file.o... yes
1611:info:build (cached) yes
1612:info:build checking whether the /usr/bin/clang linker (/Applications/Xcode.app/Contents/Developer/Toolchains/XcodeDefault.xctoolchain/usr/bin/ld) supports shared libraries... checking whether the /usr/bin/clang linker (/Applications/Xcode.app/Contents/Developer/Toolchains/XcodeDefault.xctoolchain/usr/bin/ld) supports shared libraries... yes
1613:info:build yes
1614:info:build checking dynamic linker characteristics... checking dynamic linker characteristics... darwin17.7.0 dyld
1615:info:build darwin17.7.0 dyld
1616:info:build checking how to hardcode library paths into programs... checking how to hardcode library paths into programs... immediate
1617:info:build immediate
1618:info:build checking for dlopen in -ldl... checking whether stripping libraries is possible... yes
1619:info:build checking if libtool supports shared libraries... yes
1620:info:build checking whether to build shared libraries... no
1621:info:build checking whether to build static libraries... yes
1622:info:build Setting warning flags = -W -Wall -Wstrict-prototypes -Wmissing-prototypes -Wshadow -Werror
1623:info:build checking whether to enable maintainer-specific portions of Makefiles... no
1624:info:build checking whether to install libbfd... no
1625:info:build checking whether NLS is requested... yes
1626:info:build checking for catalogs to be installed... yes
1627:info:build checking whether a program can dlopen itself... yes
1628:info:build checking whether a statically linked program can dlopen itself... yes
1629:info:build checking whether stripping libraries is possible... yes
1630:info:build checking if libtool supports shared libraries... yes
1631:info:build checking whether to build shared libraries... no
1632:info:build checking whether to build static libraries... yes
1633:info:build checking for special C compiler options needed for large files... no
1634:info:build checking for _FILE_OFFSET_BITS value needed for large files...  da de es fi fr ga id nl pt_BR ro sv tr vi zh_CN da de es fi fr ga id nl pt_BR ro sv tr vi zh_CN
1635:info:build checking whether NLS is requested... yes
1636:info:build no
1637:info:build checking for msgfmt... Setting warning flags = -W -Wall -Wstrict-prototypes -Wmissing-prototypes -Wshadow -Werror
1638:info:build checking whether to enable maintainer-specific portions of Makefiles... no
1639:info:build checking whether to install libbfd... no
1640:info:build /opt/local/bin/msgfmt
1641:info:build checking for gmsgfmt... /opt/local/bin/msgfmt
1642:info:build checking whether NLS is requested... yes
1643:info:build checking for catalogs to be installed... checking for xgettext... /opt/local/bin/xgettext
1644:info:build checking for msgmerge... /opt/local/bin/msgmerge
1645:info:build checking for string.h... (cached) yes
1646:info:build checking for strings.h... (cached) yes
1647:info:build checking for stdlib.h... (cached) yes
1648:info:build checking limits.h usability...  da es fi fr id ja ro ru rw sv tr vi zh_CN da es fi fr id ja ro ru rw sv tr vi zh_CN
1649:info:build checking whether NLS is requested... yes
1650:info:build yes
1651:info:build checking limits.h presence... checking for msgfmt... yes
1652:info:build checking for limits.h... yes
1653:info:build /opt/local/bin/msgfmt
1654:info:build checking for gmsgfmt... /opt/local/bin/msgfmt
1655:info:build checking for xgettext... /opt/local/bin/xgettext
1656:info:build checking whether basename is declared... checking for msgmerge... /opt/local/bin/msgmerge
1657:info:build no
1658:info:build checking size of long long... checking whether stpcpy is declared... yes
1659:info:build checking linker --as-needed support... no
1660:info:build 8
1661:info:build checking size of void *... configure: updating cache ./config.cache
1662:info:build configure: creating ./config.status
1663:info:build 8
1664:info:build checking size of long... 8
1665:info:build checking alloca.h usability... yes
1666:info:build checking alloca.h presence... yes
1667:info:build checking for alloca.h... yes
1668:info:build checking stddef.h usability... yes
1669:info:build checking stddef.h presence... yes
1670:info:build checking for stddef.h... yes
1671:info:build checking for string.h... (cached) yes
1672:info:build checking for strings.h... (cached) yes
1673:info:build checking for stdlib.h... (cached) yes
1674:info:build checking time.h usability... yes
1675:info:build checking time.h presence... yes
1676:info:build checking for time.h... yes
1677:info:build checking for unistd.h... (cached) yes
1678:info:build checking fcntl.h usability... yes
1679:info:build checking fcntl.h presence... yes
1680:info:build checking for fcntl.h... yes
1681:info:build checking sys/file.h usability... yes
1682:info:build checking sys/file.h presence... yes
1683:info:build checking for sys/file.h... yes
1684:info:build checking sys/time.h usability... yes
1685:info:build checking sys/time.h presence... yes
1686:info:build checking for sys/time.h... yes
1687:info:build checking for sys/stat.h... (cached) yes
1688:info:build looking for a compliant stdint.h in stdint.h, checking for uintmax_t... yes
1689:info:build checking for uintptr_t... yes
1690:info:build checking for int_least32_t... yes
1691:info:build checking for int_fast32_t... yes
1692:info:build checking for uint64_t... yes
1693:info:build checking what to include in bfd_stdint.h... stdint.h (already complete)
1694:info:build checking whether time.h and sys/time.h may both be included... yes
1695:info:build checking for dirent.h that defines DIR... yes
1696:info:build checking for library containing opendir... none required
1697:info:build checking whether string.h and strings.h may both be included... yes
1698:info:build checking for fcntl... yes
1699:info:build checking for getpagesize... yes
1700:info:build checking for setitimer... yes
1701:info:build checking for sysconf... yes
1702:info:build checking for fdopen... yes
1703:info:build checking for getuid... yes
1704:info:build checking for getgid... yes
1705:info:build checking for fileno... yes
1706:info:build checking for strtoull... yes
1707:info:build checking whether basename is declared... no
1708:info:build config.status: creating Makefile
1709:info:build checking whether ftello is declared... config.status: creating po/Makefile.in
1710:info:build yes
1711:info:build config.status: creating config.h
1712:info:build checking whether ftello64 is declared... config.status: executing depfiles commands
1713:info:build no
1714:info:build checking whether fseeko is declared... yes
1715:info:build checking whether fseeko64 is declared... no
1716:info:build checking whether ffs is declared... yes
1717:info:build checking whether free is declared... yes
1718:info:build checking whether getenv is declared... yes
1719:info:build checking whether malloc is declared... yes
1720:info:build checking whether realloc is declared... yes
1721:info:build checking whether stpcpy is declared... config.status: executing libtool commands
1722:info:build yes
1723:info:build checking whether strstr is declared... config.status: executing default-1 commands
1724:info:build config.status: creating po/POTFILES
1725:info:build config.status: creating po/Makefile
1726:info:build yes
1727:info:build checking whether snprintf is declared... yes
1728:info:build checking whether vsnprintf is declared... yes
1729:info:build checking for library containing zlibVersion... -lz
1730:info:build checking zlib.h usability... yes
1731:info:build checking zlib.h presence... yes
1732:info:build checking for zlib.h... yes
1733:info:build checking linker --as-needed support... no
1734:info:build checking for gcc version with buggy 64-bit support... no
1735:info:build checking for ftello... yes
1736:info:build checking for ftello64... no
1737:info:build checking for fseeko... yes
1738:info:build checking for fseeko64... no
1739:info:build checking for fopen64... no
1740:info:build checking size of off_t... 8
1741:info:build checking file_ptr type... BFD_HOST_64_BIT
1742:info:build checking for stdlib.h... (cached) yes
1743:info:build checking for unistd.h... (cached) yes
1744:info:build checking for getpagesize... (cached) yes
1745:info:build checking for working mmap... yes
1746:info:build checking for madvise... yes
1747:info:build checking for mprotect... yes
1748:info:build configure: updating cache ./config.cache
1749:info:build configure: creating ./config.status
1750:info:build config.status: creating Makefile
1751:info:build config.status: creating doc/Makefile
1752:info:build config.status: creating bfd-in3.h
1753:info:build config.status: creating po/Makefile.in
1754:info:build config.status: creating config.h
1755:info:build config.status: executing depfiles commands
1756:info:build config.status: executing libtool commands
1757:info:build config.status: executing default-1 commands
1758:info:build config.status: executing bfd_stdint.h commands
1759:info:build config.status: executing default commands
1760:info:build make[1]: Leaving directory `/opt/local/var/macports/build/_opt_local_var_macports_sources_rsync.macports.org_release_tarballs_ports_cross_msp430-gdb/msp430-gdb/work/gdb-7.2'
1761:info:build make: *** [all] Error 2
1762:info:build make: Leaving directory `/opt/local/var/macports/build/_opt_local_var_macports_sources_rsync.macports.org_release_tarballs_ports_cross_msp430-gdb/msp430-gdb/work/gdb-7.2'
1763:info:build Command failed:  cd "/opt/local/var/macports/build/_opt_local_var_macports_sources_rsync.macports.org_release_tarballs_ports_cross_msp430-gdb/msp430-gdb/work/gdb-7.2" && /usr/bin/make -j4 -w all
1764:info:build Exit code: 2
1765:error:build Failed to build msp430-gdb: command execution failed
1766:debug:build Error code: CHILDSTATUS 12051 2
1767:debug:build Backtrace: command execution failed
1768:debug:build     while executing
1769:debug:build "system {*}$notty {*}$nice $fullcmdstring"
1770:debug:build     invoked from within
1771:debug:build "command_exec build"
1772:debug:build     (procedure "portbuild::build_main" line 8)
1773:debug:build     invoked from within
1774:debug:build "$procedure $targetname"
1775:error:build See /opt/local/var/macports/logs/_opt_local_var_macports_sources_rsync.macports.org_release_tarballs_ports_cross_msp430-gdb/msp430-gdb/main.log for details.
1776version:1
1777:debug:sysinfo macOS 10.13 (darwin/17.7.0) arch i386
1778:debug:sysinfo MacPorts 2.5.3
1779:debug:sysinfo Xcode 9.3
1780:debug:sysinfo SDK 10.13
1781:debug:sysinfo MACOSX_DEPLOYMENT_TARGET: 10.13
1782:debug:clean epoch: in tree: 0 installed: 0
1783:debug:clean mspdebug 0.23_0 exists in the ports tree
1784:debug:clean mspdebug 0.23_0  is the latest installed
1785:debug:clean mspdebug 0.23_0  is active
1786:debug:clean Merging existing variants '' into variants
1787:debug:clean new fully merged portvariants:
1788:debug:clean Changing to port directory: /opt/local/var/macports/sources/rsync.macports.org/release/tarballs/ports/devel/mspdebug
1789:debug:clean OS darwin/17.7.0 (Mac OS X 10.13) arch i386
1790:debug:clean Reading variant descriptions from /opt/local/var/macports/sources/rsync.macports.org/release/tarballs/ports/_resources/port1.0/variant_descriptions.conf
1791:debug:clean universal variant already exists, so not adding the default one
1792:debug:clean Running callback portconfigure::add_automatic_compiler_dependencies
1793:debug:clean Finished running callback portconfigure::add_automatic_compiler_dependencies
1794:debug:clean Running callback portbuild::add_automatic_buildsystem_dependencies
1795:debug:clean Finished running callback portbuild::add_automatic_buildsystem_dependencies
1796:debug:clean Running callback portstartupitem::add_notes
1797:debug:clean Finished running callback portstartupitem::add_notes
1798:debug:clean No need to upgrade! mspdebug 0.23_0 >= mspdebug 0.23_0
1799:debug:clean epoch: in tree: 0 installed: 0
1800:debug:clean libusb-compat 0.1.5_0 exists in the ports tree
1801:debug:clean libusb-compat 0.1.5_0  is the latest installed
1802:debug:clean libusb-compat 0.1.5_0  is active
1803:debug:clean Merging existing variants '' into variants
1804:debug:clean new fully merged portvariants:
1805:debug:clean Changing to port directory: /opt/local/var/macports/sources/rsync.macports.org/release/tarballs/ports/devel/libusb-compat
1806:debug:clean OS darwin/17.7.0 (Mac OS X 10.13) arch i386
1807:debug:clean adding the default universal variant
1808:debug:clean Reading variant descriptions from /opt/local/var/macports/sources/rsync.macports.org/release/tarballs/ports/_resources/port1.0/variant_descriptions.conf
1809:debug:clean Running callback portconfigure::add_automatic_compiler_dependencies
1810:debug:clean Finished running callback portconfigure::add_automatic_compiler_dependencies
1811:debug:clean Running callback portbuild::add_automatic_buildsystem_dependencies
1812:debug:clean Finished running callback portbuild::add_automatic_buildsystem_dependencies
1813:debug:clean Running callback portstartupitem::add_notes
1814:debug:clean Finished running callback portstartupitem::add_notes
1815:debug:clean No need to upgrade! libusb-compat 0.1.5_0 >= libusb-compat 0.1.5_0
1816:debug:clean epoch: in tree: 0 installed: 0
1817:debug:clean libusb 1.0.22_0 exists in the ports tree
1818:debug:clean libusb 1.0.22_0  is the latest installed
1819:debug:clean libusb 1.0.22_0  is active
1820:debug:clean Merging existing variants '' into variants
1821:debug:clean new fully merged portvariants:
1822:debug:clean Changing to port directory: /opt/local/var/macports/sources/rsync.macports.org/release/tarballs/ports/devel/libusb
1823:debug:clean OS darwin/17.7.0 (Mac OS X 10.13) arch i386
1824:debug:clean Sourcing PortGroup github 1.0 from /opt/local/var/macports/sources/rsync.macports.org/release/tarballs/ports/_resources/port1.0/group/github-1.0.tcl
1825:debug:clean Re-registering default for livecheck.regex
1826:debug:clean adding the default universal variant
1827:debug:clean Reading variant descriptions from /opt/local/var/macports/sources/rsync.macports.org/release/tarballs/ports/_resources/port1.0/variant_descriptions.conf
1828:debug:clean Running callback portconfigure::add_automatic_compiler_dependencies
1829:debug:clean Finished running callback portconfigure::add_automatic_compiler_dependencies
1830:debug:clean Running callback portbuild::add_automatic_buildsystem_dependencies
1831:debug:clean Finished running callback portbuild::add_automatic_buildsystem_dependencies
1832:debug:clean Running callback portstartupitem::add_notes
1833:debug:clean Finished running callback portstartupitem::add_notes
1834:debug:clean No need to upgrade! libusb 1.0.22_0 >= libusb 1.0.22_0
1835:msg:clean --->  Computing dependencies for msp430-gdb:info:clean .:debug:clean Checking for conflicts against msp430-gdb
1836:debug:clean Searching for dependency: msp430-gdb-devel
1837:debug:clean Didn't find receipt, going to depspec regex for: msp430-gdb-devel
1838:debug:clean Searching for dependency: mspdebug
1839:debug:clean Found Dependency: receipt exists for mspdebug
1840:debug:main Executing org.macports.main (msp430-gdb)
1841:debug:main dropping privileges: euid changed to 502, egid changed to 501.
1842:debug:main Skipping completed org.macports.archivefetch (msp430-gdb)
1843:debug:main Privilege de-escalation not attempted as not running as root.
1844:debug:main Skipping completed org.macports.fetch (msp430-gdb)
1845:debug:main Privilege de-escalation not attempted as not running as root.
1846:debug:main Skipping completed org.macports.checksum (msp430-gdb)
1847:debug:main Privilege de-escalation not attempted as not running as root.
1848:debug:main Skipping completed org.macports.extract (msp430-gdb)
1849:debug:main Privilege de-escalation not attempted as not running as root.
1850:debug:main Skipping completed org.macports.patch (msp430-gdb)
1851:debug:main Privilege de-escalation not attempted as not running as root.
1852:debug:main Skipping completed org.macports.configure (msp430-gdb)
1853:debug:main Privilege de-escalation not attempted as not running as root.
1854:debug:build build phase started at Mon Jul 30 12:28:28 CEST 2018
1855:notice:build --->  Building msp430-gdb
1856:debug:build Executing org.macports.build (msp430-gdb)
1857:debug:build Environment:
1858:debug:build CC_PRINT_OPTIONS='YES'
1859:debug:build CC_PRINT_OPTIONS_FILE='/opt/local/var/macports/build/_opt_local_var_macports_sources_rsync.macports.org_release_tarballs_ports_cross_msp430-gdb/msp430-gdb/work/.CC_PRINT_OPTIONS'
1860:debug:build CFLAGS='-I/opt/local/include'
1861:debug:build CPATH='/opt/local/include'
1862:debug:build LIBRARY_PATH='/opt/local/lib'
1863:debug:build MACOSX_DEPLOYMENT_TARGET='10.13'
1864:info:build Executing:  cd "/opt/local/var/macports/build/_opt_local_var_macports_sources_rsync.macports.org_release_tarballs_ports_cross_msp430-gdb/msp430-gdb/work/gdb-7.2" && /usr/bin/make -j4 -w all
1865:debug:build system:  cd "/opt/local/var/macports/build/_opt_local_var_macports_sources_rsync.macports.org_release_tarballs_ports_cross_msp430-gdb/msp430-gdb/work/gdb-7.2" && /usr/bin/make -j4 -w all
1866:info:build make: Entering directory `/opt/local/var/macports/build/_opt_local_var_macports_sources_rsync.macports.org_release_tarballs_ports_cross_msp430-gdb/msp430-gdb/work/gdb-7.2'
1867:info:build make[1]: Entering directory `/opt/local/var/macports/build/_opt_local_var_macports_sources_rsync.macports.org_release_tarballs_ports_cross_msp430-gdb/msp430-gdb/work/gdb-7.2'
1868:info:build make[1]: Nothing to be done for `all-target'.
1869:info:build make[2]: Entering directory `/opt/local/var/macports/build/_opt_local_var_macports_sources_rsync.macports.org_release_tarballs_ports_cross_msp430-gdb/msp430-gdb/work/gdb-7.2/intl'
1870:info:build make[2]: Nothing to be done for `all'.
1871:info:build make[2]: Leaving directory `/opt/local/var/macports/build/_opt_local_var_macports_sources_rsync.macports.org_release_tarballs_ports_cross_msp430-gdb/msp430-gdb/work/gdb-7.2/intl'
1872:info:build make[2]: Entering directory `/opt/local/var/macports/build/_opt_local_var_macports_sources_rsync.macports.org_release_tarballs_ports_cross_msp430-gdb/msp430-gdb/work/gdb-7.2/libiberty'
1873:info:build if [ x"" != x ]; then \
1874:info:build       /usr/bin/clang -c -DHAVE_CONFIG_H -I/opt/local/include -pipe -Os -arch x86_64  -I. -I./../include  -W -Wall -Wwrite-strings -Wc++-compat -Wstrict-prototypes -pedantic   ./md5.c -o pic/md5.o; \
1875:info:build     else true; fi
1876:info:build /usr/bin/clang -c -DHAVE_CONFIG_H -I/opt/local/include -pipe -Os -arch x86_64  -I. -I./../include  -W -Wall -Wwrite-strings -Wc++-compat -Wstrict-prototypes -pedantic  ./md5.c -o md5.o
1877:info:build make[2]: Entering directory `/opt/local/var/macports/build/_opt_local_var_macports_sources_rsync.macports.org_release_tarballs_ports_cross_msp430-gdb/msp430-gdb/work/gdb-7.2/etc'
1878:info:build for f in standards.info configure.info; do \
1879:info:build       if test -f ./`echo $f | sed -e 's/.info$/.texi/'`; then \
1880:info:build         if /Applications/Xcode.app/Contents/Developer/usr/bin/make "MAKEINFO=makeinfo --split-size=5000000 --split-size=5000000" $f; then \
1881:info:build           true; \
1882:info:build         else \
1883:info:build           exit 1; \
1884:info:build         fi; \
1885:info:build       fi; \
1886:info:build     done
1887:info:build make[2]: Entering directory `/opt/local/var/macports/build/_opt_local_var_macports_sources_rsync.macports.org_release_tarballs_ports_cross_msp430-gdb/msp430-gdb/work/gdb-7.2/libdecnumber'
1888:info:build make[2]: Nothing to be done for `all'.
1889:info:build make[2]: Leaving directory `/opt/local/var/macports/build/_opt_local_var_macports_sources_rsync.macports.org_release_tarballs_ports_cross_msp430-gdb/msp430-gdb/work/gdb-7.2/libdecnumber'
1890:info:build if [ x"" != x ]; then \
1891:info:build       /usr/bin/clang -c -DHAVE_CONFIG_H -I/opt/local/include -pipe -Os -arch x86_64  -I. -I./../include  -W -Wall -Wwrite-strings -Wc++-compat -Wstrict-prototypes -pedantic   ./sha1.c -o pic/sha1.o; \
1892:info:build     else true; fi
1893:info:build /usr/bin/clang -c -DHAVE_CONFIG_H -I/opt/local/include -pipe -Os -arch x86_64  -I. -I./../include  -W -Wall -Wwrite-strings -Wc++-compat -Wstrict-prototypes -pedantic  ./sha1.c -o sha1.o
1894:info:build make[3]: Entering directory `/opt/local/var/macports/build/_opt_local_var_macports_sources_rsync.macports.org_release_tarballs_ports_cross_msp430-gdb/msp430-gdb/work/gdb-7.2/etc'
1895:info:build make[3]: `standards.info' is up to date.
1896:info:build make[3]: Leaving directory `/opt/local/var/macports/build/_opt_local_var_macports_sources_rsync.macports.org_release_tarballs_ports_cross_msp430-gdb/msp430-gdb/work/gdb-7.2/etc'
1897:info:build make[3]: Entering directory `/opt/local/var/macports/build/_opt_local_var_macports_sources_rsync.macports.org_release_tarballs_ports_cross_msp430-gdb/msp430-gdb/work/gdb-7.2/etc'
1898:info:build make[3]: `configure.info' is up to date.
1899:info:build make[3]: Leaving directory `/opt/local/var/macports/build/_opt_local_var_macports_sources_rsync.macports.org_release_tarballs_ports_cross_msp430-gdb/msp430-gdb/work/gdb-7.2/etc'
1900:info:build make[2]: Leaving directory `/opt/local/var/macports/build/_opt_local_var_macports_sources_rsync.macports.org_release_tarballs_ports_cross_msp430-gdb/msp430-gdb/work/gdb-7.2/etc'
1901:info:build if [ x"" != x ]; then \
1902:info:build       /usr/bin/clang -c -DHAVE_CONFIG_H -I/opt/local/include -pipe -Os -arch x86_64  -I. -I./../include  -W -Wall -Wwrite-strings -Wc++-compat -Wstrict-prototypes -pedantic   ./alloca.c -o pic/alloca.o; \
1903:info:build     else true; fi
1904:info:build /usr/bin/clang -c -DHAVE_CONFIG_H -I/opt/local/include -pipe -Os -arch x86_64  -I. -I./../include  -W -Wall -Wwrite-strings -Wc++-compat -Wstrict-prototypes -pedantic  ./alloca.c -o alloca.o
1905:info:build make[2]: Entering directory `/opt/local/var/macports/build/_opt_local_var_macports_sources_rsync.macports.org_release_tarballs_ports_cross_msp430-gdb/msp430-gdb/work/gdb-7.2/readline'
1906:info:build make[2]: Nothing to be done for `all'.
1907:info:build make[2]: Leaving directory `/opt/local/var/macports/build/_opt_local_var_macports_sources_rsync.macports.org_release_tarballs_ports_cross_msp430-gdb/msp430-gdb/work/gdb-7.2/readline'
1908:info:build if [ x"" != x ]; then \
1909:info:build       /usr/bin/clang -c -DHAVE_CONFIG_H -I/opt/local/include -pipe -Os -arch x86_64  -I. -I./../include  -W -Wall -Wwrite-strings -Wc++-compat -Wstrict-prototypes -pedantic   ./argv.c -o pic/argv.o; \
1910:info:build     else true; fi
1911:info:build /usr/bin/clang -c -DHAVE_CONFIG_H -I/opt/local/include -pipe -Os -arch x86_64  -I. -I./../include  -W -Wall -Wwrite-strings -Wc++-compat -Wstrict-prototypes -pedantic  ./argv.c -o argv.o
1912:info:build ./md5.c:65:./sha1.c:2258::23: warning : warning: declaration of 'struct sha1_ctx' will not be visible outside of this function [-Wvisibility]
1913:info:build declaration of 'struct md5_ctx' will not be visible outside of this function [-Wvisibility]
1914:info:build sha1_init_ctx (struct sha1_ctx *ctx)
1915:info:build                       ^
1916:info:build md5_init_ctx (struct md5_ctx *ctx)
1917:info:build                      ^
1918:info:build ./sha1.c:60:6: error: incomplete definition of type 'struct sha1_ctx'
1919:info:build ./md5.c:67:6: error: incomplete definition of type 'struct md5_ctx'
1920:info:build   ctx->A = 0x67452301;  ctx->A = (md5_uint32) 0x67452301;
1921:info:build   ~~~^  ~~~^
1922:info:build ./sha1.c:./md5.c58::6523::22 :note : noteforward declaration of 'struct sha1_ctx'
1923:info:build : forward declaration of 'struct md5_ctx'
1924:info:build sha1_init_ctx (struct sha1_ctx *ctx)
1925:info:build                       ^md5_init_ctx (struct md5_ctx *ctx)
1926:info:build                      ^
1927:info:build ./sha1.c:61:6: error: incomplete definition of type 'struct sha1_ctx'
1928:info:build   ctx->B = 0xefcdab89;
1929:info:build   ~~~^
1930:info:build ./sha1.c:58:23: note: forward declaration of 'struct sha1_ctx'
1931:info:build sha1_init_ctx (struct sha1_ctx *ctx)
1932:info:build                       ^
1933:info:build ./sha1.c:62:6: error: incomplete definition of type 'struct sha1_ctx'
1934:info:build   ctx->C = 0x98badcfe;
1935:info:build   ~~~^
1936:info:build ./sha1.c:58:23: note: forward declaration of 'struct sha1_ctx'
1937:info:build sha1_init_ctx (struct sha1_ctx *ctx)
1938:info:build                       ^
1939:info:build ./sha1.c:63:6: error: incomplete definition of type 'struct sha1_ctx'
1940:info:build   ctx->D = 0x10325476;
1941:info:build   ~~~^
1942:info:build ./sha1.c:58:23: note: forward declaration of 'struct sha1_ctx'
1943:info:build sha1_init_ctx (struct sha1_ctx *ctx)
1944:info:build                       ^
1945:info:build ./sha1.c:64:6: error: incomplete definition of type 'struct sha1_ctx'
1946:info:build   ctx->E = 0xc3d2e1f0;
1947:info:build   ~~~^
1948:info:build ./sha1.c:58:23: note: forward declaration of 'struct sha1_ctx'
1949:info:build sha1_init_ctx (struct sha1_ctx *ctx)
1950:info:build                       ^
1951:info:build ./sha1.c:66:6: error: incomplete definition of type 'struct sha1_ctx'
1952:info:build   ctx->total[0] = ctx->total[1] = 0;
1953:info:build   ~~~^
1954:info:build ./sha1.c:58:23: note: forward declaration of 'struct sha1_ctx'
1955:info:build sha1_init_ctx (struct sha1_ctx *ctx)
1956:info:build                       ^
1957:info:build ./sha1.c:66:22: error: incomplete definition of type 'struct sha1_ctx'
1958:info:build   ctx->total[0] = ctx->total[1] = 0;
1959:info:build                   ~~~^
1960:info:build ./sha1.c:58:23: note: forward declaration of 'struct sha1_ctx'
1961:info:build sha1_init_ctx (struct sha1_ctx *ctx)
1962:info:build                       ^
1963:info:build ./sha1.c:67:6: error: incomplete definition of type 'struct sha1_ctx'
1964:info:build   ctx->buflen = 0;
1965:info:build   ~~~^
1966:info:build ./sha1.c:58:23: note: forward declaration of 'struct sha1_ctx'
1967:info:build sha1_init_ctx (struct sha1_ctx *ctx)
1968:info:build                       ^
1969:info:build ./sha1.c:76:29: warning: declaration of 'struct sha1_ctx' will not be visible outside of this function [-Wvisibility]
1970:info:build sha1_read_ctx (const struct sha1_ctx *ctx, void *resbuf)
1971:info:build                             ^
1972:info:build ./sha1.c:78:18: error: expected expression
1973:info:build   ((sha1_uint32 *) resbuf)[0] = SWAP (ctx->A);
1974:info:build                  ^
1975:info:build ./sha1.c:78:5: error./md5.c:67:13: : use of undeclared identifier 'sha1_uint32'error:
1976:info:build use of undeclared identifier 'md5_uint32'
1977:info:build   ((sha1_uint32 *) resbuf)[0] = SWAP (ctx->A);
1978:info:build   ctx->A = (md5_uint32) 0x67452301;    ^
1979:info:build             ^
1980:info:build ./md5.c:68:./sha1.c:786::42 :error : error: incomplete definition of type 'struct md5_ctx'incomplete definition of type 'struct sha1_ctx'
1981:info:build   ctx->B = (md5_uint32) 0xefcdab89;
1982:info:build   ~~~^
1983:info:build ./md5.c:  ((sha1_uint32 *) resbuf)[0] = SWAP (ctx->A);
1984:info:build 65                                      ~~~^:
1985:info:build 22: note: forward declaration of 'struct md5_ctx'
1986:info:build md5_init_ctx (struct md5_ctx *ctx)
1987:info:build                      ^
1988:info:build ./sha1.c:41:8: note: expanded from macro 'SWAP'
1989:info:build     (((n) << 24) | (((n) & 0xff00) << 8) | (((n) >> 8) & 0xff00) | ((n) >> 24))
1990:info:build        ^
1991:info:build ./sha1.c:76:29: note: forward declaration of 'struct sha1_ctx'
1992:info:build sha1_read_ctx (const struct sha1_ctx *ctx, void *resbuf)
1993:info:build                             ^
1994:info:build ./sha1.c:78:42: error: incomplete definition of type 'struct sha1_ctx'
1995:info:build   ((sha1_uint32 *) resbuf)[0] = SWAP (ctx->A);
1996:info:build                                       ~~~^
1997:info:build ./sha1.c:41:23: note: expanded from macro 'SWAP'
1998:info:build     (((n) << 24) | (((n) & 0xff00) << 8) | (((n) >> 8) & 0xff00) | ((n) >> 24))
1999:info:build                       ^
2000:info:build ./sha1.c:76:29: note: forward declaration of 'struct sha1_ctx'
2001:info:build sha1_read_ctx (const struct sha1_ctx *ctx, void *resbuf)
2002:info:build                             ^
2003:info:build ./sha1.c:78:42: error: incomplete definition of type 'struct sha1_ctx'
2004:info:build   ((sha1_uint32 *) resbuf)[0] = SWAP (ctx->A);
2005:info:build                                       ~~~^
2006:info:build ./sha1.c:41:47: note: expanded from macro 'SWAP'
2007:info:build     (((n) << 24) | (((n) & 0xff00) << 8) | (((n) >> 8) & 0xff00) | ((n) >> 24))
2008:info:build                                               ^
2009:info:build ./sha1.c:76:29: note: forward declaration of 'struct sha1_ctx'
2010:info:build sha1_read_ctx (const struct sha1_ctx *ctx, void *resbuf)
2011:info:build                             ^
2012:info:build ./sha1.c:78:42: error: incomplete definition of type 'struct sha1_ctx'
2013:info:build   ((sha1_uint32 *) resbuf)[0] = SWAP (ctx->A);
2014:info:build                                       ~~~^
2015:info:build ./sha1.c:41:70: note: expanded from macro 'SWAP'
2016:info:build     (((n) << 24) | (((n) & 0xff00) << 8) | (((n) >> 8) & 0xff00) | ((n) >> 24))
2017:info:build ./md5.c:68:                                                                     ^13
2018:info:build ./sha1.c:76::29:  error: noteuse of undeclared identifier 'md5_uint32':
2019:info:build forward declaration of 'struct sha1_ctx'
2020:info:build   ctx->B = (md5_uint32) 0xefcdab89;
2021:info:build             ^
2022:info:build sha1_read_ctx (const struct sha1_ctx *ctx, void *resbuf)
2023:info:build                             ^
2024:info:build ./md5.c:69:6: error: incomplete definition of type 'struct md5_ctx'
2025:info:build   ctx->C = (md5_uint32) 0x98badcfe;
2026:info:build   ~~~^
2027:info:build ./md5.c:65:22: note: forward declaration of 'struct md5_ctx'
2028:info:build md5_init_ctx (struct md5_ctx *ctx)
2029:info:build                      ^
2030:info:build ./sha1.c:79:18: error: expected expression
2031:info:build   ((sha1_uint32 *) resbuf)[1] = SWAP (ctx->B);
2032:info:build                  ^
2033:info:build ./sha1.c:79:5: error: use of undeclared identifier 'sha1_uint32'
2034:info:build   ((sha1_uint32 *) resbuf)[1] = SWAP (ctx->B);
2035:info:build     ^
2036:info:build ./sha1.c:79:42: error: incomplete definition of type 'struct sha1_ctx'
2037:info:build   ((sha1_uint32 *) resbuf)[1] = SWAP (ctx->B);
2038:info:build                                       ~~~^
2039:info:build ./sha1.c:41:8: note: expanded from macro 'SWAP'
2040:info:build ./md5.c:69:13: error: use of undeclared identifier 'md5_uint32'
2041:info:build   ctx->C = (md5_uint32) 0x98badcfe;
2042:info:build             ^    (((n) << 24) | (((n) & 0xff00) << 8) | (((n) >> 8) & 0xff00) | ((n) >> 24))
2043:info:build        ^
2044:info:build ./sha1.c:76:29: note: forward declaration of 'struct sha1_ctx'
2045:info:build ./md5.c:70:6: error: sha1_read_ctx (const struct sha1_ctx *ctx, void *resbuf)incomplete definition of type 'struct md5_ctx'
2046:info:build                             ^
2047:info:build ./sha1.c:79:42: error:   ctx->D = (md5_uint32) 0x10325476;
2048:info:build   ~~~^
2049:info:build incomplete definition of type 'struct sha1_ctx'./md5.c:65:22:
2050:info:build note: forward declaration of 'struct md5_ctx'
2051:info:build md5_init_ctx (struct md5_ctx *ctx)
2052:info:build                      ^
2053:info:build   ((sha1_uint32 *) resbuf)[1] = SWAP (ctx->B);
2054:info:build                                       ~~~^
2055:info:build ./sha1.c:41:23: note: expanded from macro 'SWAP'
2056:info:build     (((n) << 24) | (((n) & 0xff00) << 8) | (((n) >> 8) & 0xff00) | ((n) >> 24))
2057:info:build                       ^
2058:info:build ./sha1.c:76:29: note: forward declaration of 'struct sha1_ctx'
2059:info:build sha1_read_ctx (const struct sha1_ctx *ctx, void *resbuf)
2060:info:build                             ^
2061:info:build ./sha1.c:79:42: error: incomplete definition of type 'struct sha1_ctx'
2062:info:build   ((sha1_uint32 *) resbuf)[1] = SWAP (ctx->B);
2063:info:build                                       ~~~^
2064:info:build ./sha1.c:41:47: note: expanded from macro 'SWAP'
2065:info:build     (((n) << 24) | (((n) & 0xff00) << 8) | (((n) >> 8) & 0xff00) | ((n) >> 24))
2066:info:build                                               ^
2067:info:build ./sha1.c:76:29: note: forward declaration of 'struct sha1_ctx'
2068:info:build sha1_read_ctx (const struct sha1_ctx *ctx, void *resbuf)
2069:info:build                             ^
2070:info:build ./md5.c:70:13: error: use of undeclared identifier 'md5_uint32'
2071:info:build   ctx->D = (md5_uint32) 0x10325476;
2072:info:build             ^
2073:info:build ./md5.c:72:6: error: incomplete definition of type 'struct md5_ctx'
2074:info:build   ctx->total[0] = ctx->total[1] = 0;
2075:info:build   ~~~^
2076:info:build ./md5.c:65:22: note: forward declaration of 'struct md5_ctx'
2077:info:build md5_init_ctx (struct md5_ctx *ctx)
2078:info:build                      ^
2079:info:build ./md5.c:72:22: error: incomplete definition of type 'struct md5_ctx'
2080:info:build   ctx->total[0] = ctx->total[1] = 0;
2081:info:build                   ~~~^
2082:info:build ./md5.c:65:22: note: forward declaration of 'struct md5_ctx'
2083:info:build md5_init_ctx (struct md5_ctx *ctx)
2084:info:build                      ^
2085:info:build ./md5.c:73:6: error: incomplete definition of type 'struct md5_ctx'
2086:info:build   ctx->buflen = 0;
2087:info:build   ~~~^
2088:info:build ./md5.c:65:22: note: forward declaration of 'struct md5_ctx'
2089:info:build md5_init_ctx (struct md5_ctx *ctx)
2090:info:build                      ^
2091:info:build ./md5.c:82:28: warning: declaration of 'struct md5_ctx' will not be visible outside of this function [-Wvisibility]
2092:info:build fatal error: too many errors emitted, stopping now [-ferror-limit=]
2093:info:build md5_read_ctx (const struct md5_ctx *ctx, void *resbuf)
2094:info:build                            ^
2095:info:build ./md5.c:84:17: error: expected expression
2096:info:build   ((md5_uint32 *) resbuf)[0] = SWAP (ctx->A);
2097:info:build                 ^
2098:info:build ./md5.c:84:5: error: use of undeclared identifier 'md5_uint32'
2099:info:build   ((md5_uint32 *) resbuf)[0] = SWAP (ctx->A);
2100:info:build     ^
2101:info:build ./md5.c:84:41: error: incomplete definition of type 'struct md5_ctx'
2102:info:build   ((md5_uint32 *) resbuf)[0] = SWAP (ctx->A);
2103:info:build                                      ~~~^
2104:info:build ./md5.c:53:19: note: expanded from macro 'SWAP'
2105:info:build # define SWAP(n) (n)
2106:info:build                   ^
2107:info:build ./md5.c:82:28: note: forward declaration of 'struct md5_ctx'
2108:info:build md5_read_ctx (const struct md5_ctx *ctx, void *resbuf)
2109:info:build                            ^
2110:info:build ./md5.c:85:17: error: expected expression
2111:info:build   ((md5_uint32 *) resbuf)[1] = SWAP (ctx->B);
2112:info:build                 ^
2113:info:build ./md5.c:85:5: error: use of undeclared identifier 'md5_uint32'
2114:info:build   ((md5_uint32 *) resbuf)[1] = SWAP (ctx->B);
2115:info:build     ^
2116:info:build ./md5.c:85:41: error: incomplete definition of type 'struct md5_ctx'
2117:info:build   ((md5_uint32 *) resbuf)[1] = SWAP (ctx->B);
2118:info:build                                      ~~~^
2119:info:build ./md5.c:53:19: note: expanded from macro 'SWAP'
2120:info:build # define SWAP(n) (n)
2121:info:build                   ^
2122:info:build ./md5.c:82:28: note: forward declaration of 'struct md5_ctx'
2123:info:build md5_read_ctx (const struct md5_ctx *ctx, void *resbuf)
2124:info:build                            ^
2125:info:build ./md5.c:86:17: error: expected expression
2126:info:build   ((md5_uint32 *) resbuf)[2] = SWAP (ctx->C);
2127:info:build                 ^
2128:info:build ./md5.c:86:5: error: use of undeclared identifier 'md5_uint32'
2129:info:build   ((md5_uint32 *) resbuf)[2] = SWAP (ctx->C);
2130:info:build     ^
2131:info:build fatal error: too many errors emitted, stopping now [-ferror-limit=]
2132:info:build 2 warnings and 20 errors generated.
2133:info:build 2 warnings and 20 errors generated.
2134:info:build make[2]: *** [md5.o] Error 1
2135:info:build make[2]: *** Waiting for unfinished jobs....
2136:info:build make[2]: *** [sha1.o] Error 1
2137:info:build make[2]: Leaving directory `/opt/local/var/macports/build/_opt_local_var_macports_sources_rsync.macports.org_release_tarballs_ports_cross_msp430-gdb/msp430-gdb/work/gdb-7.2/libiberty'
2138:info:build make[1]: *** [all-libiberty] Error 2
2139:info:build make[1]: Leaving directory `/opt/local/var/macports/build/_opt_local_var_macports_sources_rsync.macports.org_release_tarballs_ports_cross_msp430-gdb/msp430-gdb/work/gdb-7.2'
2140:info:build make: *** [all] Error 2
2141:info:build make: Leaving directory `/opt/local/var/macports/build/_opt_local_var_macports_sources_rsync.macports.org_release_tarballs_ports_cross_msp430-gdb/msp430-gdb/work/gdb-7.2'
2142:info:build Command failed:  cd "/opt/local/var/macports/build/_opt_local_var_macports_sources_rsync.macports.org_release_tarballs_ports_cross_msp430-gdb/msp430-gdb/work/gdb-7.2" && /usr/bin/make -j4 -w all
2143:info:build Exit code: 2
2144:error:build Failed to build msp430-gdb: command execution failed
2145:debug:build Error code: CHILDSTATUS 32528 2
2146:debug:build Backtrace: command execution failed
2147:debug:build     while executing
2148:debug:build "system {*}$notty {*}$nice $fullcmdstring"
2149:debug:build     invoked from within
2150:debug:build "command_exec build"
2151:debug:build     (procedure "portbuild::build_main" line 8)
2152:debug:build     invoked from within
2153:debug:build "$procedure $targetname"
2154:error:build See /opt/local/var/macports/logs/_opt_local_var_macports_sources_rsync.macports.org_release_tarballs_ports_cross_msp430-gdb/msp430-gdb/main.log for details.
2155version:1
2156:debug:sysinfo macOS 10.13 (darwin/17.7.0) arch i386
2157:debug:sysinfo MacPorts 2.5.3
2158:debug:sysinfo Xcode 9.3
2159:debug:sysinfo SDK 10.13
2160:debug:sysinfo MACOSX_DEPLOYMENT_TARGET: 10.13
2161:debug:main epoch: in tree: 0 installed: 0
2162:debug:main mspdebug 0.23_0 exists in the ports tree
2163:debug:main mspdebug 0.23_0  is the latest installed
2164:debug:main mspdebug 0.23_0  is active
2165:debug:main Merging existing variants '' into variants
2166:debug:main new fully merged portvariants:
2167:debug:main Changing to port directory: /opt/local/var/macports/sources/rsync.macports.org/release/tarballs/ports/devel/mspdebug
2168:debug:main OS darwin/17.7.0 (Mac OS X 10.13) arch i386
2169:debug:main Reading variant descriptions from /opt/local/var/macports/sources/rsync.macports.org/release/tarballs/ports/_resources/port1.0/variant_descriptions.conf
2170:debug:main universal variant already exists, so not adding the default one
2171:debug:main Running callback portconfigure::add_automatic_compiler_dependencies
2172:debug:main Finished running callback portconfigure::add_automatic_compiler_dependencies
2173:debug:main Running callback portbuild::add_automatic_buildsystem_dependencies
2174:debug:main Finished running callback portbuild::add_automatic_buildsystem_dependencies
2175:debug:main Running callback portstartupitem::add_notes
2176:debug:main Finished running callback portstartupitem::add_notes
2177:debug:main No need to upgrade! mspdebug 0.23_0 >= mspdebug 0.23_0
2178:debug:main epoch: in tree: 0 installed: 0
2179:debug:main libusb-compat 0.1.5_0 exists in the ports tree
2180:debug:main libusb-compat 0.1.5_0  is the latest installed
2181:debug:main libusb-compat 0.1.5_0  is active
2182:debug:main Merging existing variants '' into variants
2183:debug:main new fully merged portvariants:
2184:debug:main Changing to port directory: /opt/local/var/macports/sources/rsync.macports.org/release/tarballs/ports/devel/libusb-compat
2185:debug:main OS darwin/17.7.0 (Mac OS X 10.13) arch i386
2186:debug:main adding the default universal variant
2187:debug:main Reading variant descriptions from /opt/local/var/macports/sources/rsync.macports.org/release/tarballs/ports/_resources/port1.0/variant_descriptions.conf
2188:debug:main Running callback portconfigure::add_automatic_compiler_dependencies
2189:debug:main Finished running callback portconfigure::add_automatic_compiler_dependencies
2190:debug:main Running callback portbuild::add_automatic_buildsystem_dependencies
2191:debug:main Finished running callback portbuild::add_automatic_buildsystem_dependencies
2192:debug:main Running callback portstartupitem::add_notes
2193:debug:main Finished running callback portstartupitem::add_notes
2194:debug:main No need to upgrade! libusb-compat 0.1.5_0 >= libusb-compat 0.1.5_0
2195:debug:main epoch: in tree: 0 installed: 0
2196:debug:main libusb 1.0.22_0 exists in the ports tree
2197:debug:main libusb 1.0.22_0  is the latest installed
2198:debug:main libusb 1.0.22_0  is active
2199:debug:main Merging existing variants '' into variants
2200:debug:main new fully merged portvariants:
2201:debug:main Changing to port directory: /opt/local/var/macports/sources/rsync.macports.org/release/tarballs/ports/devel/libusb
2202:debug:main OS darwin/17.7.0 (Mac OS X 10.13) arch i386
2203:debug:main Sourcing PortGroup github 1.0 from /opt/local/var/macports/sources/rsync.macports.org/release/tarballs/ports/_resources/port1.0/group/github-1.0.tcl
2204:debug:main Re-registering default for livecheck.regex
2205:debug:main adding the default universal variant
2206:debug:main Reading variant descriptions from /opt/local/var/macports/sources/rsync.macports.org/release/tarballs/ports/_resources/port1.0/variant_descriptions.conf
2207:debug:main Running callback portconfigure::add_automatic_compiler_dependencies
2208:debug:main Finished running callback portconfigure::add_automatic_compiler_dependencies
2209:debug:main Running callback portbuild::add_automatic_buildsystem_dependencies
2210:debug:main Finished running callback portbuild::add_automatic_buildsystem_dependencies
2211:debug:main Running callback portstartupitem::add_notes
2212:debug:main Finished running callback portstartupitem::add_notes
2213:debug:main No need to upgrade! libusb 1.0.22_0 >= libusb 1.0.22_0
2214:msg:main --->  Computing dependencies for msp430-gdb:info:main .:debug:main Checking for conflicts against msp430-gdb
2215:debug:main Searching for dependency: msp430-gdb-devel
2216:debug:main Didn't find receipt, going to depspec regex for: msp430-gdb-devel
2217:debug:main Searching for dependency: mspdebug
2218:debug:main Found Dependency: receipt exists for mspdebug
2219:debug:main Executing org.macports.main (msp430-gdb)
2220:debug:main dropping privileges: euid changed to 502, egid changed to 501.
2221:debug:main Skipping completed org.macports.archivefetch (msp430-gdb)
2222:debug:main Privilege de-escalation not attempted as not running as root.
2223:debug:main Skipping completed org.macports.fetch (msp430-gdb)
2224:debug:main Privilege de-escalation not attempted as not running as root.
2225:debug:main Skipping completed org.macports.checksum (msp430-gdb)
2226:debug:main Privilege de-escalation not attempted as not running as root.
2227:debug:main Skipping completed org.macports.extract (msp430-gdb)
2228:debug:main Privilege de-escalation not attempted as not running as root.
2229:debug:main Skipping completed org.macports.patch (msp430-gdb)
2230:debug:main Privilege de-escalation not attempted as not running as root.
2231:debug:main Skipping completed org.macports.configure (msp430-gdb)
2232:debug:main Privilege de-escalation not attempted as not running as root.
2233:debug:build build phase started at Mon Jul 30 12:46:21 CEST 2018
2234:notice:build --->  Building msp430-gdb
2235:debug:build Executing org.macports.build (msp430-gdb)
2236:debug:build Environment:
2237:debug:build CC_PRINT_OPTIONS='YES'
2238:debug:build CC_PRINT_OPTIONS_FILE='/opt/local/var/macports/build/_opt_local_var_macports_sources_rsync.macports.org_release_tarballs_ports_cross_msp430-gdb/msp430-gdb/work/.CC_PRINT_OPTIONS'
2239:debug:build CFLAGS='-I/opt/local/include'
2240:debug:build CPATH='/opt/local/include'
2241:debug:build LIBRARY_PATH='/opt/local/lib'
2242:debug:build MACOSX_DEPLOYMENT_TARGET='10.13'
2243:info:build Executing:  cd "/opt/local/var/macports/build/_opt_local_var_macports_sources_rsync.macports.org_release_tarballs_ports_cross_msp430-gdb/msp430-gdb/work/gdb-7.2" && /usr/bin/make -j4 -w all
2244:debug:build system:  cd "/opt/local/var/macports/build/_opt_local_var_macports_sources_rsync.macports.org_release_tarballs_ports_cross_msp430-gdb/msp430-gdb/work/gdb-7.2" && /usr/bin/make -j4 -w all
2245:info:build make: Entering directory `/opt/local/var/macports/build/_opt_local_var_macports_sources_rsync.macports.org_release_tarballs_ports_cross_msp430-gdb/msp430-gdb/work/gdb-7.2'
2246:info:build make[1]: Entering directory `/opt/local/var/macports/build/_opt_local_var_macports_sources_rsync.macports.org_release_tarballs_ports_cross_msp430-gdb/msp430-gdb/work/gdb-7.2'
2247:info:build make[1]: Nothing to be done for `all-target'.
2248:info:build make[2]: Entering directory `/opt/local/var/macports/build/_opt_local_var_macports_sources_rsync.macports.org_release_tarballs_ports_cross_msp430-gdb/msp430-gdb/work/gdb-7.2/intl'
2249:info:build make[2]: Nothing to be done for `all'.
2250:info:build make[2]: Leaving directory `/opt/local/var/macports/build/_opt_local_var_macports_sources_rsync.macports.org_release_tarballs_ports_cross_msp430-gdb/msp430-gdb/work/gdb-7.2/intl'
2251:info:build make[2]: Entering directory `/opt/local/var/macports/build/_opt_local_var_macports_sources_rsync.macports.org_release_tarballs_ports_cross_msp430-gdb/msp430-gdb/work/gdb-7.2/libiberty'
2252:info:build if [ x"" != x ]; then \
2253:info:build       /usr/bin/clang -c -DHAVE_CONFIG_H -I/opt/local/include -pipe -Os -arch x86_64  -I. -I./../include  -W -Wall -Wwrite-strings -Wc++-compat -Wstrict-prototypes -pedantic   ./md5.c -o pic/md5.o; \
2254:info:build     else true; fi
2255:info:build make[2]: Entering directory `/opt/local/var/macports/build/_opt_local_var_macports_sources_rsync.macports.org_release_tarballs_ports_cross_msp430-gdb/msp430-gdb/work/gdb-7.2/libdecnumber'
2256:info:build make[2]: Nothing to be done for `all'.
2257:info:build make[2]: Leaving directory `/opt/local/var/macports/build/_opt_local_var_macports_sources_rsync.macports.org_release_tarballs_ports_cross_msp430-gdb/msp430-gdb/work/gdb-7.2/libdecnumber'
2258:info:build /usr/bin/clang -c -DHAVE_CONFIG_H -I/opt/local/include -pipe -Os -arch x86_64  -I. -I./../include  -W -Wall -Wwrite-strings -Wc++-compat -Wstrict-prototypes -pedantic  ./md5.c -o md5.o
2259:info:build make[2]: Entering directory `/opt/local/var/macports/build/_opt_local_var_macports_sources_rsync.macports.org_release_tarballs_ports_cross_msp430-gdb/msp430-gdb/work/gdb-7.2/etc'
2260:info:build for f in standards.info configure.info; do \
2261:info:build       if test -f ./`echo $f | sed -e 's/.info$/.texi/'`; then \
2262:info:build         if /Applications/Xcode.app/Contents/Developer/usr/bin/make "MAKEINFO=makeinfo --split-size=5000000 --split-size=5000000" $f; then \
2263:info:build           true; \
2264:info:build         else \
2265:info:build           exit 1; \
2266:info:build         fi; \
2267:info:build       fi; \
2268:info:build     done
2269:info:build if [ x"" != x ]; then \
2270:info:build       /usr/bin/clang -c -DHAVE_CONFIG_H -I/opt/local/include -pipe -Os -arch x86_64  -I. -I./../include  -W -Wall -Wwrite-strings -Wc++-compat -Wstrict-prototypes -pedantic   ./sha1.c -o pic/sha1.o; \
2271:info:build     else true; fi
2272:info:build /usr/bin/clang -c -DHAVE_CONFIG_H -I/opt/local/include -pipe -Os -arch x86_64  -I. -I./../include  -W -Wall -Wwrite-strings -Wc++-compat -Wstrict-prototypes -pedantic  ./sha1.c -o sha1.o
2273:info:build make[3]: Entering directory `/opt/local/var/macports/build/_opt_local_var_macports_sources_rsync.macports.org_release_tarballs_ports_cross_msp430-gdb/msp430-gdb/work/gdb-7.2/etc'
2274:info:build make[3]: `standards.info' is up to date.
2275:info:build make[3]: Leaving directory `/opt/local/var/macports/build/_opt_local_var_macports_sources_rsync.macports.org_release_tarballs_ports_cross_msp430-gdb/msp430-gdb/work/gdb-7.2/etc'
2276:info:build make[3]: Entering directory `/opt/local/var/macports/build/_opt_local_var_macports_sources_rsync.macports.org_release_tarballs_ports_cross_msp430-gdb/msp430-gdb/work/gdb-7.2/etc'
2277:info:build make[3]: `configure.info' is up to date.
2278:info:build make[3]: Leaving directory `/opt/local/var/macports/build/_opt_local_var_macports_sources_rsync.macports.org_release_tarballs_ports_cross_msp430-gdb/msp430-gdb/work/gdb-7.2/etc'
2279:info:build make[2]: Leaving directory `/opt/local/var/macports/build/_opt_local_var_macports_sources_rsync.macports.org_release_tarballs_ports_cross_msp430-gdb/msp430-gdb/work/gdb-7.2/etc'
2280:info:build if [ x"" != x ]; then \
2281:info:build       /usr/bin/clang -c -DHAVE_CONFIG_H -I/opt/local/include -pipe -Os -arch x86_64  -I. -I./../include  -W -Wall -Wwrite-strings -Wc++-compat -Wstrict-prototypes -pedantic   ./choose-temp.c -o pic/choose-temp.o; \
2282:info:build     else true; fi
2283:info:build /usr/bin/clang -c -DHAVE_CONFIG_H -I/opt/local/include -pipe -Os -arch x86_64  -I. -I./../include  -W -Wall -Wwrite-strings -Wc++-compat -Wstrict-prototypes -pedantic  ./choose-temp.c -o choose-temp.o
2284:info:build ./md5.c:65:22: warning: declaration of 'struct md5_ctx' will not be visible outside of this function [-Wvisibility]
2285:info:build md5_init_ctx (struct md5_ctx *ctx)
2286:info:build                      ^
2287:info:build ./md5.c:67:6: error: incomplete definition of type 'struct md5_ctx'
2288:info:build   ctx->A = (md5_uint32) 0x67452301;
2289:info:build   ~~~^
2290:info:build ./md5.c:65:22: note: forward declaration of 'struct md5_ctx'
2291:info:build md5_init_ctx (struct md5_ctx *ctx)
2292:info:build                      ^
2293:info:build ./md5.c:67:13: error: use of undeclared identifier 'md5_uint32'
2294:info:build   ctx->A = (md5_uint32) 0x67452301;
2295:info:build             ^
2296:info:build ./md5.c:68:6: error: incomplete definition of type 'struct md5_ctx'
2297:info:build   ctx->B = (md5_uint32) 0xefcdab89;
2298:info:build   ~~~^
2299:info:build ./md5.c:65:22: note: forward declaration of 'struct md5_ctx'
2300:info:build md5_init_ctx (struct md5_ctx *ctx)
2301:info:build                      ^
2302:info:build ./md5.c:68:13: error: use of undeclared identifier 'md5_uint32'
2303:info:build   ctx->B = (md5_uint32) 0xefcdab89;
2304:info:build             ^
2305:info:build ./md5.c:69:6: error: incomplete definition of type 'struct md5_ctx'
2306:info:build   ctx->C = (md5_uint32) 0x98badcfe;
2307:info:build   ~~~^
2308:info:build ./md5.c:65:22: note: forward declaration of 'struct md5_ctx'
2309:info:build md5_init_ctx (struct md5_ctx *ctx)
2310:info:build                      ^
2311:info:build ./md5.c:69:13: error: use of undeclared identifier 'md5_uint32'
2312:info:build   ctx->C = (md5_uint32) 0x98badcfe;
2313:info:build             ^
2314:info:build ./md5.c:70:6: error: incomplete definition of type 'struct md5_ctx'
2315:info:build   ctx->D = (md5_uint32) 0x10325476;
2316:info:build   ~~~^
2317:info:build ./md5.c:65:22: note: forward declaration of 'struct md5_ctx'
2318:info:build md5_init_ctx (struct md5_ctx *ctx)
2319:info:build                      ^
2320:info:build ./md5.c:70:13: error: use of undeclared identifier 'md5_uint32'
2321:info:build   ctx->D = (md5_uint32) 0x10325476;
2322:info:build             ^
2323:info:build ./md5.c:72:6: error: incomplete definition of type 'struct md5_ctx'
2324:info:build   ctx->total[0] = ctx->total[1] = 0;
2325:info:build   ~~~^
2326:info:build ./md5.c:65:22: note: forward declaration of 'struct md5_ctx'
2327:info:build md5_init_ctx (struct md5_ctx *ctx)
2328:info:build                      ^
2329:info:build ./md5.c:72:22: error: incomplete definition of type 'struct md5_ctx'
2330:info:build   ctx->total[0] = ctx->total[1] = 0;
2331:info:build                   ~~~^
2332:info:build ./md5.c:65:22: note: forward declaration of 'struct md5_ctx'
2333:info:build md5_init_ctx (struct md5_ctx *ctx)
2334:info:build                      ^
2335:info:build ./md5.c:73:6: error: incomplete definition of type 'struct md5_ctx'
2336:info:build   ctx->buflen = 0;
2337:info:build   ~~~^
2338:info:build ./md5.c:65:22: note: forward declaration of 'struct md5_ctx'
2339:info:build md5_init_ctx (struct md5_ctx *ctx)
2340:info:build                      ^
2341:info:build ./md5.c:82:28: warning: declaration of 'struct md5_ctx' will not be visible outside of this function [-Wvisibility]
2342:info:build md5_read_ctx (const struct md5_ctx *ctx, void *resbuf)
2343:info:build                            ^
2344:info:build ./md5.c:84:17: error: expected expression
2345:info:build   ((md5_uint32 *) resbuf)[0] = SWAP (ctx->A);
2346:info:build                 ^
2347:info:build ./md5.c:84:5: error: use of undeclared identifier 'md5_uint32'
2348:info:build   ((md5_uint32 *) resbuf)[0] = SWAP (ctx->A);
2349:info:build     ^
2350:info:build ./md5.c:84:41: error: incomplete definition of type 'struct md5_ctx'
2351:info:build   ((md5_uint32 *) resbuf)[0] = SWAP (ctx->A);
2352:info:build                                      ~~~^
2353:info:build ./md5.c:53:19: note: expanded from macro 'SWAP'
2354:info:build # define SWAP(n) (n)
2355:info:build                   ^
2356:info:build ./md5.c:82:28: note: forward declaration of 'struct md5_ctx'
2357:info:build md5_read_ctx (const struct md5_ctx *ctx, void *resbuf)
2358:info:build                            ^
2359:info:build ./md5.c:85:17: error: expected expression
2360:info:build   ((md5_uint32 *) resbuf)[1] = SWAP (ctx->B);
2361:info:build                 ^
2362:info:build ./md5.c:85:5: error: use of undeclared identifier 'md5_uint32'
2363:info:build   ((md5_uint32 *) resbuf)[1] = SWAP (ctx->B);
2364:info:build     ^
2365:info:build ./md5.c:85:41: error: incomplete definition of type 'struct md5_ctx'
2366:info:build   ((md5_uint32 *) resbuf)[1] = SWAP (ctx->B);
2367:info:build                                      ~~~^
2368:info:build ./md5.c:53:19: note: expanded from macro 'SWAP'
2369:info:build # define SWAP(n) (n)
2370:info:build                   ^
2371:info:build ./md5.c:82:28: note: forward declaration of 'struct md5_ctx'
2372:info:build md5_read_ctx (const struct md5_ctx *ctx, void *resbuf)
2373:info:build                            ^
2374:info:build ./md5.c:86:17: error: expected expression
2375:info:build   ((md5_uint32 *) resbuf)[2] = SWAP (ctx->C);
2376:info:build                 ^
2377:info:build ./md5.c:86:5: error: use of undeclared identifier 'md5_uint32'
2378:info:build   ((md5_uint32 *) resbuf)[2] = SWAP (ctx->C);
2379:info:build     ^
2380:info:build fatal error: too many errors emitted, stopping now [-ferror-limit=]
2381:info:build 2 warnings and 20 errors generated.
2382:info:build ./sha1.c:58:23: warning: declaration of 'struct sha1_ctx' will not be visible outside of this function [-Wvisibility]
2383:info:build sha1_init_ctx (struct sha1_ctx *ctx)
2384:info:build                       ^
2385:info:build ./sha1.c:60:6: error: incomplete definition of type 'struct sha1_ctx'
2386:info:build   ctx->A = 0x67452301;
2387:info:build   ~~~^
2388:info:build ./sha1.c:58:23: note: forward declaration of 'struct sha1_ctx'
2389:info:build sha1_init_ctx (struct sha1_ctx *ctx)
2390:info:build                       ^
2391:info:build ./sha1.c:61:6: error: incomplete definition of type 'struct sha1_ctx'
2392:info:build   ctx->B = 0xefcdab89;
2393:info:build   ~~~^
2394:info:build ./sha1.c:58:23: note: forward declaration of 'struct sha1_ctx'
2395:info:build sha1_init_ctx (struct sha1_ctx *ctx)
2396:info:build                       ^
2397:info:build ./sha1.c:62:6: error: incomplete definition of type 'struct sha1_ctx'
2398:info:build   ctx->C = 0x98badcfe;
2399:info:build   ~~~^
2400:info:build ./sha1.c:58:23: note: forward declaration of 'struct sha1_ctx'
2401:info:build sha1_init_ctx (struct sha1_ctx *ctx)
2402:info:build                       ^
2403:info:build ./sha1.c:63:6: error: incomplete definition of type 'struct sha1_ctx'
2404:info:build   ctx->D = 0x10325476;
2405:info:build   ~~~^
2406:info:build ./sha1.c:58:23: note: forward declaration of 'struct sha1_ctx'
2407:info:build sha1_init_ctx (struct sha1_ctx *ctx)
2408:info:build                       ^
2409:info:build ./sha1.c:64:6: error: incomplete definition of type 'struct sha1_ctx'
2410:info:build   ctx->E = 0xc3d2e1f0;
2411:info:build   ~~~^
2412:info:build ./sha1.c:58:23: note: forward declaration of 'struct sha1_ctx'
2413:info:build sha1_init_ctx (struct sha1_ctx *ctx)
2414:info:build                       ^
2415:info:build ./sha1.c:66:6: error: incomplete definition of type 'struct sha1_ctx'
2416:info:build   ctx->total[0] = ctx->total[1] = 0;
2417:info:build   ~~~^
2418:info:build ./sha1.c:58:23: note: forward declaration of 'struct sha1_ctx'
2419:info:build sha1_init_ctx (struct sha1_ctx *ctx)
2420:info:build                       ^
2421:info:build ./sha1.c:66:22: error: incomplete definition of type 'struct sha1_ctx'
2422:info:build   ctx->total[0] = ctx->total[1] = 0;
2423:info:build                   ~~~^
2424:info:build ./sha1.c:58:23: note: forward declaration of 'struct sha1_ctx'
2425:info:build sha1_init_ctx (struct sha1_ctx *ctx)
2426:info:build                       ^
2427:info:build ./sha1.c:67:6: error: incomplete definition of type 'struct sha1_ctx'
2428:info:build   ctx->buflen = 0;
2429:info:build   ~~~^
2430:info:build ./sha1.c:58:23: note: forward declaration of 'struct sha1_ctx'
2431:info:build sha1_init_ctx (struct sha1_ctx *ctx)
2432:info:build                       ^
2433:info:build ./sha1.c:76:29: warning: declaration of 'struct sha1_ctx' will not be visible outside of this function [-Wvisibility]
2434:info:build sha1_read_ctx (const struct sha1_ctx *ctx, void *resbuf)
2435:info:build                             ^
2436:info:build ./sha1.c:78:18: error: expected expression
2437:info:build   ((sha1_uint32 *) resbuf)[0] = SWAP (ctx->A);
2438:info:build                  ^
2439:info:build ./sha1.c:78:5: error: use of undeclared identifier 'sha1_uint32'
2440:info:build   ((sha1_uint32 *) resbuf)[0] = SWAP (ctx->A);
2441:info:build     ^
2442:info:build ./sha1.c:78:42: error: incomplete definition of type 'struct sha1_ctx'
2443:info:build   ((sha1_uint32 *) resbuf)[0] = SWAP (ctx->A);
2444:info:build                                       ~~~^
2445:info:build ./sha1.c:41:8: note: expanded from macro 'SWAP'
2446:info:build     (((n) << 24) | (((n) & 0xff00) << 8) | (((n) >> 8) & 0xff00) | ((n) >> 24))
2447:info:build        ^
2448:info:build ./sha1.c:76:29: note: forward declaration of 'struct sha1_ctx'
2449:info:build sha1_read_ctx (const struct sha1_ctx *ctx, void *resbuf)
2450:info:build                             ^
2451:info:build ./sha1.c:78:42: error: incomplete definition of type 'struct sha1_ctx'
2452:info:build   ((sha1_uint32 *) resbuf)[0] = SWAP (ctx->A);
2453:info:build                                       ~~~^
2454:info:build ./sha1.c:41:23: note: expanded from macro 'SWAP'
2455:info:build     (((n) << 24) | (((n) & 0xff00) << 8) | (((n) >> 8) & 0xff00) | ((n) >> 24))
2456:info:build                       ^
2457:info:build ./sha1.c:76:29: note: forward declaration of 'struct sha1_ctx'
2458:info:build sha1_read_ctx (const struct sha1_ctx *ctx, void *resbuf)
2459:info:build                             ^
2460:info:build ./sha1.c:78:42: error: incomplete definition of type 'struct sha1_ctx'
2461:info:build   ((sha1_uint32 *) resbuf)[0] = SWAP (ctx->A);
2462:info:build                                       ~~~^
2463:info:build ./sha1.c:41:47: note: expanded from macro 'SWAP'
2464:info:build make[2]: *** [md5.o] Error 1
2465:info:build make[2]: *** Waiting for unfinished jobs....
2466:info:build     (((n) << 24) | (((n) & 0xff00) << 8) | (((n) >> 8) & 0xff00) | ((n) >> 24))
2467:info:build                                               ^
2468:info:build ./sha1.c:76:29: note: forward declaration of 'struct sha1_ctx'
2469:info:build sha1_read_ctx (const struct sha1_ctx *ctx, void *resbuf)
2470:info:build                             ^
2471:info:build ./sha1.c:78:42: error: incomplete definition of type 'struct sha1_ctx'
2472:info:build   ((sha1_uint32 *) resbuf)[0] = SWAP (ctx->A);
2473:info:build                                       ~~~^
2474:info:build ./sha1.c:41:70: note: expanded from macro 'SWAP'
2475:info:build     (((n) << 24) | (((n) & 0xff00) << 8) | (((n) >> 8) & 0xff00) | ((n) >> 24))
2476:info:build                                                                      ^
2477:info:build ./sha1.c:76:29: note: forward declaration of 'struct sha1_ctx'
2478:info:build sha1_read_ctx (const struct sha1_ctx *ctx, void *resbuf)
2479:info:build                             ^
2480:info:build ./sha1.c:79:18: error: expected expression
2481:info:build   ((sha1_uint32 *) resbuf)[1] = SWAP (ctx->B);
2482:info:build                  ^
2483:info:build ./sha1.c:79:5: error: use of undeclared identifier 'sha1_uint32'
2484:info:build   ((sha1_uint32 *) resbuf)[1] = SWAP (ctx->B);
2485:info:build     ^
2486:info:build ./sha1.c:79:42: error: incomplete definition of type 'struct sha1_ctx'
2487:info:build   ((sha1_uint32 *) resbuf)[1] = SWAP (ctx->B);
2488:info:build                                       ~~~^
2489:info:build ./sha1.c:41:8: note: expanded from macro 'SWAP'
2490:info:build     (((n) << 24) | (((n) & 0xff00) << 8) | (((n) >> 8) & 0xff00) | ((n) >> 24))
2491:info:build        ^
2492:info:build ./sha1.c:76:29: note: forward declaration of 'struct sha1_ctx'
2493:info:build sha1_read_ctx (const struct sha1_ctx *ctx, void *resbuf)
2494:info:build                             ^
2495:info:build ./sha1.c:79:42: error: incomplete definition of type 'struct sha1_ctx'
2496:info:build   ((sha1_uint32 *) resbuf)[1] = SWAP (ctx->B);
2497:info:build                                       ~~~^
2498:info:build ./sha1.c:41:23: note: expanded from macro 'SWAP'
2499:info:build     (((n) << 24) | (((n) & 0xff00) << 8) | (((n) >> 8) & 0xff00) | ((n) >> 24))
2500:info:build                       ^
2501:info:build ./sha1.c:76:29: note: forward declaration of 'struct sha1_ctx'
2502:info:build sha1_read_ctx (const struct sha1_ctx *ctx, void *resbuf)
2503:info:build                             ^
2504:info:build ./sha1.c:79:42: error: incomplete definition of type 'struct sha1_ctx'
2505:info:build   ((sha1_uint32 *) resbuf)[1] = SWAP (ctx->B);
2506:info:build                                       ~~~^
2507:info:build ./sha1.c:41:47: note: expanded from macro 'SWAP'
2508:info:build     (((n) << 24) | (((n) & 0xff00) << 8) | (((n) >> 8) & 0xff00) | ((n) >> 24))
2509:info:build                                               ^
2510:info:build ./sha1.c:76:29: note: forward declaration of 'struct sha1_ctx'
2511:info:build sha1_read_ctx (const struct sha1_ctx *ctx, void *resbuf)
2512:info:build                             ^
2513:info:build fatal error: too many errors emitted, stopping now [-ferror-limit=]
2514:info:build 2 warnings and 20 errors generated.
2515:info:build make[2]: make[2]: Entering directory `/opt/local/var/macports/build/_opt_local_var_macports_sources_rsync.macports.org_release_tarballs_ports_cross_msp430-gdb/msp430-gdb/work/gdb-7.2/readline'
2516:info:build *** [sha1.o] Error 1
2517:info:build make[2]: Nothing to be done for `all'.
2518:info:build make[2]: Leaving directory `/opt/local/var/macports/build/_opt_local_var_macports_sources_rsync.macports.org_release_tarballs_ports_cross_msp430-gdb/msp430-gdb/work/gdb-7.2/readline'
2519:info:build make[2]: Leaving directory `/opt/local/var/macports/build/_opt_local_var_macports_sources_rsync.macports.org_release_tarballs_ports_cross_msp430-gdb/msp430-gdb/work/gdb-7.2/libiberty'
2520:info:build make[1]: *** [all-libiberty] Error 2
2521:info:build make[1]: Leaving directory `/opt/local/var/macports/build/_opt_local_var_macports_sources_rsync.macports.org_release_tarballs_ports_cross_msp430-gdb/msp430-gdb/work/gdb-7.2'
2522:info:build make: *** [all] Error 2
2523:info:build make: Leaving directory `/opt/local/var/macports/build/_opt_local_var_macports_sources_rsync.macports.org_release_tarballs_ports_cross_msp430-gdb/msp430-gdb/work/gdb-7.2'
2524:info:build Command failed:  cd "/opt/local/var/macports/build/_opt_local_var_macports_sources_rsync.macports.org_release_tarballs_ports_cross_msp430-gdb/msp430-gdb/work/gdb-7.2" && /usr/bin/make -j4 -w all
2525:info:build Exit code: 2
2526:error:build Failed to build msp430-gdb: command execution failed
2527:debug:build Error code: CHILDSTATUS 53183 2
2528:debug:build Backtrace: command execution failed
2529:debug:build     while executing
2530:debug:build "system {*}$notty {*}$nice $fullcmdstring"
2531:debug:build     invoked from within
2532:debug:build "command_exec build"
2533:debug:build     (procedure "portbuild::build_main" line 8)
2534:debug:build     invoked from within
2535:debug:build "$procedure $targetname"
2536:error:build See /opt/local/var/macports/logs/_opt_local_var_macports_sources_rsync.macports.org_release_tarballs_ports_cross_msp430-gdb/msp430-gdb/main.log for details.