Ticket #57273: main.log

File main.log, 55.8 KB (added by danmurray2k, 6 months ago)
Line 
1version:1
2:debug:sysinfo macOS 10.14 (darwin/18.0.0) arch i386
3:debug:sysinfo MacPorts 2.5.4
4:debug:sysinfo Xcode 10.0
5:debug:sysinfo SDK 10.14
6:debug:sysinfo MACOSX_DEPLOYMENT_TARGET: 10.14
7:debug:clean dropping privileges: euid changed to 502, egid changed to 501.
8:debug:main Executing org.macports.main (mysql57)
9:debug:main Privilege de-escalation not attempted as not running as root.
10:debug:archivefetch archivefetch phase started at Sat Oct  6 22:31:26 BST 2018
11:msg:archivefetch --->  Fetching archive for mysql57
12:debug:archivefetch Executing org.macports.archivefetch (mysql57)
13:debug:archivefetch euid/egid changed to: 0/0
14:debug:archivefetch chowned /opt/local/var/macports/incoming to macports
15:debug:archivefetch euid/egid changed to: 502/501
16:info:archivefetch --->  mysql57-5.7.17_0.darwin_18.x86_64.tbz2 doesn't seem to exist in /opt/local/var/macports/incoming/verified
17:msg:archivefetch --->  Attempting to fetch mysql57-5.7.17_0.darwin_18.x86_64.tbz2 from https://packages.macports.org/mysql57
18:debug:archivefetch Fetching archive failed: The requested URL returned error: 404 Not Found
19:msg:archivefetch --->  Attempting to fetch mysql57-5.7.17_0.darwin_18.x86_64.tbz2 from http://lil.fr.packages.macports.org/mysql57
20:debug:archivefetch Fetching archive failed: The requested URL returned error: 404 Not Found
21:msg:archivefetch --->  Attempting to fetch mysql57-5.7.17_0.darwin_18.x86_64.tbz2 from http://mse.uk.packages.macports.org/sites/packages.macports.org/mysql57
22:debug:archivefetch Fetching archive failed: The requested URL returned error: 404 Not Found
23:debug:archivefetch Privilege de-escalation not attempted as not running as root.
24:debug:fetch fetch phase started at Sat Oct  6 22:31:26 BST 2018
25:notice:fetch --->  Fetching distfiles for mysql57
26:debug:fetch elevating privileges for fetch: euid changed to 0, egid changed to 0.
27:debug:fetch dropping privileges: euid changed to 502, egid changed to 501.
28:debug:fetch Executing org.macports.fetch (mysql57)
29:info:fetch --->  mysql-5.7.17.tar.gz does not exist in /opt/local/var/macports/distfiles/mysql57
30:notice:fetch --->  Attempting to fetch mysql-5.7.17.tar.gz from https://distfiles.macports.org/mysql57
31:info:fetch --->  boost_1_59_0.tar.gz does not exist in /opt/local/var/macports/distfiles/mysql57
32:notice:fetch --->  Attempting to fetch boost_1_59_0.tar.gz from https://distfiles.macports.org/mysql57
33:debug:fetch Privilege de-escalation not attempted as not running as root.
34:debug:checksum checksum phase started at Sat Oct  6 22:32:01 BST 2018
35:notice:checksum --->  Verifying checksums for mysql57
36:debug:checksum Executing org.macports.checksum (mysql57)
37:info:checksum --->  Checksumming mysql-5.7.17.tar.gz
38:debug:checksum Calculated (rmd160) is acd8714fe1bda26466c4490b9e71d510677ac9a5
39:debug:checksum Correct (rmd160) checksum for mysql-5.7.17.tar.gz
40:debug:checksum Calculated (sha256) is cebf23e858aee11e354c57d30de7a079754bdc2ef85eb684782458332a4b9651
41:debug:checksum Correct (sha256) checksum for mysql-5.7.17.tar.gz
42:info:checksum --->  Checksumming boost_1_59_0.tar.gz
43:debug:checksum Calculated (rmd160) is a7974be69a426e8a56b880a412d6c418e4cd751c
44:debug:checksum Correct (rmd160) checksum for boost_1_59_0.tar.gz
45:debug:checksum Calculated (sha256) is 47f11c8844e579d02691a607fbd32540104a9ac7a2534a8ddaef50daf502baac
46:debug:checksum Correct (sha256) checksum for boost_1_59_0.tar.gz
47:debug:checksum Privilege de-escalation not attempted as not running as root.
48:debug:extract extract phase started at Sat Oct  6 22:32:03 BST 2018
49:notice:extract --->  Extracting mysql57
50:debug:extract Executing org.macports.extract (mysql57)
51:info:extract --->  Extracting mysql-5.7.17.tar.gz
52:debug:extract setting option extract.args to '/opt/local/var/macports/distfiles/mysql57/mysql-5.7.17.tar.gz'
53:debug:extract Environment:
54:debug:extract CC_PRINT_OPTIONS='YES'
55:debug:extract CC_PRINT_OPTIONS_FILE='/opt/local/var/macports/build/_opt_local_var_macports_sources_rsync.macports.org_macports_release_tarballs_ports_databases_mysql57/mysql57/work/.CC_PRINT_OPTIONS'
56:debug:extract CPATH='/opt/local/include'
57:debug:extract LIBRARY_PATH='/opt/local/lib'
58:debug:extract MACOSX_DEPLOYMENT_TARGET='10.14'
59:info:extract Executing:  cd "/opt/local/var/macports/build/_opt_local_var_macports_sources_rsync.macports.org_macports_release_tarballs_ports_databases_mysql57/mysql57/work" && /usr/bin/gzip -dc '/opt/local/var/macports/distfiles/mysql57/mysql-5.7.17.tar.gz' | /usr/bin/tar -xf -
60:debug:extract system:  cd "/opt/local/var/macports/build/_opt_local_var_macports_sources_rsync.macports.org_macports_release_tarballs_ports_databases_mysql57/mysql57/work" && /usr/bin/gzip -dc '/opt/local/var/macports/distfiles/mysql57/mysql-5.7.17.tar.gz' | /usr/bin/tar -xf -
61:debug:extract euid/egid changed to: 0/0
62:debug:extract chowned /opt/local/var/macports/build/_opt_local_var_macports_sources_rsync.macports.org_macports_release_tarballs_ports_databases_mysql57/mysql57/work to macports
63:debug:extract euid/egid changed to: 502/501
64:info:extract --->  Extracting boost_1_59_0.tar.gz
65:debug:extract setting option extract.args to '/opt/local/var/macports/distfiles/mysql57/boost_1_59_0.tar.gz'
66:debug:extract Environment:
67:debug:extract CC_PRINT_OPTIONS='YES'
68:debug:extract CC_PRINT_OPTIONS_FILE='/opt/local/var/macports/build/_opt_local_var_macports_sources_rsync.macports.org_macports_release_tarballs_ports_databases_mysql57/mysql57/work/.CC_PRINT_OPTIONS'
69:debug:extract CPATH='/opt/local/include'
70:debug:extract LIBRARY_PATH='/opt/local/lib'
71:debug:extract MACOSX_DEPLOYMENT_TARGET='10.14'
72:info:extract Executing:  cd "/opt/local/var/macports/build/_opt_local_var_macports_sources_rsync.macports.org_macports_release_tarballs_ports_databases_mysql57/mysql57/work" && /usr/bin/gzip -dc '/opt/local/var/macports/distfiles/mysql57/boost_1_59_0.tar.gz' | /usr/bin/tar -xf -
73:debug:extract system:  cd "/opt/local/var/macports/build/_opt_local_var_macports_sources_rsync.macports.org_macports_release_tarballs_ports_databases_mysql57/mysql57/work" && /usr/bin/gzip -dc '/opt/local/var/macports/distfiles/mysql57/boost_1_59_0.tar.gz' | /usr/bin/tar -xf -
74:debug:extract euid/egid changed to: 0/0
75:debug:extract chowned /opt/local/var/macports/build/_opt_local_var_macports_sources_rsync.macports.org_macports_release_tarballs_ports_databases_mysql57/mysql57/work to macports
76:debug:extract euid/egid changed to: 502/501
77:debug:extract Executing proc-post-org.macports.extract-extract-0
78:debug:extract Privilege de-escalation not attempted as not running as root.
79:debug:patch patch phase started at Sat Oct  6 22:32:27 BST 2018
80:debug:patch Executing org.macports.patch (mysql57)
81:notice:patch --->  Applying patches to mysql57
82:info:patch --->  Applying patch-cmake-install_layout.cmake.diff
83:debug:patch Environment:
84:debug:patch CC_PRINT_OPTIONS='YES'
85:debug:patch CC_PRINT_OPTIONS_FILE='/opt/local/var/macports/build/_opt_local_var_macports_sources_rsync.macports.org_macports_release_tarballs_ports_databases_mysql57/mysql57/work/.CC_PRINT_OPTIONS'
86:debug:patch CPATH='/opt/local/include'
87:debug:patch LIBRARY_PATH='/opt/local/lib'
88:debug:patch MACOSX_DEPLOYMENT_TARGET='10.14'
89:info:patch Executing:  cd "/opt/local/var/macports/build/_opt_local_var_macports_sources_rsync.macports.org_macports_release_tarballs_ports_databases_mysql57/mysql57/work/mysql-5.7.17" && /usr/bin/patch -p1 < '/opt/local/var/macports/sources/rsync.macports.org/macports/release/tarballs/ports/databases/mysql57/files/patch-cmake-install_layout.cmake.diff'
90:debug:patch system:  cd "/opt/local/var/macports/build/_opt_local_var_macports_sources_rsync.macports.org_macports_release_tarballs_ports_databases_mysql57/mysql57/work/mysql-5.7.17" && /usr/bin/patch -p1 < '/opt/local/var/macports/sources/rsync.macports.org/macports/release/tarballs/ports/databases/mysql57/files/patch-cmake-install_layout.cmake.diff'
91:info:patch patching file cmake/install_layout.cmake
92:info:patch Hunk #3 succeeded at 289 (offset -2 lines).
93:info:patch --->  Applying patch-cmake-install_layout.cmake-yassl.diff
94:debug:patch Environment:
95:debug:patch CC_PRINT_OPTIONS='YES'
96:debug:patch CC_PRINT_OPTIONS_FILE='/opt/local/var/macports/build/_opt_local_var_macports_sources_rsync.macports.org_macports_release_tarballs_ports_databases_mysql57/mysql57/work/.CC_PRINT_OPTIONS'
97:debug:patch CPATH='/opt/local/include'
98:debug:patch LIBRARY_PATH='/opt/local/lib'
99:debug:patch MACOSX_DEPLOYMENT_TARGET='10.14'
100:info:patch Executing:  cd "/opt/local/var/macports/build/_opt_local_var_macports_sources_rsync.macports.org_macports_release_tarballs_ports_databases_mysql57/mysql57/work/mysql-5.7.17" && /usr/bin/patch -p1 < '/opt/local/var/macports/sources/rsync.macports.org/macports/release/tarballs/ports/databases/mysql57/files/patch-cmake-install_layout.cmake-yassl.diff'
101:debug:patch system:  cd "/opt/local/var/macports/build/_opt_local_var_macports_sources_rsync.macports.org_macports_release_tarballs_ports_databases_mysql57/mysql57/work/mysql-5.7.17" && /usr/bin/patch -p1 < '/opt/local/var/macports/sources/rsync.macports.org/macports/release/tarballs/ports/databases/mysql57/files/patch-cmake-install_layout.cmake-yassl.diff'
102:info:patch patching file cmake/install_layout.cmake
103:info:patch Hunk #1 succeeded at 291 (offset -2 lines).
104:info:patch --->  Applying patch-configure.cmake.diff
105:debug:patch Environment:
106:debug:patch CC_PRINT_OPTIONS='YES'
107:debug:patch CC_PRINT_OPTIONS_FILE='/opt/local/var/macports/build/_opt_local_var_macports_sources_rsync.macports.org_macports_release_tarballs_ports_databases_mysql57/mysql57/work/.CC_PRINT_OPTIONS'
108:debug:patch CPATH='/opt/local/include'
109:debug:patch LIBRARY_PATH='/opt/local/lib'
110:debug:patch MACOSX_DEPLOYMENT_TARGET='10.14'
111:info:patch Executing:  cd "/opt/local/var/macports/build/_opt_local_var_macports_sources_rsync.macports.org_macports_release_tarballs_ports_databases_mysql57/mysql57/work/mysql-5.7.17" && /usr/bin/patch -p1 < '/opt/local/var/macports/sources/rsync.macports.org/macports/release/tarballs/ports/databases/mysql57/files/patch-configure.cmake.diff'
112:debug:patch system:  cd "/opt/local/var/macports/build/_opt_local_var_macports_sources_rsync.macports.org_macports_release_tarballs_ports_databases_mysql57/mysql57/work/mysql-5.7.17" && /usr/bin/patch -p1 < '/opt/local/var/macports/sources/rsync.macports.org/macports/release/tarballs/ports/databases/mysql57/files/patch-configure.cmake.diff'
113:info:patch patching file configure.cmake
114:info:patch Hunk #1 succeeded at 499 (offset 32 lines).
115:info:patch --->  Applying patch-innodb_memcached-daemon_memcached-include-memcached-util.h.diff
116:debug:patch Environment:
117:debug:patch CC_PRINT_OPTIONS='YES'
118:debug:patch CC_PRINT_OPTIONS_FILE='/opt/local/var/macports/build/_opt_local_var_macports_sources_rsync.macports.org_macports_release_tarballs_ports_databases_mysql57/mysql57/work/.CC_PRINT_OPTIONS'
119:debug:patch CPATH='/opt/local/include'
120:debug:patch LIBRARY_PATH='/opt/local/lib'
121:debug:patch MACOSX_DEPLOYMENT_TARGET='10.14'
122:info:patch Executing:  cd "/opt/local/var/macports/build/_opt_local_var_macports_sources_rsync.macports.org_macports_release_tarballs_ports_databases_mysql57/mysql57/work/mysql-5.7.17" && /usr/bin/patch -p1 < '/opt/local/var/macports/sources/rsync.macports.org/macports/release/tarballs/ports/databases/mysql57/files/patch-innodb_memcached-daemon_memcached-include-memcached-util.h.diff'
123:debug:patch system:  cd "/opt/local/var/macports/build/_opt_local_var_macports_sources_rsync.macports.org_macports_release_tarballs_ports_databases_mysql57/mysql57/work/mysql-5.7.17" && /usr/bin/patch -p1 < '/opt/local/var/macports/sources/rsync.macports.org/macports/release/tarballs/ports/databases/mysql57/files/patch-innodb_memcached-daemon_memcached-include-memcached-util.h.diff'
124:info:patch patching file plugin/innodb_memcached/daemon_memcached/include/memcached/util.h
125:info:patch Hunk #1 succeeded at 13 with fuzz 2 (offset 2 lines).
126:info:patch --->  Applying patch-lockpool.diff
127:debug:patch Environment:
128:debug:patch CC_PRINT_OPTIONS='YES'
129:debug:patch CC_PRINT_OPTIONS_FILE='/opt/local/var/macports/build/_opt_local_var_macports_sources_rsync.macports.org_macports_release_tarballs_ports_databases_mysql57/mysql57/work/.CC_PRINT_OPTIONS'
130:debug:patch CPATH='/opt/local/include'
131:debug:patch LIBRARY_PATH='/opt/local/lib'
132:debug:patch MACOSX_DEPLOYMENT_TARGET='10.14'
133:info:patch Executing:  cd "/opt/local/var/macports/build/_opt_local_var_macports_sources_rsync.macports.org_macports_release_tarballs_ports_databases_mysql57/mysql57/work/mysql-5.7.17" && /usr/bin/patch -p1 < '/opt/local/var/macports/sources/rsync.macports.org/macports/release/tarballs/ports/databases/mysql57/files/patch-lockpool.diff'
134:debug:patch system:  cd "/opt/local/var/macports/build/_opt_local_var_macports_sources_rsync.macports.org_macports_release_tarballs_ports_databases_mysql57/mysql57/work/mysql-5.7.17" && /usr/bin/patch -p1 < '/opt/local/var/macports/sources/rsync.macports.org/macports/release/tarballs/ports/databases/mysql57/files/patch-lockpool.diff'
135:info:patch patching file rapid/plugin/x/CMakeLists.txt
136:debug:patch Executing proc-post-org.macports.patch-patch-0
137:info:patch --->  Patching install_layout.cmake: s|@NAME@|mysql57|g
138:debug:patch Executing reinplace: /usr/bin/sed s|@NAME@|mysql57|g </opt/local/var/macports/build/_opt_local_var_macports_sources_rsync.macports.org_macports_release_tarballs_ports_databases_mysql57/mysql57/work/mysql-5.7.17/cmake/install_layout.cmake >@file13
139:debug:patch euid/egid changed to: 0/0
140:debug:patch chowned /opt/local/var/macports/build/_opt_local_var_macports_sources_rsync.macports.org_macports_release_tarballs_ports_databases_mysql57/mysql57/work/mysql-5.7.17/cmake/install_layout.cmake to macports
141:debug:patch euid/egid changed to: 502/501
142:debug:patch euid/egid changed to: 0/0
143:debug:patch setting attributes on /opt/local/var/macports/build/_opt_local_var_macports_sources_rsync.macports.org_macports_release_tarballs_ports_databases_mysql57/mysql57/work/mysql-5.7.17/cmake/install_layout.cmake
144:debug:patch euid/egid changed to: 502/501
145:info:patch --->  Patching install_layout.cmake: s|@WORKSRCPATH@|/opt/local/var/macports/build/_opt_local_var_macports_sources_rsync.macports.org_macports_release_tarballs_ports_databases_mysql57/mysql57/work/mysql-5.7.17|g
146:debug:patch Executing reinplace: /usr/bin/sed s|@WORKSRCPATH@|/opt/local/var/macports/build/_opt_local_var_macports_sources_rsync.macports.org_macports_release_tarballs_ports_databases_mysql57/mysql57/work/mysql-5.7.17|g </opt/local/var/macports/build/_opt_local_var_macports_sources_rsync.macports.org_macports_release_tarballs_ports_databases_mysql57/mysql57/work/mysql-5.7.17/cmake/install_layout.cmake >@file13
147:debug:patch euid/egid changed to: 0/0
148:debug:patch chowned /opt/local/var/macports/build/_opt_local_var_macports_sources_rsync.macports.org_macports_release_tarballs_ports_databases_mysql57/mysql57/work/mysql-5.7.17/cmake/install_layout.cmake to macports
149:debug:patch euid/egid changed to: 502/501
150:debug:patch euid/egid changed to: 0/0
151:debug:patch setting attributes on /opt/local/var/macports/build/_opt_local_var_macports_sources_rsync.macports.org_macports_release_tarballs_ports_databases_mysql57/mysql57/work/mysql-5.7.17/cmake/install_layout.cmake
152:debug:patch euid/egid changed to: 502/501
153:info:patch --->  Patching macports-default.cnf: s|@NAME@|mysql57|g
154:debug:patch Executing reinplace: /usr/bin/sed s|@NAME@|mysql57|g </opt/local/var/macports/build/_opt_local_var_macports_sources_rsync.macports.org_macports_release_tarballs_ports_databases_mysql57/mysql57/work/build/macports/macports-default.cnf >@file13
155:debug:patch euid/egid changed to: 0/0
156:debug:patch chowned /opt/local/var/macports/build/_opt_local_var_macports_sources_rsync.macports.org_macports_release_tarballs_ports_databases_mysql57/mysql57/work/build/macports/macports-default.cnf to macports
157:debug:patch euid/egid changed to: 502/501
158:debug:patch euid/egid changed to: 0/0
159:debug:patch setting attributes on /opt/local/var/macports/build/_opt_local_var_macports_sources_rsync.macports.org_macports_release_tarballs_ports_databases_mysql57/mysql57/work/build/macports/macports-default.cnf
160:debug:patch euid/egid changed to: 502/501
161:info:patch --->  Patching my.cnf: s|@NAME@|mysql57|g
162:debug:patch Executing reinplace: /usr/bin/sed s|@NAME@|mysql57|g </opt/local/var/macports/build/_opt_local_var_macports_sources_rsync.macports.org_macports_release_tarballs_ports_databases_mysql57/mysql57/work/build/macports/my.cnf >@file13
163:debug:patch euid/egid changed to: 0/0
164:debug:patch chowned /opt/local/var/macports/build/_opt_local_var_macports_sources_rsync.macports.org_macports_release_tarballs_ports_databases_mysql57/mysql57/work/build/macports/my.cnf to macports
165:debug:patch euid/egid changed to: 502/501
166:debug:patch euid/egid changed to: 0/0
167:debug:patch setting attributes on /opt/local/var/macports/build/_opt_local_var_macports_sources_rsync.macports.org_macports_release_tarballs_ports_databases_mysql57/mysql57/work/build/macports/my.cnf
168:debug:patch euid/egid changed to: 502/501
169:info:patch --->  Patching macports-default.cnf: s|@PREFIX@|/opt/local|g
170:debug:patch Executing reinplace: /usr/bin/sed s|@PREFIX@|/opt/local|g </opt/local/var/macports/build/_opt_local_var_macports_sources_rsync.macports.org_macports_release_tarballs_ports_databases_mysql57/mysql57/work/build/macports/macports-default.cnf >@file13
171:debug:patch euid/egid changed to: 0/0
172:debug:patch chowned /opt/local/var/macports/build/_opt_local_var_macports_sources_rsync.macports.org_macports_release_tarballs_ports_databases_mysql57/mysql57/work/build/macports/macports-default.cnf to macports
173:debug:patch euid/egid changed to: 502/501
174:debug:patch euid/egid changed to: 0/0
175:debug:patch setting attributes on /opt/local/var/macports/build/_opt_local_var_macports_sources_rsync.macports.org_macports_release_tarballs_ports_databases_mysql57/mysql57/work/build/macports/macports-default.cnf
176:debug:patch euid/egid changed to: 502/501
177:info:patch --->  Patching my.cnf: s|@PREFIX@|/opt/local|g
178:debug:patch Executing reinplace: /usr/bin/sed s|@PREFIX@|/opt/local|g </opt/local/var/macports/build/_opt_local_var_macports_sources_rsync.macports.org_macports_release_tarballs_ports_databases_mysql57/mysql57/work/build/macports/my.cnf >@file13
179:debug:patch euid/egid changed to: 0/0
180:debug:patch chowned /opt/local/var/macports/build/_opt_local_var_macports_sources_rsync.macports.org_macports_release_tarballs_ports_databases_mysql57/mysql57/work/build/macports/my.cnf to macports
181:debug:patch euid/egid changed to: 502/501
182:debug:patch euid/egid changed to: 0/0
183:debug:patch setting attributes on /opt/local/var/macports/build/_opt_local_var_macports_sources_rsync.macports.org_macports_release_tarballs_ports_databases_mysql57/mysql57/work/build/macports/my.cnf
184:debug:patch euid/egid changed to: 502/501
185:debug:patch Privilege de-escalation not attempted as not running as root.
186:debug:configure configure phase started at Sat Oct  6 22:32:27 BST 2018
187:notice:configure --->  Configuring mysql57
188:debug:configure Preferred compilers: clang macports-clang-5.0 macports-clang-4.0
189:debug:configure Using compiler 'Xcode Clang'
190:debug:configure Executing proc-pre-org.macports.configure-configure-0
191:debug:configure Executing proc-pre-org.macports.configure-configure-1
192:debug:configure Executing proc-pre-org.macports.configure-configure-2
193:debug:configure Executing org.macports.configure (mysql57)
194:debug:configure Environment:
195:debug:configure CC='/usr/bin/clang'
196:debug:configure CC_PRINT_OPTIONS='YES'
197:debug:configure CC_PRINT_OPTIONS_FILE='/opt/local/var/macports/build/_opt_local_var_macports_sources_rsync.macports.org_macports_release_tarballs_ports_databases_mysql57/mysql57/work/.CC_PRINT_OPTIONS'
198:debug:configure CFLAGS='-pipe -Os -isysroot/Applications/Xcode.app/Contents/Developer/Platforms/MacOSX.platform/Developer/SDKs/MacOSX10.14.sdk'
199:debug:configure CPATH='/opt/local/include'
200:debug:configure CPPFLAGS='-isysroot/Applications/Xcode.app/Contents/Developer/Platforms/MacOSX.platform/Developer/SDKs/MacOSX10.14.sdk'
201:debug:configure CXX='/usr/bin/clang++'
202:debug:configure CXXFLAGS='-pipe -Os -stdlib=libc++ -isysroot/Applications/Xcode.app/Contents/Developer/Platforms/MacOSX.platform/Developer/SDKs/MacOSX10.14.sdk'
203:debug:configure F77FLAGS='-m64'
204:debug:configure F90FLAGS='-pipe -Os -m64'
205:debug:configure FCFLAGS='-pipe -Os -m64'
206:debug:configure FFLAGS='-pipe -Os'
207:debug:configure INSTALL='/usr/bin/install -c'
208:debug:configure LDFLAGS='-L/opt/local/lib -Wl,-headerpad_max_install_names -Wl,-syslibroot,/Applications/Xcode.app/Contents/Developer/Platforms/MacOSX.platform/Developer/SDKs/MacOSX10.14.sdk'
209:debug:configure LIBRARY_PATH='/opt/local/lib'
210:debug:configure MACOSX_DEPLOYMENT_TARGET='10.14'
211:debug:configure OBJC='/usr/bin/clang'
212:debug:configure OBJCFLAGS='-pipe -Os -isysroot/Applications/Xcode.app/Contents/Developer/Platforms/MacOSX.platform/Developer/SDKs/MacOSX10.14.sdk'
213:debug:configure OBJCXX='/usr/bin/clang++'
214:debug:configure OBJCXXFLAGS='-pipe -Os -stdlib=libc++ -isysroot/Applications/Xcode.app/Contents/Developer/Platforms/MacOSX.platform/Developer/SDKs/MacOSX10.14.sdk'
215:info:configure Executing:  cd "/opt/local/var/macports/build/_opt_local_var_macports_sources_rsync.macports.org_macports_release_tarballs_ports_databases_mysql57/mysql57/work/build" && /opt/local/bin/cmake -DCMAKE_INSTALL_PREFIX='/opt/local' -DCMAKE_BUILD_TYPE=Release -DCMAKE_BUILD_WITH_INSTALL_RPATH=ON -DCMAKE_C_COMPILER="$CC" -DCMAKE_COLOR_MAKEFILE=ON -DCMAKE_CXX_COMPILER="$CXX" -DCMAKE_FIND_FRAMEWORK=LAST -DCMAKE_INSTALL_RPATH=/opt/local/lib -DCMAKE_MODULE_PATH=/opt/local/share/cmake/Modules -DCMAKE_SYSTEM_PREFIX_PATH="/opt/local;/opt/local;/usr" -DCMAKE_VERBOSE_MAKEFILE=ON -DCMAKE_POLICY_DEFAULT_CMP0025=NEW -Wno-dev -DCMAKE_INSTALL_NAME_DIR:STRING=/opt/local/lib/mysql57/mysql -DINSTALL_LAYOUT:STRING=MACPORTS -DSYSCONFDIR:PATH=/opt/local/etc/mysql57 -DMYSQL_UNIX_ADDR:PATH=/opt/local/var/run/mysql57/mysqld.sock -DMYSQL_DATADIR:PATH=/opt/local/var/db/mysql57 -DDEFAULT_CHARSET:STRING=utf8 -DDEFAULT_COLLATION:STRING=utf8_general_ci -DWITH_EMBEDDED_SERVER:BOOL=ON -DWITH_ZLIB:STRING=system -DWITH_UNIT_TESTS:BOOL=ON -DENABLE_DOWNLOADS:BOOL=OFF -DENABLE_GCOV:BOOL=OFF -DENABLE_DTRACE:BOOL=OFF -DWITH_LIBWRAP:BOOL=OFF -DWITH_SSL:STRING=bundled -DWITH_INNODB_MEMCACHED=1 -DWITH_PARTITION_STORAGE_ENGINE=1 -DDOWNLOAD_BOOST=1 -DWITH_BOOST=/opt/local/var/macports/build/_opt_local_var_macports_sources_rsync.macports.org_macports_release_tarballs_ports_databases_mysql57/mysql57/work/mysql-5.7.17/../boost_1_59_0 -DDOWNLOAD_BOOST_TIMEOUT=2400 -DCMAKE_C_FLAGS_RELEASE="-DNDEBUG" -DCMAKE_CXX_FLAGS_RELEASE="-DNDEBUG" -DCMAKE_OSX_ARCHITECTURES="x86_64" -DCMAKE_OSX_DEPLOYMENT_TARGET="10.14" -DCMAKE_OSX_SYSROOT="/Applications/Xcode.app/Contents/Developer/Platforms/MacOSX.platform/Developer/SDKs/MacOSX10.14.sdk" /opt/local/var/macports/build/_opt_local_var_macports_sources_rsync.macports.org_macports_release_tarballs_ports_databases_mysql57/mysql57/work/mysql-5.7.17
216:debug:configure system:  cd "/opt/local/var/macports/build/_opt_local_var_macports_sources_rsync.macports.org_macports_release_tarballs_ports_databases_mysql57/mysql57/work/build" && /opt/local/bin/cmake -DCMAKE_INSTALL_PREFIX='/opt/local' -DCMAKE_BUILD_TYPE=Release -DCMAKE_BUILD_WITH_INSTALL_RPATH=ON -DCMAKE_C_COMPILER="$CC" -DCMAKE_COLOR_MAKEFILE=ON -DCMAKE_CXX_COMPILER="$CXX" -DCMAKE_FIND_FRAMEWORK=LAST -DCMAKE_INSTALL_RPATH=/opt/local/lib -DCMAKE_MODULE_PATH=/opt/local/share/cmake/Modules -DCMAKE_SYSTEM_PREFIX_PATH="/opt/local;/opt/local;/usr" -DCMAKE_VERBOSE_MAKEFILE=ON -DCMAKE_POLICY_DEFAULT_CMP0025=NEW -Wno-dev -DCMAKE_INSTALL_NAME_DIR:STRING=/opt/local/lib/mysql57/mysql -DINSTALL_LAYOUT:STRING=MACPORTS -DSYSCONFDIR:PATH=/opt/local/etc/mysql57 -DMYSQL_UNIX_ADDR:PATH=/opt/local/var/run/mysql57/mysqld.sock -DMYSQL_DATADIR:PATH=/opt/local/var/db/mysql57 -DDEFAULT_CHARSET:STRING=utf8 -DDEFAULT_COLLATION:STRING=utf8_general_ci -DWITH_EMBEDDED_SERVER:BOOL=ON -DWITH_ZLIB:STRING=system -DWITH_UNIT_TESTS:BOOL=ON -DENABLE_DOWNLOADS:BOOL=OFF -DENABLE_GCOV:BOOL=OFF -DENABLE_DTRACE:BOOL=OFF -DWITH_LIBWRAP:BOOL=OFF -DWITH_SSL:STRING=bundled -DWITH_INNODB_MEMCACHED=1 -DWITH_PARTITION_STORAGE_ENGINE=1 -DDOWNLOAD_BOOST=1 -DWITH_BOOST=/opt/local/var/macports/build/_opt_local_var_macports_sources_rsync.macports.org_macports_release_tarballs_ports_databases_mysql57/mysql57/work/mysql-5.7.17/../boost_1_59_0 -DDOWNLOAD_BOOST_TIMEOUT=2400 -DCMAKE_C_FLAGS_RELEASE="-DNDEBUG" -DCMAKE_CXX_FLAGS_RELEASE="-DNDEBUG" -DCMAKE_OSX_ARCHITECTURES="x86_64" -DCMAKE_OSX_DEPLOYMENT_TARGET="10.14" -DCMAKE_OSX_SYSROOT="/Applications/Xcode.app/Contents/Developer/Platforms/MacOSX.platform/Developer/SDKs/MacOSX10.14.sdk" /opt/local/var/macports/build/_opt_local_var_macports_sources_rsync.macports.org_macports_release_tarballs_ports_databases_mysql57/mysql57/work/mysql-5.7.17
217:info:configure -- Running cmake version 3.12.3
218:info:configure -- Found Git: /usr/bin/git (found version "2.17.1 (Apple Git-112)")
219:info:configure -- Configuring with MAX_INDEXES = 64U
220:info:configure -- The C compiler identification is AppleClang 10.0.0.10001145
221:info:configure -- The CXX compiler identification is AppleClang 10.0.0.10001145
222:info:configure -- Check for working C compiler: /usr/bin/clang
223:info:configure -- Check for working C compiler: /usr/bin/clang -- broken
224:info:configure CMake Error at /opt/local/share/cmake-3.12/Modules/CMakeTestCCompiler.cmake:52 (message):
225:info:configure   The C compiler
226:info:configure     "/usr/bin/clang"
227:info:configure   is not able to compile a simple test program.
228:info:configure   It fails with the following output:
229:info:configure     Change Dir: /opt/local/var/macports/build/_opt_local_var_macports_sources_rsync.macports.org_macports_release_tarballs_ports_databases_mysql57/mysql57/work/build/CMakeFiles/CMakeTmp
230:info:configure     
231:info:configure     Run Build Command:"/usr/bin/make" "cmTC_a7022/fast"
232:info:configure     /Applications/Xcode.app/Contents/Developer/usr/bin/make -f CMakeFiles/cmTC_a7022.dir/build.make CMakeFiles/cmTC_a7022.dir/build
233:info:configure     Building C object CMakeFiles/cmTC_a7022.dir/testCCompiler.c.o
234:info:configure     /usr/bin/clang   -pipe -Os -isysroot/Applications/Xcode.app/Contents/Developer/Platforms/MacOSX.platform/Developer/SDKs/MacOSX10.14.sdk  -arch x86_64 -isysroot /Applications/Xcode.app/Contents/Developer/Platforms/MacOSX.platform/Developer/SDKs/MacOSX10.14.sdk -mmacosx-version-min=10.14   -o CMakeFiles/cmTC_a7022.dir/testCCompiler.c.o   -c /opt/local/var/macports/build/_opt_local_var_macports_sources_rsync.macports.org_macports_release_tarballs_ports_databases_mysql57/mysql57/work/build/CMakeFiles/CMakeTmp/testCCompiler.c
235:info:configure     Linking C executable cmTC_a7022
236:info:configure     /opt/local/bin/cmake -E cmake_link_script CMakeFiles/cmTC_a7022.dir/link.txt --verbose=1
237:info:configure     /usr/bin/clang -pipe -Os -isysroot/Applications/Xcode.app/Contents/Developer/Platforms/MacOSX.platform/Developer/SDKs/MacOSX10.14.sdk  -arch x86_64 -isysroot /Applications/Xcode.app/Contents/Developer/Platforms/MacOSX.platform/Developer/SDKs/MacOSX10.14.sdk -mmacosx-version-min=10.14 -Wl,-search_paths_first -Wl,-headerpad_max_install_names -L/opt/local/lib -Wl,-headerpad_max_install_names -Wl,-syslibroot,/Applications/Xcode.app/Contents/Developer/Platforms/MacOSX.platform/Developer/SDKs/MacOSX10.14.sdk  CMakeFiles/cmTC_a7022.dir/testCCompiler.c.o  -o cmTC_a7022
238:info:configure     ld: in '/Applications/Xcode.app/Contents/Developer/Platforms/MacOSX.platform/Developer/SDKs/MacOSX10.14.sdk/usr/lib/system/libmacho.tbd', file too small (length=0) for architecture x86_64
239:info:configure     clang: error: linker command failed with exit code 1 (use -v to see invocation)
240:info:configure     make[1]: *** [cmTC_a7022] Error 1
241:info:configure     make: *** [cmTC_a7022/fast] Error 2
242:info:configure     
243:info:configure   
244:info:configure   CMake will not be able to correctly generate this project.
245:info:configure Call Stack (most recent call first):
246:info:configure   CMakeLists.txt:125 (PROJECT)
247:info:configure -- Configuring incomplete, errors occurred!
248:info:configure See also "/opt/local/var/macports/build/_opt_local_var_macports_sources_rsync.macports.org_macports_release_tarballs_ports_databases_mysql57/mysql57/work/build/CMakeFiles/CMakeOutput.log".
249:info:configure See also "/opt/local/var/macports/build/_opt_local_var_macports_sources_rsync.macports.org_macports_release_tarballs_ports_databases_mysql57/mysql57/work/build/CMakeFiles/CMakeError.log".
250:info:configure Command failed:  cd "/opt/local/var/macports/build/_opt_local_var_macports_sources_rsync.macports.org_macports_release_tarballs_ports_databases_mysql57/mysql57/work/build" && /opt/local/bin/cmake -DCMAKE_INSTALL_PREFIX='/opt/local' -DCMAKE_BUILD_TYPE=Release -DCMAKE_BUILD_WITH_INSTALL_RPATH=ON -DCMAKE_C_COMPILER="$CC" -DCMAKE_COLOR_MAKEFILE=ON -DCMAKE_CXX_COMPILER="$CXX" -DCMAKE_FIND_FRAMEWORK=LAST -DCMAKE_INSTALL_RPATH=/opt/local/lib -DCMAKE_MODULE_PATH=/opt/local/share/cmake/Modules -DCMAKE_SYSTEM_PREFIX_PATH="/opt/local;/opt/local;/usr" -DCMAKE_VERBOSE_MAKEFILE=ON -DCMAKE_POLICY_DEFAULT_CMP0025=NEW -Wno-dev -DCMAKE_INSTALL_NAME_DIR:STRING=/opt/local/lib/mysql57/mysql -DINSTALL_LAYOUT:STRING=MACPORTS -DSYSCONFDIR:PATH=/opt/local/etc/mysql57 -DMYSQL_UNIX_ADDR:PATH=/opt/local/var/run/mysql57/mysqld.sock -DMYSQL_DATADIR:PATH=/opt/local/var/db/mysql57 -DDEFAULT_CHARSET:STRING=utf8 -DDEFAULT_COLLATION:STRING=utf8_general_ci -DWITH_EMBEDDED_SERVER:BOOL=ON -DWITH_ZLIB:STRING=system -DWITH_UNIT_TESTS:BOOL=ON -DENABLE_DOWNLOADS:BOOL=OFF -DENABLE_GCOV:BOOL=OFF -DENABLE_DTRACE:BOOL=OFF -DWITH_LIBWRAP:BOOL=OFF -DWITH_SSL:STRING=bundled -DWITH_INNODB_MEMCACHED=1 -DWITH_PARTITION_STORAGE_ENGINE=1 -DDOWNLOAD_BOOST=1 -DWITH_BOOST=/opt/local/var/macports/build/_opt_local_var_macports_sources_rsync.macports.org_macports_release_tarballs_ports_databases_mysql57/mysql57/work/mysql-5.7.17/../boost_1_59_0 -DDOWNLOAD_BOOST_TIMEOUT=2400 -DCMAKE_C_FLAGS_RELEASE="-DNDEBUG" -DCMAKE_CXX_FLAGS_RELEASE="-DNDEBUG" -DCMAKE_OSX_ARCHITECTURES="x86_64" -DCMAKE_OSX_DEPLOYMENT_TARGET="10.14" -DCMAKE_OSX_SYSROOT="/Applications/Xcode.app/Contents/Developer/Platforms/MacOSX.platform/Developer/SDKs/MacOSX10.14.sdk" /opt/local/var/macports/build/_opt_local_var_macports_sources_rsync.macports.org_macports_release_tarballs_ports_databases_mysql57/mysql57/work/mysql-5.7.17
251:info:configure Exit code: 1
252:error:configure Failed to configure mysql57: configure failure: command execution failed
253:debug:configure Error code: NONE
254:debug:configure Backtrace: configure failure: command execution failed
255:debug:configure     while executing
256:debug:configure "$procedure $targetname"
257:error:configure See /opt/local/var/macports/logs/_opt_local_var_macports_sources_rsync.macports.org_macports_release_tarballs_ports_databases_mysql57/mysql57/main.log for details.
258version:1
259:debug:sysinfo macOS 10.14 (darwin/18.0.0) arch i386
260:debug:sysinfo MacPorts 2.5.4
261:debug:sysinfo Xcode 10.0
262:debug:sysinfo SDK 10.14
263:debug:sysinfo MACOSX_DEPLOYMENT_TARGET: 10.14
264:debug:main dropping privileges: euid changed to 502, egid changed to 501.
265:debug:main Executing org.macports.main (mysql57)
266:debug:main Privilege de-escalation not attempted as not running as root.
267:debug:main Skipping completed org.macports.archivefetch (mysql57)
268:debug:main Privilege de-escalation not attempted as not running as root.
269:debug:main Skipping completed org.macports.fetch (mysql57)
270:debug:main Privilege de-escalation not attempted as not running as root.
271:debug:main Skipping completed org.macports.checksum (mysql57)
272:debug:main Privilege de-escalation not attempted as not running as root.
273:debug:main Skipping completed org.macports.extract (mysql57)
274:debug:main Privilege de-escalation not attempted as not running as root.
275:debug:main Skipping completed org.macports.patch (mysql57)
276:debug:main Privilege de-escalation not attempted as not running as root.
277:debug:configure configure phase started at Sat Oct  6 22:36:36 BST 2018
278:notice:configure --->  Configuring mysql57
279:debug:configure Preferred compilers: clang macports-clang-5.0 macports-clang-4.0
280:debug:configure Using compiler 'Xcode Clang'
281:debug:configure Executing proc-pre-org.macports.configure-configure-0
282:debug:configure Executing proc-pre-org.macports.configure-configure-1
283:debug:configure Executing proc-pre-org.macports.configure-configure-2
284:debug:configure Executing org.macports.configure (mysql57)
285:debug:configure Environment:
286:debug:configure CC='/usr/bin/clang'
287:debug:configure CC_PRINT_OPTIONS='YES'
288:debug:configure CC_PRINT_OPTIONS_FILE='/opt/local/var/macports/build/_opt_local_var_macports_sources_rsync.macports.org_macports_release_tarballs_ports_databases_mysql57/mysql57/work/.CC_PRINT_OPTIONS'
289:debug:configure CFLAGS='-pipe -Os -isysroot/Applications/Xcode.app/Contents/Developer/Platforms/MacOSX.platform/Developer/SDKs/MacOSX10.14.sdk'
290:debug:configure CPATH='/opt/local/include'
291:debug:configure CPPFLAGS='-isysroot/Applications/Xcode.app/Contents/Developer/Platforms/MacOSX.platform/Developer/SDKs/MacOSX10.14.sdk'
292:debug:configure CXX='/usr/bin/clang++'
293:debug:configure CXXFLAGS='-pipe -Os -stdlib=libc++ -isysroot/Applications/Xcode.app/Contents/Developer/Platforms/MacOSX.platform/Developer/SDKs/MacOSX10.14.sdk'
294:debug:configure F77FLAGS='-m64'
295:debug:configure F90FLAGS='-pipe -Os -m64'
296:debug:configure FCFLAGS='-pipe -Os -m64'
297:debug:configure FFLAGS='-pipe -Os'
298:debug:configure INSTALL='/usr/bin/install -c'
299:debug:configure LDFLAGS='-L/opt/local/lib -Wl,-headerpad_max_install_names -Wl,-syslibroot,/Applications/Xcode.app/Contents/Developer/Platforms/MacOSX.platform/Developer/SDKs/MacOSX10.14.sdk'
300:debug:configure LIBRARY_PATH='/opt/local/lib'
301:debug:configure MACOSX_DEPLOYMENT_TARGET='10.14'
302:debug:configure OBJC='/usr/bin/clang'
303:debug:configure OBJCFLAGS='-pipe -Os -isysroot/Applications/Xcode.app/Contents/Developer/Platforms/MacOSX.platform/Developer/SDKs/MacOSX10.14.sdk'
304:debug:configure OBJCXX='/usr/bin/clang++'
305:debug:configure OBJCXXFLAGS='-pipe -Os -stdlib=libc++ -isysroot/Applications/Xcode.app/Contents/Developer/Platforms/MacOSX.platform/Developer/SDKs/MacOSX10.14.sdk'
306:info:configure Executing:  cd "/opt/local/var/macports/build/_opt_local_var_macports_sources_rsync.macports.org_macports_release_tarballs_ports_databases_mysql57/mysql57/work/build" && /opt/local/bin/cmake -DCMAKE_INSTALL_PREFIX='/opt/local' -DCMAKE_BUILD_TYPE=Release -DCMAKE_BUILD_WITH_INSTALL_RPATH=ON -DCMAKE_C_COMPILER="$CC" -DCMAKE_COLOR_MAKEFILE=ON -DCMAKE_CXX_COMPILER="$CXX" -DCMAKE_FIND_FRAMEWORK=LAST -DCMAKE_INSTALL_RPATH=/opt/local/lib -DCMAKE_MODULE_PATH=/opt/local/share/cmake/Modules -DCMAKE_SYSTEM_PREFIX_PATH="/opt/local;/opt/local;/usr" -DCMAKE_VERBOSE_MAKEFILE=ON -DCMAKE_POLICY_DEFAULT_CMP0025=NEW -Wno-dev -DCMAKE_INSTALL_NAME_DIR:STRING=/opt/local/lib/mysql57/mysql -DINSTALL_LAYOUT:STRING=MACPORTS -DSYSCONFDIR:PATH=/opt/local/etc/mysql57 -DMYSQL_UNIX_ADDR:PATH=/opt/local/var/run/mysql57/mysqld.sock -DMYSQL_DATADIR:PATH=/opt/local/var/db/mysql57 -DDEFAULT_CHARSET:STRING=utf8 -DDEFAULT_COLLATION:STRING=utf8_general_ci -DWITH_EMBEDDED_SERVER:BOOL=ON -DWITH_ZLIB:STRING=system -DWITH_UNIT_TESTS:BOOL=ON -DENABLE_DOWNLOADS:BOOL=OFF -DENABLE_GCOV:BOOL=OFF -DENABLE_DTRACE:BOOL=OFF -DWITH_LIBWRAP:BOOL=OFF -DWITH_SSL:STRING=bundled -DWITH_INNODB_MEMCACHED=1 -DWITH_PARTITION_STORAGE_ENGINE=1 -DDOWNLOAD_BOOST=1 -DWITH_BOOST=/opt/local/var/macports/build/_opt_local_var_macports_sources_rsync.macports.org_macports_release_tarballs_ports_databases_mysql57/mysql57/work/mysql-5.7.17/../boost_1_59_0 -DDOWNLOAD_BOOST_TIMEOUT=2400 -DCMAKE_C_FLAGS_RELEASE="-DNDEBUG" -DCMAKE_CXX_FLAGS_RELEASE="-DNDEBUG" -DCMAKE_OSX_ARCHITECTURES="x86_64" -DCMAKE_OSX_DEPLOYMENT_TARGET="10.14" -DCMAKE_OSX_SYSROOT="/Applications/Xcode.app/Contents/Developer/Platforms/MacOSX.platform/Developer/SDKs/MacOSX10.14.sdk" /opt/local/var/macports/build/_opt_local_var_macports_sources_rsync.macports.org_macports_release_tarballs_ports_databases_mysql57/mysql57/work/mysql-5.7.17
307:debug:configure system:  cd "/opt/local/var/macports/build/_opt_local_var_macports_sources_rsync.macports.org_macports_release_tarballs_ports_databases_mysql57/mysql57/work/build" && /opt/local/bin/cmake -DCMAKE_INSTALL_PREFIX='/opt/local' -DCMAKE_BUILD_TYPE=Release -DCMAKE_BUILD_WITH_INSTALL_RPATH=ON -DCMAKE_C_COMPILER="$CC" -DCMAKE_COLOR_MAKEFILE=ON -DCMAKE_CXX_COMPILER="$CXX" -DCMAKE_FIND_FRAMEWORK=LAST -DCMAKE_INSTALL_RPATH=/opt/local/lib -DCMAKE_MODULE_PATH=/opt/local/share/cmake/Modules -DCMAKE_SYSTEM_PREFIX_PATH="/opt/local;/opt/local;/usr" -DCMAKE_VERBOSE_MAKEFILE=ON -DCMAKE_POLICY_DEFAULT_CMP0025=NEW -Wno-dev -DCMAKE_INSTALL_NAME_DIR:STRING=/opt/local/lib/mysql57/mysql -DINSTALL_LAYOUT:STRING=MACPORTS -DSYSCONFDIR:PATH=/opt/local/etc/mysql57 -DMYSQL_UNIX_ADDR:PATH=/opt/local/var/run/mysql57/mysqld.sock -DMYSQL_DATADIR:PATH=/opt/local/var/db/mysql57 -DDEFAULT_CHARSET:STRING=utf8 -DDEFAULT_COLLATION:STRING=utf8_general_ci -DWITH_EMBEDDED_SERVER:BOOL=ON -DWITH_ZLIB:STRING=system -DWITH_UNIT_TESTS:BOOL=ON -DENABLE_DOWNLOADS:BOOL=OFF -DENABLE_GCOV:BOOL=OFF -DENABLE_DTRACE:BOOL=OFF -DWITH_LIBWRAP:BOOL=OFF -DWITH_SSL:STRING=bundled -DWITH_INNODB_MEMCACHED=1 -DWITH_PARTITION_STORAGE_ENGINE=1 -DDOWNLOAD_BOOST=1 -DWITH_BOOST=/opt/local/var/macports/build/_opt_local_var_macports_sources_rsync.macports.org_macports_release_tarballs_ports_databases_mysql57/mysql57/work/mysql-5.7.17/../boost_1_59_0 -DDOWNLOAD_BOOST_TIMEOUT=2400 -DCMAKE_C_FLAGS_RELEASE="-DNDEBUG" -DCMAKE_CXX_FLAGS_RELEASE="-DNDEBUG" -DCMAKE_OSX_ARCHITECTURES="x86_64" -DCMAKE_OSX_DEPLOYMENT_TARGET="10.14" -DCMAKE_OSX_SYSROOT="/Applications/Xcode.app/Contents/Developer/Platforms/MacOSX.platform/Developer/SDKs/MacOSX10.14.sdk" /opt/local/var/macports/build/_opt_local_var_macports_sources_rsync.macports.org_macports_release_tarballs_ports_databases_mysql57/mysql57/work/mysql-5.7.17
308:info:configure -- Running cmake version 3.12.3
309:info:configure -- Configuring with MAX_INDEXES = 64U
310:info:configure -- The C compiler identification is AppleClang 10.0.0.10001145
311:info:configure -- The CXX compiler identification is AppleClang 10.0.0.10001145
312:info:configure -- Check for working C compiler: /usr/bin/clang
313:info:configure -- Check for working C compiler: /usr/bin/clang -- broken
314:info:configure CMake Error at /opt/local/share/cmake-3.12/Modules/CMakeTestCCompiler.cmake:52 (message):
315:info:configure   The C compiler
316:info:configure     "/usr/bin/clang"
317:info:configure   is not able to compile a simple test program.
318:info:configure   It fails with the following output:
319:info:configure     Change Dir: /opt/local/var/macports/build/_opt_local_var_macports_sources_rsync.macports.org_macports_release_tarballs_ports_databases_mysql57/mysql57/work/build/CMakeFiles/CMakeTmp
320:info:configure     
321:info:configure     Run Build Command:"/usr/bin/make" "cmTC_dda35/fast"
322:info:configure     /Applications/Xcode.app/Contents/Developer/usr/bin/make -f CMakeFiles/cmTC_dda35.dir/build.make CMakeFiles/cmTC_dda35.dir/build
323:info:configure     Building C object CMakeFiles/cmTC_dda35.dir/testCCompiler.c.o
324:info:configure     /usr/bin/clang   -pipe -Os -isysroot/Applications/Xcode.app/Contents/Developer/Platforms/MacOSX.platform/Developer/SDKs/MacOSX10.14.sdk  -arch x86_64 -isysroot /Applications/Xcode.app/Contents/Developer/Platforms/MacOSX.platform/Developer/SDKs/MacOSX10.14.sdk -mmacosx-version-min=10.14   -o CMakeFiles/cmTC_dda35.dir/testCCompiler.c.o   -c /opt/local/var/macports/build/_opt_local_var_macports_sources_rsync.macports.org_macports_release_tarballs_ports_databases_mysql57/mysql57/work/build/CMakeFiles/CMakeTmp/testCCompiler.c
325:info:configure     Linking C executable cmTC_dda35
326:info:configure     /opt/local/bin/cmake -E cmake_link_script CMakeFiles/cmTC_dda35.dir/link.txt --verbose=1
327:info:configure     /usr/bin/clang -pipe -Os -isysroot/Applications/Xcode.app/Contents/Developer/Platforms/MacOSX.platform/Developer/SDKs/MacOSX10.14.sdk  -arch x86_64 -isysroot /Applications/Xcode.app/Contents/Developer/Platforms/MacOSX.platform/Developer/SDKs/MacOSX10.14.sdk -mmacosx-version-min=10.14 -Wl,-search_paths_first -Wl,-headerpad_max_install_names -L/opt/local/lib -Wl,-headerpad_max_install_names -Wl,-syslibroot,/Applications/Xcode.app/Contents/Developer/Platforms/MacOSX.platform/Developer/SDKs/MacOSX10.14.sdk  CMakeFiles/cmTC_dda35.dir/testCCompiler.c.o  -o cmTC_dda35
328:info:configure     ld: in '/Applications/Xcode.app/Contents/Developer/Platforms/MacOSX.platform/Developer/SDKs/MacOSX10.14.sdk/usr/lib/system/libmacho.tbd', file too small (length=0) for architecture x86_64
329:info:configure     clang: error: linker command failed with exit code 1 (use -v to see invocation)
330:info:configure     make[1]: *** [cmTC_dda35] Error 1
331:info:configure     make: *** [cmTC_dda35/fast] Error 2
332:info:configure     
333:info:configure   
334:info:configure   CMake will not be able to correctly generate this project.
335:info:configure Call Stack (most recent call first):
336:info:configure   CMakeLists.txt:125 (PROJECT)
337:info:configure -- Configuring incomplete, errors occurred!
338:info:configure See also "/opt/local/var/macports/build/_opt_local_var_macports_sources_rsync.macports.org_macports_release_tarballs_ports_databases_mysql57/mysql57/work/build/CMakeFiles/CMakeOutput.log".
339:info:configure See also "/opt/local/var/macports/build/_opt_local_var_macports_sources_rsync.macports.org_macports_release_tarballs_ports_databases_mysql57/mysql57/work/build/CMakeFiles/CMakeError.log".
340:info:configure Command failed:  cd "/opt/local/var/macports/build/_opt_local_var_macports_sources_rsync.macports.org_macports_release_tarballs_ports_databases_mysql57/mysql57/work/build" && /opt/local/bin/cmake -DCMAKE_INSTALL_PREFIX='/opt/local' -DCMAKE_BUILD_TYPE=Release -DCMAKE_BUILD_WITH_INSTALL_RPATH=ON -DCMAKE_C_COMPILER="$CC" -DCMAKE_COLOR_MAKEFILE=ON -DCMAKE_CXX_COMPILER="$CXX" -DCMAKE_FIND_FRAMEWORK=LAST -DCMAKE_INSTALL_RPATH=/opt/local/lib -DCMAKE_MODULE_PATH=/opt/local/share/cmake/Modules -DCMAKE_SYSTEM_PREFIX_PATH="/opt/local;/opt/local;/usr" -DCMAKE_VERBOSE_MAKEFILE=ON -DCMAKE_POLICY_DEFAULT_CMP0025=NEW -Wno-dev -DCMAKE_INSTALL_NAME_DIR:STRING=/opt/local/lib/mysql57/mysql -DINSTALL_LAYOUT:STRING=MACPORTS -DSYSCONFDIR:PATH=/opt/local/etc/mysql57 -DMYSQL_UNIX_ADDR:PATH=/opt/local/var/run/mysql57/mysqld.sock -DMYSQL_DATADIR:PATH=/opt/local/var/db/mysql57 -DDEFAULT_CHARSET:STRING=utf8 -DDEFAULT_COLLATION:STRING=utf8_general_ci -DWITH_EMBEDDED_SERVER:BOOL=ON -DWITH_ZLIB:STRING=system -DWITH_UNIT_TESTS:BOOL=ON -DENABLE_DOWNLOADS:BOOL=OFF -DENABLE_GCOV:BOOL=OFF -DENABLE_DTRACE:BOOL=OFF -DWITH_LIBWRAP:BOOL=OFF -DWITH_SSL:STRING=bundled -DWITH_INNODB_MEMCACHED=1 -DWITH_PARTITION_STORAGE_ENGINE=1 -DDOWNLOAD_BOOST=1 -DWITH_BOOST=/opt/local/var/macports/build/_opt_local_var_macports_sources_rsync.macports.org_macports_release_tarballs_ports_databases_mysql57/mysql57/work/mysql-5.7.17/../boost_1_59_0 -DDOWNLOAD_BOOST_TIMEOUT=2400 -DCMAKE_C_FLAGS_RELEASE="-DNDEBUG" -DCMAKE_CXX_FLAGS_RELEASE="-DNDEBUG" -DCMAKE_OSX_ARCHITECTURES="x86_64" -DCMAKE_OSX_DEPLOYMENT_TARGET="10.14" -DCMAKE_OSX_SYSROOT="/Applications/Xcode.app/Contents/Developer/Platforms/MacOSX.platform/Developer/SDKs/MacOSX10.14.sdk" /opt/local/var/macports/build/_opt_local_var_macports_sources_rsync.macports.org_macports_release_tarballs_ports_databases_mysql57/mysql57/work/mysql-5.7.17
341:info:configure Exit code: 1
342:error:configure Failed to configure mysql57: configure failure: command execution failed
343:debug:configure Error code: NONE
344:debug:configure Backtrace: configure failure: command execution failed
345:debug:configure     while executing
346:debug:configure "$procedure $targetname"
347:error:configure See /opt/local/var/macports/logs/_opt_local_var_macports_sources_rsync.macports.org_macports_release_tarballs_ports_databases_mysql57/mysql57/main.log for details.
348version:1
349:debug:sysinfo macOS 10.14 (darwin/18.0.0) arch i386
350:debug:sysinfo MacPorts 2.5.4
351:debug:sysinfo Xcode 10.0
352:debug:sysinfo SDK 10.14
353:debug:sysinfo MACOSX_DEPLOYMENT_TARGET: 10.14
354:debug:main dropping privileges: euid changed to 502, egid changed to 501.
355:debug:main Executing org.macports.main (mysql57)
356:debug:main Privilege de-escalation not attempted as not running as root.
357:debug:main Skipping completed org.macports.archivefetch (mysql57)
358:debug:main Privilege de-escalation not attempted as not running as root.
359:debug:main Skipping completed org.macports.fetch (mysql57)
360:debug:main Privilege de-escalation not attempted as not running as root.
361:debug:main Skipping completed org.macports.checksum (mysql57)
362:debug:main Privilege de-escalation not attempted as not running as root.
363:debug:main Skipping completed org.macports.extract (mysql57)
364:debug:main Privilege de-escalation not attempted as not running as root.
365:debug:main Skipping completed org.macports.patch (mysql57)
366:debug:main Privilege de-escalation not attempted as not running as root.
367:debug:configure configure phase started at Sat Oct  6 22:38:03 BST 2018
368:notice:configure --->  Configuring mysql57
369:debug:configure Preferred compilers: clang macports-clang-5.0 macports-clang-4.0
370:debug:configure Using compiler 'Xcode Clang'
371:debug:configure Executing proc-pre-org.macports.configure-configure-0
372:debug:configure Executing proc-pre-org.macports.configure-configure-1
373:debug:configure Executing proc-pre-org.macports.configure-configure-2
374:debug:configure Executing org.macports.configure (mysql57)
375:debug:configure Environment:
376:debug:configure CC='/usr/bin/clang'
377:debug:configure CC_PRINT_OPTIONS='YES'
378:debug:configure CC_PRINT_OPTIONS_FILE='/opt/local/var/macports/build/_opt_local_var_macports_sources_rsync.macports.org_macports_release_tarballs_ports_databases_mysql57/mysql57/work/.CC_PRINT_OPTIONS'
379:debug:configure CFLAGS='-pipe -Os -isysroot/Applications/Xcode.app/Contents/Developer/Platforms/MacOSX.platform/Developer/SDKs/MacOSX10.14.sdk'
380:debug:configure CPATH='/opt/local/include'
381:debug:configure CPPFLAGS='-isysroot/Applications/Xcode.app/Contents/Developer/Platforms/MacOSX.platform/Developer/SDKs/MacOSX10.14.sdk'
382:debug:configure CXX='/usr/bin/clang++'
383:debug:configure CXXFLAGS='-pipe -Os -stdlib=libc++ -isysroot/Applications/Xcode.app/Contents/Developer/Platforms/MacOSX.platform/Developer/SDKs/MacOSX10.14.sdk'
384:debug:configure F77FLAGS='-m64'
385:debug:configure F90FLAGS='-pipe -Os -m64'
386:debug:configure FCFLAGS='-pipe -Os -m64'
387:debug:configure FFLAGS='-pipe -Os'
388:debug:configure INSTALL='/usr/bin/install -c'
389:debug:configure LDFLAGS='-L/opt/local/lib -Wl,-headerpad_max_install_names -Wl,-syslibroot,/Applications/Xcode.app/Contents/Developer/Platforms/MacOSX.platform/Developer/SDKs/MacOSX10.14.sdk'
390:debug:configure LIBRARY_PATH='/opt/local/lib'
391:debug:configure MACOSX_DEPLOYMENT_TARGET='10.14'
392:debug:configure OBJC='/usr/bin/clang'
393:debug:configure OBJCFLAGS='-pipe -Os -isysroot/Applications/Xcode.app/Contents/Developer/Platforms/MacOSX.platform/Developer/SDKs/MacOSX10.14.sdk'
394:debug:configure OBJCXX='/usr/bin/clang++'
395:debug:configure OBJCXXFLAGS='-pipe -Os -stdlib=libc++ -isysroot/Applications/Xcode.app/Contents/Developer/Platforms/MacOSX.platform/Developer/SDKs/MacOSX10.14.sdk'
396:info:configure Executing:  cd "/opt/local/var/macports/build/_opt_local_var_macports_sources_rsync.macports.org_macports_release_tarballs_ports_databases_mysql57/mysql57/work/build" && /opt/local/bin/cmake -DCMAKE_INSTALL_PREFIX='/opt/local' -DCMAKE_BUILD_TYPE=Release -DCMAKE_BUILD_WITH_INSTALL_RPATH=ON -DCMAKE_C_COMPILER="$CC" -DCMAKE_COLOR_MAKEFILE=ON -DCMAKE_CXX_COMPILER="$CXX" -DCMAKE_FIND_FRAMEWORK=LAST -DCMAKE_INSTALL_RPATH=/opt/local/lib -DCMAKE_MODULE_PATH=/opt/local/share/cmake/Modules -DCMAKE_SYSTEM_PREFIX_PATH="/opt/local;/opt/local;/usr" -DCMAKE_VERBOSE_MAKEFILE=ON -DCMAKE_POLICY_DEFAULT_CMP0025=NEW -Wno-dev -DCMAKE_INSTALL_NAME_DIR:STRING=/opt/local/lib/mysql57/mysql -DINSTALL_LAYOUT:STRING=MACPORTS -DSYSCONFDIR:PATH=/opt/local/etc/mysql57 -DMYSQL_UNIX_ADDR:PATH=/opt/local/var/run/mysql57/mysqld.sock -DMYSQL_DATADIR:PATH=/opt/local/var/db/mysql57 -DDEFAULT_CHARSET:STRING=utf8 -DDEFAULT_COLLATION:STRING=utf8_general_ci -DWITH_EMBEDDED_SERVER:BOOL=ON -DWITH_ZLIB:STRING=system -DWITH_UNIT_TESTS:BOOL=ON -DENABLE_DOWNLOADS:BOOL=OFF -DENABLE_GCOV:BOOL=OFF -DENABLE_DTRACE:BOOL=OFF -DWITH_LIBWRAP:BOOL=OFF -DWITH_SSL:STRING=bundled -DWITH_INNODB_MEMCACHED=1 -DWITH_PARTITION_STORAGE_ENGINE=1 -DDOWNLOAD_BOOST=1 -DWITH_BOOST=/opt/local/var/macports/build/_opt_local_var_macports_sources_rsync.macports.org_macports_release_tarballs_ports_databases_mysql57/mysql57/work/mysql-5.7.17/../boost_1_59_0 -DDOWNLOAD_BOOST_TIMEOUT=2400 -DCMAKE_C_FLAGS_RELEASE="-DNDEBUG" -DCMAKE_CXX_FLAGS_RELEASE="-DNDEBUG" -DCMAKE_OSX_ARCHITECTURES="x86_64" -DCMAKE_OSX_DEPLOYMENT_TARGET="10.14" -DCMAKE_OSX_SYSROOT="/Applications/Xcode.app/Contents/Developer/Platforms/MacOSX.platform/Developer/SDKs/MacOSX10.14.sdk" /opt/local/var/macports/build/_opt_local_var_macports_sources_rsync.macports.org_macports_release_tarballs_ports_databases_mysql57/mysql57/work/mysql-5.7.17
397:debug:configure system:  cd "/opt/local/var/macports/build/_opt_local_var_macports_sources_rsync.macports.org_macports_release_tarballs_ports_databases_mysql57/mysql57/work/build" && /opt/local/bin/cmake -DCMAKE_INSTALL_PREFIX='/opt/local' -DCMAKE_BUILD_TYPE=Release -DCMAKE_BUILD_WITH_INSTALL_RPATH=ON -DCMAKE_C_COMPILER="$CC" -DCMAKE_COLOR_MAKEFILE=ON -DCMAKE_CXX_COMPILER="$CXX" -DCMAKE_FIND_FRAMEWORK=LAST -DCMAKE_INSTALL_RPATH=/opt/local/lib -DCMAKE_MODULE_PATH=/opt/local/share/cmake/Modules -DCMAKE_SYSTEM_PREFIX_PATH="/opt/local;/opt/local;/usr" -DCMAKE_VERBOSE_MAKEFILE=ON -DCMAKE_POLICY_DEFAULT_CMP0025=NEW -Wno-dev -DCMAKE_INSTALL_NAME_DIR:STRING=/opt/local/lib/mysql57/mysql -DINSTALL_LAYOUT:STRING=MACPORTS -DSYSCONFDIR:PATH=/opt/local/etc/mysql57 -DMYSQL_UNIX_ADDR:PATH=/opt/local/var/run/mysql57/mysqld.sock -DMYSQL_DATADIR:PATH=/opt/local/var/db/mysql57 -DDEFAULT_CHARSET:STRING=utf8 -DDEFAULT_COLLATION:STRING=utf8_general_ci -DWITH_EMBEDDED_SERVER:BOOL=ON -DWITH_ZLIB:STRING=system -DWITH_UNIT_TESTS:BOOL=ON -DENABLE_DOWNLOADS:BOOL=OFF -DENABLE_GCOV:BOOL=OFF -DENABLE_DTRACE:BOOL=OFF -DWITH_LIBWRAP:BOOL=OFF -DWITH_SSL:STRING=bundled -DWITH_INNODB_MEMCACHED=1 -DWITH_PARTITION_STORAGE_ENGINE=1 -DDOWNLOAD_BOOST=1 -DWITH_BOOST=/opt/local/var/macports/build/_opt_local_var_macports_sources_rsync.macports.org_macports_release_tarballs_ports_databases_mysql57/mysql57/work/mysql-5.7.17/../boost_1_59_0 -DDOWNLOAD_BOOST_TIMEOUT=2400 -DCMAKE_C_FLAGS_RELEASE="-DNDEBUG" -DCMAKE_CXX_FLAGS_RELEASE="-DNDEBUG" -DCMAKE_OSX_ARCHITECTURES="x86_64" -DCMAKE_OSX_DEPLOYMENT_TARGET="10.14" -DCMAKE_OSX_SYSROOT="/Applications/Xcode.app/Contents/Developer/Platforms/MacOSX.platform/Developer/SDKs/MacOSX10.14.sdk" /opt/local/var/macports/build/_opt_local_var_macports_sources_rsync.macports.org_macports_release_tarballs_ports_databases_mysql57/mysql57/work/mysql-5.7.17
398:info:configure -- Running cmake version 3.12.3
399:info:configure -- Configuring with MAX_INDEXES = 64U
400:info:configure -- The C compiler identification is AppleClang 10.0.0.10001145
401:info:configure -- The CXX compiler identification is AppleClang 10.0.0.10001145
402:info:configure -- Check for working C compiler: /usr/bin/clang
403:info:configure -- Check for working C compiler: /usr/bin/clang -- broken
404:info:configure CMake Error at /opt/local/share/cmake-3.12/Modules/CMakeTestCCompiler.cmake:52 (message):
405:info:configure   The C compiler
406:info:configure     "/usr/bin/clang"
407:info:configure   is not able to compile a simple test program.
408:info:configure   It fails with the following output:
409:info:configure     Change Dir: /opt/local/var/macports/build/_opt_local_var_macports_sources_rsync.macports.org_macports_release_tarballs_ports_databases_mysql57/mysql57/work/build/CMakeFiles/CMakeTmp
410:info:configure     
411:info:configure     Run Build Command:"/usr/bin/make" "cmTC_ac3b3/fast"
412:info:configure     /Applications/Xcode.app/Contents/Developer/usr/bin/make -f CMakeFiles/cmTC_ac3b3.dir/build.make CMakeFiles/cmTC_ac3b3.dir/build
413:info:configure     Building C object CMakeFiles/cmTC_ac3b3.dir/testCCompiler.c.o
414:info:configure     /usr/bin/clang   -pipe -Os -isysroot/Applications/Xcode.app/Contents/Developer/Platforms/MacOSX.platform/Developer/SDKs/MacOSX10.14.sdk  -arch x86_64 -isysroot /Applications/Xcode.app/Contents/Developer/Platforms/MacOSX.platform/Developer/SDKs/MacOSX10.14.sdk -mmacosx-version-min=10.14   -o CMakeFiles/cmTC_ac3b3.dir/testCCompiler.c.o   -c /opt/local/var/macports/build/_opt_local_var_macports_sources_rsync.macports.org_macports_release_tarballs_ports_databases_mysql57/mysql57/work/build/CMakeFiles/CMakeTmp/testCCompiler.c
415:info:configure     Linking C executable cmTC_ac3b3
416:info:configure     /opt/local/bin/cmake -E cmake_link_script CMakeFiles/cmTC_ac3b3.dir/link.txt --verbose=1
417:info:configure     /usr/bin/clang -pipe -Os -isysroot/Applications/Xcode.app/Contents/Developer/Platforms/MacOSX.platform/Developer/SDKs/MacOSX10.14.sdk  -arch x86_64 -isysroot /Applications/Xcode.app/Contents/Developer/Platforms/MacOSX.platform/Developer/SDKs/MacOSX10.14.sdk -mmacosx-version-min=10.14 -Wl,-search_paths_first -Wl,-headerpad_max_install_names -L/opt/local/lib -Wl,-headerpad_max_install_names -Wl,-syslibroot,/Applications/Xcode.app/Contents/Developer/Platforms/MacOSX.platform/Developer/SDKs/MacOSX10.14.sdk  CMakeFiles/cmTC_ac3b3.dir/testCCompiler.c.o  -o cmTC_ac3b3
418:info:configure     ld: in '/Applications/Xcode.app/Contents/Developer/Platforms/MacOSX.platform/Developer/SDKs/MacOSX10.14.sdk/usr/lib/system/libmacho.tbd', file too small (length=0) for architecture x86_64
419:info:configure     clang: error: linker command failed with exit code 1 (use -v to see invocation)
420:info:configure     make[1]: *** [cmTC_ac3b3] Error 1
421:info:configure     make: *** [cmTC_ac3b3/fast] Error 2
422:info:configure     
423:info:configure   
424:info:configure   CMake will not be able to correctly generate this project.
425:info:configure Call Stack (most recent call first):
426:info:configure   CMakeLists.txt:125 (PROJECT)
427:info:configure -- Configuring incomplete, errors occurred!
428:info:configure See also "/opt/local/var/macports/build/_opt_local_var_macports_sources_rsync.macports.org_macports_release_tarballs_ports_databases_mysql57/mysql57/work/build/CMakeFiles/CMakeOutput.log".
429:info:configure See also "/opt/local/var/macports/build/_opt_local_var_macports_sources_rsync.macports.org_macports_release_tarballs_ports_databases_mysql57/mysql57/work/build/CMakeFiles/CMakeError.log".
430:info:configure Command failed:  cd "/opt/local/var/macports/build/_opt_local_var_macports_sources_rsync.macports.org_macports_release_tarballs_ports_databases_mysql57/mysql57/work/build" && /opt/local/bin/cmake -DCMAKE_INSTALL_PREFIX='/opt/local' -DCMAKE_BUILD_TYPE=Release -DCMAKE_BUILD_WITH_INSTALL_RPATH=ON -DCMAKE_C_COMPILER="$CC" -DCMAKE_COLOR_MAKEFILE=ON -DCMAKE_CXX_COMPILER="$CXX" -DCMAKE_FIND_FRAMEWORK=LAST -DCMAKE_INSTALL_RPATH=/opt/local/lib -DCMAKE_MODULE_PATH=/opt/local/share/cmake/Modules -DCMAKE_SYSTEM_PREFIX_PATH="/opt/local;/opt/local;/usr" -DCMAKE_VERBOSE_MAKEFILE=ON -DCMAKE_POLICY_DEFAULT_CMP0025=NEW -Wno-dev -DCMAKE_INSTALL_NAME_DIR:STRING=/opt/local/lib/mysql57/mysql -DINSTALL_LAYOUT:STRING=MACPORTS -DSYSCONFDIR:PATH=/opt/local/etc/mysql57 -DMYSQL_UNIX_ADDR:PATH=/opt/local/var/run/mysql57/mysqld.sock -DMYSQL_DATADIR:PATH=/opt/local/var/db/mysql57 -DDEFAULT_CHARSET:STRING=utf8 -DDEFAULT_COLLATION:STRING=utf8_general_ci -DWITH_EMBEDDED_SERVER:BOOL=ON -DWITH_ZLIB:STRING=system -DWITH_UNIT_TESTS:BOOL=ON -DENABLE_DOWNLOADS:BOOL=OFF -DENABLE_GCOV:BOOL=OFF -DENABLE_DTRACE:BOOL=OFF -DWITH_LIBWRAP:BOOL=OFF -DWITH_SSL:STRING=bundled -DWITH_INNODB_MEMCACHED=1 -DWITH_PARTITION_STORAGE_ENGINE=1 -DDOWNLOAD_BOOST=1 -DWITH_BOOST=/opt/local/var/macports/build/_opt_local_var_macports_sources_rsync.macports.org_macports_release_tarballs_ports_databases_mysql57/mysql57/work/mysql-5.7.17/../boost_1_59_0 -DDOWNLOAD_BOOST_TIMEOUT=2400 -DCMAKE_C_FLAGS_RELEASE="-DNDEBUG" -DCMAKE_CXX_FLAGS_RELEASE="-DNDEBUG" -DCMAKE_OSX_ARCHITECTURES="x86_64" -DCMAKE_OSX_DEPLOYMENT_TARGET="10.14" -DCMAKE_OSX_SYSROOT="/Applications/Xcode.app/Contents/Developer/Platforms/MacOSX.platform/Developer/SDKs/MacOSX10.14.sdk" /opt/local/var/macports/build/_opt_local_var_macports_sources_rsync.macports.org_macports_release_tarballs_ports_databases_mysql57/mysql57/work/mysql-5.7.17
431:info:configure Exit code: 1
432:error:configure Failed to configure mysql57: configure failure: command execution failed
433:debug:configure Error code: NONE
434:debug:configure Backtrace: configure failure: command execution failed
435:debug:configure     while executing
436:debug:configure "$procedure $targetname"
437:error:configure See /opt/local/var/macports/logs/_opt_local_var_macports_sources_rsync.macports.org_macports_release_tarballs_ports_databases_mysql57/mysql57/main.log for details.