| 1 | :debug:sysinfo macOS 10.13 (darwin/17.7.0) arch i386 |
|---|
| 2 | :debug:sysinfo MacPorts 2.5.4 |
|---|
| 3 | :debug:sysinfo Xcode 10.1 |
|---|
| 4 | :debug:sysinfo SDK 10.13 |
|---|
| 5 | :debug:sysinfo MACOSX_DEPLOYMENT_TARGET: 10.13 |
|---|
| 6 | :debug:main gcc49 has no conflicts |
|---|
| 7 | :debug:main Executing org.macports.main (gcc49) |
|---|
| 8 | :debug:main dropping privileges: euid changed to 502, egid changed to 501. |
|---|
| 9 | :debug:main Skipping completed org.macports.archivefetch (gcc49) |
|---|
| 10 | :debug:main Privilege de-escalation not attempted as not running as root. |
|---|
| 11 | :debug:main Skipping completed org.macports.fetch (gcc49) |
|---|
| 12 | :debug:main Privilege de-escalation not attempted as not running as root. |
|---|
| 13 | :debug:main Skipping completed org.macports.checksum (gcc49) |
|---|
| 14 | :debug:main Privilege de-escalation not attempted as not running as root. |
|---|
| 15 | :debug:main Skipping completed org.macports.extract (gcc49) |
|---|
| 16 | :debug:main Privilege de-escalation not attempted as not running as root. |
|---|
| 17 | :debug:main Skipping completed org.macports.patch (gcc49) |
|---|
| 18 | :debug:main Privilege de-escalation not attempted as not running as root. |
|---|
| 19 | :debug:main Skipping completed org.macports.configure (gcc49) |
|---|
| 20 | :debug:main Privilege de-escalation not attempted as not running as root. |
|---|
| 21 | :debug:build build phase started at Wed Oct 31 12:39:27 CST 2018 |
|---|
| 22 | :notice:build ---> Building gcc49 |
|---|
| 23 | :debug:build Executing org.macports.build (gcc49) |
|---|
| 24 | :debug:build Environment: |
|---|
| 25 | :debug:build CC_PRINT_OPTIONS='YES' |
|---|
| 26 | :debug:build CC_PRINT_OPTIONS_FILE='/opt/local/var/macports/build/_opt_local_var_macports_sources_rsync.macports.org_macports_release_tarballs_ports_lang_gcc49/gcc49/work/.CC_PRINT_OPTIONS' |
|---|
| 27 | :debug:build CPATH='/opt/local/include' |
|---|
| 28 | :debug:build CPP='/usr/bin/clang -E' |
|---|
| 29 | :debug:build CXXCPP='/usr/bin/clang++ -E' |
|---|
| 30 | :debug:build LIBRARY_PATH='/opt/local/lib' |
|---|
| 31 | :debug:build MACOSX_DEPLOYMENT_TARGET='10.13' |
|---|
| 32 | :info:build Executing: cd "/opt/local/var/macports/build/_opt_local_var_macports_sources_rsync.macports.org_macports_release_tarballs_ports_lang_gcc49/gcc49/work/build" && /usr/bin/make -j4 -w bootstrap-lean |
|---|
| 33 | :debug:build system: cd "/opt/local/var/macports/build/_opt_local_var_macports_sources_rsync.macports.org_macports_release_tarballs_ports_lang_gcc49/gcc49/work/build" && /usr/bin/make -j4 -w bootstrap-lean |
|---|
| 34 | :info:build make: Entering directory `/opt/local/var/macports/build/_opt_local_var_macports_sources_rsync.macports.org_macports_release_tarballs_ports_lang_gcc49/gcc49/work/build' |
|---|
| 35 | :info:build echo stage3 > stage_final |
|---|
| 36 | :info:build make[1]: Entering directory `/opt/local/var/macports/build/_opt_local_var_macports_sources_rsync.macports.org_macports_release_tarballs_ports_lang_gcc49/gcc49/work/build' |
|---|
| 37 | :info:build make[2]: Entering directory `/opt/local/var/macports/build/_opt_local_var_macports_sources_rsync.macports.org_macports_release_tarballs_ports_lang_gcc49/gcc49/work/build' |
|---|
| 38 | :info:build make[3]: Entering directory `/opt/local/var/macports/build/_opt_local_var_macports_sources_rsync.macports.org_macports_release_tarballs_ports_lang_gcc49/gcc49/work/build' |
|---|
| 39 | :info:build rm -f stage_current |
|---|
| 40 | :info:build make[3]: Leaving directory `/opt/local/var/macports/build/_opt_local_var_macports_sources_rsync.macports.org_macports_release_tarballs_ports_lang_gcc49/gcc49/work/build' |
|---|
| 41 | :info:build make[2]: Leaving directory `/opt/local/var/macports/build/_opt_local_var_macports_sources_rsync.macports.org_macports_release_tarballs_ports_lang_gcc49/gcc49/work/build' |
|---|
| 42 | :info:build make[2]: Entering directory `/opt/local/var/macports/build/_opt_local_var_macports_sources_rsync.macports.org_macports_release_tarballs_ports_lang_gcc49/gcc49/work/build' |
|---|
| 43 | :info:build make[3]: Entering directory `/opt/local/var/macports/build/_opt_local_var_macports_sources_rsync.macports.org_macports_release_tarballs_ports_lang_gcc49/gcc49/work/build/build-x86_64-apple-darwin17/libiberty' |
|---|
| 44 | :info:build make[4]: Entering directory `/opt/local/var/macports/build/_opt_local_var_macports_sources_rsync.macports.org_macports_release_tarballs_ports_lang_gcc49/gcc49/work/build/build-x86_64-apple-darwin17/libiberty/testsuite' |
|---|
| 45 | :info:build make[4]: Nothing to be done for `all'. |
|---|
| 46 | :info:build make[4]: Leaving directory `/opt/local/var/macports/build/_opt_local_var_macports_sources_rsync.macports.org_macports_release_tarballs_ports_lang_gcc49/gcc49/work/build/build-x86_64-apple-darwin17/libiberty/testsuite' |
|---|
| 47 | :info:build make[3]: Leaving directory `/opt/local/var/macports/build/_opt_local_var_macports_sources_rsync.macports.org_macports_release_tarballs_ports_lang_gcc49/gcc49/work/build/build-x86_64-apple-darwin17/libiberty' |
|---|
| 48 | :info:build make[3]: Entering directory `/opt/local/var/macports/build/_opt_local_var_macports_sources_rsync.macports.org_macports_release_tarballs_ports_lang_gcc49/gcc49/work/build/intl' |
|---|
| 49 | :info:build make[3]: Nothing to be done for `all'. |
|---|
| 50 | :info:build make[3]: Leaving directory `/opt/local/var/macports/build/_opt_local_var_macports_sources_rsync.macports.org_macports_release_tarballs_ports_lang_gcc49/gcc49/work/build/intl' |
|---|
| 51 | :info:build make[3]: Entering directory `/opt/local/var/macports/build/_opt_local_var_macports_sources_rsync.macports.org_macports_release_tarballs_ports_lang_gcc49/gcc49/work/build/libiberty' |
|---|
| 52 | :info:build make[3]: Entering directory `/opt/local/var/macports/build/_opt_local_var_macports_sources_rsync.macports.org_macports_release_tarballs_ports_lang_gcc49/gcc49/work/build/libbacktrace' |
|---|
| 53 | :info:build /Applications/Xcode.app/Contents/Developer/usr/bin/make all-am |
|---|
| 54 | :info:build make[4]: Entering directory `/opt/local/var/macports/build/_opt_local_var_macports_sources_rsync.macports.org_macports_release_tarballs_ports_lang_gcc49/gcc49/work/build/libiberty/testsuite' |
|---|
| 55 | :info:build make[4]: Nothing to be done for `all'. |
|---|
| 56 | :info:build make[4]: Leaving directory `/opt/local/var/macports/build/_opt_local_var_macports_sources_rsync.macports.org_macports_release_tarballs_ports_lang_gcc49/gcc49/work/build/libiberty/testsuite' |
|---|
| 57 | :info:build make[3]: Leaving directory `/opt/local/var/macports/build/_opt_local_var_macports_sources_rsync.macports.org_macports_release_tarballs_ports_lang_gcc49/gcc49/work/build/libiberty' |
|---|
| 58 | :info:build make[3]: Entering directory `/opt/local/var/macports/build/_opt_local_var_macports_sources_rsync.macports.org_macports_release_tarballs_ports_lang_gcc49/gcc49/work/build/build-x86_64-apple-darwin17/fixincludes' |
|---|
| 59 | :info:build make[3]: Nothing to be done for `all'. |
|---|
| 60 | :info:build make[3]: Leaving directory `/opt/local/var/macports/build/_opt_local_var_macports_sources_rsync.macports.org_macports_release_tarballs_ports_lang_gcc49/gcc49/work/build/build-x86_64-apple-darwin17/fixincludes' |
|---|
| 61 | :info:build make[4]: Entering directory `/opt/local/var/macports/build/_opt_local_var_macports_sources_rsync.macports.org_macports_release_tarballs_ports_lang_gcc49/gcc49/work/build/libbacktrace' |
|---|
| 62 | :info:build true DO=all multi-do # /Applications/Xcode.app/Contents/Developer/usr/bin/make |
|---|
| 63 | :info:build make[4]: Leaving directory `/opt/local/var/macports/build/_opt_local_var_macports_sources_rsync.macports.org_macports_release_tarballs_ports_lang_gcc49/gcc49/work/build/libbacktrace' |
|---|
| 64 | :info:build make[3]: Leaving directory `/opt/local/var/macports/build/_opt_local_var_macports_sources_rsync.macports.org_macports_release_tarballs_ports_lang_gcc49/gcc49/work/build/libbacktrace' |
|---|
| 65 | :info:build make[3]: Entering directory `/opt/local/var/macports/build/_opt_local_var_macports_sources_rsync.macports.org_macports_release_tarballs_ports_lang_gcc49/gcc49/work/build/libdecnumber' |
|---|
| 66 | :info:build make[3]: Nothing to be done for `all'. |
|---|
| 67 | :info:build make[3]: Leaving directory `/opt/local/var/macports/build/_opt_local_var_macports_sources_rsync.macports.org_macports_release_tarballs_ports_lang_gcc49/gcc49/work/build/libdecnumber' |
|---|
| 68 | :info:build make[3]: Entering directory `/opt/local/var/macports/build/_opt_local_var_macports_sources_rsync.macports.org_macports_release_tarballs_ports_lang_gcc49/gcc49/work/build/libcpp' |
|---|
| 69 | :info:build make[3]: Nothing to be done for `all'. |
|---|
| 70 | :info:build make[3]: Leaving directory `/opt/local/var/macports/build/_opt_local_var_macports_sources_rsync.macports.org_macports_release_tarballs_ports_lang_gcc49/gcc49/work/build/libcpp' |
|---|
| 71 | :info:build make[3]: Entering directory `/opt/local/var/macports/build/_opt_local_var_macports_sources_rsync.macports.org_macports_release_tarballs_ports_lang_gcc49/gcc49/work/build/gcc' |
|---|
| 72 | :info:build /usr/bin/c++ -m64 -c -DIN_GCC_FRONTEND -g -DIN_GCC -fno-exceptions -fno-rtti -fasynchronous-unwind-tables -W -Wall -Wno-narrowing -Wwrite-strings -Wcast-qual -Wno-format -Wmissing-format-attribute -pedantic -Wno-long-long -Wno-variadic-macros -Wno-overlength-strings -fno-common -DHAVE_CONFIG_H -I. -Ic -I/opt/local/var/macports/build/_opt_local_var_macports_sources_rsync.macports.org_macports_release_tarballs_ports_lang_gcc49/gcc49/work/gcc-4.9.4/gcc -I/opt/local/var/macports/build/_opt_local_var_macports_sources_rsync.macports.org_macports_release_tarballs_ports_lang_gcc49/gcc49/work/gcc-4.9.4/gcc/c -I/opt/local/var/macports/build/_opt_local_var_macports_sources_rsync.macports.org_macports_release_tarballs_ports_lang_gcc49/gcc49/work/gcc-4.9.4/gcc/../include -I/opt/local/var/macports/build/_opt_local_var_macports_sources_rsync.macports.org_macports_release_tarballs_ports_lang_gcc49/gcc49/work/gcc-4.9.4/gcc/../libcpp/include -I/opt/local/include -I/opt/local/include -I/opt/local/include -I/opt/local/var/macports/build/_opt_local_var_macports_sources_rsync.macports.org_macports_release_tarballs_ports_lang_gcc49/gcc49/work/gcc-4.9.4/gcc/../libdecnumber -I/opt/local/var/macports/build/_opt_local_var_macports_sources_rsync.macports.org_macports_release_tarballs_ports_lang_gcc49/gcc49/work/gcc-4.9.4/gcc/../libdecnumber/dpd -I../libdecnumber -I/opt/local/var/macports/build/_opt_local_var_macports_sources_rsync.macports.org_macports_release_tarballs_ports_lang_gcc49/gcc49/work/gcc-4.9.4/gcc/../libbacktrace -DCLOOG_INT_GMP -I/opt/local/include -I/opt/local/libexec/isl18/include -I/opt/local/include -o c/c-objc-common.o -MT c/c-objc-common.o -MMD -MP -MF c/.deps/c-objc-common.TPo /opt/local/var/macports/build/_opt_local_var_macports_sources_rsync.macports.org_macports_release_tarballs_ports_lang_gcc49/gcc49/work/gcc-4.9.4/gcc/c/c-objc-common.c |
|---|
| 73 | :info:build /usr/bin/c++ -m64 -c -DIN_GCC_FRONTEND -DIN_GCC_FRONTEND -g -DIN_GCC -fno-exceptions -fno-rtti -fasynchronous-unwind-tables -W -Wall -Wno-narrowing -Wwrite-strings -Wcast-qual -Wno-format -Wmissing-format-attribute -pedantic -Wno-long-long -Wno-variadic-macros -Wno-overlength-strings -fno-common -DHAVE_CONFIG_H -I. -I. -I/opt/local/var/macports/build/_opt_local_var_macports_sources_rsync.macports.org_macports_release_tarballs_ports_lang_gcc49/gcc49/work/gcc-4.9.4/gcc -I/opt/local/var/macports/build/_opt_local_var_macports_sources_rsync.macports.org_macports_release_tarballs_ports_lang_gcc49/gcc49/work/gcc-4.9.4/gcc/. -I/opt/local/var/macports/build/_opt_local_var_macports_sources_rsync.macports.org_macports_release_tarballs_ports_lang_gcc49/gcc49/work/gcc-4.9.4/gcc/../include -I/opt/local/var/macports/build/_opt_local_var_macports_sources_rsync.macports.org_macports_release_tarballs_ports_lang_gcc49/gcc49/work/gcc-4.9.4/gcc/../libcpp/include -I/opt/local/include -I/opt/local/include -I/opt/local/include -I/opt/local/var/macports/build/_opt_local_var_macports_sources_rsync.macports.org_macports_release_tarballs_ports_lang_gcc49/gcc49/work/gcc-4.9.4/gcc/../libdecnumber -I/opt/local/var/macports/build/_opt_local_var_macports_sources_rsync.macports.org_macports_release_tarballs_ports_lang_gcc49/gcc49/work/gcc-4.9.4/gcc/../libdecnumber/dpd -I../libdecnumber -I/opt/local/var/macports/build/_opt_local_var_macports_sources_rsync.macports.org_macports_release_tarballs_ports_lang_gcc49/gcc49/work/gcc-4.9.4/gcc/../libbacktrace -DCLOOG_INT_GMP -I/opt/local/include -I/opt/local/libexec/isl18/include -I/opt/local/include -o i386-c.o -MT i386-c.o -MMD -MP -MF ./.deps/i386-c.TPo /opt/local/var/macports/build/_opt_local_var_macports_sources_rsync.macports.org_macports_release_tarballs_ports_lang_gcc49/gcc49/work/gcc-4.9.4/gcc/config/i386/i386-c.c |
|---|
| 74 | :info:build /usr/bin/c++ -m64 -c -DIN_GCC_FRONTEND -DIN_GCC_FRONTEND -g -DIN_GCC -fno-exceptions -fno-rtti -fasynchronous-unwind-tables -W -Wall -Wno-narrowing -Wwrite-strings -Wcast-qual -Wno-format -Wmissing-format-attribute -pedantic -Wno-long-long -Wno-variadic-macros -Wno-overlength-strings -fno-common -DHAVE_CONFIG_H -I. -I. -I/opt/local/var/macports/build/_opt_local_var_macports_sources_rsync.macports.org_macports_release_tarballs_ports_lang_gcc49/gcc49/work/gcc-4.9.4/gcc -I/opt/local/var/macports/build/_opt_local_var_macports_sources_rsync.macports.org_macports_release_tarballs_ports_lang_gcc49/gcc49/work/gcc-4.9.4/gcc/. -I/opt/local/var/macports/build/_opt_local_var_macports_sources_rsync.macports.org_macports_release_tarballs_ports_lang_gcc49/gcc49/work/gcc-4.9.4/gcc/../include -I/opt/local/var/macports/build/_opt_local_var_macports_sources_rsync.macports.org_macports_release_tarballs_ports_lang_gcc49/gcc49/work/gcc-4.9.4/gcc/../libcpp/include -I/opt/local/include -I/opt/local/include -I/opt/local/include -I/opt/local/var/macports/build/_opt_local_var_macports_sources_rsync.macports.org_macports_release_tarballs_ports_lang_gcc49/gcc49/work/gcc-4.9.4/gcc/../libdecnumber -I/opt/local/var/macports/build/_opt_local_var_macports_sources_rsync.macports.org_macports_release_tarballs_ports_lang_gcc49/gcc49/work/gcc-4.9.4/gcc/../libdecnumber/dpd -I../libdecnumber -I/opt/local/var/macports/build/_opt_local_var_macports_sources_rsync.macports.org_macports_release_tarballs_ports_lang_gcc49/gcc49/work/gcc-4.9.4/gcc/../libbacktrace -DCLOOG_INT_GMP -I/opt/local/include -I/opt/local/libexec/isl18/include -I/opt/local/include -o darwin-c.o -MT darwin-c.o -MMD -MP -MF ./.deps/darwin-c.TPo -DGCC_INCLUDE_DIR=\"/opt/local/lib/gcc49/gcc/x86_64-apple-darwin17/4.9.4/include\" -DFIXED_INCLUDE_DIR=\"/opt/local/lib/gcc49/gcc/x86_64-apple-darwin17/4.9.4/include-fixed\" -DGPLUSPLUS_INCLUDE_DIR=\"/opt/local/include/gcc49/c++/\" -DGPLUSPLUS_INCLUDE_DIR_ADD_SYSROOT=0 -DGPLUSPLUS_TOOL_INCLUDE_DIR=\"/opt/local/include/gcc49/c++//x86_64-apple-darwin17\" -DGPLUSPLUS_BACKWARD_INCLUDE_DIR=\"/opt/local/include/gcc49/c++//backward\" -DLOCAL_INCLUDE_DIR=\"/opt/local/include\" -DCROSS_INCLUDE_DIR=\"/opt/local/lib/gcc49/gcc/x86_64-apple-darwin17/4.9.4/../../../../../x86_64-apple-darwin17/sys-include\" -DTOOL_INCLUDE_DIR=\"/opt/local/lib/gcc49/gcc/x86_64-apple-darwin17/4.9.4/../../../../../x86_64-apple-darwin17/include\" -DNATIVE_SYSTEM_HEADER_DIR=\"/usr/include\" -DPREFIX=\"/opt/local/\" -DSTANDARD_EXEC_PREFIX=\"/opt/local/lib/gcc49/gcc/\" /opt/local/var/macports/build/_opt_local_var_macports_sources_rsync.macports.org_macports_release_tarballs_ports_lang_gcc49/gcc49/work/gcc-4.9.4/gcc/config/darwin-c.c |
|---|
| 75 | :info:build /usr/bin/c++ -m64 -c -g -DIN_GCC -fno-exceptions -fno-rtti -fasynchronous-unwind-tables -W -Wall -Wno-narrowing -Wwrite-strings -Wcast-qual -Wno-format -Wmissing-format-attribute -pedantic -Wno-long-long -Wno-variadic-macros -Wno-overlength-strings -fno-common -DHAVE_CONFIG_H -I. -I. -I/opt/local/var/macports/build/_opt_local_var_macports_sources_rsync.macports.org_macports_release_tarballs_ports_lang_gcc49/gcc49/work/gcc-4.9.4/gcc -I/opt/local/var/macports/build/_opt_local_var_macports_sources_rsync.macports.org_macports_release_tarballs_ports_lang_gcc49/gcc49/work/gcc-4.9.4/gcc/. -I/opt/local/var/macports/build/_opt_local_var_macports_sources_rsync.macports.org_macports_release_tarballs_ports_lang_gcc49/gcc49/work/gcc-4.9.4/gcc/../include -I/opt/local/var/macports/build/_opt_local_var_macports_sources_rsync.macports.org_macports_release_tarballs_ports_lang_gcc49/gcc49/work/gcc-4.9.4/gcc/../libcpp/include -I/opt/local/include -I/opt/local/include -I/opt/local/include -I/opt/local/var/macports/build/_opt_local_var_macports_sources_rsync.macports.org_macports_release_tarballs_ports_lang_gcc49/gcc49/work/gcc-4.9.4/gcc/../libdecnumber -I/opt/local/var/macports/build/_opt_local_var_macports_sources_rsync.macports.org_macports_release_tarballs_ports_lang_gcc49/gcc49/work/gcc-4.9.4/gcc/../libdecnumber/dpd -I../libdecnumber -I/opt/local/var/macports/build/_opt_local_var_macports_sources_rsync.macports.org_macports_release_tarballs_ports_lang_gcc49/gcc49/work/gcc-4.9.4/gcc/../libbacktrace -DCLOOG_INT_GMP -I/opt/local/include -I/opt/local/libexec/isl18/include -I/opt/local/include -o insn-attrtab.o -MT insn-attrtab.o -MMD -MP -MF ./.deps/insn-attrtab.TPo insn-attrtab.c |
|---|
| 76 | :info:build clang: warning: clangclang: warning: clangtreating 'c' input as 'c++' when in C++ mode, this behavior is deprecated [-Wdeprecated]: |
|---|
| 77 | :info:build treating 'c' input as 'c++' when in C++ mode, this behavior is deprecated [-Wdeprecated]warning |
|---|
| 78 | :info:build : treating 'c' input as 'c++' when in C++ mode, this behavior is deprecated [-Wdeprecated] |
|---|
| 79 | :info:build : warning: treating 'c' input as 'c++' when in C++ mode, this behavior is deprecated [-Wdeprecated] |
|---|
| 80 | :info:build In file included from /opt/local/var/macports/build/_opt_local_var_macports_sources_rsync.macports.org_macports_release_tarballs_ports_lang_gcc49/gcc49/work/gcc-4.9.4/gcc/c/c-objc-common.c:33: |
|---|
| 81 | :info:build In file included from /Applications/Xcode.app/Contents/Developer/Toolchains/XcodeDefault.xctoolchain/usr/include/c++/v1/new:91: |
|---|
| 82 | :info:build /Applications/Xcode.app/Contents/Developer/Toolchains/XcodeDefault.xctoolchain/usr/include/c++/v1/exception:180:5: error: no member named 'fancy_abort' in namespace 'std::__1'; did you mean simply 'fancy_abort'? |
|---|
| 83 | :info:build _VSTD::abort(); |
|---|
| 84 | :info:build ^~~~~~~ |
|---|
| 85 | :info:build /Applications/Xcode.app/Contents/Developer/Toolchains/XcodeDefault.xctoolchain/usr/include/c++/v1/__config:447:15: note: expanded from macro '_VSTD' |
|---|
| 86 | :info:build #define _VSTD std::_LIBCPP_NAMESPACE |
|---|
| 87 | :info:build ^ |
|---|
| 88 | :info:build /opt/local/var/macports/build/_opt_local_var_macports_sources_rsync.macports.org_macports_release_tarballs_ports_lang_gcc49/gcc49/work/gcc-4.9.4/gcc/system.h:685:13: note: 'fancy_abort' declared here |
|---|
| 89 | :info:build extern void fancy_abort (const char *, int, const char *) ATTRIBUTE_NORETURN; |
|---|
| 90 | :info:build ^ |
|---|
| 91 | :info:build 1 error generated. |
|---|
| 92 | :info:build make[3]: *** [c/c-objc-common.o] Error 1 |
|---|
| 93 | :info:build make[3]: *** Waiting for unfinished jobs.... |
|---|
| 94 | :info:build In file included from /opt/local/var/macports/build/_opt_local_var_macports_sources_rsync.macports.org_macports_release_tarballs_ports_lang_gcc49/gcc49/work/gcc-4.9.4/gcc/config/darwin-c.c:27: |
|---|
| 95 | :info:build In file included from /opt/local/var/macports/build/_opt_local_var_macports_sources_rsync.macports.org_macports_release_tarballs_ports_lang_gcc49/gcc49/work/gcc-4.9.4/gcc/target.h:175: |
|---|
| 96 | :info:build /opt/local/var/macports/build/_opt_local_var_macports_sources_rsync.macports.org_macports_release_tarballs_ports_lang_gcc49/gcc49/work/gcc-4.9.4/gcc/target.def:902:1: warning: empty macro arguments are a C99 feature [-Wc99-extensions] |
|---|
| 97 | :info:build HOOK_VECTOR_END (asm_out) |
|---|
| 98 | :info:build ^ |
|---|
| 99 | :info:build /opt/local/var/macports/build/_opt_local_var_macports_sources_rsync.macports.org_macports_release_tarballs_ports_lang_gcc49/gcc49/work/gcc-4.9.4/gcc/target-hooks-macros.h:43:50: note: expanded from macro 'HOOK_VECTOR_END' |
|---|
| 100 | :info:build #define HOOK_VECTOR_END(DECL_NAME) HOOK_VECTOR_1(,} DECL_NAME ;) |
|---|
| 101 | :info:build ^ |
|---|
| 102 | :info:build In file included from /opt/local/var/macports/build/_opt_local_var_macports_sources_rsync.macports.org_macports_release_tarballs_ports_lang_gcc49/gcc49/work/gcc-4.9.4/gcc/config/darwin-c.c:27: |
|---|
| 103 | :info:build In file included from /opt/local/var/macports/build/_opt_local_var_macports_sources_rsync.macports.org_macports_release_tarballs_ports_lang_gcc49/gcc49/work/gcc-4.9.4/gcc/target.h:175: |
|---|
| 104 | :info:build /opt/local/var/macports/build/_opt_local_var_macports_sources_rsync.macports.org_macports_release_tarballs_ports_lang_gcc49/gcc49/work/gcc-4.9.4/gcc/target.def:1522:1: warning: empty macro arguments are a C99 feature [-Wc99-extensions] |
|---|
| 105 | :info:build HOOK_VECTOR_END (sched) |
|---|
| 106 | :info:build ^ |
|---|
| 107 | :info:build /opt/local/var/macports/build/_opt_local_var_macports_sources_rsync.macports.org_macports_release_tarballs_ports_lang_gcc49/gcc49/work/gcc-4.9.4/gcc/target-hooks-macros.h:43:50: note: expanded from macro 'HOOK_VECTOR_END' |
|---|
| 108 | :info:build #define HOOK_VECTOR_END(DECL_NAME) HOOK_VECTOR_1(,} DECL_NAME ;) |
|---|
| 109 | :info:build ^ |
|---|
| 110 | :info:build In file included from /opt/local/var/macports/build/_opt_local_var_macports_sources_rsync.macports.org_macports_release_tarballs_ports_lang_gcc49/gcc49/work/gcc-4.9.4/gcc/config/darwin-c.c:27: |
|---|
| 111 | :info:build In file included from /opt/local/var/macports/build/_opt_local_var_macports_sources_rsync.macports.org_macports_release_tarballs_ports_lang_gcc49/gcc49/work/gcc-4.9.4/gcc/target.h:175: |
|---|
| 112 | :info:build /opt/local/var/macports/build/_opt_local_var_macports_sources_rsync.macports.org_macports_release_tarballs_ports_lang_gcc49/gcc49/work/gcc-4.9.4/gcc/target.def:1552:1: warning: empty macro arguments are a C99 feature [-Wc99-extensions] |
|---|
| 113 | :info:build HOOK_VECTOR_END (simd_clone) |
|---|
| 114 | :info:build ^ |
|---|
| 115 | :info:build /opt/local/var/macports/build/_opt_local_var_macports_sources_rsync.macports.org_macports_release_tarballs_ports_lang_gcc49/gcc49/work/gcc-4.9.4/gcc/target-hooks-macros.h:43:50: note: expanded from macro 'HOOK_VECTOR_END' |
|---|
| 116 | :info:build #define HOOK_VECTOR_END(DECL_NAME) HOOK_VECTOR_1(,} DECL_NAME ;) |
|---|
| 117 | :info:build ^ |
|---|
| 118 | :info:build In file included from /opt/local/var/macports/build/_opt_local_var_macports_sources_rsync.macports.org_macports_release_tarballs_ports_lang_gcc49/gcc49/work/gcc-4.9.4/gcc/config/darwin-c.c:27: |
|---|
| 119 | :info:build In file included from /opt/local/var/macports/build/_opt_local_var_macports_sources_rsync.macports.org_macports_release_tarballs_ports_lang_gcc49/gcc49/work/gcc-4.9.4/gcc/target.h:175: |
|---|
| 120 | :info:build /opt/local/var/macports/build/_opt_local_var_macports_sources_rsync.macports.org_macports_release_tarballs_ports_lang_gcc49/gcc49/work/gcc-4.9.4/gcc/target.def:1770:1: warning: empty macro arguments are a C99 feature [-Wc99-extensions] |
|---|
| 121 | :info:build HOOK_VECTOR_END (vectorize) |
|---|
| 122 | :info:build ^ |
|---|
| 123 | :info:build /opt/local/var/macports/build/_opt_local_var_macports_sources_rsync.macports.org_macports_release_tarballs_ports_lang_gcc49/gcc49/work/gcc-4.9.4/gcc/target-hooks-macros.h:43:50: note: expanded from macro 'HOOK_VECTOR_END' |
|---|
| 124 | :info:build #define HOOK_VECTOR_END(DECL_NAME) HOOK_VECTOR_1(,} DECL_NAME ;) |
|---|
| 125 | :info:build ^ |
|---|
| 126 | :info:build In file included from /opt/local/var/macports/build/_opt_local_var_macports_sources_rsync.macports.org_macports_release_tarballs_ports_lang_gcc49/gcc49/work/gcc-4.9.4/gcc/config/darwin-c.c:27: |
|---|
| 127 | :info:build In file included from /opt/local/var/macports/build/_opt_local_var_macports_sources_rsync.macports.org_macports_release_tarballs_ports_lang_gcc49/gcc49/work/gcc-4.9.4/gcc/target.h:175: |
|---|
| 128 | :info:build /opt/local/var/macports/build/_opt_local_var_macports_sources_rsync.macports.org_macports_release_tarballs_ports_lang_gcc49/gcc49/work/gcc-4.9.4/gcc/target.def:2913:1: warning: empty macro arguments are a C99 feature [-Wc99-extensions] |
|---|
| 129 | :info:build HOOK_VECTOR_END (addr_space) |
|---|
| 130 | :info:build ^ |
|---|
| 131 | :info:build /opt/local/var/macports/build/_opt_local_var_macports_sources_rsync.macports.org_macports_release_tarballs_ports_lang_gcc49/gcc49/work/gcc-4.9.4/gcc/target-hooks-macros.h:43:50: note: expanded from macro 'HOOK_VECTOR_END' |
|---|
| 132 | :info:build #define HOOK_VECTOR_END(DECL_NAME) HOOK_VECTOR_1(,} DECL_NAME ;) |
|---|
| 133 | :info:build ^ |
|---|
| 134 | :info:build In file included from /opt/local/var/macports/build/_opt_local_var_macports_sources_rsync.macports.org_macports_release_tarballs_ports_lang_gcc49/gcc49/work/gcc-4.9.4/gcc/config/darwin-c.c:27: |
|---|
| 135 | :info:build In file included from /opt/local/var/macports/build/_opt_local_var_macports_sources_rsync.macports.org_macports_release_tarballs_ports_lang_gcc49/gcc49/work/gcc-4.9.4/gcc/target.h:175: |
|---|
| 136 | :info:build /opt/local/var/macports/build/_opt_local_var_macports_sources_rsync.macports.org_macports_release_tarballs_ports_lang_gcc49/gcc49/work/gcc-4.9.4/gcc/target.def:4254:1: warning: empty macro arguments are a C99 feature [-Wc99-extensions] |
|---|
| 137 | :info:build HOOK_VECTOR_END (calls) |
|---|
| 138 | :info:build ^ |
|---|
| 139 | :info:build /opt/local/var/macports/build/_opt_local_var_macports_sources_rsync.macports.org_macports_release_tarballs_ports_lang_gcc49/gcc49/work/gcc-4.9.4/gcc/target-hooks-macros.h:43:50: note: expanded from macro 'HOOK_VECTOR_END' |
|---|
| 140 | :info:build #define HOOK_VECTOR_END(DECL_NAME) HOOK_VECTOR_1(,} DECL_NAME ;) |
|---|
| 141 | :info:build ^ |
|---|
| 142 | :info:build In file included from /opt/local/var/macports/build/_opt_local_var_macports_sources_rsync.macports.org_macports_release_tarballs_ports_lang_gcc49/gcc49/work/gcc-4.9.4/gcc/config/darwin-c.c:27: |
|---|
| 143 | :info:build In file included from /opt/local/var/macports/build/_opt_local_var_macports_sources_rsync.macports.org_macports_release_tarballs_ports_lang_gcc49/gcc49/work/gcc-4.9.4/gcc/target.h:175: |
|---|
| 144 | :info:build /opt/local/var/macports/build/_opt_local_var_macports_sources_rsync.macports.org_macports_release_tarballs_ports_lang_gcc49/gcc49/work/gcc-4.9.4/gcc/target.def:4769:1: warning: empty macro arguments are a C99 feature [-Wc99-extensions] |
|---|
| 145 | :info:build HOOK_VECTOR_END (c) |
|---|
| 146 | :info:build ^ |
|---|
| 147 | :info:build /opt/local/var/macports/build/_opt_local_var_macports_sources_rsync.macports.org_macports_release_tarballs_ports_lang_gcc49/gcc49/work/gcc-4.9.4/gcc/target-hooks-macros.h:43:50: note: expanded from macro 'HOOK_VECTOR_END' |
|---|
| 148 | :info:build #define HOOK_VECTOR_END(DECL_NAME) HOOK_VECTOR_1(,} DECL_NAME ;) |
|---|
| 149 | :info:build ^ |
|---|
| 150 | :info:build In file included from /opt/local/var/macports/build/_opt_local_var_macports_sources_rsync.macports.org_macports_release_tarballs_ports_lang_gcc49/gcc49/work/gcc-4.9.4/gcc/config/darwin-c.c:27: |
|---|
| 151 | :info:build In file included from /opt/local/var/macports/build/_opt_local_var_macports_sources_rsync.macports.org_macports_release_tarballs_ports_lang_gcc49/gcc49/work/gcc-4.9.4/gcc/target.h:175: |
|---|
| 152 | :info:build /opt/local/var/macports/build/_opt_local_var_macports_sources_rsync.macports.org_macports_release_tarballs_ports_lang_gcc49/gcc49/work/gcc-4.9.4/gcc/target.def:4922:1: warning: empty macro arguments are a C99 feature [-Wc99-extensions] |
|---|
| 153 | :info:build HOOK_VECTOR_END (cxx) |
|---|
| 154 | :info:build ^ |
|---|
| 155 | :info:build /opt/local/var/macports/build/_opt_local_var_macports_sources_rsync.macports.org_macports_release_tarballs_ports_lang_gcc49/gcc49/work/gcc-4.9.4/gcc/target-hooks-macros.h:43:50: note: expanded from macro 'HOOK_VECTOR_END' |
|---|
| 156 | :info:build #define HOOK_VECTOR_END(DECL_NAME) HOOK_VECTOR_1(,} DECL_NAME ;) |
|---|
| 157 | :info:build ^ |
|---|
| 158 | :info:build In file included from /opt/local/var/macports/build/_opt_local_var_macports_sources_rsync.macports.org_macports_release_tarballs_ports_lang_gcc49/gcc49/work/gcc-4.9.4/gcc/config/darwin-c.c:27: |
|---|
| 159 | :info:build In file included from /opt/local/var/macports/build/_opt_local_var_macports_sources_rsync.macports.org_macports_release_tarballs_ports_lang_gcc49/gcc49/work/gcc-4.9.4/gcc/target.h:175: |
|---|
| 160 | :info:build /opt/local/var/macports/build/_opt_local_var_macports_sources_rsync.macports.org_macports_release_tarballs_ports_lang_gcc49/gcc49/work/gcc-4.9.4/gcc/target.def:5011:1: warning: empty macro arguments are a C99 feature [-Wc99-extensions] |
|---|
| 161 | :info:build HOOK_VECTOR_END (emutls) |
|---|
| 162 | :info:build ^ |
|---|
| 163 | :info:build /opt/local/var/macports/build/_opt_local_var_macports_sources_rsync.macports.org_macports_release_tarballs_ports_lang_gcc49/gcc49/work/gcc-4.9.4/gcc/target-hooks-macros.h:43:50: note: expanded from macro 'HOOK_VECTOR_END' |
|---|
| 164 | :info:build #define HOOK_VECTOR_END(DECL_NAME) HOOK_VECTOR_1(,} DECL_NAME ;) |
|---|
| 165 | :info:build ^ |
|---|
| 166 | :info:build In file included from /opt/local/var/macports/build/_opt_local_var_macports_sources_rsync.macports.org_macports_release_tarballs_ports_lang_gcc49/gcc49/work/gcc-4.9.4/gcc/config/darwin-c.c:27: |
|---|
| 167 | :info:build In file included from /opt/local/var/macports/build/_opt_local_var_macports_sources_rsync.macports.org_macports_release_tarballs_ports_lang_gcc49/gcc49/work/gcc-4.9.4/gcc/target.h:175: |
|---|
| 168 | :info:build /opt/local/var/macports/build/_opt_local_var_macports_sources_rsync.macports.org_macports_release_tarballs_ports_lang_gcc49/gcc49/work/gcc-4.9.4/gcc/target.def:5117:1: warning: empty macro arguments are a C99 feature [-Wc99-extensions] |
|---|
| 169 | :info:build HOOK_VECTOR_END (target_option) |
|---|
| 170 | :info:build ^ |
|---|
| 171 | :info:build /opt/local/var/macports/build/_opt_local_var_macports_sources_rsync.macports.org_macports_release_tarballs_ports_lang_gcc49/gcc49/work/gcc-4.9.4/gcc/target-hooks-macros.h:43:50: note: expanded from macro 'HOOK_VECTOR_END' |
|---|
| 172 | :info:build #define HOOK_VECTOR_END(DECL_NAME) HOOK_VECTOR_1(,} DECL_NAME ;) |
|---|
| 173 | :info:build ^ |
|---|
| 174 | :info:build In file included from /opt/local/var/macports/build/_opt_local_var_macports_sources_rsync.macports.org_macports_release_tarballs_ports_lang_gcc49/gcc49/work/gcc-4.9.4/gcc/config/darwin-c.c:27: |
|---|
| 175 | :info:build In file included from /opt/local/var/macports/build/_opt_local_var_macports_sources_rsync.macports.org_macports_release_tarballs_ports_lang_gcc49/gcc49/work/gcc-4.9.4/gcc/target.h:175: |
|---|
| 176 | :info:build /opt/local/var/macports/build/_opt_local_var_macports_sources_rsync.macports.org_macports_release_tarballs_ports_lang_gcc49/gcc49/work/gcc-4.9.4/gcc/target.def:5349:1: warning: empty macro arguments are a C99 feature [-Wc99-extensions] |
|---|
| 177 | :info:build HOOK_VECTOR_END (C90_EMPTY_HACK) |
|---|
| 178 | :info:build ^ |
|---|
| 179 | :info:build /opt/local/var/macports/build/_opt_local_var_macports_sources_rsync.macports.org_macports_release_tarballs_ports_lang_gcc49/gcc49/work/gcc-4.9.4/gcc/target-hooks-macros.h:43:50: note: expanded from macro 'HOOK_VECTOR_END' |
|---|
| 180 | :info:build #define HOOK_VECTOR_END(DECL_NAME) HOOK_VECTOR_1(,} DECL_NAME ;) |
|---|
| 181 | :info:build ^ |
|---|
| 182 | :info:build In file included from /opt/local/var/macports/build/_opt_local_var_macports_sources_rsync.macports.org_macports_release_tarballs_ports_lang_gcc49/gcc49/work/gcc-4.9.4/gcc/config/i386/i386-c.c:29: |
|---|
| 183 | :info:build In file included from /opt/local/var/macports/build/_opt_local_var_macports_sources_rsync.macports.org_macports_release_tarballs_ports_lang_gcc49/gcc49/work/gcc-4.9.4/gcc/target.h:175: |
|---|
| 184 | :info:build /opt/local/var/macports/build/_opt_local_var_macports_sources_rsync.macports.org_macports_release_tarballs_ports_lang_gcc49/gcc49/work/gcc-4.9.4/gcc/target.def:902:1: warning: empty macro arguments are a C99 feature [-Wc99-extensions] |
|---|
| 185 | :info:build HOOK_VECTOR_END (asm_out) |
|---|
| 186 | :info:build ^ |
|---|
| 187 | :info:build /opt/local/var/macports/build/_opt_local_var_macports_sources_rsync.macports.org_macports_release_tarballs_ports_lang_gcc49/gcc49/work/gcc-4.9.4/gcc/target-hooks-macros.h:43:50: note: expanded from macro 'HOOK_VECTOR_END' |
|---|
| 188 | :info:build #define HOOK_VECTOR_END(DECL_NAME) HOOK_VECTOR_1(,} DECL_NAME ;) |
|---|
| 189 | :info:build ^ |
|---|
| 190 | :info:build In file included from /opt/local/var/macports/build/_opt_local_var_macports_sources_rsync.macports.org_macports_release_tarballs_ports_lang_gcc49/gcc49/work/gcc-4.9.4/gcc/config/i386/i386-c.c:29: |
|---|
| 191 | :info:build In file included from /opt/local/var/macports/build/_opt_local_var_macports_sources_rsync.macports.org_macports_release_tarballs_ports_lang_gcc49/gcc49/work/gcc-4.9.4/gcc/target.h:175: |
|---|
| 192 | :info:build /opt/local/var/macports/build/_opt_local_var_macports_sources_rsync.macports.org_macports_release_tarballs_ports_lang_gcc49/gcc49/work/gcc-4.9.4/gcc/target.def:1522:1: warning: empty macro arguments are a C99 feature [-Wc99-extensions] |
|---|
| 193 | :info:build HOOK_VECTOR_END (sched) |
|---|
| 194 | :info:build ^ |
|---|
| 195 | :info:build /opt/local/var/macports/build/_opt_local_var_macports_sources_rsync.macports.org_macports_release_tarballs_ports_lang_gcc49/gcc49/work/gcc-4.9.4/gcc/target-hooks-macros.h:43:50: note: expanded from macro 'HOOK_VECTOR_END' |
|---|
| 196 | :info:build #define HOOK_VECTOR_END(DECL_NAME) HOOK_VECTOR_1(,} DECL_NAME ;) |
|---|
| 197 | :info:build ^ |
|---|
| 198 | :info:build In file included from /opt/local/var/macports/build/_opt_local_var_macports_sources_rsync.macports.org_macports_release_tarballs_ports_lang_gcc49/gcc49/work/gcc-4.9.4/gcc/config/i386/i386-c.c:29: |
|---|
| 199 | :info:build In file included from /opt/local/var/macports/build/_opt_local_var_macports_sources_rsync.macports.org_macports_release_tarballs_ports_lang_gcc49/gcc49/work/gcc-4.9.4/gcc/target.h:175: |
|---|
| 200 | :info:build /opt/local/var/macports/build/_opt_local_var_macports_sources_rsync.macports.org_macports_release_tarballs_ports_lang_gcc49/gcc49/work/gcc-4.9.4/gcc/target.def:1552:1: warning: empty macro arguments are a C99 feature [-Wc99-extensions] |
|---|
| 201 | :info:build HOOK_VECTOR_END (simd_clone) |
|---|
| 202 | :info:build ^ |
|---|
| 203 | :info:build /opt/local/var/macports/build/_opt_local_var_macports_sources_rsync.macports.org_macports_release_tarballs_ports_lang_gcc49/gcc49/work/gcc-4.9.4/gcc/target-hooks-macros.h:43:50: note: expanded from macro 'HOOK_VECTOR_END' |
|---|
| 204 | :info:build #define HOOK_VECTOR_END(DECL_NAME) HOOK_VECTOR_1(,} DECL_NAME ;) |
|---|
| 205 | :info:build ^ |
|---|
| 206 | :info:build In file included from /opt/local/var/macports/build/_opt_local_var_macports_sources_rsync.macports.org_macports_release_tarballs_ports_lang_gcc49/gcc49/work/gcc-4.9.4/gcc/config/i386/i386-c.c:29: |
|---|
| 207 | :info:build In file included from /opt/local/var/macports/build/_opt_local_var_macports_sources_rsync.macports.org_macports_release_tarballs_ports_lang_gcc49/gcc49/work/gcc-4.9.4/gcc/target.h:175: |
|---|
| 208 | :info:build /opt/local/var/macports/build/_opt_local_var_macports_sources_rsync.macports.org_macports_release_tarballs_ports_lang_gcc49/gcc49/work/gcc-4.9.4/gcc/target.def:1770:1: warning: empty macro arguments are a C99 feature [-Wc99-extensions] |
|---|
| 209 | :info:build HOOK_VECTOR_END (vectorize) |
|---|
| 210 | :info:build ^ |
|---|
| 211 | :info:build /opt/local/var/macports/build/_opt_local_var_macports_sources_rsync.macports.org_macports_release_tarballs_ports_lang_gcc49/gcc49/work/gcc-4.9.4/gcc/target-hooks-macros.h:43:50: note: expanded from macro 'HOOK_VECTOR_END' |
|---|
| 212 | :info:build #define HOOK_VECTOR_END(DECL_NAME) HOOK_VECTOR_1(,} DECL_NAME ;) |
|---|
| 213 | :info:build ^ |
|---|
| 214 | :info:build In file included from /opt/local/var/macports/build/_opt_local_var_macports_sources_rsync.macports.org_macports_release_tarballs_ports_lang_gcc49/gcc49/work/gcc-4.9.4/gcc/config/i386/i386-c.c:29: |
|---|
| 215 | :info:build In file included from /opt/local/var/macports/build/_opt_local_var_macports_sources_rsync.macports.org_macports_release_tarballs_ports_lang_gcc49/gcc49/work/gcc-4.9.4/gcc/target.h:175: |
|---|
| 216 | :info:build /opt/local/var/macports/build/_opt_local_var_macports_sources_rsync.macports.org_macports_release_tarballs_ports_lang_gcc49/gcc49/work/gcc-4.9.4/gcc/target.def:2913:1: warning: empty macro arguments are a C99 feature [-Wc99-extensions] |
|---|
| 217 | :info:build HOOK_VECTOR_END (addr_space) |
|---|
| 218 | :info:build ^ |
|---|
| 219 | :info:build /opt/local/var/macports/build/_opt_local_var_macports_sources_rsync.macports.org_macports_release_tarballs_ports_lang_gcc49/gcc49/work/gcc-4.9.4/gcc/target-hooks-macros.h:43:50: note: expanded from macro 'HOOK_VECTOR_END' |
|---|
| 220 | :info:build #define HOOK_VECTOR_END(DECL_NAME) HOOK_VECTOR_1(,} DECL_NAME ;) |
|---|
| 221 | :info:build ^ |
|---|
| 222 | :info:build In file included from insn-attrtab.c:12: |
|---|
| 223 | :info:build In file included from /opt/local/var/macports/build/_opt_local_var_macports_sources_rsync.macports.org_macports_release_tarballs_ports_lang_gcc49/gcc49/work/gcc-4.9.4/gcc/rtl.h:2350: |
|---|
| 224 | :info:build ./genrtl.h:447:3: warning: array index 1 is past the end of the array (which contains 1 element) [-Warray-bounds] |
|---|
| 225 | :info:build In file included from /opt/local/var/macports/build/_opt_local_var_macports_sources_rsync.macports.org_macports_release_tarballs_ports_lang_gcc49/gcc49/work/gcc-4.9.4/gcc/config/i386/i386-c.c:29: |
|---|
| 226 | :info:build In file included from /opt/local/var/macports/build/_opt_local_var_macports_sources_rsync.macports.org_macports_release_tarballs_ports_lang_gcc49/gcc49/work/gcc-4.9.4/gcc/target.h:175: |
|---|
| 227 | :info:build /opt/local/var/macports/build/_opt_local_var_macports_sources_rsync.macports.org_macports_release_tarballs_ports_lang_gcc49/gcc49/work/gcc-4.9.4/gcc/target.def:4254:1: warning: empty macro arguments are a C99 feature [-Wc99-extensions] |
|---|
| 228 | :info:build HOOK_VECTOR_END (calls) |
|---|
| 229 | :info:build ^ |
|---|
| 230 | :info:build /opt/local/var/macports/build/_opt_local_var_macports_sources_rsync.macports.org_macports_release_tarballs_ports_lang_gcc49/gcc49/work/gcc-4.9.4/gcc/target-hooks-macros.h:43:50: note: expanded from macro 'HOOK_VECTOR_END' |
|---|
| 231 | :info:build #define HOOK_VECTOR_END(DECL_NAME) HOOK_VECTOR_1(,} DECL_NAME ;) |
|---|
| 232 | :info:build ^ |
|---|
| 233 | :info:build In file included from /opt/local/var/macports/build/_opt_local_var_macports_sources_rsync.macports.org_macports_release_tarballs_ports_lang_gcc49/gcc49/work/gcc-4.9.4/gcc/config/i386/i386-c.c:29: |
|---|
| 234 | :info:build In file included from /opt/local/var/macports/build/_opt_local_var_macports_sources_rsync.macports.org_macports_release_tarballs_ports_lang_gcc49/gcc49/work/gcc-4.9.4/gcc/target.h:175: |
|---|
| 235 | :info:build /opt/local/var/macports/build/_opt_local_var_macports_sources_rsync.macports.org_macports_release_tarballs_ports_lang_gcc49/gcc49/work/gcc-4.9.4/gcc/target.def:4769:1: warning: empty macro arguments are a C99 feature [-Wc99-extensions] |
|---|
| 236 | :info:build HOOK_VECTOR_END (c) |
|---|
| 237 | :info:build ^ |
|---|
| 238 | :info:build /opt/local/var/macports/build/_opt_local_var_macports_sources_rsync.macports.org_macports_release_tarballs_ports_lang_gcc49/gcc49/work/gcc-4.9.4/gcc/target-hooks-macros.h:43:50: note: expanded from macro 'HOOK_VECTOR_END' |
|---|
| 239 | :info:build #define HOOK_VECTOR_END(DECL_NAME) HOOK_VECTOR_1(,} DECL_NAME ;) |
|---|
| 240 | :info:build ^ |
|---|
| 241 | :info:build In file included from /opt/local/var/macports/build/_opt_local_var_macports_sources_rsync.macports.org_macports_release_tarballs_ports_lang_gcc49/gcc49/work/gcc-4.9.4/gcc/config/i386/i386-c.c:29: |
|---|
| 242 | :info:build In file included from /opt/local/var/macports/build/_opt_local_var_macports_sources_rsync.macports.org_macports_release_tarballs_ports_lang_gcc49/gcc49/work/gcc-4.9.4/gcc/target.h:175: |
|---|
| 243 | :info:build /opt/local/var/macports/build/_opt_local_var_macports_sources_rsync.macports.org_macports_release_tarballs_ports_lang_gcc49/gcc49/work/gcc-4.9.4/gcc/target.def:4922:1: warning: empty macro arguments are a C99 feature [-Wc99-extensions] |
|---|
| 244 | :info:build HOOK_VECTOR_END (cxx) |
|---|
| 245 | :info:build ^ |
|---|
| 246 | :info:build /opt/local/var/macports/build/_opt_local_var_macports_sources_rsync.macports.org_macports_release_tarballs_ports_lang_gcc49/gcc49/work/gcc-4.9.4/gcc/target-hooks-macros.h:43:50: note: expanded from macro 'HOOK_VECTOR_END' |
|---|
| 247 | :info:build #define HOOK_VECTOR_END(DECL_NAME) HOOK_VECTOR_1(,} DECL_NAME ;) |
|---|
| 248 | :info:build ^ |
|---|
| 249 | :info:build In file included from /opt/local/var/macports/build/_opt_local_var_macports_sources_rsync.macports.org_macports_release_tarballs_ports_lang_gcc49/gcc49/work/gcc-4.9.4/gcc/config/i386/i386-c.c:29: |
|---|
| 250 | :info:build In file included from /opt/local/var/macports/build/_opt_local_var_macports_sources_rsync.macports.org_macports_release_tarballs_ports_lang_gcc49/gcc49/work/gcc-4.9.4/gcc/target.h:175: |
|---|
| 251 | :info:build /opt/local/var/macports/build/_opt_local_var_macports_sources_rsync.macports.org_macports_release_tarballs_ports_lang_gcc49/gcc49/work/gcc-4.9.4/gcc/target.def:5011:1: warning: empty macro arguments are a C99 feature [-Wc99-extensions] |
|---|
| 252 | :info:build HOOK_VECTOR_END (emutls) |
|---|
| 253 | :info:build ^ |
|---|
| 254 | :info:build /opt/local/var/macports/build/_opt_local_var_macports_sources_rsync.macports.org_macports_release_tarballs_ports_lang_gcc49/gcc49/work/gcc-4.9.4/gcc/target-hooks-macros.h:43:50: note: expanded from macro 'HOOK_VECTOR_END' |
|---|
| 255 | :info:build #define HOOK_VECTOR_END(DECL_NAME) HOOK_VECTOR_1(,} DECL_NAME ;) |
|---|
| 256 | :info:build ^ |
|---|
| 257 | :info:build In file included from /opt/local/var/macports/build/_opt_local_var_macports_sources_rsync.macports.org_macports_release_tarballs_ports_lang_gcc49/gcc49/work/gcc-4.9.4/gcc/config/i386/i386-c.c XWINT (rt, 1) = arg1;: |
|---|
| 258 | :info:build 29: |
|---|
| 259 | :info:build In file included from /opt/local/var/macports/build/_opt_local_var_macports_sources_rsync.macports.org_macports_release_tarballs_ports_lang_gcc49/gcc49/work/gcc-4.9.4/gcc/target.h:175: |
|---|
| 260 | :info:build /opt/local/var/macports/build/_opt_local_var_macports_sources_rsync.macports.org_macports_release_tarballs_ports_lang_gcc49/gcc49/work/gcc-4.9.4/gcc/target.def:5117:1: warning: empty macro arguments are a C99 feature [-Wc99-extensions] |
|---|
| 261 | :info:build HOOK_VECTOR_END (target_option) |
|---|
| 262 | :info:build ^ |
|---|
| 263 | :info:build /opt/local/var/macports/build/_opt_local_var_macports_sources_rsync.macports.org_macports_release_tarballs_ports_lang_gcc49/gcc49/work/gcc-4.9.4/gcc/target-hooks-macros.h:43:50: ^ ~ |
|---|
| 264 | :info:build /opt/local/var/macports/build/_opt_local_var_macports_sources_rsync.macports.org_macports_release_tarballs_ports_lang_gcc49/gcc49/work/gcc-4.9.4/gcc/rtl.h:663:29: note: expanded from macro 'XWINT' |
|---|
| 265 | :info:build #define XWINT(RTX, N) ((RTX)->u.hwint[N]) |
|---|
| 266 | :info:build ^ ~ |
|---|
| 267 | :info:build /opt/local/var/macports/build/_opt_local_var_macports_sources_rsync.macports.org_macports_release_tarballs_ports_lang_gcc49/gcc49/work/gcc-4.9.4/gcc/rtl.h:342:5: note: array 'hwint' declared here |
|---|
| 268 | :info:build HOST_WIDE_INT hwint[1]; |
|---|
| 269 | :info:build ^ |
|---|
| 270 | :info:build /opt/local/var/macports/build/_opt_local_var_macports_sources_rsync.macports.org_macports_release_tarballs_ports_lang_gcc49/gcc49/work/gcc-4.9.4/gcc/hwint.h:61:26: note: expanded from macro 'HOST_WIDE_INT' |
|---|
| 271 | :info:build # define HOST_WIDE_INT long |
|---|
| 272 | :info:build ^ |
|---|
| 273 | :info:build In file included from insn-attrtab.c:12: |
|---|
| 274 | :info:build In file included from /opt/local/var/macports/build/_opt_local_var_macports_sources_rsync.macports.org_macports_release_tarballs_ports_lang_gcc49/gcc49/work/gcc-4.9.4/gcc/rtl.h:2350: |
|---|
| 275 | :info:build ./genrtl.h:448:3: warning: array index 2 is past the end of the array (which contains 1 element) [-Warray-bounds] |
|---|
| 276 | :info:build In file included from XWINT (rt, 2) = arg2; |
|---|
| 277 | :info:build ^ ~ |
|---|
| 278 | :info:build note/opt/local/var/macports/build/_opt_local_var_macports_sources_rsync.macports.org_macports_release_tarballs_ports_lang_gcc49/gcc49/work/gcc-4.9.4/gcc/rtl.h: :663expanded from macro 'HOOK_VECTOR_END': |
|---|
| 279 | :info:build 29:/opt/local/var/macports/build/_opt_local_var_macports_sources_rsync.macports.org_macports_release_tarballs_ports_lang_gcc49/gcc49/work/gcc-4.9.4/gcc/config/darwin-c.c :37: |
|---|
| 280 | :info:build In file included from /opt/local/var/macports/build/_opt_local_var_macports_sources_rsync.macports.org_macports_release_tarballs_ports_lang_gcc49/gcc49/work/gcc-4.9.4/gcc/c-family/c-target.h:30: |
|---|
| 281 | :info:build /opt/local/var/macports/build/_opt_local_var_macports_sources_rsync.macports.org_macports_release_tarballs_ports_lang_gcc49/gcc49/work/gcc-4.9.4/gcc/c-family/c-target.def:116:1: warning: empty macro arguments are a C99 feature [-Wc99-extensions] |
|---|
| 282 | :info:build #define HOOK_VECTOR_END(DECL_NAME) HOOK_VECTOR_1(,} DECL_NAME ;) |
|---|
| 283 | :info:build ^ |
|---|
| 284 | :info:build HOOK_VECTOR_END (C90_EMPTY_HACK) |
|---|
| 285 | :info:build ^ |
|---|
| 286 | :info:build /opt/local/var/macports/build/_opt_local_var_macports_sources_rsync.macports.org_macports_release_tarballs_ports_lang_gcc49/gcc49/work/gcc-4.9.4/gcc/target-hooks-macros.h:43:50: note: expanded from macro 'HOOK_VECTOR_END' |
|---|
| 287 | :info:build #define HOOK_VECTOR_END(DECL_NAME) HOOK_VECTOR_1(,} DECL_NAME ;) |
|---|
| 288 | :info:build ^ |
|---|
| 289 | :info:build note: expanded from macro 'XWINT' |
|---|
| 290 | :info:build #define XWINT(RTX, N) ((RTX)->u.hwint[N]) |
|---|
| 291 | :info:build ^ ~ |
|---|
| 292 | :info:build /opt/local/var/macports/build/_opt_local_var_macports_sources_rsync.macports.org_macports_release_tarballs_ports_lang_gcc49/gcc49/work/gcc-4.9.4/gcc/rtl.h:342:5: note: array 'hwint' declared here |
|---|
| 293 | :info:build HOST_WIDE_INT hwint[1]; |
|---|
| 294 | :info:build ^ |
|---|
| 295 | :info:build /opt/local/var/macports/build/_opt_local_var_macports_sources_rsync.macports.org_macports_release_tarballs_ports_lang_gcc49/gcc49/work/gcc-4.9.4/gcc/hwint.h:61:26: note: expanded from macro 'HOST_WIDE_INT' |
|---|
| 296 | :info:build # define HOST_WIDE_INT long |
|---|
| 297 | :info:build ^ |
|---|
| 298 | :info:build In file included from /opt/local/var/macports/build/_opt_local_var_macports_sources_rsync.macports.org_macports_release_tarballs_ports_lang_gcc49/gcc49/work/gcc-4.9.4/gcc/config/i386/i386-c.c:29: |
|---|
| 299 | :info:build In file included from /opt/local/var/macports/build/_opt_local_var_macports_sources_rsync.macports.org_macports_release_tarballs_ports_lang_gcc49/gcc49/work/gcc-4.9.4/gcc/target.h:175: |
|---|
| 300 | :info:build /opt/local/var/macports/build/_opt_local_var_macports_sources_rsync.macports.org_macports_release_tarballs_ports_lang_gcc49/gcc49/work/gcc-4.9.4/gcc/target.def:5349:1: warning: empty macro arguments are a C99 feature [-Wc99-extensions] |
|---|
| 301 | :info:build HOOK_VECTOR_END (C90_EMPTY_HACK) |
|---|
| 302 | :info:build ^ |
|---|
| 303 | :info:build /opt/local/var/macports/build/_opt_local_var_macports_sources_rsync.macports.org_macports_release_tarballs_ports_lang_gcc49/gcc49/work/gcc-4.9.4/gcc/target-hooks-macros.h:43:50: note: expanded from macro 'HOOK_VECTOR_END' |
|---|
| 304 | :info:build #define HOOK_VECTOR_END(DECL_NAME) HOOK_VECTOR_1(,} DECL_NAME ;) |
|---|
| 305 | :info:build ^ |
|---|
| 306 | :info:build In file included from insn-attrtab.c:16: |
|---|
| 307 | :info:build /opt/local/var/macports/build/_opt_local_var_macports_sources_rsync.macports.org_macports_release_tarballs_ports_lang_gcc49/gcc49/work/gcc-4.9.4/gcc/recog.h:338:5: warning: macro expansion producing 'defined' has undefined behavior [-Wexpansion-to-defined] |
|---|
| 308 | :info:build #if HAVE_DESIGNATED_UNION_INITIALIZERS |
|---|
| 309 | :info:build ^ |
|---|
| 310 | :info:build /opt/local/var/macports/build/_opt_local_var_macports_sources_rsync.macports.org_macports_release_tarballs_ports_lang_gcc49/gcc49/work/gcc-4.9.4/gcc/system.h:554:9: note: expanded from macro 'HAVE_DESIGNATED_UNION_INITIALIZERS' |
|---|
| 311 | :info:build && (!defined(__cplusplus) || (GCC_VERSION >= 4007))) |
|---|
| 312 | :info:build ^ |
|---|
| 313 | :info:build In file included from insn-attrtab.c:19: |
|---|
| 314 | :info:build /opt/local/var/macports/build/_opt_local_var_macports_sources_rsync.macports.org_macports_release_tarballs_ports_lang_gcc49/gcc49/work/gcc-4.9.4/gcc/output.h:131:6: warning: '__format__' attribute argument not supported: asm_fprintf [-Wignored-attributes] |
|---|
| 315 | :info:build ATTRIBUTE_ASM_FPRINTF(2, 3); |
|---|
| 316 | :info:build ^ |
|---|
| 317 | :info:build /opt/local/var/macports/build/_opt_local_var_macports_sources_rsync.macports.org_macports_release_tarballs_ports_lang_gcc49/gcc49/work/gcc-4.9.4/gcc/output.h:121:53: note: expanded from macro 'ATTRIBUTE_ASM_FPRINTF' |
|---|
| 318 | :info:build #define ATTRIBUTE_ASM_FPRINTF(m, n) __attribute__ ((__format__ (__asm_fprintf__, m, n))) ATTRIBUTE_NONNULL(m) |
|---|
| 319 | :info:build ^ |
|---|
| 320 | :info:build In file included from /opt/local/var/macports/build/_opt_local_var_macports_sources_rsync.macports.org_macports_release_tarballs_ports_lang_gcc49/gcc49/work/gcc-4.9.4/gcc/config/darwin-c.c:40: |
|---|
| 321 | :info:build /opt/local/var/macports/build/_opt_local_var_macports_sources_rsync.macports.org_macports_release_tarballs_ports_lang_gcc49/gcc49/work/gcc-4.9.4/gcc/config/../../libcpp/internal.h:589:5: warning: macro expansion producing 'defined' has undefined behavior [-Wexpansion-to-defined] |
|---|
| 322 | :info:build #if HAVE_DESIGNATED_INITIALIZERS |
|---|
| 323 | :info:build ^ |
|---|
| 324 | :info:build /opt/local/var/macports/build/_opt_local_var_macports_sources_rsync.macports.org_macports_release_tarballs_ports_lang_gcc49/gcc49/work/gcc-4.9.4/gcc/system.h:548:8: note: expanded from macro 'HAVE_DESIGNATED_INITIALIZERS' |
|---|
| 325 | :info:build && !defined(__cplusplus)) |
|---|
| 326 | :info:build ^ |
|---|
| 327 | :info:build /opt/local/var/macports/build/_opt_local_var_macports_sources_rsync.macports.org_macports_release_tarballs_ports_lang_gcc49/gcc49/work/gcc-4.9.4/gcc/config/i386/i386.md:374:18: warning: equality comparison with extraneous parentheses [-Wparentheses-equality] |
|---|
| 328 | :info:build (ix86_schedule)) == ( |
|---|
| 329 | :info:build ~~~~~~~~~~~~~~~~~^~~~ |
|---|
| 330 | :info:build /opt/local/var/macports/build/_opt_local_var_macports_sources_rsync.macports.org_macports_release_tarballs_ports_lang_gcc49/gcc49/work/gcc-4.9.4/gcc/config/i386/i386.md:374:18: note: remove extraneous parentheses around the comparison to silence this warning |
|---|
| 331 | :info:build (ix86_schedule)) == ( |
|---|
| 332 | :info:build ^ |
|---|
| 333 | :info:build /opt/local/var/macports/build/_opt_local_var_macports_sources_rsync.macports.org_macports_release_tarballs_ports_lang_gcc49/gcc49/work/gcc-4.9.4/gcc/config/i386/i386.md:374:18: note: use '=' to turn this equality comparison into an assignment |
|---|
| 334 | :info:build (ix86_schedule)) == ( |
|---|
| 335 | :info:build ^~ |
|---|
| 336 | :info:build = |
|---|
| 337 | :info:build /opt/local/var/macports/build/_opt_local_var_macports_sources_rsync.macports.org_macports_release_tarballs_ports_lang_gcc49/gcc49/work/gcc-4.9.4/gcc/config/i386/i386.md:374:18: warning: equality comparison with extraneous parentheses [-Wparentheses-equality] |
|---|
| 338 | :info:build (ix86_schedule)) == ( |
|---|
| 339 | :info:build ~~~~~~~~~~~~~~~~~^~~~ |
|---|
| 340 | :info:build /opt/local/var/macports/build/_opt_local_var_macports_sources_rsync.macports.org_macports_release_tarballs_ports_lang_gcc49/gcc49/work/gcc-4.9.4/gcc/config/i386/i386.md:374:18: note: remove extraneous parentheses around the comparison to silence this warning |
|---|
| 341 | :info:build (ix86_schedule)) == ( |
|---|
| 342 | :info:build ^ |
|---|
| 343 | :info:build /opt/local/var/macports/build/_opt_local_var_macports_sources_rsync.macports.org_macports_release_tarballs_ports_lang_gcc49/gcc49/work/gcc-4.9.4/gcc/config/i386/i386.md:374:18: note: use '=' to turn this equality comparison into an assignment |
|---|
| 344 | :info:build (ix86_schedule)) == ( |
|---|
| 345 | :info:build ^~ |
|---|
| 346 | :info:build = |
|---|
| 347 | :info:build /opt/local/var/macports/build/_opt_local_var_macports_sources_rsync.macports.org_macports_release_tarballs_ports_lang_gcc49/gcc49/work/gcc-4.9.4/gcc/config/i386/i386.md:374:18: warning: equality comparison with extraneous parentheses [-Wparentheses-equality] |
|---|
| 348 | :info:build (ix86_schedule)) == ( |
|---|
| 349 | :info:build ~~~~~~~~~~~~~~~~~^~~~ |
|---|
| 350 | :info:build /opt/local/var/macports/build/_opt_local_var_macports_sources_rsync.macports.org_macports_release_tarballs_ports_lang_gcc49/gcc49/work/gcc-4.9.4/gcc/config/i386/i386.md:374:18: note: remove extraneous parentheses around the comparison to silence this warning |
|---|
| 351 | :info:build (ix86_schedule)) == ( |
|---|
| 352 | :info:build ^ |
|---|
| 353 | :info:build /opt/local/var/macports/build/_opt_local_var_macports_sources_rsync.macports.org_macports_release_tarballs_ports_lang_gcc49/gcc49/work/gcc-4.9.4/gcc/config/i386/i386.md:374:18: note: use '=' to turn this equality comparison into an assignment |
|---|
| 354 | :info:build (ix86_schedule)) == ( |
|---|
| 355 | :info:build ^~ |
|---|
| 356 | :info:build = |
|---|
| 357 | :info:build /opt/local/var/macports/build/_opt_local_var_macports_sources_rsync.macports.org_macports_release_tarballs_ports_lang_gcc49/gcc49/work/gcc-4.9.4/gcc/config/i386/i386.md:374:18: warning: equality comparison with extraneous parentheses [-Wparentheses-equality] |
|---|
| 358 | :info:build (ix86_schedule)) == ( |
|---|
| 359 | :info:build ~~~~~~~~~~~~~~~~~^~~~ |
|---|
| 360 | :info:build /opt/local/var/macports/build/_opt_local_var_macports_sources_rsync.macports.org_macports_release_tarballs_ports_lang_gcc49/gcc49/work/gcc-4.9.4/gcc/config/i386/i386.md:374:18: note: remove extraneous parentheses around the comparison to silence this warning |
|---|
| 361 | :info:build (ix86_schedule)) == ( |
|---|
| 362 | :info:build ^ |
|---|
| 363 | :info:build /opt/local/var/macports/build/_opt_local_var_macports_sources_rsync.macports.org_macports_release_tarballs_ports_lang_gcc49/gcc49/work/gcc-4.9.4/gcc/config/i386/i386.md:374:18: note: use '=' to turn this equality comparison into an assignment |
|---|
| 364 | :info:build (ix86_schedule)) == ( |
|---|
| 365 | :info:build ^~ |
|---|
| 366 | :info:build = |
|---|
| 367 | :info:build /opt/local/var/macports/build/_opt_local_var_macports_sources_rsync.macports.org_macports_release_tarballs_ports_lang_gcc49/gcc49/work/gcc-4.9.4/gcc/config/i386/i386.md:374:18: warning: equality comparison with extraneous parentheses [-Wparentheses-equality] |
|---|
| 368 | :info:build (ix86_schedule)) == ( |
|---|
| 369 | :info:build ~~~~~~~~~~~~~~~~~^~~~ |
|---|
| 370 | :info:build /opt/local/var/macports/build/_opt_local_var_macports_sources_rsync.macports.org_macports_release_tarballs_ports_lang_gcc49/gcc49/work/gcc-4.9.4/gcc/config/i386/i386.md:374:18: note: remove extraneous parentheses around the comparison to silence this warning |
|---|
| 371 | :info:build (ix86_schedule)) == ( |
|---|
| 372 | :info:build ^ |
|---|
| 373 | :info:build /opt/local/var/macports/build/_opt_local_var_macports_sources_rsync.macports.org_macports_release_tarballs_ports_lang_gcc49/gcc49/work/gcc-4.9.4/gcc/config/i386/i386.md:374:18: note: use '=' to turn this equality comparison into an assignment |
|---|
| 374 | :info:build (ix86_schedule)) == ( |
|---|
| 375 | :info:build ^~ |
|---|
| 376 | :info:build = |
|---|
| 377 | :info:build /opt/local/var/macports/build/_opt_local_var_macports_sources_rsync.macports.org_macports_release_tarballs_ports_lang_gcc49/gcc49/work/gcc-4.9.4/gcc/config/i386/i386.md:374:18: warning: equality comparison with extraneous parentheses [-Wparentheses-equality] |
|---|
| 378 | :info:build (ix86_schedule)) == ( |
|---|
| 379 | :info:build ~~~~~~~~~~~~~~~~~^~~~ |
|---|
| 380 | :info:build /opt/local/var/macports/build/_opt_local_var_macports_sources_rsync.macports.org_macports_release_tarballs_ports_lang_gcc49/gcc49/work/gcc-4.9.4/gcc/config/i386/i386.md:374:18: note: remove extraneous parentheses around the comparison to silence this warning |
|---|
| 381 | :info:build (ix86_schedule)) == ( |
|---|
| 382 | :info:build ^ |
|---|
| 383 | :info:build /opt/local/var/macports/build/_opt_local_var_macports_sources_rsync.macports.org_macports_release_tarballs_ports_lang_gcc49/gcc49/work/gcc-4.9.4/gcc/config/i386/i386.md:374:18: note: use '=' to turn this equality comparison into an assignment |
|---|
| 384 | :info:build (ix86_schedule)) == ( |
|---|
| 385 | :info:build ^~ |
|---|
| 386 | :info:build = |
|---|
| 387 | :info:build /opt/local/var/macports/build/_opt_local_var_macports_sources_rsync.macports.org_macports_release_tarballs_ports_lang_gcc49/gcc49/work/gcc-4.9.4/gcc/config/i386/i386.md:374:18: warning: equality comparison with extraneous parentheses [-Wparentheses-equality] |
|---|
| 388 | :info:build (ix86_schedule)) == ( |
|---|
| 389 | :info:build ~~~~~~~~~~~~~~~~~^~~~ |
|---|
| 390 | :info:build /opt/local/var/macports/build/_opt_local_var_macports_sources_rsync.macports.org_macports_release_tarballs_ports_lang_gcc49/gcc49/work/gcc-4.9.4/gcc/config/i386/i386.md:374:18: note: remove extraneous parentheses around the comparison to silence this warning |
|---|
| 391 | :info:build (ix86_schedule)) == ( |
|---|
| 392 | :info:build ^ |
|---|
| 393 | :info:build /opt/local/var/macports/build/_opt_local_var_macports_sources_rsync.macports.org_macports_release_tarballs_ports_lang_gcc49/gcc49/work/gcc-4.9.4/gcc/config/i386/i386.md:374:18: note: use '=' to turn this equality comparison into an assignment |
|---|
| 394 | :info:build (ix86_schedule)) == ( |
|---|
| 395 | :info:build ^~ |
|---|
| 396 | :info:build = |
|---|
| 397 | :info:build /opt/local/var/macports/build/_opt_local_var_macports_sources_rsync.macports.org_macports_release_tarballs_ports_lang_gcc49/gcc49/work/gcc-4.9.4/gcc/config/i386/i386.md:374:18: warning: equality comparison with extraneous parentheses [-Wparentheses-equality] |
|---|
| 398 | :info:build (ix86_schedule)) == ( |
|---|
| 399 | :info:build ~~~~~~~~~~~~~~~~~^~~~ |
|---|
| 400 | :info:build /opt/local/var/macports/build/_opt_local_var_macports_sources_rsync.macports.org_macports_release_tarballs_ports_lang_gcc49/gcc49/work/gcc-4.9.4/gcc/config/i386/i386.md:374:18: note: remove extraneous parentheses around the comparison to silence this warning |
|---|
| 401 | :info:build (ix86_schedule)) == ( |
|---|
| 402 | :info:build ^ |
|---|
| 403 | :info:build /opt/local/var/macports/build/_opt_local_var_macports_sources_rsync.macports.org_macports_release_tarballs_ports_lang_gcc49/gcc49/work/gcc-4.9.4/gcc/config/i386/i386.md:374:18: note: use '=' to turn this equality comparison into an assignment |
|---|
| 404 | :info:build (ix86_schedule)) == ( |
|---|
| 405 | :info:build ^~ |
|---|
| 406 | :info:build = |
|---|
| 407 | :info:build /opt/local/var/macports/build/_opt_local_var_macports_sources_rsync.macports.org_macports_release_tarballs_ports_lang_gcc49/gcc49/work/gcc-4.9.4/gcc/config/i386/i386.md:374:18: warning: equality comparison with extraneous parentheses [-Wparentheses-equality] |
|---|
| 408 | :info:build (ix86_schedule)) == ( |
|---|
| 409 | :info:build ~~~~~~~~~~~~~~~~~^~~~ |
|---|
| 410 | :info:build /opt/local/var/macports/build/_opt_local_var_macports_sources_rsync.macports.org_macports_release_tarballs_ports_lang_gcc49/gcc49/work/gcc-4.9.4/gcc/config/i386/i386.md:374:18: note: remove extraneous parentheses around the comparison to silence this warning |
|---|
| 411 | :info:build (ix86_schedule)) == ( |
|---|
| 412 | :info:build ^ |
|---|
| 413 | :info:build /opt/local/var/macports/build/_opt_local_var_macports_sources_rsync.macports.org_macports_release_tarballs_ports_lang_gcc49/gcc49/work/gcc-4.9.4/gcc/config/i386/i386.md:374:18: note: use '=' to turn this equality comparison into an assignment |
|---|
| 414 | :info:build (ix86_schedule)) == ( |
|---|
| 415 | :info:build ^~ |
|---|
| 416 | :info:build = |
|---|
| 417 | :info:build /opt/local/var/macports/build/_opt_local_var_macports_sources_rsync.macports.org_macports_release_tarballs_ports_lang_gcc49/gcc49/work/gcc-4.9.4/gcc/config/i386/i386.md:374:18: warning: equality comparison with extraneous parentheses [-Wparentheses-equality] |
|---|
| 418 | :info:build (ix86_schedule)) == ( |
|---|
| 419 | :info:build ~~~~~~~~~~~~~~~~~^~~~ |
|---|
| 420 | :info:build /opt/local/var/macports/build/_opt_local_var_macports_sources_rsync.macports.org_macports_release_tarballs_ports_lang_gcc49/gcc49/work/gcc-4.9.4/gcc/config/i386/i386.md:374:18: note: remove extraneous parentheses around the comparison to silence this warning |
|---|
| 421 | :info:build (ix86_schedule)) == ( |
|---|
| 422 | :info:build ^ |
|---|
| 423 | :info:build /opt/local/var/macports/build/_opt_local_var_macports_sources_rsync.macports.org_macports_release_tarballs_ports_lang_gcc49/gcc49/work/gcc-4.9.4/gcc/config/i386/i386.md:374:18: note: use '=' to turn this equality comparison into an assignment |
|---|
| 424 | :info:build (ix86_schedule)) == ( |
|---|
| 425 | :info:build ^~ |
|---|
| 426 | :info:build = |
|---|
| 427 | :info:build /opt/local/var/macports/build/_opt_local_var_macports_sources_rsync.macports.org_macports_release_tarballs_ports_lang_gcc49/gcc49/work/gcc-4.9.4/gcc/config/i386/i386.md:374:18: warning: equality comparison with extraneous parentheses [-Wparentheses-equality] |
|---|
| 428 | :info:build (ix86_schedule)) == ( |
|---|
| 429 | :info:build ~~~~~~~~~~~~~~~~~^~~~ |
|---|
| 430 | :info:build /opt/local/var/macports/build/_opt_local_var_macports_sources_rsync.macports.org_macports_release_tarballs_ports_lang_gcc49/gcc49/work/gcc-4.9.4/gcc/config/i386/i386.md:374:18: note: remove extraneous parentheses around the comparison to silence this warning |
|---|
| 431 | :info:build (ix86_schedule)) == ( |
|---|
| 432 | :info:build ^ |
|---|
| 433 | :info:build /opt/local/var/macports/build/_opt_local_var_macports_sources_rsync.macports.org_macports_release_tarballs_ports_lang_gcc49/gcc49/work/gcc-4.9.4/gcc/config/i386/i386.md:374:18: note: use '=' to turn this equality comparison into an assignment |
|---|
| 434 | :info:build (ix86_schedule)) == ( |
|---|
| 435 | :info:build ^~ |
|---|
| 436 | :info:build = |
|---|
| 437 | :info:build /opt/local/var/macports/build/_opt_local_var_macports_sources_rsync.macports.org_macports_release_tarballs_ports_lang_gcc49/gcc49/work/gcc-4.9.4/gcc/config/i386/i386.md:374:18: warning: equality comparison with extraneous parentheses [-Wparentheses-equality] |
|---|
| 438 | :info:build (ix86_schedule)) == ( |
|---|
| 439 | :info:build ~~~~~~~~~~~~~~~~~^~~~ |
|---|
| 440 | :info:build /opt/local/var/macports/build/_opt_local_var_macports_sources_rsync.macports.org_macports_release_tarballs_ports_lang_gcc49/gcc49/work/gcc-4.9.4/gcc/config/i386/i386.md:374:18: note: remove extraneous parentheses around the comparison to silence this warning |
|---|
| 441 | :info:build (ix86_schedule)) == ( |
|---|
| 442 | :info:build ^ |
|---|
| 443 | :info:build /opt/local/var/macports/build/_opt_local_var_macports_sources_rsync.macports.org_macports_release_tarballs_ports_lang_gcc49/gcc49/work/gcc-4.9.4/gcc/config/i386/i386.md:374:18: note: use '=' to turn this equality comparison into an assignment |
|---|
| 444 | :info:build (ix86_schedule)) == ( |
|---|
| 445 | :info:build ^~ |
|---|
| 446 | :info:build = |
|---|
| 447 | :info:build /opt/local/var/macports/build/_opt_local_var_macports_sources_rsync.macports.org_macports_release_tarballs_ports_lang_gcc49/gcc49/work/gcc-4.9.4/gcc/config/i386/i386.md:374:18: warning: equality comparison with extraneous parentheses [-Wparentheses-equality] |
|---|
| 448 | :info:build (ix86_schedule)) == ( |
|---|
| 449 | :info:build ~~~~~~~~~~~~~~~~~^~~~ |
|---|
| 450 | :info:build /opt/local/var/macports/build/_opt_local_var_macports_sources_rsync.macports.org_macports_release_tarballs_ports_lang_gcc49/gcc49/work/gcc-4.9.4/gcc/config/i386/i386.md:374:18: note: remove extraneous parentheses around the comparison to silence this warning |
|---|
| 451 | :info:build (ix86_schedule)) == ( |
|---|
| 452 | :info:build ^ |
|---|
| 453 | :info:build /opt/local/var/macports/build/_opt_local_var_macports_sources_rsync.macports.org_macports_release_tarballs_ports_lang_gcc49/gcc49/work/gcc-4.9.4/gcc/config/i386/i386.md:374:18: note: use '=' to turn this equality comparison into an assignment |
|---|
| 454 | :info:build (ix86_schedule)) == ( |
|---|
| 455 | :info:build ^~ |
|---|
| 456 | :info:build = |
|---|
| 457 | :info:build /opt/local/var/macports/build/_opt_local_var_macports_sources_rsync.macports.org_macports_release_tarballs_ports_lang_gcc49/gcc49/work/gcc-4.9.4/gcc/config/i386/i386.md:374:18: warning: equality comparison with extraneous parentheses [-Wparentheses-equality] |
|---|
| 458 | :info:build (ix86_schedule)) == ( |
|---|
| 459 | :info:build ~~~~~~~~~~~~~~~~~^~~~ |
|---|
| 460 | :info:build /opt/local/var/macports/build/_opt_local_var_macports_sources_rsync.macports.org_macports_release_tarballs_ports_lang_gcc49/gcc49/work/gcc-4.9.4/gcc/config/i386/i386.md:374:18: note: remove extraneous parentheses around the comparison to silence this warning |
|---|
| 461 | :info:build (ix86_schedule)) == ( |
|---|
| 462 | :info:build ^ |
|---|
| 463 | :info:build /opt/local/var/macports/build/_opt_local_var_macports_sources_rsync.macports.org_macports_release_tarballs_ports_lang_gcc49/gcc49/work/gcc-4.9.4/gcc/config/i386/i386.md:374:18: note: use '=' to turn this equality comparison into an assignment |
|---|
| 464 | :info:build (ix86_schedule)) == ( |
|---|
| 465 | :info:build ^~ |
|---|
| 466 | :info:build = |
|---|
| 467 | :info:build /opt/local/var/macports/build/_opt_local_var_macports_sources_rsync.macports.org_macports_release_tarballs_ports_lang_gcc49/gcc49/work/gcc-4.9.4/gcc/config/i386/i386.md:374:18: warning: equality comparison with extraneous parentheses [-Wparentheses-equality] |
|---|
| 468 | :info:build (ix86_schedule)) == ( |
|---|
| 469 | :info:build ~~~~~~~~~~~~~~~~~^~~~ |
|---|
| 470 | :info:build /opt/local/var/macports/build/_opt_local_var_macports_sources_rsync.macports.org_macports_release_tarballs_ports_lang_gcc49/gcc49/work/gcc-4.9.4/gcc/config/i386/i386.md:374:18: note: remove extraneous parentheses around the comparison to silence this warning |
|---|
| 471 | :info:build (ix86_schedule)) == ( |
|---|
| 472 | :info:build ^ |
|---|
| 473 | :info:build /opt/local/var/macports/build/_opt_local_var_macports_sources_rsync.macports.org_macports_release_tarballs_ports_lang_gcc49/gcc49/work/gcc-4.9.4/gcc/config/i386/i386.md:374:18: note: use '=' to turn this equality comparison into an assignment |
|---|
| 474 | :info:build (ix86_schedule)) == ( |
|---|
| 475 | :info:build ^~ |
|---|
| 476 | :info:build = |
|---|
| 477 | :info:build /opt/local/var/macports/build/_opt_local_var_macports_sources_rsync.macports.org_macports_release_tarballs_ports_lang_gcc49/gcc49/work/gcc-4.9.4/gcc/config/i386/i386.md:374:18: warning: equality comparison with extraneous parentheses [-Wparentheses-equality] |
|---|
| 478 | :info:build (ix86_schedule)) == ( |
|---|
| 479 | :info:build ~~~~~~~~~~~~~~~~~^~~~ |
|---|
| 480 | :info:build /opt/local/var/macports/build/_opt_local_var_macports_sources_rsync.macports.org_macports_release_tarballs_ports_lang_gcc49/gcc49/work/gcc-4.9.4/gcc/config/i386/i386.md:374:18: note: remove extraneous parentheses around the comparison to silence this warning |
|---|
| 481 | :info:build (ix86_schedule)) == ( |
|---|
| 482 | :info:build ^ |
|---|
| 483 | :info:build /opt/local/var/macports/build/_opt_local_var_macports_sources_rsync.macports.org_macports_release_tarballs_ports_lang_gcc49/gcc49/work/gcc-4.9.4/gcc/config/i386/i386.md:374:18: note: use '=' to turn this equality comparison into an assignment |
|---|
| 484 | :info:build (ix86_schedule)) == ( |
|---|
| 485 | :info:build ^~ |
|---|
| 486 | :info:build = |
|---|
| 487 | :info:build /opt/local/var/macports/build/_opt_local_var_macports_sources_rsync.macports.org_macports_release_tarballs_ports_lang_gcc49/gcc49/work/gcc-4.9.4/gcc/config/i386/i386.md:374:18: warning: equality comparison with extraneous parentheses [-Wparentheses-equality] |
|---|
| 488 | :info:build (ix86_schedule)) == ( |
|---|
| 489 | :info:build ~~~~~~~~~~~~~~~~~^~~~ |
|---|
| 490 | :info:build /opt/local/var/macports/build/_opt_local_var_macports_sources_rsync.macports.org_macports_release_tarballs_ports_lang_gcc49/gcc49/work/gcc-4.9.4/gcc/config/i386/i386.md:374:18: note: remove extraneous parentheses around the comparison to silence this warning |
|---|
| 491 | :info:build (ix86_schedule)) == ( |
|---|
| 492 | :info:build ^ |
|---|
| 493 | :info:build /opt/local/var/macports/build/_opt_local_var_macports_sources_rsync.macports.org_macports_release_tarballs_ports_lang_gcc49/gcc49/work/gcc-4.9.4/gcc/config/i386/i386.md:374:18: note: use '=' to turn this equality comparison into an assignment |
|---|
| 494 | :info:build (ix86_schedule)) == ( |
|---|
| 495 | :info:build ^~ |
|---|
| 496 | :info:build = |
|---|
| 497 | :info:build /opt/local/var/macports/build/_opt_local_var_macports_sources_rsync.macports.org_macports_release_tarballs_ports_lang_gcc49/gcc49/work/gcc-4.9.4/gcc/config/i386/i386.md:374:18: warning: equality comparison with extraneous parentheses [-Wparentheses-equality] |
|---|
| 498 | :info:build (ix86_schedule)) == ( |
|---|
| 499 | :info:build ~~~~~~~~~~~~~~~~~^~~~ |
|---|
| 500 | :info:build /opt/local/var/macports/build/_opt_local_var_macports_sources_rsync.macports.org_macports_release_tarballs_ports_lang_gcc49/gcc49/work/gcc-4.9.4/gcc/config/i386/i386.md:374:18: note: remove extraneous parentheses around the comparison to silence this warning |
|---|
| 501 | :info:build (ix86_schedule)) == ( |
|---|
| 502 | :info:build ^ |
|---|
| 503 | :info:build /opt/local/var/macports/build/_opt_local_var_macports_sources_rsync.macports.org_macports_release_tarballs_ports_lang_gcc49/gcc49/work/gcc-4.9.4/gcc/config/i386/i386.md:374:18: note: use '=' to turn this equality comparison into an assignment |
|---|
| 504 | :info:build (ix86_schedule)) == ( |
|---|
| 505 | :info:build ^~ |
|---|
| 506 | :info:build = |
|---|
| 507 | :info:build 11 warnings generated. |
|---|
| 508 | :info:build /opt/local/var/macports/build/_opt_local_var_macports_sources_rsync.macports.org_macports_release_tarballs_ports_lang_gcc49/gcc49/work/gcc-4.9.4/gcc/config/i386/i386.md:374:18: warning: equality comparison with extraneous parentheses [-Wparentheses-equality] |
|---|
| 509 | :info:build (ix86_schedule)) == ( |
|---|
| 510 | :info:build ~~~~~~~~~~~~~~~~~^~~~ |
|---|
| 511 | :info:build /opt/local/var/macports/build/_opt_local_var_macports_sources_rsync.macports.org_macports_release_tarballs_ports_lang_gcc49/gcc49/work/gcc-4.9.4/gcc/config/i386/i386.md:374:18: note: remove extraneous parentheses around the comparison to silence this warning |
|---|
| 512 | :info:build (ix86_schedule)) == ( |
|---|
| 513 | :info:build ^ |
|---|
| 514 | :info:build /opt/local/var/macports/build/_opt_local_var_macports_sources_rsync.macports.org_macports_release_tarballs_ports_lang_gcc49/gcc49/work/gcc-4.9.4/gcc/config/i386/i386.md:374:18: note: use '=' to turn this equality comparison into an assignment |
|---|
| 515 | :info:build (ix86_schedule)) == ( |
|---|
| 516 | :info:build ^~ |
|---|
| 517 | :info:build = |
|---|
| 518 | :info:build /opt/local/var/macports/build/_opt_local_var_macports_sources_rsync.macports.org_macports_release_tarballs_ports_lang_gcc49/gcc49/work/gcc-4.9.4/gcc/config/i386/i386.md:374:18: warning: equality comparison with extraneous parentheses [-Wparentheses-equality] |
|---|
| 519 | :info:build (ix86_schedule)) == ( |
|---|
| 520 | :info:build ~~~~~~~~~~~~~~~~~^~~~ |
|---|
| 521 | :info:build /opt/local/var/macports/build/_opt_local_var_macports_sources_rsync.macports.org_macports_release_tarballs_ports_lang_gcc49/gcc49/work/gcc-4.9.4/gcc/config/i386/i386.md:374:18: note: remove extraneous parentheses around the comparison to silence this warning |
|---|
| 522 | :info:build (ix86_schedule)) == ( |
|---|
| 523 | :info:build ^ |
|---|
| 524 | :info:build /opt/local/var/macports/build/_opt_local_var_macports_sources_rsync.macports.org_macports_release_tarballs_ports_lang_gcc49/gcc49/work/gcc-4.9.4/gcc/config/i386/i386.md:374:18: note: use '=' to turn this equality comparison into an assignment |
|---|
| 525 | :info:build (ix86_schedule)) == ( |
|---|
| 526 | :info:build ^~ |
|---|
| 527 | :info:build = |
|---|
| 528 | :info:build 13 warnings generated. |
|---|
| 529 | :info:build /opt/local/var/macports/build/_opt_local_var_macports_sources_rsync.macports.org_macports_release_tarballs_ports_lang_gcc49/gcc49/work/gcc-4.9.4/gcc/config/i386/i386.md:374:18: warning: equality comparison with extraneous parentheses [-Wparentheses-equality] |
|---|
| 530 | :info:build (ix86_schedule)) == ( |
|---|
| 531 | :info:build ~~~~~~~~~~~~~~~~~^~~~ |
|---|
| 532 | :info:build /opt/local/var/macports/build/_opt_local_var_macports_sources_rsync.macports.org_macports_release_tarballs_ports_lang_gcc49/gcc49/work/gcc-4.9.4/gcc/config/i386/i386.md:374:18: note: remove extraneous parentheses around the comparison to silence this warning |
|---|
| 533 | :info:build (ix86_schedule)) == ( |
|---|
| 534 | :info:build ^ |
|---|
| 535 | :info:build /opt/local/var/macports/build/_opt_local_var_macports_sources_rsync.macports.org_macports_release_tarballs_ports_lang_gcc49/gcc49/work/gcc-4.9.4/gcc/config/i386/i386.md:374:18: note: use '=' to turn this equality comparison into an assignment |
|---|
| 536 | :info:build (ix86_schedule)) == ( |
|---|
| 537 | :info:build ^~ |
|---|
| 538 | :info:build = |
|---|
| 539 | :info:build /opt/local/var/macports/build/_opt_local_var_macports_sources_rsync.macports.org_macports_release_tarballs_ports_lang_gcc49/gcc49/work/gcc-4.9.4/gcc/config/i386/i386.md:374:18: warning: equality comparison with extraneous parentheses [-Wparentheses-equality] |
|---|
| 540 | :info:build (ix86_schedule)) == ( |
|---|
| 541 | :info:build ~~~~~~~~~~~~~~~~~^~~~ |
|---|
| 542 | :info:build /opt/local/var/macports/build/_opt_local_var_macports_sources_rsync.macports.org_macports_release_tarballs_ports_lang_gcc49/gcc49/work/gcc-4.9.4/gcc/config/i386/i386.md:374:18: note: remove extraneous parentheses around the comparison to silence this warning |
|---|
| 543 | :info:build (ix86_schedule)) == ( |
|---|
| 544 | :info:build ^ |
|---|
| 545 | :info:build /opt/local/var/macports/build/_opt_local_var_macports_sources_rsync.macports.org_macports_release_tarballs_ports_lang_gcc49/gcc49/work/gcc-4.9.4/gcc/config/i386/i386.md:374:18: note: use '=' to turn this equality comparison into an assignment |
|---|
| 546 | :info:build (ix86_schedule)) == ( |
|---|
| 547 | :info:build ^~ |
|---|
| 548 | :info:build = |
|---|
| 549 | :info:build /opt/local/var/macports/build/_opt_local_var_macports_sources_rsync.macports.org_macports_release_tarballs_ports_lang_gcc49/gcc49/work/gcc-4.9.4/gcc/config/i386/i386.md:374:18: warning: equality comparison with extraneous parentheses [-Wparentheses-equality] |
|---|
| 550 | :info:build (ix86_schedule)) == ( |
|---|
| 551 | :info:build ~~~~~~~~~~~~~~~~~^~~~ |
|---|
| 552 | :info:build /opt/local/var/macports/build/_opt_local_var_macports_sources_rsync.macports.org_macports_release_tarballs_ports_lang_gcc49/gcc49/work/gcc-4.9.4/gcc/config/i386/i386.md:374:18: note: remove extraneous parentheses around the comparison to silence this warning |
|---|
| 553 | :info:build (ix86_schedule)) == ( |
|---|
| 554 | :info:build ^ |
|---|
| 555 | :info:build /opt/local/var/macports/build/_opt_local_var_macports_sources_rsync.macports.org_macports_release_tarballs_ports_lang_gcc49/gcc49/work/gcc-4.9.4/gcc/config/i386/i386.md:374:18: note: use '=' to turn this equality comparison into an assignment |
|---|
| 556 | :info:build (ix86_schedule)) == ( |
|---|
| 557 | :info:build ^~ |
|---|
| 558 | :info:build = |
|---|
| 559 | :info:build /opt/local/var/macports/build/_opt_local_var_macports_sources_rsync.macports.org_macports_release_tarballs_ports_lang_gcc49/gcc49/work/gcc-4.9.4/gcc/config/i386/i386.md:374:18: warning: equality comparison with extraneous parentheses [-Wparentheses-equality] |
|---|
| 560 | :info:build (ix86_schedule)) == ( |
|---|
| 561 | :info:build ~~~~~~~~~~~~~~~~~^~~~ |
|---|
| 562 | :info:build /opt/local/var/macports/build/_opt_local_var_macports_sources_rsync.macports.org_macports_release_tarballs_ports_lang_gcc49/gcc49/work/gcc-4.9.4/gcc/config/i386/i386.md:374:18: note: remove extraneous parentheses around the comparison to silence this warning |
|---|
| 563 | :info:build (ix86_schedule)) == ( |
|---|
| 564 | :info:build ^ |
|---|
| 565 | :info:build /opt/local/var/macports/build/_opt_local_var_macports_sources_rsync.macports.org_macports_release_tarballs_ports_lang_gcc49/gcc49/work/gcc-4.9.4/gcc/config/i386/i386.md:374:18: note: use '=' to turn this equality comparison into an assignment |
|---|
| 566 | :info:build (ix86_schedule)) == ( |
|---|
| 567 | :info:build ^~ |
|---|
| 568 | :info:build = |
|---|
| 569 | :info:build /opt/local/var/macports/build/_opt_local_var_macports_sources_rsync.macports.org_macports_release_tarballs_ports_lang_gcc49/gcc49/work/gcc-4.9.4/gcc/config/i386/i386.md:374:18: warning: equality comparison with extraneous parentheses [-Wparentheses-equality] |
|---|
| 570 | :info:build (ix86_schedule)) == ( |
|---|
| 571 | :info:build ~~~~~~~~~~~~~~~~~^~~~ |
|---|
| 572 | :info:build /opt/local/var/macports/build/_opt_local_var_macports_sources_rsync.macports.org_macports_release_tarballs_ports_lang_gcc49/gcc49/work/gcc-4.9.4/gcc/config/i386/i386.md:374:18: note: remove extraneous parentheses around the comparison to silence this warning |
|---|
| 573 | :info:build (ix86_schedule)) == ( |
|---|
| 574 | :info:build ^ |
|---|
| 575 | :info:build /opt/local/var/macports/build/_opt_local_var_macports_sources_rsync.macports.org_macports_release_tarballs_ports_lang_gcc49/gcc49/work/gcc-4.9.4/gcc/config/i386/i386.md:374:18: note: use '=' to turn this equality comparison into an assignment |
|---|
| 576 | :info:build (ix86_schedule)) == ( |
|---|
| 577 | :info:build ^~ |
|---|
| 578 | :info:build = |
|---|
| 579 | :info:build /opt/local/var/macports/build/_opt_local_var_macports_sources_rsync.macports.org_macports_release_tarballs_ports_lang_gcc49/gcc49/work/gcc-4.9.4/gcc/config/i386/i386.md:374:18: warning: equality comparison with extraneous parentheses [-Wparentheses-equality] |
|---|
| 580 | :info:build (ix86_schedule)) == ( |
|---|
| 581 | :info:build ~~~~~~~~~~~~~~~~~^~~~ |
|---|
| 582 | :info:build /opt/local/var/macports/build/_opt_local_var_macports_sources_rsync.macports.org_macports_release_tarballs_ports_lang_gcc49/gcc49/work/gcc-4.9.4/gcc/config/i386/i386.md:374:18: note: remove extraneous parentheses around the comparison to silence this warning |
|---|
| 583 | :info:build (ix86_schedule)) == ( |
|---|
| 584 | :info:build ^ |
|---|
| 585 | :info:build /opt/local/var/macports/build/_opt_local_var_macports_sources_rsync.macports.org_macports_release_tarballs_ports_lang_gcc49/gcc49/work/gcc-4.9.4/gcc/config/i386/i386.md:374:18: note: use '=' to turn this equality comparison into an assignment |
|---|
| 586 | :info:build (ix86_schedule)) == ( |
|---|
| 587 | :info:build ^~ |
|---|
| 588 | :info:build = |
|---|
| 589 | :info:build /opt/local/var/macports/build/_opt_local_var_macports_sources_rsync.macports.org_macports_release_tarballs_ports_lang_gcc49/gcc49/work/gcc-4.9.4/gcc/config/i386/i386.md:374:18: warning: equality comparison with extraneous parentheses [-Wparentheses-equality] |
|---|
| 590 | :info:build (ix86_schedule)) == ( |
|---|
| 591 | :info:build ~~~~~~~~~~~~~~~~~^~~~ |
|---|
| 592 | :info:build /opt/local/var/macports/build/_opt_local_var_macports_sources_rsync.macports.org_macports_release_tarballs_ports_lang_gcc49/gcc49/work/gcc-4.9.4/gcc/config/i386/i386.md:374:18: note: remove extraneous parentheses around the comparison to silence this warning |
|---|
| 593 | :info:build (ix86_schedule)) == ( |
|---|
| 594 | :info:build ^ |
|---|
| 595 | :info:build /opt/local/var/macports/build/_opt_local_var_macports_sources_rsync.macports.org_macports_release_tarballs_ports_lang_gcc49/gcc49/work/gcc-4.9.4/gcc/config/i386/i386.md:374:18: note: use '=' to turn this equality comparison into an assignment |
|---|
| 596 | :info:build (ix86_schedule)) == ( |
|---|
| 597 | :info:build ^~ |
|---|
| 598 | :info:build = |
|---|
| 599 | :info:build /opt/local/var/macports/build/_opt_local_var_macports_sources_rsync.macports.org_macports_release_tarballs_ports_lang_gcc49/gcc49/work/gcc-4.9.4/gcc/config/i386/i386.md:555:51: warning: self-comparison always evaluates to true [-Wtautological-compare] |
|---|
| 600 | :info:build if ((which_alternative == 0) && ((V8HImode) == (V8HImode))) |
|---|
| 601 | :info:build ^ |
|---|
| 602 | :info:build /opt/local/var/macports/build/_opt_local_var_macports_sources_rsync.macports.org_macports_release_tarballs_ports_lang_gcc49/gcc49/work/gcc-4.9.4/gcc/config/i386/i386.md:617:31: warning: self-comparison always evaluates to true [-Wtautological-compare] |
|---|
| 603 | :info:build (TARGET_AVX))) && ((V8HImode) == (V8HImode))) |
|---|
| 604 | :info:build ^ |
|---|
| 605 | :info:build /opt/local/var/macports/build/_opt_local_var_macports_sources_rsync.macports.org_macports_release_tarballs_ports_lang_gcc49/gcc49/work/gcc-4.9.4/gcc/config/i386/mmx.md:188:11: warning: self-comparison always evaluates to true [-Wtautological-compare] |
|---|
| 606 | :info:build (V2SFmode == V2SFmode)) |
|---|
| 607 | :info:build ^ |
|---|
| 608 | :info:build /opt/local/var/macports/build/_opt_local_var_macports_sources_rsync.macports.org_macports_release_tarballs_ports_lang_gcc49/gcc49/work/gcc-4.9.4/gcc/config/i386/mmx.md:188:11: warning: self-comparison always evaluates to true [-Wtautological-compare] |
|---|
| 609 | :info:build (V2SFmode == V2SFmode)) || (! ( |
|---|
| 610 | :info:build ^ |
|---|
| 611 | :info:build /opt/local/var/macports/build/_opt_local_var_macports_sources_rsync.macports.org_macports_release_tarballs_ports_lang_gcc49/gcc49/work/gcc-4.9.4/gcc/config/i386/i386.md:4427:51: warning: self-comparison always evaluates to true [-Wtautological-compare] |
|---|
| 612 | :info:build if ((which_alternative == 0) && ((V8HImode) == (V8HImode))) |
|---|
| 613 | :info:build ^ |
|---|
| 614 | :info:build /opt/local/var/macports/build/_opt_local_var_macports_sources_rsync.macports.org_macports_release_tarballs_ports_lang_gcc49/gcc49/work/gcc-4.9.4/gcc/config/i386/i386.md:617:31: warning: self-comparison always evaluates to true [-Wtautological-compare] |
|---|
| 615 | :info:build (TARGET_AVX))) && ((V8HImode) == (V8HImode))) |
|---|
| 616 | :info:build ^ |
|---|
| 617 | :info:build /opt/local/var/macports/build/_opt_local_var_macports_sources_rsync.macports.org_macports_release_tarballs_ports_lang_gcc49/gcc49/work/gcc-4.9.4/gcc/config/i386/i386.md:617:31: warning: self-comparison always evaluates to true [-Wtautological-compare] |
|---|
| 618 | :info:build (TARGET_AVX))) && ((V2DImode) == (V2DImode))) |
|---|
| 619 | :info:build ^ |
|---|
| 620 | :info:build /opt/local/var/macports/build/_opt_local_var_macports_sources_rsync.macports.org_macports_release_tarballs_ports_lang_gcc49/gcc49/work/gcc-4.9.4/gcc/config/i386/i386.md:16057:9: warning: self-comparison always evaluates to true [-Wtautological-compare] |
|---|
| 621 | :info:build (DImode == DImode)) |
|---|
| 622 | :info:build ^ |
|---|
| 623 | :info:build /opt/local/var/macports/build/_opt_local_var_macports_sources_rsync.macports.org_macports_release_tarballs_ports_lang_gcc49/gcc49/work/gcc-4.9.4/gcc/config/i386/i386.md:16057:9: warning: self-comparison always evaluates to true [-Wtautological-compare] |
|---|
| 624 | :info:build (DImode == DImode))) |
|---|
| 625 | :info:build ^ |
|---|
| 626 | :info:build /opt/local/var/macports/build/_opt_local_var_macports_sources_rsync.macports.org_macports_release_tarballs_ports_lang_gcc49/gcc49/work/gcc-4.9.4/gcc/config/i386/i386.md:16057:9: warning: self-comparison always evaluates to true [-Wtautological-compare] |
|---|
| 627 | :info:build (DImode == DImode)) |
|---|
| 628 | :info:build ^ |
|---|
| 629 | :info:build 41 warnings generated. |
|---|
| 630 | :info:build make[3]: Leaving directory `/opt/local/var/macports/build/_opt_local_var_macports_sources_rsync.macports.org_macports_release_tarballs_ports_lang_gcc49/gcc49/work/build/gcc' |
|---|
| 631 | :info:build make[2]: *** [all-stage1-gcc] Error 2 |
|---|
| 632 | :info:build make[2]: Leaving directory `/opt/local/var/macports/build/_opt_local_var_macports_sources_rsync.macports.org_macports_release_tarballs_ports_lang_gcc49/gcc49/work/build' |
|---|
| 633 | :info:build make[1]: *** [stage1-bubble] Error 2 |
|---|
| 634 | :info:build make[1]: Leaving directory `/opt/local/var/macports/build/_opt_local_var_macports_sources_rsync.macports.org_macports_release_tarballs_ports_lang_gcc49/gcc49/work/build' |
|---|
| 635 | :info:build make: *** [bootstrap-lean] Error 2 |
|---|
| 636 | :info:build make: Leaving directory `/opt/local/var/macports/build/_opt_local_var_macports_sources_rsync.macports.org_macports_release_tarballs_ports_lang_gcc49/gcc49/work/build' |
|---|
| 637 | :info:build Command failed: cd "/opt/local/var/macports/build/_opt_local_var_macports_sources_rsync.macports.org_macports_release_tarballs_ports_lang_gcc49/gcc49/work/build" && /usr/bin/make -j4 -w bootstrap-lean |
|---|
| 638 | :info:build Exit code: 2 |
|---|
| 639 | :error:build Failed to build gcc49: command execution failed |
|---|
| 640 | :debug:build Error code: CHILDSTATUS 50127 2 |
|---|
| 641 | :debug:build Backtrace: command execution failed |
|---|
| 642 | :debug:build while executing |
|---|
| 643 | :debug:build "system {*}$notty {*}$nice $fullcmdstring" |
|---|
| 644 | :debug:build invoked from within |
|---|
| 645 | :debug:build "command_exec build" |
|---|
| 646 | :debug:build (procedure "portbuild::build_main" line 8) |
|---|
| 647 | :debug:build invoked from within |
|---|
| 648 | :debug:build "$procedure $targetname" |
|---|
| 649 | :error:build See /opt/local/var/macports/logs/_opt_local_var_macports_sources_rsync.macports.org_macports_release_tarballs_ports_lang_gcc49/gcc49/main.log for details. |
|---|
| 650 | version:1 |
|---|
| 651 | :debug:sysinfo macOS 10.13 (darwin/17.7.0) arch i386 |
|---|
| 652 | :debug:sysinfo MacPorts 2.5.4 |
|---|
| 653 | :debug:sysinfo Xcode 10.1 |
|---|
| 654 | :debug:sysinfo SDK 10.13 |
|---|
| 655 | :debug:sysinfo MACOSX_DEPLOYMENT_TARGET: 10.13 |
|---|
| 656 | :debug:main gcc49 has no conflicts |
|---|
| 657 | :debug:main Executing org.macports.main (gcc49) |
|---|
| 658 | :debug:main dropping privileges: euid changed to 502, egid changed to 501. |
|---|
| 659 | :debug:main Skipping completed org.macports.archivefetch (gcc49) |
|---|
| 660 | :debug:main Privilege de-escalation not attempted as not running as root. |
|---|
| 661 | :debug:main Skipping completed org.macports.fetch (gcc49) |
|---|
| 662 | :debug:main Privilege de-escalation not attempted as not running as root. |
|---|
| 663 | :debug:main Skipping completed org.macports.checksum (gcc49) |
|---|
| 664 | :debug:main Privilege de-escalation not attempted as not running as root. |
|---|
| 665 | :debug:main Skipping completed org.macports.extract (gcc49) |
|---|
| 666 | :debug:main Privilege de-escalation not attempted as not running as root. |
|---|
| 667 | :debug:main Skipping completed org.macports.patch (gcc49) |
|---|
| 668 | :debug:main Privilege de-escalation not attempted as not running as root. |
|---|
| 669 | :debug:main Skipping completed org.macports.configure (gcc49) |
|---|
| 670 | :debug:main Privilege de-escalation not attempted as not running as root. |
|---|
| 671 | :debug:build build phase started at Wed Oct 31 14:09:51 CST 2018 |
|---|
| 672 | :notice:build ---> Building gcc49 |
|---|
| 673 | :debug:build Executing org.macports.build (gcc49) |
|---|
| 674 | :debug:build Environment: |
|---|
| 675 | :debug:build CC_PRINT_OPTIONS='YES' |
|---|
| 676 | :debug:build CC_PRINT_OPTIONS_FILE='/opt/local/var/macports/build/_opt_local_var_macports_sources_rsync.macports.org_macports_release_tarballs_ports_lang_gcc49/gcc49/work/.CC_PRINT_OPTIONS' |
|---|
| 677 | :debug:build CPATH='/opt/local/include' |
|---|
| 678 | :debug:build CPP='/usr/bin/clang -E' |
|---|
| 679 | :debug:build CXXCPP='/usr/bin/clang++ -E' |
|---|
| 680 | :debug:build LIBRARY_PATH='/opt/local/lib' |
|---|
| 681 | :debug:build MACOSX_DEPLOYMENT_TARGET='10.13' |
|---|
| 682 | :info:build Executing: cd "/opt/local/var/macports/build/_opt_local_var_macports_sources_rsync.macports.org_macports_release_tarballs_ports_lang_gcc49/gcc49/work/build" && /usr/bin/make -j4 -w bootstrap-lean |
|---|
| 683 | :debug:build system: cd "/opt/local/var/macports/build/_opt_local_var_macports_sources_rsync.macports.org_macports_release_tarballs_ports_lang_gcc49/gcc49/work/build" && /usr/bin/make -j4 -w bootstrap-lean |
|---|
| 684 | :info:build make: Entering directory `/opt/local/var/macports/build/_opt_local_var_macports_sources_rsync.macports.org_macports_release_tarballs_ports_lang_gcc49/gcc49/work/build' |
|---|
| 685 | :info:build echo stage3 > stage_final |
|---|
| 686 | :info:build make[1]: Entering directory `/opt/local/var/macports/build/_opt_local_var_macports_sources_rsync.macports.org_macports_release_tarballs_ports_lang_gcc49/gcc49/work/build' |
|---|
| 687 | :info:build make[2]: Entering directory `/opt/local/var/macports/build/_opt_local_var_macports_sources_rsync.macports.org_macports_release_tarballs_ports_lang_gcc49/gcc49/work/build' |
|---|
| 688 | :info:build make[3]: Entering directory `/opt/local/var/macports/build/_opt_local_var_macports_sources_rsync.macports.org_macports_release_tarballs_ports_lang_gcc49/gcc49/work/build' |
|---|
| 689 | :info:build rm -f stage_current |
|---|
| 690 | :info:build make[3]: Leaving directory `/opt/local/var/macports/build/_opt_local_var_macports_sources_rsync.macports.org_macports_release_tarballs_ports_lang_gcc49/gcc49/work/build' |
|---|
| 691 | :info:build make[2]: Leaving directory `/opt/local/var/macports/build/_opt_local_var_macports_sources_rsync.macports.org_macports_release_tarballs_ports_lang_gcc49/gcc49/work/build' |
|---|
| 692 | :info:build make[2]: Entering directory `/opt/local/var/macports/build/_opt_local_var_macports_sources_rsync.macports.org_macports_release_tarballs_ports_lang_gcc49/gcc49/work/build' |
|---|
| 693 | :info:build make[3]: Entering directory `/opt/local/var/macports/build/_opt_local_var_macports_sources_rsync.macports.org_macports_release_tarballs_ports_lang_gcc49/gcc49/work/build/build-x86_64-apple-darwin17/libiberty' |
|---|
| 694 | :info:build make[4]: Entering directory `/opt/local/var/macports/build/_opt_local_var_macports_sources_rsync.macports.org_macports_release_tarballs_ports_lang_gcc49/gcc49/work/build/build-x86_64-apple-darwin17/libiberty/testsuite' |
|---|
| 695 | :info:build make[4]: Nothing to be done for `all'. |
|---|
| 696 | :info:build make[4]: Leaving directory `/opt/local/var/macports/build/_opt_local_var_macports_sources_rsync.macports.org_macports_release_tarballs_ports_lang_gcc49/gcc49/work/build/build-x86_64-apple-darwin17/libiberty/testsuite' |
|---|
| 697 | :info:build make[3]: Leaving directory `/opt/local/var/macports/build/_opt_local_var_macports_sources_rsync.macports.org_macports_release_tarballs_ports_lang_gcc49/gcc49/work/build/build-x86_64-apple-darwin17/libiberty' |
|---|
| 698 | :info:build make[3]: Entering directory `/opt/local/var/macports/build/_opt_local_var_macports_sources_rsync.macports.org_macports_release_tarballs_ports_lang_gcc49/gcc49/work/build/intl' |
|---|
| 699 | :info:build make[3]: Nothing to be done for `all'. |
|---|
| 700 | :info:build make[3]: Leaving directory `/opt/local/var/macports/build/_opt_local_var_macports_sources_rsync.macports.org_macports_release_tarballs_ports_lang_gcc49/gcc49/work/build/intl' |
|---|
| 701 | :info:build make[3]: Entering directory `/opt/local/var/macports/build/_opt_local_var_macports_sources_rsync.macports.org_macports_release_tarballs_ports_lang_gcc49/gcc49/work/build/libbacktrace' |
|---|
| 702 | :info:build /Applications/Xcode.app/Contents/Developer/usr/bin/make all-am |
|---|
| 703 | :info:build make[3]: Entering directory `/opt/local/var/macports/build/_opt_local_var_macports_sources_rsync.macports.org_macports_release_tarballs_ports_lang_gcc49/gcc49/work/build/libdecnumber' |
|---|
| 704 | :info:build make[3]: Nothing to be done for `all'. |
|---|
| 705 | :info:build make[3]: Leaving directory `/opt/local/var/macports/build/_opt_local_var_macports_sources_rsync.macports.org_macports_release_tarballs_ports_lang_gcc49/gcc49/work/build/libdecnumber' |
|---|
| 706 | :info:build make[3]: Entering directory `/opt/local/var/macports/build/_opt_local_var_macports_sources_rsync.macports.org_macports_release_tarballs_ports_lang_gcc49/gcc49/work/build/build-x86_64-apple-darwin17/fixincludes' |
|---|
| 707 | :info:build make[3]: Nothing to be done for `all'. |
|---|
| 708 | :info:build make[3]: Leaving directory `/opt/local/var/macports/build/_opt_local_var_macports_sources_rsync.macports.org_macports_release_tarballs_ports_lang_gcc49/gcc49/work/build/build-x86_64-apple-darwin17/fixincludes' |
|---|
| 709 | :info:build make[4]: Entering directory `/opt/local/var/macports/build/_opt_local_var_macports_sources_rsync.macports.org_macports_release_tarballs_ports_lang_gcc49/gcc49/work/build/libbacktrace' |
|---|
| 710 | :info:build true DO=all multi-do # /Applications/Xcode.app/Contents/Developer/usr/bin/make |
|---|
| 711 | :info:build make[4]: Leaving directory `/opt/local/var/macports/build/_opt_local_var_macports_sources_rsync.macports.org_macports_release_tarballs_ports_lang_gcc49/gcc49/work/build/libbacktrace' |
|---|
| 712 | :info:build make[3]: Leaving directory `/opt/local/var/macports/build/_opt_local_var_macports_sources_rsync.macports.org_macports_release_tarballs_ports_lang_gcc49/gcc49/work/build/libbacktrace' |
|---|
| 713 | :info:build make[3]: Entering directory `/opt/local/var/macports/build/_opt_local_var_macports_sources_rsync.macports.org_macports_release_tarballs_ports_lang_gcc49/gcc49/work/build/libiberty' |
|---|
| 714 | :info:build make[4]: Entering directory `/opt/local/var/macports/build/_opt_local_var_macports_sources_rsync.macports.org_macports_release_tarballs_ports_lang_gcc49/gcc49/work/build/libiberty/testsuite' |
|---|
| 715 | :info:build make[4]: Nothing to be done for `all'. |
|---|
| 716 | :info:build make[4]: Leaving directory `/opt/local/var/macports/build/_opt_local_var_macports_sources_rsync.macports.org_macports_release_tarballs_ports_lang_gcc49/gcc49/work/build/libiberty/testsuite' |
|---|
| 717 | :info:build make[3]: Leaving directory `/opt/local/var/macports/build/_opt_local_var_macports_sources_rsync.macports.org_macports_release_tarballs_ports_lang_gcc49/gcc49/work/build/libiberty' |
|---|
| 718 | :info:build make[3]: Entering directory `/opt/local/var/macports/build/_opt_local_var_macports_sources_rsync.macports.org_macports_release_tarballs_ports_lang_gcc49/gcc49/work/build/libcpp' |
|---|
| 719 | :info:build make[3]: Nothing to be done for `all'. |
|---|
| 720 | :info:build make[3]: Leaving directory `/opt/local/var/macports/build/_opt_local_var_macports_sources_rsync.macports.org_macports_release_tarballs_ports_lang_gcc49/gcc49/work/build/libcpp' |
|---|
| 721 | :info:build make[3]: Entering directory `/opt/local/var/macports/build/_opt_local_var_macports_sources_rsync.macports.org_macports_release_tarballs_ports_lang_gcc49/gcc49/work/build/gcc' |
|---|
| 722 | :info:build /usr/bin/c++ -m64 -c -DIN_GCC_FRONTEND -g -DIN_GCC -fno-exceptions -fno-rtti -fasynchronous-unwind-tables -W -Wall -Wno-narrowing -Wwrite-strings -Wcast-qual -Wno-format -Wmissing-format-attribute -pedantic -Wno-long-long -Wno-variadic-macros -Wno-overlength-strings -fno-common -DHAVE_CONFIG_H -I. -Ic -I/opt/local/var/macports/build/_opt_local_var_macports_sources_rsync.macports.org_macports_release_tarballs_ports_lang_gcc49/gcc49/work/gcc-4.9.4/gcc -I/opt/local/var/macports/build/_opt_local_var_macports_sources_rsync.macports.org_macports_release_tarballs_ports_lang_gcc49/gcc49/work/gcc-4.9.4/gcc/c -I/opt/local/var/macports/build/_opt_local_var_macports_sources_rsync.macports.org_macports_release_tarballs_ports_lang_gcc49/gcc49/work/gcc-4.9.4/gcc/../include -I/opt/local/var/macports/build/_opt_local_var_macports_sources_rsync.macports.org_macports_release_tarballs_ports_lang_gcc49/gcc49/work/gcc-4.9.4/gcc/../libcpp/include -I/opt/local/include -I/opt/local/include -I/opt/local/include -I/opt/local/var/macports/build/_opt_local_var_macports_sources_rsync.macports.org_macports_release_tarballs_ports_lang_gcc49/gcc49/work/gcc-4.9.4/gcc/../libdecnumber -I/opt/local/var/macports/build/_opt_local_var_macports_sources_rsync.macports.org_macports_release_tarballs_ports_lang_gcc49/gcc49/work/gcc-4.9.4/gcc/../libdecnumber/dpd -I../libdecnumber -I/opt/local/var/macports/build/_opt_local_var_macports_sources_rsync.macports.org_macports_release_tarballs_ports_lang_gcc49/gcc49/work/gcc-4.9.4/gcc/../libbacktrace -DCLOOG_INT_GMP -I/opt/local/include -I/opt/local/libexec/isl18/include -I/opt/local/include -o c/c-objc-common.o -MT c/c-objc-common.o -MMD -MP -MF c/.deps/c-objc-common.TPo /opt/local/var/macports/build/_opt_local_var_macports_sources_rsync.macports.org_macports_release_tarballs_ports_lang_gcc49/gcc49/work/gcc-4.9.4/gcc/c/c-objc-common.c |
|---|
| 723 | :info:build /usr/bin/c++ -m64 -c -g -DIN_GCC -fno-exceptions -fno-rtti -fasynchronous-unwind-tables -W -Wall -Wno-narrowing -Wwrite-strings -Wcast-qual -Wno-format -Wmissing-format-attribute -pedantic -Wno-long-long -Wno-variadic-macros -Wno-overlength-strings -fno-common -DHAVE_CONFIG_H -I. -I. -I/opt/local/var/macports/build/_opt_local_var_macports_sources_rsync.macports.org_macports_release_tarballs_ports_lang_gcc49/gcc49/work/gcc-4.9.4/gcc -I/opt/local/var/macports/build/_opt_local_var_macports_sources_rsync.macports.org_macports_release_tarballs_ports_lang_gcc49/gcc49/work/gcc-4.9.4/gcc/. -I/opt/local/var/macports/build/_opt_local_var_macports_sources_rsync.macports.org_macports_release_tarballs_ports_lang_gcc49/gcc49/work/gcc-4.9.4/gcc/../include -I/opt/local/var/macports/build/_opt_local_var_macports_sources_rsync.macports.org_macports_release_tarballs_ports_lang_gcc49/gcc49/work/gcc-4.9.4/gcc/../libcpp/include -I/opt/local/include -I/opt/local/include -I/opt/local/include -I/opt/local/var/macports/build/_opt_local_var_macports_sources_rsync.macports.org_macports_release_tarballs_ports_lang_gcc49/gcc49/work/gcc-4.9.4/gcc/../libdecnumber -I/opt/local/var/macports/build/_opt_local_var_macports_sources_rsync.macports.org_macports_release_tarballs_ports_lang_gcc49/gcc49/work/gcc-4.9.4/gcc/../libdecnumber/dpd -I../libdecnumber -I/opt/local/var/macports/build/_opt_local_var_macports_sources_rsync.macports.org_macports_release_tarballs_ports_lang_gcc49/gcc49/work/gcc-4.9.4/gcc/../libbacktrace -DCLOOG_INT_GMP -I/opt/local/include -I/opt/local/libexec/isl18/include -I/opt/local/include -o insn-automata.o -MT insn-automata.o -MMD -MP -MF ./.deps/insn-automata.TPo insn-automata.c |
|---|
| 724 | :info:build /usr/bin/c++ -m64 -c -g -DIN_GCC -fno-exceptions -fno-rtti -fasynchronous-unwind-tables -W -Wall -Wno-narrowing -Wwrite-strings -Wcast-qual -Wno-format -Wmissing-format-attribute -pedantic -Wno-long-long -Wno-variadic-macros -Wno-overlength-strings -fno-common -DHAVE_CONFIG_H -I. -I. -I/opt/local/var/macports/build/_opt_local_var_macports_sources_rsync.macports.org_macports_release_tarballs_ports_lang_gcc49/gcc49/work/gcc-4.9.4/gcc -I/opt/local/var/macports/build/_opt_local_var_macports_sources_rsync.macports.org_macports_release_tarballs_ports_lang_gcc49/gcc49/work/gcc-4.9.4/gcc/. -I/opt/local/var/macports/build/_opt_local_var_macports_sources_rsync.macports.org_macports_release_tarballs_ports_lang_gcc49/gcc49/work/gcc-4.9.4/gcc/../include -I/opt/local/var/macports/build/_opt_local_var_macports_sources_rsync.macports.org_macports_release_tarballs_ports_lang_gcc49/gcc49/work/gcc-4.9.4/gcc/../libcpp/include -I/opt/local/include -I/opt/local/include -I/opt/local/include -I/opt/local/var/macports/build/_opt_local_var_macports_sources_rsync.macports.org_macports_release_tarballs_ports_lang_gcc49/gcc49/work/gcc-4.9.4/gcc/../libdecnumber -I/opt/local/var/macports/build/_opt_local_var_macports_sources_rsync.macports.org_macports_release_tarballs_ports_lang_gcc49/gcc49/work/gcc-4.9.4/gcc/../libdecnumber/dpd -I../libdecnumber -I/opt/local/var/macports/build/_opt_local_var_macports_sources_rsync.macports.org_macports_release_tarballs_ports_lang_gcc49/gcc49/work/gcc-4.9.4/gcc/../libbacktrace -DCLOOG_INT_GMP -I/opt/local/include -I/opt/local/libexec/isl18/include -I/opt/local/include -o insn-dfatab.o -MT insn-dfatab.o -MMD -MP -MF ./.deps/insn-dfatab.TPo insn-dfatab.c |
|---|
| 725 | :info:build /usr/bin/c++ -m64 -c -g -DIN_GCC -fno-exceptions -fno-rtti -fasynchronous-unwind-tables -W -Wall -Wno-narrowing -Wwrite-strings -Wcast-qual -Wno-format -Wmissing-format-attribute -pedantic -Wno-long-long -Wno-variadic-macros -Wno-overlength-strings -fno-common -DHAVE_CONFIG_H -I. -I. -I/opt/local/var/macports/build/_opt_local_var_macports_sources_rsync.macports.org_macports_release_tarballs_ports_lang_gcc49/gcc49/work/gcc-4.9.4/gcc -I/opt/local/var/macports/build/_opt_local_var_macports_sources_rsync.macports.org_macports_release_tarballs_ports_lang_gcc49/gcc49/work/gcc-4.9.4/gcc/. -I/opt/local/var/macports/build/_opt_local_var_macports_sources_rsync.macports.org_macports_release_tarballs_ports_lang_gcc49/gcc49/work/gcc-4.9.4/gcc/../include -I/opt/local/var/macports/build/_opt_local_var_macports_sources_rsync.macports.org_macports_release_tarballs_ports_lang_gcc49/gcc49/work/gcc-4.9.4/gcc/../libcpp/include -I/opt/local/include -I/opt/local/include -I/opt/local/include -I/opt/local/var/macports/build/_opt_local_var_macports_sources_rsync.macports.org_macports_release_tarballs_ports_lang_gcc49/gcc49/work/gcc-4.9.4/gcc/../libdecnumber -I/opt/local/var/macports/build/_opt_local_var_macports_sources_rsync.macports.org_macports_release_tarballs_ports_lang_gcc49/gcc49/work/gcc-4.9.4/gcc/../libdecnumber/dpd -I../libdecnumber -I/opt/local/var/macports/build/_opt_local_var_macports_sources_rsync.macports.org_macports_release_tarballs_ports_lang_gcc49/gcc49/work/gcc-4.9.4/gcc/../libbacktrace -DCLOOG_INT_GMP -I/opt/local/include -I/opt/local/libexec/isl18/include -I/opt/local/include -o insn-emit.o -MT insn-emit.o -MMD -MP -MF ./.deps/insn-emit.TPo insn-emit.c |
|---|
| 726 | :info:build clang: warning: treating 'c' input as 'c++' when in C++ mode, this behavior is deprecated [-Wdeprecated] |
|---|
| 727 | :info:build clang: warning: treating 'c' input as 'c++' when in C++ mode, this behavior is deprecated [-Wdeprecated] |
|---|
| 728 | :info:build clang: warning: treating 'c' input as 'c++' when in C++ mode, this behavior is deprecated [-Wdeprecated] |
|---|
| 729 | :info:build clang: warning: treating 'c' input as 'c++' when in C++ mode, this behavior is deprecated [-Wdeprecated] |
|---|
| 730 | :info:build In file included from /opt/local/var/macports/build/_opt_local_var_macports_sources_rsync.macports.org_macports_release_tarballs_ports_lang_gcc49/gcc49/work/gcc-4.9.4/gcc/c/c-objc-common.c:33: |
|---|
| 731 | :info:build In file included from /Applications/Xcode.app/Contents/Developer/Toolchains/XcodeDefault.xctoolchain/usr/include/c++/v1/new:91: |
|---|
| 732 | :info:build /Applications/Xcode.app/Contents/Developer/Toolchains/XcodeDefault.xctoolchain/usr/include/c++/v1/exception:180:5: error: no member named 'fancy_abort' in namespace 'std::__1'; did you mean simply 'fancy_abort'? |
|---|
| 733 | :info:build _VSTD::abort(); |
|---|
| 734 | :info:build ^~~~~~~ |
|---|
| 735 | :info:build /Applications/Xcode.app/Contents/Developer/Toolchains/XcodeDefault.xctoolchain/usr/include/c++/v1/__config:447:15: note: expanded from macro '_VSTD' |
|---|
| 736 | :info:build #define _VSTD std::_LIBCPP_NAMESPACE |
|---|
| 737 | :info:build ^ |
|---|
| 738 | :info:build /opt/local/var/macports/build/_opt_local_var_macports_sources_rsync.macports.org_macports_release_tarballs_ports_lang_gcc49/gcc49/work/gcc-4.9.4/gcc/system.h:685:13: note: 'fancy_abort' declared here |
|---|
| 739 | :info:build extern void fancy_abort (const char *, int, const char *) ATTRIBUTE_NORETURN; |
|---|
| 740 | :info:build ^ |
|---|
| 741 | :info:build 1 error generated. |
|---|
| 742 | :info:build In file included from insn-dfatab.c:12: |
|---|
| 743 | :info:build In file included from /opt/local/var/macports/build/_opt_local_var_macports_sources_rsync.macports.org_macports_release_tarballs_ports_lang_gcc49/gcc49/work/gcc-4.9.4/gcc/rtl.h:2350: |
|---|
| 744 | :info:build ./genrtl.h:447:3: warning: array index 1 is past the end of the array (which contains 1 element) [-Warray-bounds] |
|---|
| 745 | :info:build XWINT (rt, 1) = arg1; |
|---|
| 746 | :info:build ^ ~ |
|---|
| 747 | :info:build /opt/local/var/macports/build/_opt_local_var_macports_sources_rsync.macports.org_macports_release_tarballs_ports_lang_gcc49/gcc49/work/gcc-4.9.4/gcc/rtl.h:663:29: note: expanded from macro 'XWINT' |
|---|
| 748 | :info:build #define XWINT(RTX, N) ((RTX)->u.hwint[N]) |
|---|
| 749 | :info:build ^ ~ |
|---|
| 750 | :info:build /opt/local/var/macports/build/_opt_local_var_macports_sources_rsync.macports.org_macports_release_tarballs_ports_lang_gcc49/gcc49/work/gcc-4.9.4/gcc/rtl.h:342:5: note: array 'hwint' declared here |
|---|
| 751 | :info:build HOST_WIDE_INT hwint[1]; |
|---|
| 752 | :info:build ^ |
|---|
| 753 | :info:build /opt/local/var/macports/build/_opt_local_var_macports_sources_rsync.macports.org_macports_release_tarballs_ports_lang_gcc49/gcc49/work/gcc-4.9.4/gcc/hwint.h:61:26: note: expanded from macro 'HOST_WIDE_INT' |
|---|
| 754 | :info:build # define HOST_WIDE_INT long |
|---|
| 755 | :info:build ^ |
|---|
| 756 | :info:build In file included from insn-dfatab.c:12: |
|---|
| 757 | :info:build In file included from /opt/local/var/macports/build/_opt_local_var_macports_sources_rsync.macports.org_macports_release_tarballs_ports_lang_gcc49/gcc49/work/gcc-4.9.4/gcc/rtl.h:2350: |
|---|
| 758 | :info:build ./genrtl.h:448:3: warning: array index 2 is past the end of the array (which contains 1 element) [-Warray-bounds] |
|---|
| 759 | :info:build XWINT (rt, 2) = arg2; |
|---|
| 760 | :info:build ^ ~ |
|---|
| 761 | :info:build /opt/local/var/macports/build/_opt_local_var_macports_sources_rsync.macports.org_macports_release_tarballs_ports_lang_gcc49/gcc49/work/gcc-4.9.4/gcc/rtl.h:663:29: note: expanded from macro 'XWINT' |
|---|
| 762 | :info:build #define XWINT(RTX, N) ((RTX)->u.hwint[N]) |
|---|
| 763 | :info:build ^ ~ |
|---|
| 764 | :info:build /opt/local/var/macports/build/_opt_local_var_macports_sources_rsync.macports.org_macports_release_tarballs_ports_lang_gcc49/gcc49/work/gcc-4.9.4/gcc/rtl.h:342:5: note: array 'hwint' declared here |
|---|
| 765 | :info:build HOST_WIDE_INT hwint[1]; |
|---|
| 766 | :info:build ^ |
|---|
| 767 | :info:build /opt/local/var/macports/build/_opt_local_var_macports_sources_rsync.macports.org_macports_release_tarballs_ports_lang_gcc49/gcc49/work/gcc-4.9.4/gcc/hwint.h:61:26: note: expanded from macro 'HOST_WIDE_INT' |
|---|
| 768 | :info:build # define HOST_WIDE_INT long |
|---|
| 769 | :info:build ^ |
|---|
| 770 | :info:build make[3]: *** [c/c-objc-common.o] Error 1 |
|---|
| 771 | :info:build make[3]: *** Waiting for unfinished jobs.... |
|---|
| 772 | :info:build In file included from insn-automata.c:12: |
|---|
| 773 | :info:build In file included from /opt/local/var/macports/build/_opt_local_var_macports_sources_rsync.macports.org_macports_release_tarballs_ports_lang_gcc49/gcc49/work/gcc-4.9.4/gcc/rtl.h:2350: |
|---|
| 774 | :info:build ./genrtl.h:447:3: warning: array index 1 is past the end of the array (which contains 1 element) [-Warray-bounds] |
|---|
| 775 | :info:build XWINT (rt, 1) = arg1; |
|---|
| 776 | :info:build ^ ~ |
|---|
| 777 | :info:build /opt/local/var/macports/build/_opt_local_var_macports_sources_rsync.macports.org_macports_release_tarballs_ports_lang_gcc49/gcc49/work/gcc-4.9.4/gcc/rtl.h:663:29: note: expanded from macro 'XWINT' |
|---|
| 778 | :info:build #define XWINT(RTX, N) ((RTX)->u.hwint[N]) |
|---|
| 779 | :info:build ^ ~ |
|---|
| 780 | :info:build /opt/local/var/macports/build/_opt_local_var_macports_sources_rsync.macports.org_macports_release_tarballs_ports_lang_gcc49/gcc49/work/gcc-4.9.4/gcc/rtl.h:342:5: note: array 'hwint' declared here |
|---|
| 781 | :info:build HOST_WIDE_INT hwint[1]; |
|---|
| 782 | :info:build ^ |
|---|
| 783 | :info:build /opt/local/var/macports/build/_opt_local_var_macports_sources_rsync.macports.org_macports_release_tarballs_ports_lang_gcc49/gcc49/work/gcc-4.9.4/gcc/hwint.h:61:26: note: expanded from macro 'HOST_WIDE_INT' |
|---|
| 784 | :info:build # define HOST_WIDE_INT long |
|---|
| 785 | :info:build ^ |
|---|
| 786 | :info:build In file included from insn-automata.c:12: |
|---|
| 787 | :info:build In file included from /opt/local/var/macports/build/_opt_local_var_macports_sources_rsync.macports.org_macports_release_tarballs_ports_lang_gcc49/gcc49/work/gcc-4.9.4/gcc/rtl.h:2350: |
|---|
| 788 | :info:build ./genrtl.h:448:3: warning: array index 2 is past the end of the array (which contains 1 element) [-Warray-bounds] |
|---|
| 789 | :info:build XWINT (rt, 2) = arg2; |
|---|
| 790 | :info:build ^ ~ |
|---|
| 791 | :info:build /opt/local/var/macports/build/_opt_local_var_macports_sources_rsync.macports.org_macports_release_tarballs_ports_lang_gcc49/gcc49/work/gcc-4.9.4/gcc/rtl.h:663:29: note: expanded from macro 'XWINT' |
|---|
| 792 | :info:build #define XWINT(RTX, N) ((RTX)->u.hwint[N]) |
|---|
| 793 | :info:build ^ ~ |
|---|
| 794 | :info:build /opt/local/var/macports/build/_opt_local_var_macports_sources_rsync.macports.org_macports_release_tarballs_ports_lang_gcc49/gcc49/work/gcc-4.9.4/gcc/rtl.h:342:5: note: array 'hwint' declared here |
|---|
| 795 | :info:build HOST_WIDE_INT hwint[1]; |
|---|
| 796 | :info:build ^ |
|---|
| 797 | :info:build /opt/local/var/macports/build/_opt_local_var_macports_sources_rsync.macports.org_macports_release_tarballs_ports_lang_gcc49/gcc49/work/gcc-4.9.4/gcc/hwint.h:61:26: note: expanded from macro 'HOST_WIDE_INT' |
|---|
| 798 | :info:build # define HOST_WIDE_INT long |
|---|
| 799 | :info:build ^ |
|---|
| 800 | :info:build In file included from insn-emit.c:12: |
|---|
| 801 | :info:build In file included from /opt/local/var/macports/build/_opt_local_var_macports_sources_rsync.macports.org_macports_release_tarballs_ports_lang_gcc49/gcc49/work/gcc-4.9.4/gcc/rtl.h:2350: |
|---|
| 802 | :info:build ./genrtl.h:447:3: warning: array index 1 is past the end of the array (which contains 1 element) [-Warray-bounds] |
|---|
| 803 | :info:build XWINT (rt, 1) = arg1; |
|---|
| 804 | :info:build ^ ~ |
|---|
| 805 | :info:build /opt/local/var/macports/build/_opt_local_var_macports_sources_rsync.macports.org_macports_release_tarballs_ports_lang_gcc49/gcc49/work/gcc-4.9.4/gcc/rtl.h:663:29: note: expanded from macro 'XWINT' |
|---|
| 806 | :info:build #define XWINT(RTX, N) ((RTX)->u.hwint[N]) |
|---|
| 807 | :info:build ^ ~ |
|---|
| 808 | :info:build /opt/local/var/macports/build/_opt_local_var_macports_sources_rsync.macports.org_macports_release_tarballs_ports_lang_gcc49/gcc49/work/gcc-4.9.4/gcc/rtl.h:342:5: note: array 'hwint' declared here |
|---|
| 809 | :info:build HOST_WIDE_INT hwint[1]; |
|---|
| 810 | :info:build ^ |
|---|
| 811 | :info:build /opt/local/var/macports/build/_opt_local_var_macports_sources_rsync.macports.org_macports_release_tarballs_ports_lang_gcc49/gcc49/work/gcc-4.9.4/gcc/hwint.h:61:26: note: expanded from macro 'HOST_WIDE_INT' |
|---|
| 812 | :info:build # define HOST_WIDE_INT long |
|---|
| 813 | :info:build ^ |
|---|
| 814 | :info:build In file included from insn-emit.c:12: |
|---|
| 815 | :info:build In file included from /opt/local/var/macports/build/_opt_local_var_macports_sources_rsync.macports.org_macports_release_tarballs_ports_lang_gcc49/gcc49/work/gcc-4.9.4/gcc/rtl.h:2350: |
|---|
| 816 | :info:build ./genrtl.h:448:3: warning: array index 2 is past the end of the array (which contains 1 element) [-Warray-bounds] |
|---|
| 817 | :info:build XWINT (rt, 2) = arg2; |
|---|
| 818 | :info:build ^ ~ |
|---|
| 819 | :info:build /opt/local/var/macports/build/_opt_local_var_macports_sources_rsync.macports.org_macports_release_tarballs_ports_lang_gcc49/gcc49/work/gcc-4.9.4/gcc/rtl.h:663:29: note: expanded from macro 'XWINT' |
|---|
| 820 | :info:build #define XWINT(RTX, N) ((RTX)->u.hwint[N]) |
|---|
| 821 | :info:build ^ ~ |
|---|
| 822 | :info:build /opt/local/var/macports/build/_opt_local_var_macports_sources_rsync.macports.org_macports_release_tarballs_ports_lang_gcc49/gcc49/work/gcc-4.9.4/gcc/rtl.h:342:5: note: array 'hwint' declared here |
|---|
| 823 | :info:build HOST_WIDE_INT hwint[1]; |
|---|
| 824 | :info:build ^ |
|---|
| 825 | :info:build /opt/local/var/macports/build/_opt_local_var_macports_sources_rsync.macports.org_macports_release_tarballs_ports_lang_gcc49/gcc49/work/gcc-4.9.4/gcc/hwint.h:61:26: note: expanded from macro 'HOST_WIDE_INT' |
|---|
| 826 | :info:build # define HOST_WIDE_INT long |
|---|
| 827 | :info:build ^ |
|---|
| 828 | :info:build In file included from insn-dfatab.c:16: |
|---|
| 829 | :info:build /opt/local/var/macports/build/_opt_local_var_macports_sources_rsync.macports.org_macports_release_tarballs_ports_lang_gcc49/gcc49/work/gcc-4.9.4/gcc/recog.h:338:5: warning: macro expansion producing 'defined' has undefined behavior [-Wexpansion-to-defined] |
|---|
| 830 | :info:build #if HAVE_DESIGNATED_UNION_INITIALIZERS |
|---|
| 831 | :info:build ^ |
|---|
| 832 | :info:build /opt/local/var/macports/build/_opt_local_var_macports_sources_rsync.macports.org_macports_release_tarballs_ports_lang_gcc49/gcc49/work/gcc-4.9.4/gcc/system.h:554:9: note: expanded from macro 'HAVE_DESIGNATED_UNION_INITIALIZERS' |
|---|
| 833 | :info:build && (!defined(__cplusplus) || (GCC_VERSION >= 4007))) |
|---|
| 834 | :info:build ^ |
|---|
| 835 | :info:build In file included from insn-automata.c:15: |
|---|
| 836 | :info:build /opt/local/var/macports/build/_opt_local_var_macports_sources_rsync.macports.org_macports_release_tarballs_ports_lang_gcc49/gcc49/work/gcc-4.9.4/gcc/recog.h:338:5: warning: macro expansion producing 'defined' has undefined behavior [-Wexpansion-to-defined] |
|---|
| 837 | :info:build #if HAVE_DESIGNATED_UNION_INITIALIZERS |
|---|
| 838 | :info:build ^ |
|---|
| 839 | :info:build /opt/local/var/macports/build/_opt_local_var_macports_sources_rsync.macports.org_macports_release_tarballs_ports_lang_gcc49/gcc49/work/gcc-4.9.4/gcc/system.h:554:9: note: expanded from macro 'HAVE_DESIGNATED_UNION_INITIALIZERS' |
|---|
| 840 | :info:build && (!defined(__cplusplus) || (GCC_VERSION >= 4007))) |
|---|
| 841 | :info:build ^ |
|---|
| 842 | :info:build In file included from In file included from insn-dfatab.cinsn-automata.c::19: |
|---|
| 843 | :info:build 17/opt/local/var/macports/build/_opt_local_var_macports_sources_rsync.macports.org_macports_release_tarballs_ports_lang_gcc49/gcc49/work/gcc-4.9.4/gcc/output.h: |
|---|
| 844 | :info:build :/opt/local/var/macports/build/_opt_local_var_macports_sources_rsync.macports.org_macports_release_tarballs_ports_lang_gcc49/gcc49/work/gcc-4.9.4/gcc/output.h:131131::66:: warningwarning: : '__format__' attribute argument not supported: asm_fprintf [-Wignored-attributes]'__format__' attribute argument not supported: asm_fprintf [-Wignored-attributes] |
|---|
| 845 | :info:build ATTRIBUTE_ASM_FPRINTF(2, 3); |
|---|
| 846 | :info:build ^ |
|---|
| 847 | :info:build ATTRIBUTE_ASM_FPRINTF(2, 3); |
|---|
| 848 | :info:build ^ |
|---|
| 849 | :info:build /opt/local/var/macports/build/_opt_local_var_macports_sources_rsync.macports.org_macports_release_tarballs_ports_lang_gcc49/gcc49/work/gcc-4.9.4/gcc/output.h:121/opt/local/var/macports/build/_opt_local_var_macports_sources_rsync.macports.org_macports_release_tarballs_ports_lang_gcc49/gcc49/work/gcc-4.9.4/gcc/output.h::53121:: 53note:: expanded from macro 'ATTRIBUTE_ASM_FPRINTF'note |
|---|
| 850 | :info:build : expanded from macro 'ATTRIBUTE_ASM_FPRINTF' |
|---|
| 851 | :info:build #define ATTRIBUTE_ASM_FPRINTF(m, n) __attribute__ ((__format__ (__asm_fprintf__, m, n))) ATTRIBUTE_NONNULL(m) |
|---|
| 852 | :info:build ^ |
|---|
| 853 | :info:build #define ATTRIBUTE_ASM_FPRINTF(m, n) __attribute__ ((__format__ (__asm_fprintf__, m, n))) ATTRIBUTE_NONNULL(m) |
|---|
| 854 | :info:build ^ |
|---|
| 855 | :info:build In file included from insn-emit.c:19: |
|---|
| 856 | :info:build /opt/local/var/macports/build/_opt_local_var_macports_sources_rsync.macports.org_macports_release_tarballs_ports_lang_gcc49/gcc49/work/gcc-4.9.4/gcc/output.h:131:6: warning: '__format__' attribute argument not supported: asm_fprintf [-Wignored-attributes] |
|---|
| 857 | :info:build ATTRIBUTE_ASM_FPRINTF(2, 3); |
|---|
| 858 | :info:build ^ |
|---|
| 859 | :info:build /opt/local/var/macports/build/_opt_local_var_macports_sources_rsync.macports.org_macports_release_tarballs_ports_lang_gcc49/gcc49/work/gcc-4.9.4/gcc/output.h:121:53: note: expanded from macro 'ATTRIBUTE_ASM_FPRINTF' |
|---|
| 860 | :info:build #define ATTRIBUTE_ASM_FPRINTF(m, n) __attribute__ ((__format__ (__asm_fprintf__, m, n))) ATTRIBUTE_NONNULL(m) |
|---|
| 861 | :info:build ^ |
|---|
| 862 | :info:build In file included from insn-emit.c:22: |
|---|
| 863 | :info:build /opt/local/var/macports/build/_opt_local_var_macports_sources_rsync.macports.org_macports_release_tarballs_ports_lang_gcc49/gcc49/work/gcc-4.9.4/gcc/recog.h:338:5: warning: macro expansion producing 'defined' has undefined behavior [-Wexpansion-to-defined] |
|---|
| 864 | :info:build #if HAVE_DESIGNATED_UNION_INITIALIZERS |
|---|
| 865 | :info:build ^ |
|---|
| 866 | :info:build /opt/local/var/macports/build/_opt_local_var_macports_sources_rsync.macports.org_macports_release_tarballs_ports_lang_gcc49/gcc49/work/gcc-4.9.4/gcc/system.h:554:9: note: expanded from macro 'HAVE_DESIGNATED_UNION_INITIALIZERS' |
|---|
| 867 | :info:build && (!defined(__cplusplus) || (GCC_VERSION >= 4007))) |
|---|
| 868 | :info:build ^ |
|---|
| 869 | :info:build In file included from insn-emit.c:30: |
|---|
| 870 | :info:build In file included from /opt/local/var/macports/build/_opt_local_var_macports_sources_rsync.macports.org_macports_release_tarballs_ports_lang_gcc49/gcc49/work/gcc-4.9.4/gcc/target.h:175: |
|---|
| 871 | :info:build /opt/local/var/macports/build/_opt_local_var_macports_sources_rsync.macports.org_macports_release_tarballs_ports_lang_gcc49/gcc49/work/gcc-4.9.4/gcc/target.def:902:1: warning: empty macro arguments are a C99 feature [-Wc99-extensions] |
|---|
| 872 | :info:build HOOK_VECTOR_END (asm_out) |
|---|
| 873 | :info:build ^ |
|---|
| 874 | :info:build /opt/local/var/macports/build/_opt_local_var_macports_sources_rsync.macports.org_macports_release_tarballs_ports_lang_gcc49/gcc49/work/gcc-4.9.4/gcc/target-hooks-macros.h:43:50: note: expanded from macro 'HOOK_VECTOR_END' |
|---|
| 875 | :info:build #define HOOK_VECTOR_END(DECL_NAME) HOOK_VECTOR_1(,} DECL_NAME ;) |
|---|
| 876 | :info:build ^ |
|---|
| 877 | :info:build In file included from insn-emit.c:30: |
|---|
| 878 | :info:build In file included from /opt/local/var/macports/build/_opt_local_var_macports_sources_rsync.macports.org_macports_release_tarballs_ports_lang_gcc49/gcc49/work/gcc-4.9.4/gcc/target.h:175: |
|---|
| 879 | :info:build /opt/local/var/macports/build/_opt_local_var_macports_sources_rsync.macports.org_macports_release_tarballs_ports_lang_gcc49/gcc49/work/gcc-4.9.4/gcc/target.def:1522:1: warning: empty macro arguments are a C99 feature [-Wc99-extensions] |
|---|
| 880 | :info:build HOOK_VECTOR_END (sched) |
|---|
| 881 | :info:build ^ |
|---|
| 882 | :info:build /opt/local/var/macports/build/_opt_local_var_macports_sources_rsync.macports.org_macports_release_tarballs_ports_lang_gcc49/gcc49/work/gcc-4.9.4/gcc/target-hooks-macros.h:43:50: note: expanded from macro 'HOOK_VECTOR_END' |
|---|
| 883 | :info:build #define HOOK_VECTOR_END(DECL_NAME) HOOK_VECTOR_1(,} DECL_NAME ;) |
|---|
| 884 | :info:build ^ |
|---|
| 885 | :info:build In file included from insn-emit.c:30: |
|---|
| 886 | :info:build In file included from /opt/local/var/macports/build/_opt_local_var_macports_sources_rsync.macports.org_macports_release_tarballs_ports_lang_gcc49/gcc49/work/gcc-4.9.4/gcc/target.h:175: |
|---|
| 887 | :info:build /opt/local/var/macports/build/_opt_local_var_macports_sources_rsync.macports.org_macports_release_tarballs_ports_lang_gcc49/gcc49/work/gcc-4.9.4/gcc/target.def:1552:1: warning: empty macro arguments are a C99 feature [-Wc99-extensions] |
|---|
| 888 | :info:build HOOK_VECTOR_END (simd_clone) |
|---|
| 889 | :info:build ^ |
|---|
| 890 | :info:build /opt/local/var/macports/build/_opt_local_var_macports_sources_rsync.macports.org_macports_release_tarballs_ports_lang_gcc49/gcc49/work/gcc-4.9.4/gcc/target-hooks-macros.h:43:50: note: expanded from macro 'HOOK_VECTOR_END' |
|---|
| 891 | :info:build #define HOOK_VECTOR_END(DECL_NAME) HOOK_VECTOR_1(,} DECL_NAME ;) |
|---|
| 892 | :info:build ^ |
|---|
| 893 | :info:build In file included from insn-emit.c:30: |
|---|
| 894 | :info:build In file included from /opt/local/var/macports/build/_opt_local_var_macports_sources_rsync.macports.org_macports_release_tarballs_ports_lang_gcc49/gcc49/work/gcc-4.9.4/gcc/target.h:175: |
|---|
| 895 | :info:build /opt/local/var/macports/build/_opt_local_var_macports_sources_rsync.macports.org_macports_release_tarballs_ports_lang_gcc49/gcc49/work/gcc-4.9.4/gcc/target.def:1770:1: warning: empty macro arguments are a C99 feature [-Wc99-extensions] |
|---|
| 896 | :info:build HOOK_VECTOR_END (vectorize) |
|---|
| 897 | :info:build ^ |
|---|
| 898 | :info:build /opt/local/var/macports/build/_opt_local_var_macports_sources_rsync.macports.org_macports_release_tarballs_ports_lang_gcc49/gcc49/work/gcc-4.9.4/gcc/target-hooks-macros.h:43:50: note: expanded from macro 'HOOK_VECTOR_END' |
|---|
| 899 | :info:build #define HOOK_VECTOR_END(DECL_NAME) HOOK_VECTOR_1(,} DECL_NAME ;) |
|---|
| 900 | :info:build ^ |
|---|
| 901 | :info:build In file included from insn-emit.c:30: |
|---|
| 902 | :info:build In file included from /opt/local/var/macports/build/_opt_local_var_macports_sources_rsync.macports.org_macports_release_tarballs_ports_lang_gcc49/gcc49/work/gcc-4.9.4/gcc/target.h:175: |
|---|
| 903 | :info:build /opt/local/var/macports/build/_opt_local_var_macports_sources_rsync.macports.org_macports_release_tarballs_ports_lang_gcc49/gcc49/work/gcc-4.9.4/gcc/target.def:2913:1: warning: empty macro arguments are a C99 feature [-Wc99-extensions] |
|---|
| 904 | :info:build HOOK_VECTOR_END (addr_space) |
|---|
| 905 | :info:build ^ |
|---|
| 906 | :info:build /opt/local/var/macports/build/_opt_local_var_macports_sources_rsync.macports.org_macports_release_tarballs_ports_lang_gcc49/gcc49/work/gcc-4.9.4/gcc/target-hooks-macros.h:43:50: note: expanded from macro 'HOOK_VECTOR_END' |
|---|
| 907 | :info:build #define HOOK_VECTOR_END(DECL_NAME) HOOK_VECTOR_1(,} DECL_NAME ;) |
|---|
| 908 | :info:build ^ |
|---|
| 909 | :info:build In file included from insn-emit.c:30: |
|---|
| 910 | :info:build In file included from /opt/local/var/macports/build/_opt_local_var_macports_sources_rsync.macports.org_macports_release_tarballs_ports_lang_gcc49/gcc49/work/gcc-4.9.4/gcc/target.h:175: |
|---|
| 911 | :info:build /opt/local/var/macports/build/_opt_local_var_macports_sources_rsync.macports.org_macports_release_tarballs_ports_lang_gcc49/gcc49/work/gcc-4.9.4/gcc/target.def:4254:1: warning: empty macro arguments are a C99 feature [-Wc99-extensions] |
|---|
| 912 | :info:build HOOK_VECTOR_END (calls) |
|---|
| 913 | :info:build ^ |
|---|
| 914 | :info:build /opt/local/var/macports/build/_opt_local_var_macports_sources_rsync.macports.org_macports_release_tarballs_ports_lang_gcc49/gcc49/work/gcc-4.9.4/gcc/target-hooks-macros.h:43:50: note: expanded from macro 'HOOK_VECTOR_END' |
|---|
| 915 | :info:build #define HOOK_VECTOR_END(DECL_NAME) HOOK_VECTOR_1(,} DECL_NAME ;) |
|---|
| 916 | :info:build ^ |
|---|
| 917 | :info:build In file included from insn-emit.c:30: |
|---|
| 918 | :info:build In file included from /opt/local/var/macports/build/_opt_local_var_macports_sources_rsync.macports.org_macports_release_tarballs_ports_lang_gcc49/gcc49/work/gcc-4.9.4/gcc/target.h:175: |
|---|
| 919 | :info:build /opt/local/var/macports/build/_opt_local_var_macports_sources_rsync.macports.org_macports_release_tarballs_ports_lang_gcc49/gcc49/work/gcc-4.9.4/gcc/target.def:4769:1: warning: empty macro arguments are a C99 feature [-Wc99-extensions] |
|---|
| 920 | :info:build HOOK_VECTOR_END (c) |
|---|
| 921 | :info:build ^ |
|---|
| 922 | :info:build /opt/local/var/macports/build/_opt_local_var_macports_sources_rsync.macports.org_macports_release_tarballs_ports_lang_gcc49/gcc49/work/gcc-4.9.4/gcc/target-hooks-macros.h:43:50: note: expanded from macro 'HOOK_VECTOR_END' |
|---|
| 923 | :info:build #define HOOK_VECTOR_END(DECL_NAME) HOOK_VECTOR_1(,} DECL_NAME ;) |
|---|
| 924 | :info:build ^ |
|---|
| 925 | :info:build In file included from insn-emit.c:30: |
|---|
| 926 | :info:build In file included from /opt/local/var/macports/build/_opt_local_var_macports_sources_rsync.macports.org_macports_release_tarballs_ports_lang_gcc49/gcc49/work/gcc-4.9.4/gcc/target.h:175: |
|---|
| 927 | :info:build /opt/local/var/macports/build/_opt_local_var_macports_sources_rsync.macports.org_macports_release_tarballs_ports_lang_gcc49/gcc49/work/gcc-4.9.4/gcc/target.def:4922:1: warning: empty macro arguments are a C99 feature [-Wc99-extensions] |
|---|
| 928 | :info:build HOOK_VECTOR_END (cxx) |
|---|
| 929 | :info:build ^ |
|---|
| 930 | :info:build /opt/local/var/macports/build/_opt_local_var_macports_sources_rsync.macports.org_macports_release_tarballs_ports_lang_gcc49/gcc49/work/gcc-4.9.4/gcc/target-hooks-macros.h:43:50: note: expanded from macro 'HOOK_VECTOR_END' |
|---|
| 931 | :info:build #define HOOK_VECTOR_END(DECL_NAME) HOOK_VECTOR_1(,} DECL_NAME ;) |
|---|
| 932 | :info:build ^ |
|---|
| 933 | :info:build In file included from insn-emit.c:30: |
|---|
| 934 | :info:build In file included from /opt/local/var/macports/build/_opt_local_var_macports_sources_rsync.macports.org_macports_release_tarballs_ports_lang_gcc49/gcc49/work/gcc-4.9.4/gcc/target.h:175: |
|---|
| 935 | :info:build /opt/local/var/macports/build/_opt_local_var_macports_sources_rsync.macports.org_macports_release_tarballs_ports_lang_gcc49/gcc49/work/gcc-4.9.4/gcc/target.def:5011:1: warning: empty macro arguments are a C99 feature [-Wc99-extensions] |
|---|
| 936 | :info:build HOOK_VECTOR_END (emutls) |
|---|
| 937 | :info:build ^ |
|---|
| 938 | :info:build /opt/local/var/macports/build/_opt_local_var_macports_sources_rsync.macports.org_macports_release_tarballs_ports_lang_gcc49/gcc49/work/gcc-4.9.4/gcc/target-hooks-macros.h:43:50: note: expanded from macro 'HOOK_VECTOR_END' |
|---|
| 939 | :info:build #define HOOK_VECTOR_END(DECL_NAME) HOOK_VECTOR_1(,} DECL_NAME ;) |
|---|
| 940 | :info:build ^ |
|---|
| 941 | :info:build In file included from insn-emit.c:30: |
|---|
| 942 | :info:build In file included from /opt/local/var/macports/build/_opt_local_var_macports_sources_rsync.macports.org_macports_release_tarballs_ports_lang_gcc49/gcc49/work/gcc-4.9.4/gcc/target.h:175: |
|---|
| 943 | :info:build /opt/local/var/macports/build/_opt_local_var_macports_sources_rsync.macports.org_macports_release_tarballs_ports_lang_gcc49/gcc49/work/gcc-4.9.4/gcc/target.def:5117:1: warning: empty macro arguments are a C99 feature [-Wc99-extensions] |
|---|
| 944 | :info:build HOOK_VECTOR_END (target_option) |
|---|
| 945 | :info:build ^ |
|---|
| 946 | :info:build /opt/local/var/macports/build/_opt_local_var_macports_sources_rsync.macports.org_macports_release_tarballs_ports_lang_gcc49/gcc49/work/gcc-4.9.4/gcc/target-hooks-macros.h:43:50: note: expanded from macro 'HOOK_VECTOR_END' |
|---|
| 947 | :info:build #define HOOK_VECTOR_END(DECL_NAME) HOOK_VECTOR_1(,} DECL_NAME ;) |
|---|
| 948 | :info:build ^ |
|---|
| 949 | :info:build In file included from insn-emit.c:30: |
|---|
| 950 | :info:build In file included from /opt/local/var/macports/build/_opt_local_var_macports_sources_rsync.macports.org_macports_release_tarballs_ports_lang_gcc49/gcc49/work/gcc-4.9.4/gcc/target.h:175: |
|---|
| 951 | :info:build /opt/local/var/macports/build/_opt_local_var_macports_sources_rsync.macports.org_macports_release_tarballs_ports_lang_gcc49/gcc49/work/gcc-4.9.4/gcc/target.def:5349:1: warning: empty macro arguments are a C99 feature [-Wc99-extensions] |
|---|
| 952 | :info:build HOOK_VECTOR_END (C90_EMPTY_HACK) |
|---|
| 953 | :info:build ^ |
|---|
| 954 | :info:build /opt/local/var/macports/build/_opt_local_var_macports_sources_rsync.macports.org_macports_release_tarballs_ports_lang_gcc49/gcc49/work/gcc-4.9.4/gcc/target-hooks-macros.h:43:50: note: expanded from macro 'HOOK_VECTOR_END' |
|---|
| 955 | :info:build #define HOOK_VECTOR_END(DECL_NAME) HOOK_VECTOR_1(,} DECL_NAME ;) |
|---|
| 956 | :info:build ^ |
|---|
| 957 | :info:build /opt/local/var/macports/build/_opt_local_var_macports_sources_rsync.macports.org_macports_release_tarballs_ports_lang_gcc49/gcc49/work/gcc-4.9.4/gcc/config/i386/i386.md:4704:18: warning: self-comparison always evaluates to true [-Wtautological-compare] |
|---|
| 958 | :info:build if (SFmode == SFmode) |
|---|
| 959 | :info:build ^ |
|---|
| 960 | :info:build /opt/local/var/macports/build/_opt_local_var_macports_sources_rsync.macports.org_macports_release_tarballs_ports_lang_gcc49/gcc49/work/gcc-4.9.4/gcc/config/i386/i386.md:4704:18: warning: self-comparison always evaluates to true [-Wtautological-compare] |
|---|
| 961 | :info:build if (SFmode == SFmode) |
|---|
| 962 | :info:build ^ |
|---|
| 963 | :info:build /opt/local/var/macports/build/_opt_local_var_macports_sources_rsync.macports.org_macports_release_tarballs_ports_lang_gcc49/gcc49/work/gcc-4.9.4/gcc/config/i386/i386.md:4706:23: warning: self-comparison always evaluates to true [-Wtautological-compare] |
|---|
| 964 | :info:build else if (DFmode == DFmode) |
|---|
| 965 | :info:build ^ |
|---|
| 966 | :info:build /opt/local/var/macports/build/_opt_local_var_macports_sources_rsync.macports.org_macports_release_tarballs_ports_lang_gcc49/gcc49/work/gcc-4.9.4/gcc/config/i386/i386.md:4706:23: warning: self-comparison always evaluates to true [-Wtautological-compare] |
|---|
| 967 | :info:build else if (DFmode == DFmode) |
|---|
| 968 | :info:build ^ |
|---|
| 969 | :info:build /opt/local/var/macports/build/_opt_local_var_macports_sources_rsync.macports.org_macports_release_tarballs_ports_lang_gcc49/gcc49/work/gcc-4.9.4/gcc/config/i386/i386.md:4784:16: warning: self-comparison always evaluates to true [-Wtautological-compare] |
|---|
| 970 | :info:build if (V4SFmode == V4SFmode) |
|---|
| 971 | :info:build ^ |
|---|
| 972 | :info:build /opt/local/var/macports/build/_opt_local_var_macports_sources_rsync.macports.org_macports_release_tarballs_ports_lang_gcc49/gcc49/work/gcc-4.9.4/gcc/config/i386/i386.md:6964:14: warning: self-comparison always evaluates to false [-Wtautological-compare] |
|---|
| 973 | :info:build if (HImode != HImode |
|---|
| 974 | :info:build ^ |
|---|
| 975 | :info:build /opt/local/var/macports/build/_opt_local_var_macports_sources_rsync.macports.org_macports_release_tarballs_ports_lang_gcc49/gcc49/work/gcc-4.9.4/gcc/config/i386/i386.md:7547:19: warning: self-comparison always evaluates to true [-Wtautological-compare] |
|---|
| 976 | :info:build else if (HImode == HImode) |
|---|
| 977 | :info:build ^ |
|---|
| 978 | :info:build /opt/local/var/macports/build/_opt_local_var_macports_sources_rsync.macports.org_macports_release_tarballs_ports_lang_gcc49/gcc49/work/gcc-4.9.4/gcc/config/i386/i386.md:7543:19: warning: self-comparison always evaluates to true [-Wtautological-compare] |
|---|
| 979 | :info:build else if (SImode == SImode) |
|---|
| 980 | :info:build ^ |
|---|
| 981 | :info:build /opt/local/var/macports/build/_opt_local_var_macports_sources_rsync.macports.org_macports_release_tarballs_ports_lang_gcc49/gcc49/work/gcc-4.9.4/gcc/config/i386/i386.md:7537:14: warning: self-comparison always evaluates to true [-Wtautological-compare] |
|---|
| 982 | :info:build if (DImode == DImode) |
|---|
| 983 | :info:build ^ |
|---|
| 984 | :info:build /opt/local/var/macports/build/_opt_local_var_macports_sources_rsync.macports.org_macports_release_tarballs_ports_lang_gcc49/gcc49/work/gcc-4.9.4/gcc/config/i386/i386.md:7760:18: warning: self-comparison always evaluates to false [-Wtautological-compare] |
|---|
| 985 | :info:build if (SImode != SImode) |
|---|
| 986 | :info:build ^ |
|---|
| 987 | :info:build /opt/local/var/macports/build/_opt_local_var_macports_sources_rsync.macports.org_macports_release_tarballs_ports_lang_gcc49/gcc49/work/gcc-4.9.4/gcc/config/i386/i386.md:7752:14: warning: self-comparison always evaluates to true [-Wtautological-compare] |
|---|
| 988 | :info:build if (DImode == DImode) |
|---|
| 989 | :info:build ^ |
|---|
| 990 | :info:build 4 warnings generated. |
|---|
| 991 | :info:build 4 warnings generated. |
|---|
| 992 | :info:build /opt/local/var/macports/build/_opt_local_var_macports_sources_rsync.macports.org_macports_release_tarballs_ports_lang_gcc49/gcc49/work/gcc-4.9.4/gcc/config/i386/i386.md:11877:14: warning: self-comparison always evaluates to true [-Wtautological-compare] |
|---|
| 993 | :info:build if (SImode == SImode && !TARGET_CMOVE) |
|---|
| 994 | :info:build ^ |
|---|
| 995 | :info:build /opt/local/var/macports/build/_opt_local_var_macports_sources_rsync.macports.org_macports_release_tarballs_ports_lang_gcc49/gcc49/work/gcc-4.9.4/gcc/config/i386/i386.md:13538:14: warning: self-comparison always evaluates to true [-Wtautological-compare] |
|---|
| 996 | :info:build if (SFmode == SFmode |
|---|
| 997 | :info:build ^ |
|---|
| 998 | :info:build /opt/local/var/macports/build/_opt_local_var_macports_sources_rsync.macports.org_macports_release_tarballs_ports_lang_gcc49/gcc49/work/gcc-4.9.4/gcc/config/i386/i386.md:14762:40: warning: self-comparison always evaluates to false [-Wtautological-compare] |
|---|
| 999 | :info:build else if (TARGET_64BIT || (DFmode != DFmode)) |
|---|
| 1000 | :info:build ^ |
|---|
| 1001 | :info:build /opt/local/var/macports/build/_opt_local_var_macports_sources_rsync.macports.org_macports_release_tarballs_ports_lang_gcc49/gcc49/work/gcc-4.9.4/gcc/config/i386/i386.md:14922:17: warning: self-comparison always evaluates to false [-Wtautological-compare] |
|---|
| 1002 | :info:build && HImode != HImode |
|---|
| 1003 | :info:build ^ |
|---|
| 1004 | :info:build /opt/local/var/macports/build/_opt_local_var_macports_sources_rsync.macports.org_macports_release_tarballs_ports_lang_gcc49/gcc49/work/gcc-4.9.4/gcc/config/i386/i386.md:14922:17: warning: self-comparison always evaluates to false [-Wtautological-compare] |
|---|
| 1005 | :info:build && HImode != HImode |
|---|
| 1006 | :info:build ^ |
|---|
| 1007 | :info:build /opt/local/var/macports/build/_opt_local_var_macports_sources_rsync.macports.org_macports_release_tarballs_ports_lang_gcc49/gcc49/work/gcc-4.9.4/gcc/config/i386/i386.md:14922:17: warning: self-comparison always evaluates to false [-Wtautological-compare] |
|---|
| 1008 | :info:build && HImode != HImode |
|---|
| 1009 | :info:build ^ |
|---|
| 1010 | :info:build /opt/local/var/macports/build/_opt_local_var_macports_sources_rsync.macports.org_macports_release_tarballs_ports_lang_gcc49/gcc49/work/gcc-4.9.4/gcc/config/i386/i386.md:14923:19: warning: self-comparison always evaluates to false [-Wtautological-compare] |
|---|
| 1011 | :info:build && ((DImode != DImode) || TARGET_64BIT) |
|---|
| 1012 | :info:build ^ |
|---|
| 1013 | :info:build /opt/local/var/macports/build/_opt_local_var_macports_sources_rsync.macports.org_macports_release_tarballs_ports_lang_gcc49/gcc49/work/gcc-4.9.4/gcc/config/i386/i386.md:14923:19: warning: self-comparison always evaluates to false [-Wtautological-compare] |
|---|
| 1014 | :info:build && ((DImode != DImode) || TARGET_64BIT) |
|---|
| 1015 | :info:build ^ |
|---|
| 1016 | :info:build /opt/local/var/macports/build/_opt_local_var_macports_sources_rsync.macports.org_macports_release_tarballs_ports_lang_gcc49/gcc49/work/gcc-4.9.4/gcc/config/i386/i386.md:14923:19: warning: self-comparison always evaluates to false [-Wtautological-compare] |
|---|
| 1017 | :info:build && ((DImode != DImode) || TARGET_64BIT) |
|---|
| 1018 | :info:build ^ |
|---|
| 1019 | :info:build /opt/local/var/macports/build/_opt_local_var_macports_sources_rsync.macports.org_macports_release_tarballs_ports_lang_gcc49/gcc49/work/gcc-4.9.4/gcc/config/i386/i386.md:15030:40: warning: self-comparison always evaluates to false [-Wtautological-compare] |
|---|
| 1020 | :info:build else if (TARGET_64BIT || (DFmode != DFmode)) |
|---|
| 1021 | :info:build ^ |
|---|
| 1022 | :info:build /opt/local/var/macports/build/_opt_local_var_macports_sources_rsync.macports.org_macports_release_tarballs_ports_lang_gcc49/gcc49/work/gcc-4.9.4/gcc/config/i386/i386.md:15030:40: warning: self-comparison always evaluates to false [-Wtautological-compare] |
|---|
| 1023 | :info:build else if (TARGET_64BIT || (DFmode != DFmode)) |
|---|
| 1024 | :info:build ^ |
|---|
| 1025 | :info:build /opt/local/var/macports/build/_opt_local_var_macports_sources_rsync.macports.org_macports_release_tarballs_ports_lang_gcc49/gcc49/work/gcc-4.9.4/gcc/config/i386/i386.md:15030:40: warning: self-comparison always evaluates to false [-Wtautological-compare] |
|---|
| 1026 | :info:build else if (TARGET_64BIT || (DFmode != DFmode)) |
|---|
| 1027 | :info:build ^ |
|---|
| 1028 | :info:build /opt/local/var/macports/build/_opt_local_var_macports_sources_rsync.macports.org_macports_release_tarballs_ports_lang_gcc49/gcc49/work/gcc-4.9.4/gcc/config/i386/sse.md:3613:17: warning: self-comparison always evaluates to true [-Wtautological-compare] |
|---|
| 1029 | :info:build if (V16SFmode == V16SFmode) |
|---|
| 1030 | :info:build ^ |
|---|
| 1031 | :info:build /opt/local/var/macports/build/_opt_local_var_macports_sources_rsync.macports.org_macports_release_tarballs_ports_lang_gcc49/gcc49/work/gcc-4.9.4/gcc/config/i386/sse.md:3708:17: warning: self-comparison always evaluates to true [-Wtautological-compare] |
|---|
| 1032 | :info:build if (V16SFmode == V16SFmode) |
|---|
| 1033 | :info:build ^ |
|---|
| 1034 | :info:build /opt/local/var/macports/build/_opt_local_var_macports_sources_rsync.macports.org_macports_release_tarballs_ports_lang_gcc49/gcc49/work/gcc-4.9.4/gcc/config/i386/sse.md:4840:16: warning: self-comparison always evaluates to true [-Wtautological-compare] |
|---|
| 1035 | :info:build if (V8DFmode == V8DFmode) |
|---|
| 1036 | :info:build ^ |
|---|
| 1037 | :info:build /opt/local/var/macports/build/_opt_local_var_macports_sources_rsync.macports.org_macports_release_tarballs_ports_lang_gcc49/gcc49/work/gcc-4.9.4/gcc/config/i386/sse.md:4858:20: warning: self-comparison always evaluates to true [-Wtautological-compare] |
|---|
| 1038 | :info:build if (V4SImode == V4SImode || TARGET_AVX2) |
|---|
| 1039 | :info:build ^ |
|---|
| 1040 | :info:build /opt/local/var/macports/build/_opt_local_var_macports_sources_rsync.macports.org_macports_release_tarballs_ports_lang_gcc49/gcc49/work/gcc-4.9.4/gcc/config/i386/sse.md:8466:12: warning: self-comparison always evaluates to true [-Wtautological-compare] |
|---|
| 1041 | :info:build if (SMAX == SMAX || SMAX == UMAX) |
|---|
| 1042 | :info:build ^ |
|---|
| 1043 | :info:build /opt/local/var/macports/build/_opt_local_var_macports_sources_rsync.macports.org_macports_release_tarballs_ports_lang_gcc49/gcc49/work/gcc-4.9.4/gcc/config/i386/sse.md:8466:28: warning: self-comparison always evaluates to true [-Wtautological-compare] |
|---|
| 1044 | :info:build if (UMAX == SMAX || UMAX == UMAX) |
|---|
| 1045 | :info:build ^ |
|---|
| 1046 | :info:build /opt/local/var/macports/build/_opt_local_var_macports_sources_rsync.macports.org_macports_release_tarballs_ports_lang_gcc49/gcc49/work/gcc-4.9.4/gcc/config/i386/sse.md:8477:16: warning: self-comparison always evaluates to true [-Wtautological-compare] |
|---|
| 1047 | :info:build code = (UMAX == UMAX || UMAX == UMIN) ? GTU : GT; |
|---|
| 1048 | :info:build ^ |
|---|
| 1049 | :info:build /opt/local/var/macports/build/_opt_local_var_macports_sources_rsync.macports.org_macports_release_tarballs_ports_lang_gcc49/gcc49/work/gcc-4.9.4/gcc/config/i386/sse.md:8477:32: warning: self-comparison always evaluates to true [-Wtautological-compare] |
|---|
| 1050 | :info:build code = (UMIN == UMAX || UMIN == UMIN) ? GTU : GT; |
|---|
| 1051 | :info:build ^ |
|---|
| 1052 | :info:build /opt/local/var/macports/build/_opt_local_var_macports_sources_rsync.macports.org_macports_release_tarballs_ports_lang_gcc49/gcc49/work/gcc-4.9.4/gcc/config/i386/sse.md:8466:12: warning: self-comparison always evaluates to true [-Wtautological-compare] |
|---|
| 1053 | :info:build if (SMAX == SMAX || SMAX == UMAX) |
|---|
| 1054 | :info:build ^ |
|---|
| 1055 | :info:build /opt/local/var/macports/build/_opt_local_var_macports_sources_rsync.macports.org_macports_release_tarballs_ports_lang_gcc49/gcc49/work/gcc-4.9.4/gcc/config/i386/sse.md:8466:28: warning: self-comparison always evaluates to true [-Wtautological-compare] |
|---|
| 1056 | :info:build if (UMAX == SMAX || UMAX == UMAX) |
|---|
| 1057 | :info:build ^ |
|---|
| 1058 | :info:build /opt/local/var/macports/build/_opt_local_var_macports_sources_rsync.macports.org_macports_release_tarballs_ports_lang_gcc49/gcc49/work/gcc-4.9.4/gcc/config/i386/sse.md:8477:16: warning: self-comparison always evaluates to true [-Wtautological-compare] |
|---|
| 1059 | :info:build code = (UMAX == UMAX || UMAX == UMIN) ? GTU : GT; |
|---|
| 1060 | :info:build ^ |
|---|
| 1061 | :info:build /opt/local/var/macports/build/_opt_local_var_macports_sources_rsync.macports.org_macports_release_tarballs_ports_lang_gcc49/gcc49/work/gcc-4.9.4/gcc/config/i386/sse.md:8477:32: warning: self-comparison always evaluates to true [-Wtautological-compare] |
|---|
| 1062 | :info:build code = (UMIN == UMAX || UMIN == UMIN) ? GTU : GT; |
|---|
| 1063 | :info:build ^ |
|---|
| 1064 | :info:build /opt/local/var/macports/build/_opt_local_var_macports_sources_rsync.macports.org_macports_release_tarballs_ports_lang_gcc49/gcc49/work/gcc-4.9.4/gcc/config/i386/sse.md:8506:16: warning: self-comparison always evaluates to true [-Wtautological-compare] |
|---|
| 1065 | :info:build if (SMAX == SMAX) |
|---|
| 1066 | :info:build ^ |
|---|
| 1067 | :info:build /opt/local/var/macports/build/_opt_local_var_macports_sources_rsync.macports.org_macports_release_tarballs_ports_lang_gcc49/gcc49/work/gcc-4.9.4/gcc/config/i386/sse.md:8495:33: warning: self-comparison always evaluates to true [-Wtautological-compare] |
|---|
| 1068 | :info:build if (TARGET_SSE4_1 || V8HImode == V8HImode) |
|---|
| 1069 | :info:build ^ |
|---|
| 1070 | :info:build /opt/local/var/macports/build/_opt_local_var_macports_sources_rsync.macports.org_macports_release_tarballs_ports_lang_gcc49/gcc49/work/gcc-4.9.4/gcc/config/i386/sse.md:8506:16: warning: self-comparison always evaluates to true [-Wtautological-compare] |
|---|
| 1071 | :info:build if (SMAX == SMAX) |
|---|
| 1072 | :info:build ^ |
|---|
| 1073 | :info:build /opt/local/var/macports/build/_opt_local_var_macports_sources_rsync.macports.org_macports_release_tarballs_ports_lang_gcc49/gcc49/work/gcc-4.9.4/gcc/config/i386/sse.md:8495:33: warning: self-comparison always evaluates to true [-Wtautological-compare] |
|---|
| 1074 | :info:build if (TARGET_SSE4_1 || V8HImode == V8HImode) |
|---|
| 1075 | :info:build ^ |
|---|
| 1076 | :info:build /opt/local/var/macports/build/_opt_local_var_macports_sources_rsync.macports.org_macports_release_tarballs_ports_lang_gcc49/gcc49/work/gcc-4.9.4/gcc/config/i386/sse.md:8506:16: warning: self-comparison always evaluates to true [-Wtautological-compare] |
|---|
| 1077 | :info:build if (SMAX == SMAX) |
|---|
| 1078 | :info:build ^ |
|---|
| 1079 | :info:build /opt/local/var/macports/build/_opt_local_var_macports_sources_rsync.macports.org_macports_release_tarballs_ports_lang_gcc49/gcc49/work/gcc-4.9.4/gcc/config/i386/sse.md:8565:34: warning: self-comparison always evaluates to true [-Wtautological-compare] |
|---|
| 1080 | :info:build if (TARGET_SSE4_1 || V16QImode == V16QImode) |
|---|
| 1081 | :info:build ^ |
|---|
| 1082 | :info:build /opt/local/var/macports/build/_opt_local_var_macports_sources_rsync.macports.org_macports_release_tarballs_ports_lang_gcc49/gcc49/work/gcc-4.9.4/gcc/config/i386/sse.md:8567:17: warning: self-comparison always evaluates to true [-Wtautological-compare] |
|---|
| 1083 | :info:build else if (UMAX == UMAX && V16QImode == V8HImode) |
|---|
| 1084 | :info:build ^ |
|---|
| 1085 | :info:build /opt/local/var/macports/build/_opt_local_var_macports_sources_rsync.macports.org_macports_release_tarballs_ports_lang_gcc49/gcc49/work/gcc-4.9.4/gcc/config/i386/sse.md:8587:16: warning: self-comparison always evaluates to true [-Wtautological-compare] |
|---|
| 1086 | :info:build if (UMAX == UMAX) |
|---|
| 1087 | :info:build ^ |
|---|
| 1088 | :info:build /opt/local/var/macports/build/_opt_local_var_macports_sources_rsync.macports.org_macports_release_tarballs_ports_lang_gcc49/gcc49/work/gcc-4.9.4/gcc/config/i386/sse.md:8565:34: warning: self-comparison always evaluates to true [-Wtautological-compare] |
|---|
| 1089 | :info:build if (TARGET_SSE4_1 || V16QImode == V16QImode) |
|---|
| 1090 | :info:build ^ |
|---|
| 1091 | :info:build /opt/local/var/macports/build/_opt_local_var_macports_sources_rsync.macports.org_macports_release_tarballs_ports_lang_gcc49/gcc49/work/gcc-4.9.4/gcc/config/i386/sse.md:8567:17: warning: self-comparison always evaluates to true [-Wtautological-compare] |
|---|
| 1092 | :info:build else if (UMAX == UMAX && V8HImode == V8HImode) |
|---|
| 1093 | :info:build ^ |
|---|
| 1094 | :info:build /opt/local/var/macports/build/_opt_local_var_macports_sources_rsync.macports.org_macports_release_tarballs_ports_lang_gcc49/gcc49/work/gcc-4.9.4/gcc/config/i386/sse.md:8567:37: warning: self-comparison always evaluates to true [-Wtautological-compare] |
|---|
| 1095 | :info:build else if (UMAX == UMAX && V8HImode == V8HImode) |
|---|
| 1096 | :info:build ^ |
|---|
| 1097 | :info:build /opt/local/var/macports/build/_opt_local_var_macports_sources_rsync.macports.org_macports_release_tarballs_ports_lang_gcc49/gcc49/work/gcc-4.9.4/gcc/config/i386/sse.md:8587:16: warning: self-comparison always evaluates to true [-Wtautological-compare] |
|---|
| 1098 | :info:build if (UMAX == UMAX) |
|---|
| 1099 | :info:build ^ |
|---|
| 1100 | :info:build /opt/local/var/macports/build/_opt_local_var_macports_sources_rsync.macports.org_macports_release_tarballs_ports_lang_gcc49/gcc49/work/gcc-4.9.4/gcc/config/i386/sse.md:8567:37: warning: self-comparison always evaluates to true [-Wtautological-compare] |
|---|
| 1101 | :info:build else if (UMIN == UMAX && V8HImode == V8HImode) |
|---|
| 1102 | :info:build ^ |
|---|
| 1103 | :info:build /opt/local/var/macports/build/_opt_local_var_macports_sources_rsync.macports.org_macports_release_tarballs_ports_lang_gcc49/gcc49/work/gcc-4.9.4/gcc/config/i386/sse.md:8567:17: warning: self-comparison always evaluates to true [-Wtautological-compare] |
|---|
| 1104 | :info:build else if (UMAX == UMAX && V4SImode == V8HImode) |
|---|
| 1105 | :info:build ^ |
|---|
| 1106 | :info:build /opt/local/var/macports/build/_opt_local_var_macports_sources_rsync.macports.org_macports_release_tarballs_ports_lang_gcc49/gcc49/work/gcc-4.9.4/gcc/config/i386/sse.md:8587:16: warning: self-comparison always evaluates to true [-Wtautological-compare] |
|---|
| 1107 | :info:build if (UMAX == UMAX) |
|---|
| 1108 | :info:build ^ |
|---|
| 1109 | :info:build /opt/local/var/macports/build/_opt_local_var_macports_sources_rsync.macports.org_macports_release_tarballs_ports_lang_gcc49/gcc49/work/gcc-4.9.4/gcc/config/i386/sse.md:12080:16: warning: self-comparison always evaluates to true [-Wtautological-compare] |
|---|
| 1110 | :info:build if (V2DFmode == V2DFmode |
|---|
| 1111 | :info:build ^ |
|---|
| 1112 | :info:build /opt/local/var/macports/build/_opt_local_var_macports_sources_rsync.macports.org_macports_release_tarballs_ports_lang_gcc49/gcc49/work/gcc-4.9.4/gcc/config/i386/sse.md:12186:16: warning: self-comparison always evaluates to true [-Wtautological-compare] |
|---|
| 1113 | :info:build if (V2DFmode == V2DFmode |
|---|
| 1114 | :info:build ^ |
|---|
| 1115 | :info:build /opt/local/var/macports/build/_opt_local_var_macports_sources_rsync.macports.org_macports_release_tarballs_ports_lang_gcc49/gcc49/work/gcc-4.9.4/gcc/config/i386/sse.md:13662:18: warning: self-comparison always evaluates to false [-Wtautological-compare] |
|---|
| 1116 | :info:build if (ASHIFT != ASHIFT) |
|---|
| 1117 | :info:build ^ |
|---|
| 1118 | :info:build /opt/local/var/macports/build/_opt_local_var_macports_sources_rsync.macports.org_macports_release_tarballs_ports_lang_gcc49/gcc49/work/gcc-4.9.4/gcc/config/i386/sse.md:13679:23: warning: self-comparison always evaluates to true [-Wtautological-compare] |
|---|
| 1119 | :info:build gen = (LSHIFTRT == LSHIFTRT ? gen_xop_shlv16qi3 : gen_xop_shav16qi3); |
|---|
| 1120 | :info:build ^ |
|---|
| 1121 | :info:build /opt/local/var/macports/build/_opt_local_var_macports_sources_rsync.macports.org_macports_release_tarballs_ports_lang_gcc49/gcc49/work/gcc-4.9.4/gcc/config/i386/sse.md:13655:31: warning: self-comparison always evaluates to true [-Wtautological-compare] |
|---|
| 1122 | :info:build if (TARGET_XOP && V16QImode == V16QImode) |
|---|
| 1123 | :info:build ^ |
|---|
| 1124 | :info:build /opt/local/var/macports/build/_opt_local_var_macports_sources_rsync.macports.org_macports_release_tarballs_ports_lang_gcc49/gcc49/work/gcc-4.9.4/gcc/config/i386/sse.md:13662:18: warning: self-comparison always evaluates to false [-Wtautological-compare] |
|---|
| 1125 | :info:build if (ASHIFT != ASHIFT) |
|---|
| 1126 | :info:build ^ |
|---|
| 1127 | :info:build /opt/local/var/macports/build/_opt_local_var_macports_sources_rsync.macports.org_macports_release_tarballs_ports_lang_gcc49/gcc49/work/gcc-4.9.4/gcc/config/i386/sse.md:13655:31: warning: self-comparison always evaluates to true [-Wtautological-compare] |
|---|
| 1128 | :info:build if (TARGET_XOP && V16QImode == V16QImode) |
|---|
| 1129 | :info:build ^ |
|---|
| 1130 | :info:build /opt/local/var/macports/build/_opt_local_var_macports_sources_rsync.macports.org_macports_release_tarballs_ports_lang_gcc49/gcc49/work/gcc-4.9.4/gcc/config/i386/sse.md:13679:23: warning: self-comparison always evaluates to true [-Wtautological-compare] |
|---|
| 1131 | :info:build gen = (LSHIFTRT == LSHIFTRT ? gen_xop_shlv16qi3 : gen_xop_shav16qi3); |
|---|
| 1132 | :info:build ^ |
|---|
| 1133 | :info:build /opt/local/var/macports/build/_opt_local_var_macports_sources_rsync.macports.org_macports_release_tarballs_ports_lang_gcc49/gcc49/work/gcc-4.9.4/gcc/config/i386/sse.md:13655:31: warning: self-comparison always evaluates to true [-Wtautological-compare] |
|---|
| 1134 | :info:build if (TARGET_XOP && V16QImode == V16QImode) |
|---|
| 1135 | :info:build ^ |
|---|
| 1136 | :info:build /opt/local/var/macports/build/_opt_local_var_macports_sources_rsync.macports.org_macports_release_tarballs_ports_lang_gcc49/gcc49/work/gcc-4.9.4/gcc/config/i386/sse.md:14299:20: warning: self-comparison always evaluates to true [-Wtautological-compare] |
|---|
| 1137 | :info:build if (V4DFmode == V4DFmode) |
|---|
| 1138 | :info:build ^ |
|---|
| 1139 | :info:build /opt/local/var/macports/build/_opt_local_var_macports_sources_rsync.macports.org_macports_release_tarballs_ports_lang_gcc49/gcc49/work/gcc-4.9.4/gcc/config/i386/sync.md:150:14: warning: self-comparison always evaluates to true [-Wtautological-compare] |
|---|
| 1140 | :info:build if (DImode == DImode && !TARGET_64BIT) |
|---|
| 1141 | :info:build ^ |
|---|
| 1142 | :info:build /opt/local/var/macports/build/_opt_local_var_macports_sources_rsync.macports.org_macports_release_tarballs_ports_lang_gcc49/gcc49/work/gcc-4.9.4/gcc/config/i386/sync.md:207:14: warning: self-comparison always evaluates to true [-Wtautological-compare] |
|---|
| 1143 | :info:build if (DImode == DImode && !TARGET_64BIT) |
|---|
| 1144 | :info:build ^ |
|---|
| 1145 | :info:build /opt/local/var/macports/build/_opt_local_var_macports_sources_rsync.macports.org_macports_release_tarballs_ports_lang_gcc49/gcc49/work/gcc-4.9.4/gcc/config/i386/sync.md:345:14: warning: self-comparison always evaluates to true [-Wtautological-compare] |
|---|
| 1146 | :info:build if (DImode == DImode && TARGET_64BIT) |
|---|
| 1147 | :info:build ^ |
|---|
| 1148 | :info:build 78 warnings generated. |
|---|
| 1149 | :info:build make[3]: Leaving directory `/opt/local/var/macports/build/_opt_local_var_macports_sources_rsync.macports.org_macports_release_tarballs_ports_lang_gcc49/gcc49/work/build/gcc' |
|---|
| 1150 | :info:build make[2]: *** [all-stage1-gcc] Error 2 |
|---|
| 1151 | :info:build make[2]: Leaving directory `/opt/local/var/macports/build/_opt_local_var_macports_sources_rsync.macports.org_macports_release_tarballs_ports_lang_gcc49/gcc49/work/build' |
|---|
| 1152 | :info:build make[1]: *** [stage1-bubble] Error 2 |
|---|
| 1153 | :info:build make[1]: Leaving directory `/opt/local/var/macports/build/_opt_local_var_macports_sources_rsync.macports.org_macports_release_tarballs_ports_lang_gcc49/gcc49/work/build' |
|---|
| 1154 | :info:build make: *** [bootstrap-lean] Error 2 |
|---|
| 1155 | :info:build make: Leaving directory `/opt/local/var/macports/build/_opt_local_var_macports_sources_rsync.macports.org_macports_release_tarballs_ports_lang_gcc49/gcc49/work/build' |
|---|
| 1156 | :info:build Command failed: cd "/opt/local/var/macports/build/_opt_local_var_macports_sources_rsync.macports.org_macports_release_tarballs_ports_lang_gcc49/gcc49/work/build" && /usr/bin/make -j4 -w bootstrap-lean |
|---|
| 1157 | :info:build Exit code: 2 |
|---|
| 1158 | :error:build Failed to build gcc49: command execution failed |
|---|
| 1159 | :debug:build Error code: CHILDSTATUS 911 2 |
|---|
| 1160 | :debug:build Backtrace: command execution failed |
|---|
| 1161 | :debug:build while executing |
|---|
| 1162 | :debug:build "system {*}$notty {*}$nice $fullcmdstring" |
|---|
| 1163 | :debug:build invoked from within |
|---|
| 1164 | :debug:build "command_exec build" |
|---|
| 1165 | :debug:build (procedure "portbuild::build_main" line 8) |
|---|
| 1166 | :debug:build invoked from within |
|---|
| 1167 | :debug:build "$procedure $targetname" |
|---|
| 1168 | :error:build See /opt/local/var/macports/logs/_opt_local_var_macports_sources_rsync.macports.org_macports_release_tarballs_ports_lang_gcc49/gcc49/main.log for details. |
|---|
| 1169 | version:1 |
|---|
| 1170 | :debug:sysinfo macOS 10.13 (darwin/17.7.0) arch i386 |
|---|
| 1171 | :debug:sysinfo MacPorts 2.5.4 |
|---|
| 1172 | :debug:sysinfo Xcode 10.1 |
|---|
| 1173 | :debug:sysinfo SDK 10.13 |
|---|
| 1174 | :debug:sysinfo MACOSX_DEPLOYMENT_TARGET: 10.13 |
|---|
| 1175 | :debug:main gcc49 has no conflicts |
|---|
| 1176 | :debug:main Executing org.macports.main (gcc49) |
|---|
| 1177 | :debug:main dropping privileges: euid changed to 502, egid changed to 501. |
|---|
| 1178 | :debug:main Skipping completed org.macports.archivefetch (gcc49) |
|---|
| 1179 | :debug:main Privilege de-escalation not attempted as not running as root. |
|---|
| 1180 | :debug:main Skipping completed org.macports.fetch (gcc49) |
|---|
| 1181 | :debug:main Privilege de-escalation not attempted as not running as root. |
|---|
| 1182 | :debug:main Skipping completed org.macports.checksum (gcc49) |
|---|
| 1183 | :debug:main Privilege de-escalation not attempted as not running as root. |
|---|
| 1184 | :debug:main Skipping completed org.macports.extract (gcc49) |
|---|
| 1185 | :debug:main Privilege de-escalation not attempted as not running as root. |
|---|
| 1186 | :debug:main Skipping completed org.macports.patch (gcc49) |
|---|
| 1187 | :debug:main Privilege de-escalation not attempted as not running as root. |
|---|
| 1188 | :debug:main Skipping completed org.macports.configure (gcc49) |
|---|
| 1189 | :debug:main Privilege de-escalation not attempted as not running as root. |
|---|
| 1190 | :debug:build build phase started at Wed Oct 31 14:23:32 CST 2018 |
|---|
| 1191 | :notice:build ---> Building gcc49 |
|---|
| 1192 | :debug:build Executing org.macports.build (gcc49) |
|---|
| 1193 | :debug:build Environment: |
|---|
| 1194 | :debug:build CC_PRINT_OPTIONS='YES' |
|---|
| 1195 | :debug:build CC_PRINT_OPTIONS_FILE='/opt/local/var/macports/build/_opt_local_var_macports_sources_rsync.macports.org_macports_release_tarballs_ports_lang_gcc49/gcc49/work/.CC_PRINT_OPTIONS' |
|---|
| 1196 | :debug:build CPATH='/opt/local/include' |
|---|
| 1197 | :debug:build CPP='/usr/bin/clang -E' |
|---|
| 1198 | :debug:build CXXCPP='/usr/bin/clang++ -E' |
|---|
| 1199 | :debug:build LIBRARY_PATH='/opt/local/lib' |
|---|
| 1200 | :debug:build MACOSX_DEPLOYMENT_TARGET='10.13' |
|---|
| 1201 | :info:build Executing: cd "/opt/local/var/macports/build/_opt_local_var_macports_sources_rsync.macports.org_macports_release_tarballs_ports_lang_gcc49/gcc49/work/build" && /usr/bin/make -j4 -w bootstrap-lean |
|---|
| 1202 | :debug:build system: cd "/opt/local/var/macports/build/_opt_local_var_macports_sources_rsync.macports.org_macports_release_tarballs_ports_lang_gcc49/gcc49/work/build" && /usr/bin/make -j4 -w bootstrap-lean |
|---|
| 1203 | :info:build make: Entering directory `/opt/local/var/macports/build/_opt_local_var_macports_sources_rsync.macports.org_macports_release_tarballs_ports_lang_gcc49/gcc49/work/build' |
|---|
| 1204 | :info:build echo stage3 > stage_final |
|---|
| 1205 | :info:build make[1]: Entering directory `/opt/local/var/macports/build/_opt_local_var_macports_sources_rsync.macports.org_macports_release_tarballs_ports_lang_gcc49/gcc49/work/build' |
|---|
| 1206 | :info:build make[2]: Entering directory `/opt/local/var/macports/build/_opt_local_var_macports_sources_rsync.macports.org_macports_release_tarballs_ports_lang_gcc49/gcc49/work/build' |
|---|
| 1207 | :info:build make[3]: Entering directory `/opt/local/var/macports/build/_opt_local_var_macports_sources_rsync.macports.org_macports_release_tarballs_ports_lang_gcc49/gcc49/work/build' |
|---|
| 1208 | :info:build rm -f stage_current |
|---|
| 1209 | :info:build make[3]: Leaving directory `/opt/local/var/macports/build/_opt_local_var_macports_sources_rsync.macports.org_macports_release_tarballs_ports_lang_gcc49/gcc49/work/build' |
|---|
| 1210 | :info:build make[2]: Leaving directory `/opt/local/var/macports/build/_opt_local_var_macports_sources_rsync.macports.org_macports_release_tarballs_ports_lang_gcc49/gcc49/work/build' |
|---|
| 1211 | :info:build make[2]: Entering directory `/opt/local/var/macports/build/_opt_local_var_macports_sources_rsync.macports.org_macports_release_tarballs_ports_lang_gcc49/gcc49/work/build' |
|---|
| 1212 | :info:build make[3]: Entering directory `/opt/local/var/macports/build/_opt_local_var_macports_sources_rsync.macports.org_macports_release_tarballs_ports_lang_gcc49/gcc49/work/build/build-x86_64-apple-darwin17/libiberty' |
|---|
| 1213 | :info:build make[4]: Entering directory `/opt/local/var/macports/build/_opt_local_var_macports_sources_rsync.macports.org_macports_release_tarballs_ports_lang_gcc49/gcc49/work/build/build-x86_64-apple-darwin17/libiberty/testsuite' |
|---|
| 1214 | :info:build make[4]: Nothing to be done for `all'. |
|---|
| 1215 | :info:build make[4]: Leaving directory `/opt/local/var/macports/build/_opt_local_var_macports_sources_rsync.macports.org_macports_release_tarballs_ports_lang_gcc49/gcc49/work/build/build-x86_64-apple-darwin17/libiberty/testsuite' |
|---|
| 1216 | :info:build make[3]: Leaving directory `/opt/local/var/macports/build/_opt_local_var_macports_sources_rsync.macports.org_macports_release_tarballs_ports_lang_gcc49/gcc49/work/build/build-x86_64-apple-darwin17/libiberty' |
|---|
| 1217 | :info:build make[3]: Entering directory `/opt/local/var/macports/build/_opt_local_var_macports_sources_rsync.macports.org_macports_release_tarballs_ports_lang_gcc49/gcc49/work/build/intl' |
|---|
| 1218 | :info:build make[3]: Nothing to be done for `all'. |
|---|
| 1219 | :info:build make[3]: Leaving directory `/opt/local/var/macports/build/_opt_local_var_macports_sources_rsync.macports.org_macports_release_tarballs_ports_lang_gcc49/gcc49/work/build/intl' |
|---|
| 1220 | :info:build make[3]: Entering directory `/opt/local/var/macports/build/_opt_local_var_macports_sources_rsync.macports.org_macports_release_tarballs_ports_lang_gcc49/gcc49/work/build/libbacktrace' |
|---|
| 1221 | :info:build /Applications/Xcode.app/Contents/Developer/usr/bin/make all-am |
|---|
| 1222 | :info:build make[3]: Entering directory `/opt/local/var/macports/build/_opt_local_var_macports_sources_rsync.macports.org_macports_release_tarballs_ports_lang_gcc49/gcc49/work/build/libdecnumber' |
|---|
| 1223 | :info:build make[3]: Nothing to be done for `all'. |
|---|
| 1224 | :info:build make[3]: Leaving directory `/opt/local/var/macports/build/_opt_local_var_macports_sources_rsync.macports.org_macports_release_tarballs_ports_lang_gcc49/gcc49/work/build/libdecnumber' |
|---|
| 1225 | :info:build make[3]: Entering directory `/opt/local/var/macports/build/_opt_local_var_macports_sources_rsync.macports.org_macports_release_tarballs_ports_lang_gcc49/gcc49/work/build/build-x86_64-apple-darwin17/fixincludes' |
|---|
| 1226 | :info:build make[3]: Nothing to be done for `all'. |
|---|
| 1227 | :info:build make[3]: Leaving directory `/opt/local/var/macports/build/_opt_local_var_macports_sources_rsync.macports.org_macports_release_tarballs_ports_lang_gcc49/gcc49/work/build/build-x86_64-apple-darwin17/fixincludes' |
|---|
| 1228 | :info:build make[4]: Entering directory `/opt/local/var/macports/build/_opt_local_var_macports_sources_rsync.macports.org_macports_release_tarballs_ports_lang_gcc49/gcc49/work/build/libbacktrace' |
|---|
| 1229 | :info:build true DO=all multi-do # /Applications/Xcode.app/Contents/Developer/usr/bin/make |
|---|
| 1230 | :info:build make[4]: Leaving directory `/opt/local/var/macports/build/_opt_local_var_macports_sources_rsync.macports.org_macports_release_tarballs_ports_lang_gcc49/gcc49/work/build/libbacktrace' |
|---|
| 1231 | :info:build make[3]: Leaving directory `/opt/local/var/macports/build/_opt_local_var_macports_sources_rsync.macports.org_macports_release_tarballs_ports_lang_gcc49/gcc49/work/build/libbacktrace' |
|---|
| 1232 | :info:build make[3]: Entering directory `/opt/local/var/macports/build/_opt_local_var_macports_sources_rsync.macports.org_macports_release_tarballs_ports_lang_gcc49/gcc49/work/build/libiberty' |
|---|
| 1233 | :info:build make[4]: Entering directory `/opt/local/var/macports/build/_opt_local_var_macports_sources_rsync.macports.org_macports_release_tarballs_ports_lang_gcc49/gcc49/work/build/libiberty/testsuite' |
|---|
| 1234 | :info:build make[4]: Nothing to be done for `all'. |
|---|
| 1235 | :info:build make[4]: Leaving directory `/opt/local/var/macports/build/_opt_local_var_macports_sources_rsync.macports.org_macports_release_tarballs_ports_lang_gcc49/gcc49/work/build/libiberty/testsuite' |
|---|
| 1236 | :info:build make[3]: Leaving directory `/opt/local/var/macports/build/_opt_local_var_macports_sources_rsync.macports.org_macports_release_tarballs_ports_lang_gcc49/gcc49/work/build/libiberty' |
|---|
| 1237 | :info:build make[3]: Entering directory `/opt/local/var/macports/build/_opt_local_var_macports_sources_rsync.macports.org_macports_release_tarballs_ports_lang_gcc49/gcc49/work/build/libcpp' |
|---|
| 1238 | :info:build make[3]: Nothing to be done for `all'. |
|---|
| 1239 | :info:build make[3]: Leaving directory `/opt/local/var/macports/build/_opt_local_var_macports_sources_rsync.macports.org_macports_release_tarballs_ports_lang_gcc49/gcc49/work/build/libcpp' |
|---|
| 1240 | :info:build make[3]: Entering directory `/opt/local/var/macports/build/_opt_local_var_macports_sources_rsync.macports.org_macports_release_tarballs_ports_lang_gcc49/gcc49/work/build/gcc' |
|---|
| 1241 | :info:build /usr/bin/c++ -m64 -c -DIN_GCC_FRONTEND -g -DIN_GCC -fno-exceptions -fno-rtti -fasynchronous-unwind-tables -W -Wall -Wno-narrowing -Wwrite-strings -Wcast-qual -Wno-format -Wmissing-format-attribute -pedantic -Wno-long-long -Wno-variadic-macros -Wno-overlength-strings -fno-common -DHAVE_CONFIG_H -I. -Ic -I/opt/local/var/macports/build/_opt_local_var_macports_sources_rsync.macports.org_macports_release_tarballs_ports_lang_gcc49/gcc49/work/gcc-4.9.4/gcc -I/opt/local/var/macports/build/_opt_local_var_macports_sources_rsync.macports.org_macports_release_tarballs_ports_lang_gcc49/gcc49/work/gcc-4.9.4/gcc/c -I/opt/local/var/macports/build/_opt_local_var_macports_sources_rsync.macports.org_macports_release_tarballs_ports_lang_gcc49/gcc49/work/gcc-4.9.4/gcc/../include -I/opt/local/var/macports/build/_opt_local_var_macports_sources_rsync.macports.org_macports_release_tarballs_ports_lang_gcc49/gcc49/work/gcc-4.9.4/gcc/../libcpp/include -I/opt/local/include -I/opt/local/include -I/opt/local/include -I/opt/local/var/macports/build/_opt_local_var_macports_sources_rsync.macports.org_macports_release_tarballs_ports_lang_gcc49/gcc49/work/gcc-4.9.4/gcc/../libdecnumber -I/opt/local/var/macports/build/_opt_local_var_macports_sources_rsync.macports.org_macports_release_tarballs_ports_lang_gcc49/gcc49/work/gcc-4.9.4/gcc/../libdecnumber/dpd -I../libdecnumber -I/opt/local/var/macports/build/_opt_local_var_macports_sources_rsync.macports.org_macports_release_tarballs_ports_lang_gcc49/gcc49/work/gcc-4.9.4/gcc/../libbacktrace -DCLOOG_INT_GMP -I/opt/local/include -I/opt/local/libexec/isl18/include -I/opt/local/include -o c/c-objc-common.o -MT c/c-objc-common.o -MMD -MP -MF c/.deps/c-objc-common.TPo /opt/local/var/macports/build/_opt_local_var_macports_sources_rsync.macports.org_macports_release_tarballs_ports_lang_gcc49/gcc49/work/gcc-4.9.4/gcc/c/c-objc-common.c |
|---|
| 1242 | :info:build /usr/bin/c++ -m64 -c -g -DIN_GCC -fno-exceptions -fno-rtti -fasynchronous-unwind-tables -W -Wall -Wno-narrowing -Wwrite-strings -Wcast-qual -Wno-format -Wmissing-format-attribute -pedantic -Wno-long-long -Wno-variadic-macros -Wno-overlength-strings -fno-common -DHAVE_CONFIG_H -I. -I. -I/opt/local/var/macports/build/_opt_local_var_macports_sources_rsync.macports.org_macports_release_tarballs_ports_lang_gcc49/gcc49/work/gcc-4.9.4/gcc -I/opt/local/var/macports/build/_opt_local_var_macports_sources_rsync.macports.org_macports_release_tarballs_ports_lang_gcc49/gcc49/work/gcc-4.9.4/gcc/. -I/opt/local/var/macports/build/_opt_local_var_macports_sources_rsync.macports.org_macports_release_tarballs_ports_lang_gcc49/gcc49/work/gcc-4.9.4/gcc/../include -I/opt/local/var/macports/build/_opt_local_var_macports_sources_rsync.macports.org_macports_release_tarballs_ports_lang_gcc49/gcc49/work/gcc-4.9.4/gcc/../libcpp/include -I/opt/local/include -I/opt/local/include -I/opt/local/include -I/opt/local/var/macports/build/_opt_local_var_macports_sources_rsync.macports.org_macports_release_tarballs_ports_lang_gcc49/gcc49/work/gcc-4.9.4/gcc/../libdecnumber -I/opt/local/var/macports/build/_opt_local_var_macports_sources_rsync.macports.org_macports_release_tarballs_ports_lang_gcc49/gcc49/work/gcc-4.9.4/gcc/../libdecnumber/dpd -I../libdecnumber -I/opt/local/var/macports/build/_opt_local_var_macports_sources_rsync.macports.org_macports_release_tarballs_ports_lang_gcc49/gcc49/work/gcc-4.9.4/gcc/../libbacktrace -DCLOOG_INT_GMP -I/opt/local/include -I/opt/local/libexec/isl18/include -I/opt/local/include -o insn-extract.o -MT insn-extract.o -MMD -MP -MF ./.deps/insn-extract.TPo insn-extract.c |
|---|
| 1243 | :info:build /usr/bin/c++ -m64 -c -g -DIN_GCC -fno-exceptions -fno-rtti -fasynchronous-unwind-tables -W -Wall -Wno-narrowing -Wwrite-strings -Wcast-qual -Wno-format -Wmissing-format-attribute -pedantic -Wno-long-long -Wno-variadic-macros -Wno-overlength-strings -fno-common -DHAVE_CONFIG_H -I. -I. -I/opt/local/var/macports/build/_opt_local_var_macports_sources_rsync.macports.org_macports_release_tarballs_ports_lang_gcc49/gcc49/work/gcc-4.9.4/gcc -I/opt/local/var/macports/build/_opt_local_var_macports_sources_rsync.macports.org_macports_release_tarballs_ports_lang_gcc49/gcc49/work/gcc-4.9.4/gcc/. -I/opt/local/var/macports/build/_opt_local_var_macports_sources_rsync.macports.org_macports_release_tarballs_ports_lang_gcc49/gcc49/work/gcc-4.9.4/gcc/../include -I/opt/local/var/macports/build/_opt_local_var_macports_sources_rsync.macports.org_macports_release_tarballs_ports_lang_gcc49/gcc49/work/gcc-4.9.4/gcc/../libcpp/include -I/opt/local/include -I/opt/local/include -I/opt/local/include -I/opt/local/var/macports/build/_opt_local_var_macports_sources_rsync.macports.org_macports_release_tarballs_ports_lang_gcc49/gcc49/work/gcc-4.9.4/gcc/../libdecnumber -I/opt/local/var/macports/build/_opt_local_var_macports_sources_rsync.macports.org_macports_release_tarballs_ports_lang_gcc49/gcc49/work/gcc-4.9.4/gcc/../libdecnumber/dpd -I../libdecnumber -I/opt/local/var/macports/build/_opt_local_var_macports_sources_rsync.macports.org_macports_release_tarballs_ports_lang_gcc49/gcc49/work/gcc-4.9.4/gcc/../libbacktrace -DCLOOG_INT_GMP -I/opt/local/include -I/opt/local/libexec/isl18/include -I/opt/local/include -o insn-latencytab.o -MT insn-latencytab.o -MMD -MP -MF ./.deps/insn-latencytab.TPo insn-latencytab.c |
|---|
| 1244 | :info:build /usr/bin/c++ -m64 -c -g -DIN_GCC -fno-exceptions -fno-rtti -fasynchronous-unwind-tables -W -Wall -Wno-narrowing -Wwrite-strings -Wcast-qual -Wno-format -Wmissing-format-attribute -pedantic -Wno-long-long -Wno-variadic-macros -Wno-overlength-strings -fno-common -DHAVE_CONFIG_H -I. -I. -I/opt/local/var/macports/build/_opt_local_var_macports_sources_rsync.macports.org_macports_release_tarballs_ports_lang_gcc49/gcc49/work/gcc-4.9.4/gcc -I/opt/local/var/macports/build/_opt_local_var_macports_sources_rsync.macports.org_macports_release_tarballs_ports_lang_gcc49/gcc49/work/gcc-4.9.4/gcc/. -I/opt/local/var/macports/build/_opt_local_var_macports_sources_rsync.macports.org_macports_release_tarballs_ports_lang_gcc49/gcc49/work/gcc-4.9.4/gcc/../include -I/opt/local/var/macports/build/_opt_local_var_macports_sources_rsync.macports.org_macports_release_tarballs_ports_lang_gcc49/gcc49/work/gcc-4.9.4/gcc/../libcpp/include -I/opt/local/include -I/opt/local/include -I/opt/local/include -I/opt/local/var/macports/build/_opt_local_var_macports_sources_rsync.macports.org_macports_release_tarballs_ports_lang_gcc49/gcc49/work/gcc-4.9.4/gcc/../libdecnumber -I/opt/local/var/macports/build/_opt_local_var_macports_sources_rsync.macports.org_macports_release_tarballs_ports_lang_gcc49/gcc49/work/gcc-4.9.4/gcc/../libdecnumber/dpd -I../libdecnumber -I/opt/local/var/macports/build/_opt_local_var_macports_sources_rsync.macports.org_macports_release_tarballs_ports_lang_gcc49/gcc49/work/gcc-4.9.4/gcc/../libbacktrace -DCLOOG_INT_GMP -I/opt/local/include -I/opt/local/libexec/isl18/include -I/opt/local/include -o insn-modes.o -MT insn-modes.o -MMD -MP -MF ./.deps/insn-modes.TPo insn-modes.c |
|---|
| 1245 | :info:build clang: warning: treating 'c' input as 'c++' when in C++ mode, this behavior is deprecated [-Wdeprecated] |
|---|
| 1246 | :info:build clang: warning: treating 'c' input as 'c++' when in C++ mode, this behavior is deprecated [-Wdeprecated] |
|---|
| 1247 | :info:build clang: warning: treating 'c' input as 'c++' when in C++ mode, this behavior is deprecated [-Wdeprecated] |
|---|
| 1248 | :info:build clang: warning: treating 'c' input as 'c++' when in C++ mode, this behavior is deprecated [-Wdeprecated] |
|---|
| 1249 | :info:build insn-modes.c:742:3: warning: shift count >= width of type [-Wshift-count-overflow] |
|---|
| 1250 | :info:build MODE_MASK (8*BITS_PER_UNIT), /* DI */ |
|---|
| 1251 | :info:build ^~~~~~~~~~~~~~~~~~~~~~~~~~~ |
|---|
| 1252 | :info:build insn-modes.c:723:34: note: expanded from macro 'MODE_MASK' |
|---|
| 1253 | :info:build : ((unsigned HOST_WIDE_INT) 1 << (m)) - 1 |
|---|
| 1254 | :info:build ^ ~~~ |
|---|
| 1255 | :info:build insn-modes.c:743:3: warning: shift count >= width of type [-Wshift-count-overflow] |
|---|
| 1256 | :info:build MODE_MASK (16*BITS_PER_UNIT), /* TI */ |
|---|
| 1257 | :info:build ^~~~~~~~~~~~~~~~~~~~~~~~~~~~ |
|---|
| 1258 | :info:build insn-modes.c:723:34: note: expanded from macro 'MODE_MASK' |
|---|
| 1259 | :info:build : ((unsigned HOST_WIDE_INT) 1 << (m)) - 1 |
|---|
| 1260 | :info:build ^ ~~~ |
|---|
| 1261 | :info:build insn-modes.c:744:3: warning: shift count >= width of type [-Wshift-count-overflow] |
|---|
| 1262 | :info:build MODE_MASK (32*BITS_PER_UNIT), /* OI */ |
|---|
| 1263 | :info:build ^~~~~~~~~~~~~~~~~~~~~~~~~~~~ |
|---|
| 1264 | :info:build insn-modes.c:723:34: note: expanded from macro 'MODE_MASK' |
|---|
| 1265 | :info:build : ((unsigned HOST_WIDE_INT) 1 << (m)) - 1 |
|---|
| 1266 | :info:build ^ ~~~ |
|---|
| 1267 | :info:build insn-modes.c:745:3: warning: shift count >= width of type [-Wshift-count-overflow] |
|---|
| 1268 | :info:build MODE_MASK (64*BITS_PER_UNIT), /* XI */ |
|---|
| 1269 | :info:build ^~~~~~~~~~~~~~~~~~~~~~~~~~~~ |
|---|
| 1270 | :info:build insn-modes.c:723:34: note: expanded from macro 'MODE_MASK' |
|---|
| 1271 | :info:build : ((unsigned HOST_WIDE_INT) 1 << (m)) - 1 |
|---|
| 1272 | :info:build ^ ~~~ |
|---|
| 1273 | :info:build insn-modes.c:749:3: warning: shift count >= width of type [-Wshift-count-overflow] |
|---|
| 1274 | :info:build MODE_MASK (8*BITS_PER_UNIT), /* DQ */ |
|---|
| 1275 | :info:build ^~~~~~~~~~~~~~~~~~~~~~~~~~~ |
|---|
| 1276 | :info:build insn-modes.c:723:34: note: expanded from macro 'MODE_MASK' |
|---|
| 1277 | :info:build : ((unsigned HOST_WIDE_INT) 1 << (m)) - 1 |
|---|
| 1278 | :info:build ^ ~~~ |
|---|
| 1279 | :info:build insn-modes.c:750:3: warning: shift count >= width of type [-Wshift-count-overflow] |
|---|
| 1280 | :info:build MODE_MASK (16*BITS_PER_UNIT), /* TQ */ |
|---|
| 1281 | :info:build ^~~~~~~~~~~~~~~~~~~~~~~~~~~~ |
|---|
| 1282 | :info:build insn-modes.c:723:34: note: expanded from macro 'MODE_MASK' |
|---|
| 1283 | :info:build : ((unsigned HOST_WIDE_INT) 1 << (m)) - 1 |
|---|
| 1284 | :info:build ^ ~~~ |
|---|
| 1285 | :info:build insn-modes.c:754:3: warning: shift count >= width of type [-Wshift-count-overflow] |
|---|
| 1286 | :info:build MODE_MASK (8*BITS_PER_UNIT), /* UDQ */ |
|---|
| 1287 | :info:build ^~~~~~~~~~~~~~~~~~~~~~~~~~~ |
|---|
| 1288 | :info:build insn-modes.c:723:34: note: expanded from macro 'MODE_MASK' |
|---|
| 1289 | :info:build : ((unsigned HOST_WIDE_INT) 1 << (m)) - 1 |
|---|
| 1290 | :info:build ^ ~~~ |
|---|
| 1291 | :info:build insn-modes.c:755:3: warning: shift count >= width of type [-Wshift-count-overflow] |
|---|
| 1292 | :info:build MODE_MASK (16*BITS_PER_UNIT), /* UTQ */ |
|---|
| 1293 | :info:build ^~~~~~~~~~~~~~~~~~~~~~~~~~~~ |
|---|
| 1294 | :info:build insn-modes.c:723:34: note: expanded from macro 'MODE_MASK' |
|---|
| 1295 | :info:build : ((unsigned HOST_WIDE_INT) 1 << (m)) - 1 |
|---|
| 1296 | :info:build ^ ~~~ |
|---|
| 1297 | :info:build insn-modes.c:758:3: warning: shift count >= width of type [-Wshift-count-overflow] |
|---|
| 1298 | :info:build MODE_MASK (8*BITS_PER_UNIT), /* DA */ |
|---|
| 1299 | :info:build ^~~~~~~~~~~~~~~~~~~~~~~~~~~ |
|---|
| 1300 | :info:build insn-modes.c:723:34: note: expanded from macro 'MODE_MASK' |
|---|
| 1301 | :info:build : ((unsigned HOST_WIDE_INT) 1 << (m)) - 1 |
|---|
| 1302 | :info:build ^ ~~~ |
|---|
| 1303 | :info:build insn-modes.c:759:3: warning: shift count >= width of type [-Wshift-count-overflow] |
|---|
| 1304 | :info:build MODE_MASK (16*BITS_PER_UNIT), /* TA */ |
|---|
| 1305 | :info:build ^~~~~~~~~~~~~~~~~~~~~~~~~~~~ |
|---|
| 1306 | :info:build insn-modes.c:723:34: note: expanded from macro 'MODE_MASK' |
|---|
| 1307 | :info:build : ((unsigned HOST_WIDE_INT) 1 << (m)) - 1 |
|---|
| 1308 | :info:build ^ ~~~ |
|---|
| 1309 | :info:build insn-modes.c:762:3: warning: shift count >= width of type [-Wshift-count-overflow] |
|---|
| 1310 | :info:build MODE_MASK (8*BITS_PER_UNIT), /* UDA */ |
|---|
| 1311 | :info:build ^~~~~~~~~~~~~~~~~~~~~~~~~~~ |
|---|
| 1312 | :info:build insn-modes.c:723:34: note: expanded from macro 'MODE_MASK' |
|---|
| 1313 | :info:build : ((unsigned HOST_WIDE_INT) 1 << (m)) - 1 |
|---|
| 1314 | :info:build ^ ~~~ |
|---|
| 1315 | :info:build insn-modes.c:763:3: warning: shift count >= width of type [-Wshift-count-overflow] |
|---|
| 1316 | :info:build MODE_MASK (16*BITS_PER_UNIT), /* UTA */ |
|---|
| 1317 | :info:build ^~~~~~~~~~~~~~~~~~~~~~~~~~~~ |
|---|
| 1318 | :info:build insn-modes.c:723:34: note: expanded from macro 'MODE_MASK' |
|---|
| 1319 | :info:build : ((unsigned HOST_WIDE_INT) 1 << (m)) - 1 |
|---|
| 1320 | :info:build ^ ~~~ |
|---|
| 1321 | :info:build insn-modes.c:765:3: warning: shift count >= width of type [-Wshift-count-overflow] |
|---|
| 1322 | :info:build MODE_MASK (8*BITS_PER_UNIT), /* DF */ |
|---|
| 1323 | :info:build ^~~~~~~~~~~~~~~~~~~~~~~~~~~ |
|---|
| 1324 | :info:build insn-modes.c:723:34: note: expanded from macro 'MODE_MASK' |
|---|
| 1325 | :info:build : ((unsigned HOST_WIDE_INT) 1 << (m)) - 1 |
|---|
| 1326 | :info:build ^ ~~~ |
|---|
| 1327 | :info:build insn-modes.c:766:3: warning: shift count >= width of type [-Wshift-count-overflow] |
|---|
| 1328 | :info:build MODE_MASK (80), /* XF */ |
|---|
| 1329 | :info:build ^~~~~~~~~~~~~~ |
|---|
| 1330 | :info:build insn-modes.c:723:34: note: expanded from macro 'MODE_MASK' |
|---|
| 1331 | :info:build : ((unsigned HOST_WIDE_INT) 1 << (m)) - 1 |
|---|
| 1332 | :info:build ^ ~~~ |
|---|
| 1333 | :info:build insn-modes.c:767:3: warning: shift count >= width of type [-Wshift-count-overflow] |
|---|
| 1334 | :info:build MODE_MASK (16*BITS_PER_UNIT), /* TF */ |
|---|
| 1335 | :info:build ^~~~~~~~~~~~~~~~~~~~~~~~~~~~ |
|---|
| 1336 | :info:build insn-modes.c:723:34: note: expanded from macro 'MODE_MASK' |
|---|
| 1337 | :info:build : ((unsigned HOST_WIDE_INT) 1 << (m)) - 1 |
|---|
| 1338 | :info:build ^ ~~~ |
|---|
| 1339 | :info:build insn-modes.c:769:3: warning: shift count >= width of type [-Wshift-count-overflow] |
|---|
| 1340 | :info:build MODE_MASK (8*BITS_PER_UNIT), /* DD */ |
|---|
| 1341 | :info:build ^~~~~~~~~~~~~~~~~~~~~~~~~~~ |
|---|
| 1342 | :info:build insn-modes.c:723:34: note: expanded from macro 'MODE_MASK' |
|---|
| 1343 | :info:build : ((unsigned HOST_WIDE_INT) 1 << (m)) - 1 |
|---|
| 1344 | :info:build ^ ~~~ |
|---|
| 1345 | :info:build insn-modes.c:770:3: warning: shift count >= width of type [-Wshift-count-overflow] |
|---|
| 1346 | :info:build MODE_MASK (16*BITS_PER_UNIT), /* TD */ |
|---|
| 1347 | :info:build ^~~~~~~~~~~~~~~~~~~~~~~~~~~~ |
|---|
| 1348 | :info:build insn-modes.c:723:34: note: expanded from macro 'MODE_MASK' |
|---|
| 1349 | :info:build : ((unsigned HOST_WIDE_INT) 1 << (m)) - 1 |
|---|
| 1350 | :info:build ^ ~~~ |
|---|
| 1351 | :info:build insn-modes.c:773:3: warning: shift count >= width of type [-Wshift-count-overflow] |
|---|
| 1352 | :info:build MODE_MASK (8*BITS_PER_UNIT), /* CSI */ |
|---|
| 1353 | :info:build ^~~~~~~~~~~~~~~~~~~~~~~~~~~ |
|---|
| 1354 | :info:build insn-modes.c:723:34: note: expanded from macro 'MODE_MASK' |
|---|
| 1355 | :info:build : ((unsigned HOST_WIDE_INT) 1 << (m)) - 1 |
|---|
| 1356 | :info:build ^ ~~~ |
|---|
| 1357 | :info:build insn-modes.c:774:3: warning: shift count >= width of type [-Wshift-count-overflow] |
|---|
| 1358 | :info:build MODE_MASK (16*BITS_PER_UNIT), /* CDI */ |
|---|
| 1359 | :info:build ^~~~~~~~~~~~~~~~~~~~~~~~~~~~ |
|---|
| 1360 | :info:build insn-modes.c:723:34: note: expanded from macro 'MODE_MASK' |
|---|
| 1361 | :info:build : ((unsigned HOST_WIDE_INT) 1 << (m)) - 1 |
|---|
| 1362 | :info:build ^ ~~~ |
|---|
| 1363 | :info:build insn-modes.c:775:3: warning: shift count >= width of type [-Wshift-count-overflow] |
|---|
| 1364 | :info:build MODE_MASK (32*BITS_PER_UNIT), /* CTI */ |
|---|
| 1365 | :info:build ^~~~~~~~~~~~~~~~~~~~~~~~~~~~ |
|---|
| 1366 | :info:build insn-modes.c:723:34: note: expanded from macro 'MODE_MASK' |
|---|
| 1367 | :info:build : ((unsigned HOST_WIDE_INT) 1 << (m)) - 1 |
|---|
| 1368 | :info:build ^ ~~~ |
|---|
| 1369 | :info:build insn-modes.c:776:3: warning: shift count >= width of type [-Wshift-count-overflow] |
|---|
| 1370 | :info:build MODE_MASK (64*BITS_PER_UNIT), /* COI */ |
|---|
| 1371 | :info:build ^~~~~~~~~~~~~~~~~~~~~~~~~~~~ |
|---|
| 1372 | :info:build insn-modes.c:723:34: note: expanded from macro 'MODE_MASK' |
|---|
| 1373 | :info:build : ((unsigned HOST_WIDE_INT) 1 << (m)) - 1 |
|---|
| 1374 | :info:build ^ ~~~ |
|---|
| 1375 | :info:build insn-modes.c:777:3: warning: shift count >= width of type [-Wshift-count-overflow] |
|---|
| 1376 | :info:build MODE_MASK (128*BITS_PER_UNIT), /* CXI */ |
|---|
| 1377 | :info:build ^~~~~~~~~~~~~~~~~~~~~~~~~~~~~ |
|---|
| 1378 | :info:build insn-modes.c:723:34: note: expanded from macro 'MODE_MASK' |
|---|
| 1379 | :info:build : ((unsigned HOST_WIDE_INT) 1 << (m)) - 1 |
|---|
| 1380 | :info:build ^ ~~~ |
|---|
| 1381 | :info:build insn-modes.c:778:3: warning: shift count >= width of type [-Wshift-count-overflow] |
|---|
| 1382 | :info:build MODE_MASK (8*BITS_PER_UNIT), /* SC */ |
|---|
| 1383 | :info:build ^~~~~~~~~~~~~~~~~~~~~~~~~~~ |
|---|
| 1384 | :info:build insn-modes.c:723:34: note: expanded from macro 'MODE_MASK' |
|---|
| 1385 | :info:build : ((unsigned HOST_WIDE_INT) 1 << (m)) - 1 |
|---|
| 1386 | :info:build ^ ~~~ |
|---|
| 1387 | :info:build insn-modes.c:779:3: warning: shift count >= width of type [-Wshift-count-overflow] |
|---|
| 1388 | :info:build MODE_MASK (16*BITS_PER_UNIT), /* DC */ |
|---|
| 1389 | :info:build ^~~~~~~~~~~~~~~~~~~~~~~~~~~~ |
|---|
| 1390 | :info:build insn-modes.c:723:34: note: expanded from macro 'MODE_MASK' |
|---|
| 1391 | :info:build : ((unsigned HOST_WIDE_INT) 1 << (m)) - 1 |
|---|
| 1392 | :info:build ^ ~~~ |
|---|
| 1393 | :info:build insn-modes.c:780:3: warning: shift count >= width of type [-Wshift-count-overflow] |
|---|
| 1394 | :info:build MODE_MASK (160), /* XC */ |
|---|
| 1395 | :info:build ^~~~~~~~~~~~~~~ |
|---|
| 1396 | :info:build insn-modes.c:723:34: note: expanded from macro 'MODE_MASK' |
|---|
| 1397 | :info:build : ((unsigned HOST_WIDE_INT) 1 << (m)) - 1 |
|---|
| 1398 | :info:build ^ ~~~ |
|---|
| 1399 | :info:build insn-modes.c:781:3: warning: shift count >= width of type [-Wshift-count-overflow] |
|---|
| 1400 | :info:build MODE_MASK (32*BITS_PER_UNIT), /* TC */ |
|---|
| 1401 | :info:build ^~~~~~~~~~~~~~~~~~~~~~~~~~~~ |
|---|
| 1402 | :info:build insn-modes.c:723:34: note: expanded from macro 'MODE_MASK' |
|---|
| 1403 | :info:build : ((unsigned HOST_WIDE_INT) 1 << (m)) - 1 |
|---|
| 1404 | :info:build ^ ~~~ |
|---|
| 1405 | :info:build insn-modes.c:786:3: warning: shift count >= width of type [-Wshift-count-overflow] |
|---|
| 1406 | :info:build MODE_MASK (8*BITS_PER_UNIT), /* V8QI */ |
|---|
| 1407 | :info:build ^~~~~~~~~~~~~~~~~~~~~~~~~~~ |
|---|
| 1408 | :info:build insn-modes.c:723:34: note: expanded from macro 'MODE_MASK' |
|---|
| 1409 | :info:build : ((unsigned HOST_WIDE_INT) 1 << (m)) - 1 |
|---|
| 1410 | :info:build ^ ~~~ |
|---|
| 1411 | :info:build insn-modes.c:787:3: warning: shift count >= width of type [-Wshift-count-overflow] |
|---|
| 1412 | :info:build MODE_MASK (8*BITS_PER_UNIT), /* V4HI */ |
|---|
| 1413 | :info:build ^~~~~~~~~~~~~~~~~~~~~~~~~~~ |
|---|
| 1414 | :info:build insn-modes.c:723:34: note: expanded from macro 'MODE_MASK' |
|---|
| 1415 | :info:build : ((unsigned HOST_WIDE_INT) 1 << (m)) - 1 |
|---|
| 1416 | :info:build ^ ~~~ |
|---|
| 1417 | :info:build insn-modes.c:788:3: warning: shift count >= width of type [-Wshift-count-overflow] |
|---|
| 1418 | :info:build MODE_MASK (8*BITS_PER_UNIT), /* V2SI */ |
|---|
| 1419 | :info:build ^~~~~~~~~~~~~~~~~~~~~~~~~~~ |
|---|
| 1420 | :info:build insn-modes.c:723:34: note: expanded from macro 'MODE_MASK' |
|---|
| 1421 | :info:build : ((unsigned HOST_WIDE_INT) 1 << (m)) - 1 |
|---|
| 1422 | :info:build ^ ~~~ |
|---|
| 1423 | :info:build insn-modes.c:789:3: warning: shift count >= width of type [-Wshift-count-overflow] |
|---|
| 1424 | :info:build MODE_MASK (8*BITS_PER_UNIT), /* V1DI */ |
|---|
| 1425 | :info:build ^~~~~~~~~~~~~~~~~~~~~~~~~~~ |
|---|
| 1426 | :info:build insn-modes.c:723:34: note: expanded from macro 'MODE_MASK' |
|---|
| 1427 | :info:build : ((unsigned HOST_WIDE_INT) 1 << (m)) - 1 |
|---|
| 1428 | :info:build ^ ~~~ |
|---|
| 1429 | :info:build insn-modes.c:790:3: warning: shift count >= width of type [-Wshift-count-overflow] |
|---|
| 1430 | :info:build MODE_MASK (16*BITS_PER_UNIT), /* V16QI */ |
|---|
| 1431 | :info:build ^~~~~~~~~~~~~~~~~~~~~~~~~~~~ |
|---|
| 1432 | :info:build insn-modes.c:723:34: note: expanded from macro 'MODE_MASK' |
|---|
| 1433 | :info:build : ((unsigned HOST_WIDE_INT) 1 << (m)) - 1 |
|---|
| 1434 | :info:build ^ ~~~ |
|---|
| 1435 | :info:build insn-modes.c:791:3: warning: shift count >= width of type [-Wshift-count-overflow] |
|---|
| 1436 | :info:build MODE_MASK (16*BITS_PER_UNIT), /* V8HI */ |
|---|
| 1437 | :info:build ^~~~~~~~~~~~~~~~~~~~~~~~~~~~ |
|---|
| 1438 | :info:build insn-modes.c:723:34: note: expanded from macro 'MODE_MASK' |
|---|
| 1439 | :info:build : ((unsigned HOST_WIDE_INT) 1 << (m)) - 1 |
|---|
| 1440 | :info:build ^ ~~~ |
|---|
| 1441 | :info:build insn-modes.c:792:3: warning: shift count >= width of type [-Wshift-count-overflow] |
|---|
| 1442 | :info:build MODE_MASK (16*BITS_PER_UNIT), /* V4SI */ |
|---|
| 1443 | :info:build ^~~~~~~~~~~~~~~~~~~~~~~~~~~~ |
|---|
| 1444 | :info:build insn-modes.c:723:34: note: expanded from macro 'MODE_MASK' |
|---|
| 1445 | :info:build : ((unsigned HOST_WIDE_INT) 1 << (m)) - 1 |
|---|
| 1446 | :info:build ^ ~~~ |
|---|
| 1447 | :info:build insn-modes.c:793:3: warning: shift count >= width of type [-Wshift-count-overflow] |
|---|
| 1448 | :info:build MODE_MASK (16*BITS_PER_UNIT), /* V2DI */ |
|---|
| 1449 | :info:build ^~~~~~~~~~~~~~~~~~~~~~~~~~~~ |
|---|
| 1450 | :info:build insn-modes.c:723:34: note: expanded from macro 'MODE_MASK' |
|---|
| 1451 | :info:build : ((unsigned HOST_WIDE_INT) 1 << (m)) - 1 |
|---|
| 1452 | :info:build ^ ~~~ |
|---|
| 1453 | :info:build insn-modes.c:794:3: warning: shift count >= width of type [-Wshift-count-overflow] |
|---|
| 1454 | :info:build MODE_MASK (16*BITS_PER_UNIT), /* V1TI */ |
|---|
| 1455 | :info:build ^~~~~~~~~~~~~~~~~~~~~~~~~~~~ |
|---|
| 1456 | :info:build insn-modes.c:723:34: note: expanded from macro 'MODE_MASK' |
|---|
| 1457 | :info:build : ((unsigned HOST_WIDE_INT) 1 << (m)) - 1 |
|---|
| 1458 | :info:build ^ ~~~ |
|---|
| 1459 | :info:build insn-modes.c:795:3: warning: shift count >= width of type [-Wshift-count-overflow] |
|---|
| 1460 | :info:build MODE_MASK (32*BITS_PER_UNIT), /* V32QI */ |
|---|
| 1461 | :info:build ^~~~~~~~~~~~~~~~~~~~~~~~~~~~ |
|---|
| 1462 | :info:build insn-modes.c:723:34: note: expanded from macro 'MODE_MASK' |
|---|
| 1463 | :info:build : ((unsigned HOST_WIDE_INT) 1 << (m)) - 1 |
|---|
| 1464 | :info:build ^ ~~~ |
|---|
| 1465 | :info:build insn-modes.c:796:3: warning: shift count >= width of type [-Wshift-count-overflow] |
|---|
| 1466 | :info:build MODE_MASK (32*BITS_PER_UNIT), /* V16HI */ |
|---|
| 1467 | :info:build ^~~~~~~~~~~~~~~~~~~~~~~~~~~~ |
|---|
| 1468 | :info:build insn-modes.c:723:34: note: expanded from macro 'MODE_MASK' |
|---|
| 1469 | :info:build : ((unsigned HOST_WIDE_INT) 1 << (m)) - 1 |
|---|
| 1470 | :info:build ^ ~~~ |
|---|
| 1471 | :info:build insn-modes.c:797:3: warning: shift count >= width of type [-Wshift-count-overflow] |
|---|
| 1472 | :info:build MODE_MASK (32*BITS_PER_UNIT), /* V8SI */ |
|---|
| 1473 | :info:build ^~~~~~~~~~~~~~~~~~~~~~~~~~~~ |
|---|
| 1474 | :info:build insn-modes.c:723:34: note: expanded from macro 'MODE_MASK' |
|---|
| 1475 | :info:build : ((unsigned HOST_WIDE_INT) 1 << (m)) - 1 |
|---|
| 1476 | :info:build ^ ~~~ |
|---|
| 1477 | :info:build insn-modes.c:798:3: warning: shift count >= width of type [-Wshift-count-overflow] |
|---|
| 1478 | :info:build MODE_MASK (32*BITS_PER_UNIT), /* V4DI */ |
|---|
| 1479 | :info:build ^~~~~~~~~~~~~~~~~~~~~~~~~~~~ |
|---|
| 1480 | :info:build insn-modes.c:723:34: note: expanded from macro 'MODE_MASK' |
|---|
| 1481 | :info:build : ((unsigned HOST_WIDE_INT) 1 << (m)) - 1 |
|---|
| 1482 | :info:build ^ ~~~ |
|---|
| 1483 | :info:build insn-modes.c:799:3: warning: shift count >= width of type [-Wshift-count-overflow] |
|---|
| 1484 | :info:build MODE_MASK (32*BITS_PER_UNIT), /* V2TI */ |
|---|
| 1485 | :info:build ^~~~~~~~~~~~~~~~~~~~~~~~~~~~ |
|---|
| 1486 | :info:build insn-modes.c:723:34: note: expanded from macro 'MODE_MASK' |
|---|
| 1487 | :info:build : ((unsigned HOST_WIDE_INT) 1 << (m)) - 1 |
|---|
| 1488 | :info:build ^ ~~~ |
|---|
| 1489 | :info:build insn-modes.c:800:3: warning: shift count >= width of type [-Wshift-count-overflow] |
|---|
| 1490 | :info:build MODE_MASK (64*BITS_PER_UNIT), /* V64QI */ |
|---|
| 1491 | :info:build ^~~~~~~~~~~~~~~~~~~~~~~~~~~~ |
|---|
| 1492 | :info:build insn-modes.c:723:34: note: expanded from macro 'MODE_MASK' |
|---|
| 1493 | :info:build : ((unsigned HOST_WIDE_INT) 1 << (m)) - 1 |
|---|
| 1494 | :info:build ^ ~~~ |
|---|
| 1495 | :info:build insn-modes.c:801:3: warning: shift count >= width of type [-Wshift-count-overflow] |
|---|
| 1496 | :info:build MODE_MASK (64*BITS_PER_UNIT), /* V32HI */ |
|---|
| 1497 | :info:build ^~~~~~~~~~~~~~~~~~~~~~~~~~~~ |
|---|
| 1498 | :info:build insn-modes.c:723:34: note: expanded from macro 'MODE_MASK' |
|---|
| 1499 | :info:build : ((unsigned HOST_WIDE_INT) 1 << (m)) - 1 |
|---|
| 1500 | :info:build ^ ~~~ |
|---|
| 1501 | :info:build insn-modes.c:802:3: warning: shift count >= width of type [-Wshift-count-overflow] |
|---|
| 1502 | :info:build MODE_MASK (64*BITS_PER_UNIT), /* V16SI */ |
|---|
| 1503 | :info:build ^~~~~~~~~~~~~~~~~~~~~~~~~~~~ |
|---|
| 1504 | :info:build insn-modes.c:723:34: note: expanded from macro 'MODE_MASK' |
|---|
| 1505 | :info:build : ((unsigned HOST_WIDE_INT) 1 << (m)) - 1 |
|---|
| 1506 | :info:build ^ ~~~ |
|---|
| 1507 | :info:build insn-modes.c:803:3: warning: shift count >= width of type [-Wshift-count-overflow] |
|---|
| 1508 | :info:build MODE_MASK (64*BITS_PER_UNIT), /* V8DI */ |
|---|
| 1509 | :info:build ^~~~~~~~~~~~~~~~~~~~~~~~~~~~ |
|---|
| 1510 | :info:build insn-modes.c:723:34: note: expanded from macro 'MODE_MASK' |
|---|
| 1511 | :info:build : ((unsigned HOST_WIDE_INT) 1 << (m)) - 1 |
|---|
| 1512 | :info:build ^ ~~~ |
|---|
| 1513 | :info:build insn-modes.c:804:3: warning: shift count >= width of type [-Wshift-count-overflow] |
|---|
| 1514 | :info:build MODE_MASK (64*BITS_PER_UNIT), /* V4TI */ |
|---|
| 1515 | :info:build ^~~~~~~~~~~~~~~~~~~~~~~~~~~~ |
|---|
| 1516 | :info:build insn-modes.c:723:34: note: expanded from macro 'MODE_MASK' |
|---|
| 1517 | :info:build : ((unsigned HOST_WIDE_INT) 1 << (m)) - 1 |
|---|
| 1518 | :info:build ^ ~~~ |
|---|
| 1519 | :info:build insn-modes.c:805:3: warning: shift count >= width of type [-Wshift-count-overflow] |
|---|
| 1520 | :info:build MODE_MASK (128*BITS_PER_UNIT), /* V128QI */ |
|---|
| 1521 | :info:build ^~~~~~~~~~~~~~~~~~~~~~~~~~~~~ |
|---|
| 1522 | :info:build insn-modes.c:723:34: note: expanded from macro 'MODE_MASK' |
|---|
| 1523 | :info:build : ((unsigned HOST_WIDE_INT) 1 << (m)) - 1 |
|---|
| 1524 | :info:build ^ ~~~ |
|---|
| 1525 | :info:build insn-modes.c:806:3: warning: shift count >= width of type [-Wshift-count-overflow] |
|---|
| 1526 | :info:build MODE_MASK (128*BITS_PER_UNIT), /* V64HI */ |
|---|
| 1527 | :info:build ^~~~~~~~~~~~~~~~~~~~~~~~~~~~~ |
|---|
| 1528 | :info:build insn-modes.c:723:34: note: expanded from macro 'MODE_MASK' |
|---|
| 1529 | :info:build : ((unsigned HOST_WIDE_INT) 1 << (m)) - 1 |
|---|
| 1530 | :info:build ^ ~~~ |
|---|
| 1531 | :info:build insn-modes.c:807:3: warning: shift count >= width of type [-Wshift-count-overflow] |
|---|
| 1532 | :info:build MODE_MASK (128*BITS_PER_UNIT), /* V32SI */ |
|---|
| 1533 | :info:build ^~~~~~~~~~~~~~~~~~~~~~~~~~~~~ |
|---|
| 1534 | :info:build insn-modes.c:723:34: note: expanded from macro 'MODE_MASK' |
|---|
| 1535 | :info:build : ((unsigned HOST_WIDE_INT) 1 << (m)) - 1 |
|---|
| 1536 | :info:build ^ ~~~ |
|---|
| 1537 | :info:build insn-modes.c:808:3: warning: shift count >= width of type [-Wshift-count-overflow] |
|---|
| 1538 | :info:build MODE_MASK (128*BITS_PER_UNIT), /* V16DI */ |
|---|
| 1539 | :info:build ^~~~~~~~~~~~~~~~~~~~~~~~~~~~~ |
|---|
| 1540 | :info:build insn-modes.c:723:34: note: expanded from macro 'MODE_MASK' |
|---|
| 1541 | :info:build : ((unsigned HOST_WIDE_INT) 1 << (m)) - 1 |
|---|
| 1542 | :info:build ^ ~~~ |
|---|
| 1543 | :info:build insn-modes.c:809:3: warning: shift count >= width of type [-Wshift-count-overflow] |
|---|
| 1544 | :info:build MODE_MASK (128*BITS_PER_UNIT), /* V8TI */ |
|---|
| 1545 | :info:build ^~~~~~~~~~~~~~~~~~~~~~~~~~~~~ |
|---|
| 1546 | :info:build insn-modes.c:723:34: note: expanded from macro 'MODE_MASK' |
|---|
| 1547 | :info:build : ((unsigned HOST_WIDE_INT) 1 << (m)) - 1 |
|---|
| 1548 | :info:build ^ ~~~ |
|---|
| 1549 | :info:build insn-modes.c:810:3: warning: shift count >= width of type [-Wshift-count-overflow] |
|---|
| 1550 | :info:build MODE_MASK (8*BITS_PER_UNIT), /* V2SF */ |
|---|
| 1551 | :info:build ^~~~~~~~~~~~~~~~~~~~~~~~~~~ |
|---|
| 1552 | :info:build insn-modes.c:723:34: note: expanded from macro 'MODE_MASK' |
|---|
| 1553 | :info:build : ((unsigned HOST_WIDE_INT) 1 << (m)) - 1 |
|---|
| 1554 | :info:build ^ ~~~ |
|---|
| 1555 | :info:build insn-modes.c:811:3: warning: shift count >= width of type [-Wshift-count-overflow] |
|---|
| 1556 | :info:build MODE_MASK (16*BITS_PER_UNIT), /* V4SF */ |
|---|
| 1557 | :info:build ^~~~~~~~~~~~~~~~~~~~~~~~~~~~ |
|---|
| 1558 | :info:build insn-modes.c:723:34: note: expanded from macro 'MODE_MASK' |
|---|
| 1559 | :info:build : ((unsigned HOST_WIDE_INT) 1 << (m)) - 1 |
|---|
| 1560 | :info:build ^ ~~~ |
|---|
| 1561 | :info:build insn-modes.c:812:3: warning: shift count >= width of type [-Wshift-count-overflow] |
|---|
| 1562 | :info:build MODE_MASK (16*BITS_PER_UNIT), /* V2DF */ |
|---|
| 1563 | :info:build ^~~~~~~~~~~~~~~~~~~~~~~~~~~~ |
|---|
| 1564 | :info:build insn-modes.c:723:34: note: expanded from macro 'MODE_MASK' |
|---|
| 1565 | :info:build : ((unsigned HOST_WIDE_INT) 1 << (m)) - 1 |
|---|
| 1566 | :info:build ^ ~~~ |
|---|
| 1567 | :info:build insn-modes.c:813:3: warning: shift count >= width of type [-Wshift-count-overflow] |
|---|
| 1568 | :info:build MODE_MASK (32*BITS_PER_UNIT), /* V8SF */ |
|---|
| 1569 | :info:build ^~~~~~~~~~~~~~~~~~~~~~~~~~~~ |
|---|
| 1570 | :info:build insn-modes.c:723:34: note: expanded from macro 'MODE_MASK' |
|---|
| 1571 | :info:build : ((unsigned HOST_WIDE_INT) 1 << (m)) - 1 |
|---|
| 1572 | :info:build ^ ~~~ |
|---|
| 1573 | :info:build insn-modes.c:814:3: warning: shift count >= width of type [-Wshift-count-overflow] |
|---|
| 1574 | :info:build MODE_MASK (32*BITS_PER_UNIT), /* V4DF */ |
|---|
| 1575 | :info:build ^~~~~~~~~~~~~~~~~~~~~~~~~~~~ |
|---|
| 1576 | :info:build insn-modes.c:723:34: note: expanded from macro 'MODE_MASK' |
|---|
| 1577 | :info:build : ((unsigned HOST_WIDE_INT) 1 << (m)) - 1 |
|---|
| 1578 | :info:build ^ ~~~ |
|---|
| 1579 | :info:build insn-modes.c:815:3: warning: shift count >= width of type [-Wshift-count-overflow] |
|---|
| 1580 | :info:build MODE_MASK (32*BITS_PER_UNIT), /* V2TF */ |
|---|
| 1581 | :info:build ^~~~~~~~~~~~~~~~~~~~~~~~~~~~ |
|---|
| 1582 | :info:build insn-modes.c:723:34: note: expanded from macro 'MODE_MASK' |
|---|
| 1583 | :info:build : ((unsigned HOST_WIDE_INT) 1 << (m)) - 1 |
|---|
| 1584 | :info:build ^ ~~~ |
|---|
| 1585 | :info:build insn-modes.c:816:3: warning: shift count >= width of type [-Wshift-count-overflow] |
|---|
| 1586 | :info:build MODE_MASK (64*BITS_PER_UNIT), /* V16SF */ |
|---|
| 1587 | :info:build ^~~~~~~~~~~~~~~~~~~~~~~~~~~~ |
|---|
| 1588 | :info:build insn-modes.c:723:34: note: expanded from macro 'MODE_MASK' |
|---|
| 1589 | :info:build : ((unsigned HOST_WIDE_INT) 1 << (m)) - 1 |
|---|
| 1590 | :info:build ^ ~~~ |
|---|
| 1591 | :info:build insn-modes.c:817:3: warning: shift count >= width of type [-Wshift-count-overflow] |
|---|
| 1592 | :info:build MODE_MASK (64*BITS_PER_UNIT), /* V8DF */ |
|---|
| 1593 | :info:build ^~~~~~~~~~~~~~~~~~~~~~~~~~~~ |
|---|
| 1594 | :info:build insn-modes.c:723:34: note: expanded from macro 'MODE_MASK' |
|---|
| 1595 | :info:build : ((unsigned HOST_WIDE_INT) 1 << (m)) - 1 |
|---|
| 1596 | :info:build ^ ~~~ |
|---|
| 1597 | :info:build insn-modes.c:818:3: warning: shift count >= width of type [-Wshift-count-overflow] |
|---|
| 1598 | :info:build MODE_MASK (64*BITS_PER_UNIT), /* V4TF */ |
|---|
| 1599 | :info:build ^~~~~~~~~~~~~~~~~~~~~~~~~~~~ |
|---|
| 1600 | :info:build insn-modes.c:723:34: note: expanded from macro 'MODE_MASK' |
|---|
| 1601 | :info:build : ((unsigned HOST_WIDE_INT) 1 << (m)) - 1 |
|---|
| 1602 | :info:build ^ ~~~ |
|---|
| 1603 | :info:build insn-modes.c:819:3: warning: shift count >= width of type [-Wshift-count-overflow] |
|---|
| 1604 | :info:build MODE_MASK (128*BITS_PER_UNIT), /* V32SF */ |
|---|
| 1605 | :info:build ^~~~~~~~~~~~~~~~~~~~~~~~~~~~~ |
|---|
| 1606 | :info:build insn-modes.c:723:34: note: expanded from macro 'MODE_MASK' |
|---|
| 1607 | :info:build : ((unsigned HOST_WIDE_INT) 1 << (m)) - 1 |
|---|
| 1608 | :info:build ^ ~~~ |
|---|
| 1609 | :info:build insn-modes.c:820:3: warning: shift count >= width of type [-Wshift-count-overflow] |
|---|
| 1610 | :info:build MODE_MASK (128*BITS_PER_UNIT), /* V16DF */ |
|---|
| 1611 | :info:build ^~~~~~~~~~~~~~~~~~~~~~~~~~~~~ |
|---|
| 1612 | :info:build insn-modes.c:723:34: note: expanded from macro 'MODE_MASK' |
|---|
| 1613 | :info:build : ((unsigned HOST_WIDE_INT) 1 << (m)) - 1 |
|---|
| 1614 | :info:build ^ ~~~ |
|---|
| 1615 | :info:build insn-modes.c:821:3: warning: shift count >= width of type [-Wshift-count-overflow] |
|---|
| 1616 | :info:build MODE_MASK (128*BITS_PER_UNIT), /* V8TF */ |
|---|
| 1617 | :info:build ^~~~~~~~~~~~~~~~~~~~~~~~~~~~~ |
|---|
| 1618 | :info:build insn-modes.c:723:34: note: expanded from macro 'MODE_MASK' |
|---|
| 1619 | :info:build : ((unsigned HOST_WIDE_INT) 1 << (m)) - 1 |
|---|
| 1620 | :info:build ^ ~~~ |
|---|
| 1621 | :info:build In file included from insn-extract.c:8: |
|---|
| 1622 | :info:build In file included from /opt/local/var/macports/build/_opt_local_var_macports_sources_rsync.macports.org_macports_release_tarballs_ports_lang_gcc49/gcc49/work/gcc-4.9.4/gcc/rtl.h:2350: |
|---|
| 1623 | :info:build ./genrtl.h:447:3: warning: array index 1 is past the end of the array (which contains 1 element) [-Warray-bounds] |
|---|
| 1624 | :info:build XWINT (rt, 1) = arg1; |
|---|
| 1625 | :info:build ^ ~ |
|---|
| 1626 | :info:build /opt/local/var/macports/build/_opt_local_var_macports_sources_rsync.macports.org_macports_release_tarballs_ports_lang_gcc49/gcc49/work/gcc-4.9.4/gcc/rtl.h:663:29: note: expanded from macro 'XWINT' |
|---|
| 1627 | :info:build #define XWINT(RTX, N) ((RTX)->u.hwint[N]) |
|---|
| 1628 | :info:build ^ ~ |
|---|
| 1629 | :info:build /opt/local/var/macports/build/_opt_local_var_macports_sources_rsync.macports.org_macports_release_tarballs_ports_lang_gcc49/gcc49/work/gcc-4.9.4/gcc/rtl.h:342:5: note: array 'hwint' declared here |
|---|
| 1630 | :info:build HOST_WIDE_INT hwint[1]; |
|---|
| 1631 | :info:build ^ |
|---|
| 1632 | :info:build /opt/local/var/macports/build/_opt_local_var_macports_sources_rsync.macports.org_macports_release_tarballs_ports_lang_gcc49/gcc49/work/gcc-4.9.4/gcc/hwint.h:61:26: note: expanded from macro 'HOST_WIDE_INT' |
|---|
| 1633 | :info:build # define HOST_WIDE_INT long |
|---|
| 1634 | :info:build ^ |
|---|
| 1635 | :info:build In file included from insn-extract.c:8: |
|---|
| 1636 | :info:build In file included from /opt/local/var/macports/build/_opt_local_var_macports_sources_rsync.macports.org_macports_release_tarballs_ports_lang_gcc49/gcc49/work/gcc-4.9.4/gcc/rtl.h:2350: |
|---|
| 1637 | :info:build ./genrtl.h:448:3: warning: array index 2 is past the end of the array (which contains 1 element) [-Warray-bounds] |
|---|
| 1638 | :info:build XWINT (rt, 2) = arg2; |
|---|
| 1639 | :info:build ^ ~ |
|---|
| 1640 | :info:build /opt/local/var/macports/build/_opt_local_var_macports_sources_rsync.macports.org_macports_release_tarballs_ports_lang_gcc49/gcc49/work/gcc-4.9.4/gcc/rtl.h:663:29: note: expanded from macro 'XWINT' |
|---|
| 1641 | :info:build #define XWINT(RTX, N) ((RTX)->u.hwint[N]) |
|---|
| 1642 | :info:build ^ ~ |
|---|
| 1643 | :info:build /opt/local/var/macports/build/_opt_local_var_macports_sources_rsync.macports.org_macports_release_tarballs_ports_lang_gcc49/gcc49/work/gcc-4.9.4/gcc/rtl.h:342:5: note: array 'hwint' declared here |
|---|
| 1644 | :info:build HOST_WIDE_INT hwint[1]; |
|---|
| 1645 | :info:build ^ |
|---|
| 1646 | :info:build /opt/local/var/macports/build/_opt_local_var_macports_sources_rsync.macports.org_macports_release_tarballs_ports_lang_gcc49/gcc49/work/gcc-4.9.4/gcc/hwint.h:61:26: note: expanded from macro 'HOST_WIDE_INT' |
|---|
| 1647 | :info:build # define HOST_WIDE_INT long |
|---|
| 1648 | :info:build ^ |
|---|
| 1649 | :info:build In file included from insn-extract.c:10: |
|---|
| 1650 | :info:build /opt/local/var/macports/build/_opt_local_var_macports_sources_rsync.macports.org_macports_release_tarballs_ports_lang_gcc49/gcc49/work/gcc-4.9.4/gcc/recog.h:338:5: warning: macro expansion producing 'defined' has undefined behavior [-Wexpansion-to-defined] |
|---|
| 1651 | :info:build #if HAVE_DESIGNATED_UNION_INITIALIZERS |
|---|
| 1652 | :info:build ^ |
|---|
| 1653 | :info:build /opt/local/var/macports/build/_opt_local_var_macports_sources_rsync.macports.org_macports_release_tarballs_ports_lang_gcc49/gcc49/work/gcc-4.9.4/gcc/system.h:554:9: note: expanded from macro 'HAVE_DESIGNATED_UNION_INITIALIZERS' |
|---|
| 1654 | :info:build && (!defined(__cplusplus) || (GCC_VERSION >= 4007))) |
|---|
| 1655 | :info:build ^ |
|---|
| 1656 | :info:build 62 warnings generated. |
|---|
| 1657 | :info:build /usr/bin/c++ -m64 -c -g -DIN_GCC -fno-exceptions -fno-rtti -fasynchronous-unwind-tables -W -Wall -Wno-narrowing -Wwrite-strings -Wcast-qual -Wno-format -Wmissing-format-attribute -pedantic -Wno-long-long -Wno-variadic-macros -Wno-overlength-strings -fno-common -DHAVE_CONFIG_H -I. -I. -I/opt/local/var/macports/build/_opt_local_var_macports_sources_rsync.macports.org_macports_release_tarballs_ports_lang_gcc49/gcc49/work/gcc-4.9.4/gcc -I/opt/local/var/macports/build/_opt_local_var_macports_sources_rsync.macports.org_macports_release_tarballs_ports_lang_gcc49/gcc49/work/gcc-4.9.4/gcc/. -I/opt/local/var/macports/build/_opt_local_var_macports_sources_rsync.macports.org_macports_release_tarballs_ports_lang_gcc49/gcc49/work/gcc-4.9.4/gcc/../include -I/opt/local/var/macports/build/_opt_local_var_macports_sources_rsync.macports.org_macports_release_tarballs_ports_lang_gcc49/gcc49/work/gcc-4.9.4/gcc/../libcpp/include -I/opt/local/include -I/opt/local/include -I/opt/local/include -I/opt/local/var/macports/build/_opt_local_var_macports_sources_rsync.macports.org_macports_release_tarballs_ports_lang_gcc49/gcc49/work/gcc-4.9.4/gcc/../libdecnumber -I/opt/local/var/macports/build/_opt_local_var_macports_sources_rsync.macports.org_macports_release_tarballs_ports_lang_gcc49/gcc49/work/gcc-4.9.4/gcc/../libdecnumber/dpd -I../libdecnumber -I/opt/local/var/macports/build/_opt_local_var_macports_sources_rsync.macports.org_macports_release_tarballs_ports_lang_gcc49/gcc49/work/gcc-4.9.4/gcc/../libbacktrace -DCLOOG_INT_GMP -I/opt/local/include -I/opt/local/libexec/isl18/include -I/opt/local/include -o insn-opinit.o -MT insn-opinit.o -MMD -MP -MF ./.deps/insn-opinit.TPo insn-opinit.c |
|---|
| 1658 | :info:build clang: warning: treating 'c' input as 'c++' when in C++ mode, this behavior is deprecated [-Wdeprecated] |
|---|
| 1659 | :info:build In file included from /opt/local/var/macports/build/_opt_local_var_macports_sources_rsync.macports.org_macports_release_tarballs_ports_lang_gcc49/gcc49/work/gcc-4.9.4/gcc/c/c-objc-common.c:33: |
|---|
| 1660 | :info:build In file included from /Applications/Xcode.app/Contents/Developer/Toolchains/XcodeDefault.xctoolchain/usr/include/c++/v1/new:91: |
|---|
| 1661 | :info:build /Applications/Xcode.app/Contents/Developer/Toolchains/XcodeDefault.xctoolchain/usr/include/c++/v1/exception:180:5: error: no member named 'fancy_abort' in namespace 'std::__1'; did you mean simply 'fancy_abort'? |
|---|
| 1662 | :info:build _VSTD::abort(); |
|---|
| 1663 | :info:build ^~~~~~~ |
|---|
| 1664 | :info:build /Applications/Xcode.app/Contents/Developer/Toolchains/XcodeDefault.xctoolchain/usr/include/c++/v1/__config:447:15: note: expanded from macro '_VSTD' |
|---|
| 1665 | :info:build #define _VSTD std::_LIBCPP_NAMESPACE |
|---|
| 1666 | :info:build ^ |
|---|
| 1667 | :info:build /opt/local/var/macports/build/_opt_local_var_macports_sources_rsync.macports.org_macports_release_tarballs_ports_lang_gcc49/gcc49/work/gcc-4.9.4/gcc/system.h:685:13: note: 'fancy_abort' declared here |
|---|
| 1668 | :info:build extern void fancy_abort (const char *, int, const char *) ATTRIBUTE_NORETURN; |
|---|
| 1669 | :info:build ^ |
|---|
| 1670 | :info:build In file included from insn-latencytab.c:12: |
|---|
| 1671 | :info:build In file included from /opt/local/var/macports/build/_opt_local_var_macports_sources_rsync.macports.org_macports_release_tarballs_ports_lang_gcc49/gcc49/work/gcc-4.9.4/gcc/rtl.h:2350: |
|---|
| 1672 | :info:build ./genrtl.h:447:3: warning: array index 1 is past the end of the array (which contains 1 element) [-Warray-bounds] |
|---|
| 1673 | :info:build XWINT (rt, 1) = arg1; |
|---|
| 1674 | :info:build ^ ~ |
|---|
| 1675 | :info:build /opt/local/var/macports/build/_opt_local_var_macports_sources_rsync.macports.org_macports_release_tarballs_ports_lang_gcc49/gcc49/work/gcc-4.9.4/gcc/rtl.h:663:29: note: expanded from macro 'XWINT' |
|---|
| 1676 | :info:build #define XWINT(RTX, N) ((RTX)->u.hwint[N]) |
|---|
| 1677 | :info:build ^ ~ |
|---|
| 1678 | :info:build /opt/local/var/macports/build/_opt_local_var_macports_sources_rsync.macports.org_macports_release_tarballs_ports_lang_gcc49/gcc49/work/gcc-4.9.4/gcc/rtl.h:342:5: note: array 'hwint' declared here |
|---|
| 1679 | :info:build HOST_WIDE_INT hwint[1]; |
|---|
| 1680 | :info:build ^ |
|---|
| 1681 | :info:build /opt/local/var/macports/build/_opt_local_var_macports_sources_rsync.macports.org_macports_release_tarballs_ports_lang_gcc49/gcc49/work/gcc-4.9.4/gcc/hwint.h:61:26: note: expanded from macro 'HOST_WIDE_INT' |
|---|
| 1682 | :info:build # define HOST_WIDE_INT long |
|---|
| 1683 | :info:build ^ |
|---|
| 1684 | :info:build In file included from insn-latencytab.c:12: |
|---|
| 1685 | :info:build In file included from /opt/local/var/macports/build/_opt_local_var_macports_sources_rsync.macports.org_macports_release_tarballs_ports_lang_gcc49/gcc49/work/gcc-4.9.4/gcc/rtl.h:2350: |
|---|
| 1686 | :info:build ./genrtl.h:448:3: warning: array index 2 is past the end of the array (which contains 1 element) [-Warray-bounds] |
|---|
| 1687 | :info:build XWINT (rt, 2) = arg2; |
|---|
| 1688 | :info:build ^ ~ |
|---|
| 1689 | :info:build /opt/local/var/macports/build/_opt_local_var_macports_sources_rsync.macports.org_macports_release_tarballs_ports_lang_gcc49/gcc49/work/gcc-4.9.4/gcc/rtl.h:663:29: note: expanded from macro 'XWINT' |
|---|
| 1690 | :info:build #define XWINT(RTX, N) ((RTX)->u.hwint[N]) |
|---|
| 1691 | :info:build ^ ~ |
|---|
| 1692 | :info:build /opt/local/var/macports/build/_opt_local_var_macports_sources_rsync.macports.org_macports_release_tarballs_ports_lang_gcc49/gcc49/work/gcc-4.9.4/gcc/rtl.h:342:5: note: array 'hwint' declared here |
|---|
| 1693 | :info:build HOST_WIDE_INT hwint[1]; |
|---|
| 1694 | :info:build ^ |
|---|
| 1695 | :info:build /opt/local/var/macports/build/_opt_local_var_macports_sources_rsync.macports.org_macports_release_tarballs_ports_lang_gcc49/gcc49/work/gcc-4.9.4/gcc/hwint.h:61:26: note: expanded from macro 'HOST_WIDE_INT' |
|---|
| 1696 | :info:build # define HOST_WIDE_INT long |
|---|
| 1697 | :info:build ^ |
|---|
| 1698 | :info:build 1 error generated. |
|---|
| 1699 | :info:build make[3]: *** [c/c-objc-common.o] Error 1 |
|---|
| 1700 | :info:build make[3]: *** Waiting for unfinished jobs.... |
|---|
| 1701 | :info:build In file included from insn-latencytab.c:16: |
|---|
| 1702 | :info:build /opt/local/var/macports/build/_opt_local_var_macports_sources_rsync.macports.org_macports_release_tarballs_ports_lang_gcc49/gcc49/work/gcc-4.9.4/gcc/recog.h:338:5: warning: macro expansion producing 'defined' has undefined behavior [-Wexpansion-to-defined] |
|---|
| 1703 | :info:build #if HAVE_DESIGNATED_UNION_INITIALIZERS |
|---|
| 1704 | :info:build ^ |
|---|
| 1705 | :info:build /opt/local/var/macports/build/_opt_local_var_macports_sources_rsync.macports.org_macports_release_tarballs_ports_lang_gcc49/gcc49/work/gcc-4.9.4/gcc/system.h:554:9: note: expanded from macro 'HAVE_DESIGNATED_UNION_INITIALIZERS' |
|---|
| 1706 | :info:build && (!defined(__cplusplus) || (GCC_VERSION >= 4007))) |
|---|
| 1707 | :info:build ^ |
|---|
| 1708 | :info:build In file included from insn-latencytab.c:19: |
|---|
| 1709 | :info:build /opt/local/var/macports/build/_opt_local_var_macports_sources_rsync.macports.org_macports_release_tarballs_ports_lang_gcc49/gcc49/work/gcc-4.9.4/gcc/output.h:131:6: warning: '__format__' attribute argument not supported: asm_fprintf [-Wignored-attributes] |
|---|
| 1710 | :info:build ATTRIBUTE_ASM_FPRINTF(2, 3); |
|---|
| 1711 | :info:build ^ |
|---|
| 1712 | :info:build /opt/local/var/macports/build/_opt_local_var_macports_sources_rsync.macports.org_macports_release_tarballs_ports_lang_gcc49/gcc49/work/gcc-4.9.4/gcc/output.h:121:53: note: expanded from macro 'ATTRIBUTE_ASM_FPRINTF' |
|---|
| 1713 | :info:build #define ATTRIBUTE_ASM_FPRINTF(m, n) __attribute__ ((__format__ (__asm_fprintf__, m, n))) ATTRIBUTE_NONNULL(m) |
|---|
| 1714 | :info:build ^ |
|---|
| 1715 | :info:build In file included from insn-opinit.c:12: |
|---|
| 1716 | :info:build In file included from /opt/local/var/macports/build/_opt_local_var_macports_sources_rsync.macports.org_macports_release_tarballs_ports_lang_gcc49/gcc49/work/gcc-4.9.4/gcc/rtl.h:2350: |
|---|
| 1717 | :info:build ./genrtl.h:447:3: warning: array index 1 is past the end of the array (which contains 1 element) [-Warray-bounds] |
|---|
| 1718 | :info:build XWINT (rt, 1) = arg1; |
|---|
| 1719 | :info:build ^ ~ |
|---|
| 1720 | :info:build /opt/local/var/macports/build/_opt_local_var_macports_sources_rsync.macports.org_macports_release_tarballs_ports_lang_gcc49/gcc49/work/gcc-4.9.4/gcc/rtl.h:663:29: note: expanded from macro 'XWINT' |
|---|
| 1721 | :info:build #define XWINT(RTX, N) ((RTX)->u.hwint[N]) |
|---|
| 1722 | :info:build ^ ~ |
|---|
| 1723 | :info:build /opt/local/var/macports/build/_opt_local_var_macports_sources_rsync.macports.org_macports_release_tarballs_ports_lang_gcc49/gcc49/work/gcc-4.9.4/gcc/rtl.h:342:5: note: array 'hwint' declared here |
|---|
| 1724 | :info:build HOST_WIDE_INT hwint[1]; |
|---|
| 1725 | :info:build ^ |
|---|
| 1726 | :info:build /opt/local/var/macports/build/_opt_local_var_macports_sources_rsync.macports.org_macports_release_tarballs_ports_lang_gcc49/gcc49/work/gcc-4.9.4/gcc/hwint.h:61:26: note: expanded from macro 'HOST_WIDE_INT' |
|---|
| 1727 | :info:build # define HOST_WIDE_INT long |
|---|
| 1728 | :info:build ^ |
|---|
| 1729 | :info:build In file included from insn-opinit.c:12: |
|---|
| 1730 | :info:build In file included from /opt/local/var/macports/build/_opt_local_var_macports_sources_rsync.macports.org_macports_release_tarballs_ports_lang_gcc49/gcc49/work/gcc-4.9.4/gcc/rtl.h:2350: |
|---|
| 1731 | :info:build ./genrtl.h:448:3: warning: array index 2 is past the end of the array (which contains 1 element) [-Warray-bounds] |
|---|
| 1732 | :info:build XWINT (rt, 2) = arg2; |
|---|
| 1733 | :info:build ^ ~ |
|---|
| 1734 | :info:build /opt/local/var/macports/build/_opt_local_var_macports_sources_rsync.macports.org_macports_release_tarballs_ports_lang_gcc49/gcc49/work/gcc-4.9.4/gcc/rtl.h:663:29: note: expanded from macro 'XWINT' |
|---|
| 1735 | :info:build #define XWINT(RTX, N) ((RTX)->u.hwint[N]) |
|---|
| 1736 | :info:build ^ ~ |
|---|
| 1737 | :info:build /opt/local/var/macports/build/_opt_local_var_macports_sources_rsync.macports.org_macports_release_tarballs_ports_lang_gcc49/gcc49/work/gcc-4.9.4/gcc/rtl.h:342:5: note: array 'hwint' declared here |
|---|
| 1738 | :info:build HOST_WIDE_INT hwint[1]; |
|---|
| 1739 | :info:build ^ |
|---|
| 1740 | :info:build /opt/local/var/macports/build/_opt_local_var_macports_sources_rsync.macports.org_macports_release_tarballs_ports_lang_gcc49/gcc49/work/gcc-4.9.4/gcc/hwint.h:61:26: note: expanded from macro 'HOST_WIDE_INT' |
|---|
| 1741 | :info:build # define HOST_WIDE_INT long |
|---|
| 1742 | :info:build ^ |
|---|
| 1743 | :info:build 2 warnings generated. |
|---|
| 1744 | :info:build 3 warnings generated. |
|---|
| 1745 | :info:build 4 warnings generated. |
|---|
| 1746 | :info:build make[3]: Leaving directory `/opt/local/var/macports/build/_opt_local_var_macports_sources_rsync.macports.org_macports_release_tarballs_ports_lang_gcc49/gcc49/work/build/gcc' |
|---|
| 1747 | :info:build make[2]: *** [all-stage1-gcc] Error 2 |
|---|
| 1748 | :info:build make[2]: Leaving directory `/opt/local/var/macports/build/_opt_local_var_macports_sources_rsync.macports.org_macports_release_tarballs_ports_lang_gcc49/gcc49/work/build' |
|---|
| 1749 | :info:build make[1]: *** [stage1-bubble] Error 2 |
|---|
| 1750 | :info:build make[1]: Leaving directory `/opt/local/var/macports/build/_opt_local_var_macports_sources_rsync.macports.org_macports_release_tarballs_ports_lang_gcc49/gcc49/work/build' |
|---|
| 1751 | :info:build make: *** [bootstrap-lean] Error 2 |
|---|
| 1752 | :info:build make: Leaving directory `/opt/local/var/macports/build/_opt_local_var_macports_sources_rsync.macports.org_macports_release_tarballs_ports_lang_gcc49/gcc49/work/build' |
|---|
| 1753 | :info:build Command failed: cd "/opt/local/var/macports/build/_opt_local_var_macports_sources_rsync.macports.org_macports_release_tarballs_ports_lang_gcc49/gcc49/work/build" && /usr/bin/make -j4 -w bootstrap-lean |
|---|
| 1754 | :info:build Exit code: 2 |
|---|
| 1755 | :error:build Failed to build gcc49: command execution failed |
|---|
| 1756 | :debug:build Error code: CHILDSTATUS 1515 2 |
|---|
| 1757 | :debug:build Backtrace: command execution failed |
|---|
| 1758 | :debug:build while executing |
|---|
| 1759 | :debug:build "system {*}$notty {*}$nice $fullcmdstring" |
|---|
| 1760 | :debug:build invoked from within |
|---|
| 1761 | :debug:build "command_exec build" |
|---|
| 1762 | :debug:build (procedure "portbuild::build_main" line 8) |
|---|
| 1763 | :debug:build invoked from within |
|---|
| 1764 | :debug:build "$procedure $targetname" |
|---|
| 1765 | :error:build See /opt/local/var/macports/logs/_opt_local_var_macports_sources_rsync.macports.org_macports_release_tarballs_ports_lang_gcc49/gcc49/main.log for details. |
|---|