Ticket #57610: main.log

File main.log, 194.8 KB (added by vkemerlis (Vasileios Kemerlis), 4 months ago)

build log

Line 
1version:1
2:debug:sysinfo macOS 10.14 (darwin/18.2.0) arch i386
3:debug:sysinfo MacPorts 2.5.4
4:debug:sysinfo Xcode 10.1
5:debug:sysinfo SDK 10.14
6:debug:sysinfo MACOSX_DEPLOYMENT_TARGET: 10.14
7:msg:main --->  Computing dependencies for unison:info:main .:debug:main unison has no conflicts
8:debug:main Searching for dependency: ocaml
9:debug:main Found Dependency: receipt exists for ocaml
10:debug:main Executing org.macports.main (unison)
11:debug:main dropping privileges: euid changed to 502, egid changed to 501.
12:debug:archivefetch archivefetch phase started at Thu Nov 15 11:12:17 EST 2018
13:msg:archivefetch --->  Fetching archive for unison
14:debug:archivefetch Executing org.macports.archivefetch (unison)
15:debug:archivefetch euid/egid changed to: 0/0
16:debug:archivefetch chowned /opt/local/var/macports/incoming to macports
17:debug:archivefetch euid/egid changed to: 502/501
18:info:archivefetch --->  unison-2.51.2_1+aqua.darwin_18.x86_64.tbz2 doesn't seem to exist in /opt/local/var/macports/incoming/verified
19:msg:archivefetch --->  Attempting to fetch unison-2.51.2_1+aqua.darwin_18.x86_64.tbz2 from https://packages.macports.org/unison
20:debug:archivefetch Fetching archive failed: The requested URL returned error: 404 Not Found
21:msg:archivefetch --->  Attempting to fetch unison-2.51.2_1+aqua.darwin_18.x86_64.tbz2 from http://ywg.ca.packages.macports.org/mirror/macports/packages/unison
22:debug:archivefetch Fetching archive failed: The requested URL returned error: 404 Not Found
23:msg:archivefetch --->  Attempting to fetch unison-2.51.2_1+aqua.darwin_18.x86_64.tbz2 from http://lil.fr.packages.macports.org/unison
24:debug:archivefetch Fetching archive failed: The requested URL returned error: 404 Not Found
25:debug:archivefetch Privilege de-escalation not attempted as not running as root.
26:debug:fetch fetch phase started at Thu Nov 15 11:12:18 EST 2018
27:notice:fetch --->  Fetching distfiles for unison
28:debug:fetch elevating privileges for fetch: euid changed to 0, egid changed to 0.
29:debug:fetch dropping privileges: euid changed to 502, egid changed to 501.
30:debug:fetch Executing org.macports.fetch (unison)
31:info:fetch --->  unison-2.51.2.tar.gz does not exist in /opt/local/var/macports/distfiles/unison
32:notice:fetch --->  Attempting to fetch unison-2.51.2.tar.gz from https://distfiles.macports.org/unison
33:debug:fetch Privilege de-escalation not attempted as not running as root.
34:debug:checksum checksum phase started at Thu Nov 15 11:12:18 EST 2018
35:notice:checksum --->  Verifying checksums for unison
36:debug:checksum Executing org.macports.checksum (unison)
37:info:checksum --->  Checksumming unison-2.51.2.tar.gz
38:debug:checksum Calculated (rmd160) is 24050d73c3d38389816828dd8ce77b4de7c80639
39:debug:checksum Correct (rmd160) checksum for unison-2.51.2.tar.gz
40:debug:checksum Calculated (sha256) is 8e071e862fef675ea034f0c3e4b881d392be0889db4f04ad894cc5a931891e3d
41:debug:checksum Correct (sha256) checksum for unison-2.51.2.tar.gz
42:debug:checksum Calculated (size) is 1400793
43:debug:checksum Correct (size) checksum for unison-2.51.2.tar.gz
44:debug:checksum Privilege de-escalation not attempted as not running as root.
45:debug:extract extract phase started at Thu Nov 15 11:12:18 EST 2018
46:notice:extract --->  Extracting unison
47:debug:extract Executing org.macports.extract (unison)
48:info:extract --->  Extracting unison-2.51.2.tar.gz
49:debug:extract setting option extract.args to '/opt/local/var/macports/distfiles/unison/unison-2.51.2.tar.gz'
50:debug:extract Environment:
51:debug:extract CC_PRINT_OPTIONS='YES'
52:debug:extract CC_PRINT_OPTIONS_FILE='/opt/local/var/macports/build/_opt_local_var_macports_sources_rsync.macports.org_macports_release_tarballs_ports_net_unison/unison/work/.CC_PRINT_OPTIONS'
53:debug:extract CPATH='/opt/local/include'
54:debug:extract LIBRARY_PATH='/opt/local/lib'
55:debug:extract MACOSX_DEPLOYMENT_TARGET='10.14'
56:info:extract Executing:  cd "/opt/local/var/macports/build/_opt_local_var_macports_sources_rsync.macports.org_macports_release_tarballs_ports_net_unison/unison/work" && /usr/bin/gzip -dc '/opt/local/var/macports/distfiles/unison/unison-2.51.2.tar.gz' | /usr/bin/tar -xf -
57:debug:extract system:  cd "/opt/local/var/macports/build/_opt_local_var_macports_sources_rsync.macports.org_macports_release_tarballs_ports_net_unison/unison/work" && /usr/bin/gzip -dc '/opt/local/var/macports/distfiles/unison/unison-2.51.2.tar.gz' | /usr/bin/tar -xf -
58:debug:extract euid/egid changed to: 0/0
59:debug:extract chowned /opt/local/var/macports/build/_opt_local_var_macports_sources_rsync.macports.org_macports_release_tarballs_ports_net_unison/unison/work to macports
60:debug:extract euid/egid changed to: 502/501
61:debug:extract Executing proc-post-org.macports.extract-extract-0
62:debug:extract Privilege de-escalation not attempted as not running as root.
63:debug:patch patch phase started at Thu Nov 15 11:12:18 EST 2018
64:debug:patch Executing org.macports.patch (unison)
65:notice:patch --->  Applying patches to unison
66:info:patch --->  Applying patch-Makefile.OCaml.diff
67:debug:patch Environment:
68:debug:patch CC_PRINT_OPTIONS='YES'
69:debug:patch CC_PRINT_OPTIONS_FILE='/opt/local/var/macports/build/_opt_local_var_macports_sources_rsync.macports.org_macports_release_tarballs_ports_net_unison/unison/work/.CC_PRINT_OPTIONS'
70:debug:patch CPATH='/opt/local/include'
71:debug:patch LIBRARY_PATH='/opt/local/lib'
72:debug:patch MACOSX_DEPLOYMENT_TARGET='10.14'
73:info:patch Executing:  cd "/opt/local/var/macports/build/_opt_local_var_macports_sources_rsync.macports.org_macports_release_tarballs_ports_net_unison/unison/work/unison-2.51.2" && /usr/bin/patch -p0 < '/opt/local/var/macports/sources/rsync.macports.org/macports/release/tarballs/ports/net/unison/files/patch-Makefile.OCaml.diff'
74:debug:patch system:  cd "/opt/local/var/macports/build/_opt_local_var_macports_sources_rsync.macports.org_macports_release_tarballs_ports_net_unison/unison/work/unison-2.51.2" && /usr/bin/patch -p0 < '/opt/local/var/macports/sources/rsync.macports.org/macports/release/tarballs/ports/net/unison/files/patch-Makefile.OCaml.diff'
75:info:patch patching file src/Makefile.OCaml
76:info:patch --->  Applying patch-target.diff
77:debug:patch Environment:
78:debug:patch CC_PRINT_OPTIONS='YES'
79:debug:patch CC_PRINT_OPTIONS_FILE='/opt/local/var/macports/build/_opt_local_var_macports_sources_rsync.macports.org_macports_release_tarballs_ports_net_unison/unison/work/.CC_PRINT_OPTIONS'
80:debug:patch CPATH='/opt/local/include'
81:debug:patch LIBRARY_PATH='/opt/local/lib'
82:debug:patch MACOSX_DEPLOYMENT_TARGET='10.14'
83:info:patch Executing:  cd "/opt/local/var/macports/build/_opt_local_var_macports_sources_rsync.macports.org_macports_release_tarballs_ports_net_unison/unison/work/unison-2.51.2" && /usr/bin/patch -p0 < '/opt/local/var/macports/sources/rsync.macports.org/macports/release/tarballs/ports/net/unison/files/patch-target.diff'
84:debug:patch system:  cd "/opt/local/var/macports/build/_opt_local_var_macports_sources_rsync.macports.org_macports_release_tarballs_ports_net_unison/unison/work/unison-2.51.2" && /usr/bin/patch -p0 < '/opt/local/var/macports/sources/rsync.macports.org/macports/release/tarballs/ports/net/unison/files/patch-target.diff'
85:info:patch patching file src/uimac14/uimacnew.xcodeproj/project.pbxproj
86:info:patch --->  Applying patch-Makefile.diff
87:debug:patch Environment:
88:debug:patch CC_PRINT_OPTIONS='YES'
89:debug:patch CC_PRINT_OPTIONS_FILE='/opt/local/var/macports/build/_opt_local_var_macports_sources_rsync.macports.org_macports_release_tarballs_ports_net_unison/unison/work/.CC_PRINT_OPTIONS'
90:debug:patch CPATH='/opt/local/include'
91:debug:patch LIBRARY_PATH='/opt/local/lib'
92:debug:patch MACOSX_DEPLOYMENT_TARGET='10.14'
93:info:patch Executing:  cd "/opt/local/var/macports/build/_opt_local_var_macports_sources_rsync.macports.org_macports_release_tarballs_ports_net_unison/unison/work/unison-2.51.2" && /usr/bin/patch -p0 < '/opt/local/var/macports/sources/rsync.macports.org/macports/release/tarballs/ports/net/unison/files/patch-Makefile.diff'
94:debug:patch system:  cd "/opt/local/var/macports/build/_opt_local_var_macports_sources_rsync.macports.org_macports_release_tarballs_ports_net_unison/unison/work/unison-2.51.2" && /usr/bin/patch -p0 < '/opt/local/var/macports/sources/rsync.macports.org/macports/release/tarballs/ports/net/unison/files/patch-Makefile.diff'
95:info:patch patching file src/Makefile
96:info:patch --->  Applying patch-check-cltool.diff
97:debug:patch Environment:
98:debug:patch CC_PRINT_OPTIONS='YES'
99:debug:patch CC_PRINT_OPTIONS_FILE='/opt/local/var/macports/build/_opt_local_var_macports_sources_rsync.macports.org_macports_release_tarballs_ports_net_unison/unison/work/.CC_PRINT_OPTIONS'
100:debug:patch CPATH='/opt/local/include'
101:debug:patch LIBRARY_PATH='/opt/local/lib'
102:debug:patch MACOSX_DEPLOYMENT_TARGET='10.14'
103:info:patch Executing:  cd "/opt/local/var/macports/build/_opt_local_var_macports_sources_rsync.macports.org_macports_release_tarballs_ports_net_unison/unison/work/unison-2.51.2" && /usr/bin/patch -p0 < '/opt/local/var/macports/sources/rsync.macports.org/macports/release/tarballs/ports/net/unison/files/patch-check-cltool.diff'
104:debug:patch system:  cd "/opt/local/var/macports/build/_opt_local_var_macports_sources_rsync.macports.org_macports_release_tarballs_ports_net_unison/unison/work/unison-2.51.2" && /usr/bin/patch -p0 < '/opt/local/var/macports/sources/rsync.macports.org/macports/release/tarballs/ports/net/unison/files/patch-check-cltool.diff'
105:info:patch patching file src/uimac14/MyController.m
106:info:patch --->  Applying patch-lablgtk.diff
107:debug:patch Environment:
108:debug:patch CC_PRINT_OPTIONS='YES'
109:debug:patch CC_PRINT_OPTIONS_FILE='/opt/local/var/macports/build/_opt_local_var_macports_sources_rsync.macports.org_macports_release_tarballs_ports_net_unison/unison/work/.CC_PRINT_OPTIONS'
110:debug:patch CPATH='/opt/local/include'
111:debug:patch LIBRARY_PATH='/opt/local/lib'
112:debug:patch MACOSX_DEPLOYMENT_TARGET='10.14'
113:info:patch Executing:  cd "/opt/local/var/macports/build/_opt_local_var_macports_sources_rsync.macports.org_macports_release_tarballs_ports_net_unison/unison/work/unison-2.51.2" && /usr/bin/patch -p0 < '/opt/local/var/macports/sources/rsync.macports.org/macports/release/tarballs/ports/net/unison/files/patch-lablgtk.diff'
114:debug:patch system:  cd "/opt/local/var/macports/build/_opt_local_var_macports_sources_rsync.macports.org_macports_release_tarballs_ports_net_unison/unison/work/unison-2.51.2" && /usr/bin/patch -p0 < '/opt/local/var/macports/sources/rsync.macports.org/macports/release/tarballs/ports/net/unison/files/patch-lablgtk.diff'
115:info:patch patching file src/uigtk2.ml
116:debug:patch Executing proc-post-org.macports.patch-patch-0
117:info:patch --->  Patching MyController.m: s|__MACPORTS_PREFIX__|/opt/local|g
118:debug:patch Executing reinplace: /usr/bin/sed s|__MACPORTS_PREFIX__|/opt/local|g </opt/local/var/macports/build/_opt_local_var_macports_sources_rsync.macports.org_macports_release_tarballs_ports_net_unison/unison/work/unison-2.51.2/src/uimac14/MyController.m >@file11
119:debug:patch euid/egid changed to: 0/0
120:debug:patch chowned /opt/local/var/macports/build/_opt_local_var_macports_sources_rsync.macports.org_macports_release_tarballs_ports_net_unison/unison/work/unison-2.51.2/src/uimac14/MyController.m to macports
121:debug:patch euid/egid changed to: 502/501
122:debug:patch euid/egid changed to: 0/0
123:debug:patch setting attributes on /opt/local/var/macports/build/_opt_local_var_macports_sources_rsync.macports.org_macports_release_tarballs_ports_net_unison/unison/work/unison-2.51.2/src/uimac14/MyController.m
124:debug:patch euid/egid changed to: 502/501
125:debug:patch Privilege de-escalation not attempted as not running as root.
126:debug:configure configure phase started at Thu Nov 15 11:12:19 EST 2018
127:notice:configure --->  Configuring unison
128:debug:configure Preferred compilers: clang macports-clang-5.0 macports-clang-4.0
129:debug:configure Using compiler 'Xcode Clang'
130:debug:configure Executing org.macports.configure (unison)
131:debug:configure Privilege de-escalation not attempted as not running as root.
132:debug:build build phase started at Thu Nov 15 11:12:19 EST 2018
133:notice:build --->  Building unison
134:debug:build Executing org.macports.build (unison)
135:debug:build port disallows a parallel build
136:debug:build Environment:
137:debug:build CC='/usr/bin/clang'
138:debug:build CC_PRINT_OPTIONS='YES'
139:debug:build CC_PRINT_OPTIONS_FILE='/opt/local/var/macports/build/_opt_local_var_macports_sources_rsync.macports.org_macports_release_tarballs_ports_net_unison/unison/work/.CC_PRINT_OPTIONS'
140:debug:build CPATH='/opt/local/include'
141:debug:build LIBRARY_PATH='/opt/local/lib'
142:debug:build MACOSX_DEPLOYMENT_TARGET='10.14'
143:debug:build XCODEFLAGS='-UseNewBuildSystem=NO'
144:info:build Executing:  cd "/opt/local/var/macports/build/_opt_local_var_macports_sources_rsync.macports.org_macports_release_tarballs_ports_net_unison/unison/work/unison-2.51.2" && /usr/bin/make -w all UISTYLE=mac14 THREADS=true
145:debug:build system:  cd "/opt/local/var/macports/build/_opt_local_var_macports_sources_rsync.macports.org_macports_release_tarballs_ports_net_unison/unison/work/unison-2.51.2" && /usr/bin/make -w all UISTYLE=mac14 THREADS=true
146:info:build make: Entering directory `/opt/local/var/macports/build/_opt_local_var_macports_sources_rsync.macports.org_macports_release_tarballs_ports_net_unison/unison/work/unison-2.51.2'
147:info:build /Applications/Xcode.app/Contents/Developer/usr/bin/make -C src
148:info:build make[1]: Entering directory `/opt/local/var/macports/build/_opt_local_var_macports_sources_rsync.macports.org_macports_release_tarballs_ports_net_unison/unison/work/unison-2.51.2/src'
149:info:build UISTYLE = mac14
150:info:build Building for Unix
151:info:build NATIVE = true
152:info:build THREADS = true
153:info:build STATIC = false
154:info:build OSTYPE =
155:info:build OSARCH = osx
156:info:build (cd uimac14; xcodebuild -UseNewBuildSystem=NO OCAMLLIBDIR="/opt/local/lib/ocaml" SYMROOT=build)
157:info:build User defaults from command line:
158:info:build     UseNewBuildSystem = NO
159:info:build Build settings from command line:
160:info:build     OCAMLLIBDIR = /opt/local/lib/ocaml
161:info:build     SYMROOT = build
162:info:build 2018-11-15 11:12:19.628 xcodebuild[86420:4775612] [MT] IDELogStore: Failed to open log store at /opt/local/var/macports/home/Library/Developer/Xcode/DerivedData/uimacnew-fcfphhhtyebjozchatvfeznqwiuj/Logs/Build
163:info:build 2018-11-15 11:12:19.628 xcodebuild[86420:4775612] [MT] IDELogStore: Failed to open Build log store: Error Domain=IDEFoundationErrorDomain Code=1 "Unable to create log store directory at '/opt/local/var/macports/home/Library/Developer/Xcode/DerivedData/uimacnew-fcfphhhtyebjozchatvfeznqwiuj/Logs/Build': (513) You don’t have permission to save the file “Build” in the folder “Logs”." UserInfo={NSLocalizedDescription=Unable to create log store directory at '/opt/local/var/macports/home/Library/Developer/Xcode/DerivedData/uimacnew-fcfphhhtyebjozchatvfeznqwiuj/Logs/Build': (513) You don’t have permission to save the file “Build” in the folder “Logs”.}. User info: {
164:info:build     NSLocalizedDescription = "Unable to create log store directory at '/opt/local/var/macports/home/Library/Developer/Xcode/DerivedData/uimacnew-fcfphhhtyebjozchatvfeznqwiuj/Logs/Build': (513) You don\U2019t have permission to save the file \U201cBuild\U201d in the folder \U201cLogs\U201d.";
165:info:build }.
166:info:build 2018-11-15 11:12:19.633 xcodebuild[86420:4775612] [MT] IDELogStore: Failed to open log store at /opt/local/var/macports/home/Library/Developer/Xcode/DerivedData/uimacnew-fcfphhhtyebjozchatvfeznqwiuj/Logs/Test
167:info:build 2018-11-15 11:12:19.633 xcodebuild[86420:4775612] [MT] IDELogStore: Failed to open Test log store: Error Domain=IDEFoundationErrorDomain Code=1 "Unable to create log store directory at '/opt/local/var/macports/home/Library/Developer/Xcode/DerivedData/uimacnew-fcfphhhtyebjozchatvfeznqwiuj/Logs/Test': (513) You don’t have permission to save the file “Test” in the folder “Logs”." UserInfo={NSLocalizedDescription=Unable to create log store directory at '/opt/local/var/macports/home/Library/Developer/Xcode/DerivedData/uimacnew-fcfphhhtyebjozchatvfeznqwiuj/Logs/Test': (513) You don’t have permission to save the file “Test” in the folder “Logs”.}. User info: {
168:info:build     NSLocalizedDescription = "Unable to create log store directory at '/opt/local/var/macports/home/Library/Developer/Xcode/DerivedData/uimacnew-fcfphhhtyebjozchatvfeznqwiuj/Logs/Test': (513) You don\U2019t have permission to save the file \U201cTest\U201d in the folder \U201cLogs\U201d.";
169:info:build }.
170:info:build Prepare build
171:info:build note: Using legacy build system
172:info:build === BUILD AGGREGATE TARGET Create ExternalSettings OF PROJECT uimacnew WITH THE DEFAULT CONFIGURATION (Default) ===
173:info:build Check dependencies
174:info:build The file “ExternalSettings.xcconfig” couldn’t be opened because there is no such file. (/opt/local/var/macports/build/_opt_local_var_macports_sources_rsync.macports.org_macports_release_tarballs_ports_net_unison/unison/work/unison-2.51.2/src/uimac14/ExternalSettings.xcconfig)
175:info:build Write auxiliary files
176:info:build write-file /opt/local/var/macports/build/_opt_local_var_macports_sources_rsync.macports.org_macports_release_tarballs_ports_net_unison/unison/work/unison-2.51.2/src/uimac14/build/uimacnew.build/Default/Create\ ExternalSettings.build/Script-2A124E7E0DE1C4BE00524237.sh
177:info:build chmod 0755 /opt/local/var/macports/build/_opt_local_var_macports_sources_rsync.macports.org_macports_release_tarballs_ports_net_unison/unison/work/unison-2.51.2/src/uimac14/build/uimacnew.build/Default/Create\ ExternalSettings.build/Script-2A124E7E0DE1C4BE00524237.sh
178:info:build PhaseScriptExecution Run\ Script\ (version,\ ocaml\ lib\ dir) build/uimacnew.build/Default/Create\ ExternalSettings.build/Script-2A124E7E0DE1C4BE00524237.sh
179:info:build     cd /opt/local/var/macports/build/_opt_local_var_macports_sources_rsync.macports.org_macports_release_tarballs_ports_net_unison/unison/work/unison-2.51.2/src/uimac14
180:info:build     export ACTION=build
181:info:build     export ALTERNATE_GROUP=macports
182:info:build     export ALTERNATE_MODE=u+w,go-w,a+rX
183:info:build     export ALTERNATE_OWNER=macports
184:info:build     export ALWAYS_EMBED_SWIFT_STANDARD_LIBRARIES=NO
185:info:build     export ALWAYS_SEARCH_USER_PATHS=YES
186:info:build     export ALWAYS_USE_SEPARATE_HEADERMAPS=NO
187:info:build     export APPLE_INTERNAL_DEVELOPER_DIR=/AppleInternal/Developer
188:info:build     export APPLE_INTERNAL_DIR=/AppleInternal
189:info:build     export APPLE_INTERNAL_DOCUMENTATION_DIR=/AppleInternal/Documentation
190:info:build     export APPLE_INTERNAL_LIBRARY_DIR=/AppleInternal/Library
191:info:build     export APPLE_INTERNAL_TOOLS=/AppleInternal/Developer/Tools
192:info:build     export APPLICATION_EXTENSION_API_ONLY=NO
193:info:build     export APPLY_RULES_IN_COPY_FILES=NO
194:info:build     export ARCHS=x86_64
195:info:build     export ARCHS_STANDARD=x86_64
196:info:build     export ARCHS_STANDARD_32_64_BIT="x86_64 i386"
197:info:build     export ARCHS_STANDARD_32_BIT=i386
198:info:build     export ARCHS_STANDARD_64_BIT=x86_64
199:info:build     export ARCHS_STANDARD_INCLUDING_64_BIT=x86_64
200:info:build     export AVAILABLE_PLATFORMS="appletvos appletvsimulator iphoneos iphonesimulator macosx watchos watchsimulator"
201:info:build     export BITCODE_GENERATION_MODE=marker
202:info:build     export BUILD_ACTIVE_RESOURCES_ONLY=NO
203:info:build     export BUILD_COMPONENTS="headers build"
204:info:build     export BUILD_DIR=/opt/local/var/macports/build/_opt_local_var_macports_sources_rsync.macports.org_macports_release_tarballs_ports_net_unison/unison/work/unison-2.51.2/src/uimac14/build
205:info:build     export BUILD_ROOT=/opt/local/var/macports/build/_opt_local_var_macports_sources_rsync.macports.org_macports_release_tarballs_ports_net_unison/unison/work/unison-2.51.2/src/uimac14/build
206:info:build     export BUILD_STYLE=
207:info:build     export BUILD_VARIANTS=normal
208:info:build     export BUILT_PRODUCTS_DIR=/opt/local/var/macports/build/_opt_local_var_macports_sources_rsync.macports.org_macports_release_tarballs_ports_net_unison/unison/work/unison-2.51.2/src/uimac14/build/Default
209:info:build     export CACHE_ROOT=/var/folders/4m/ntl3h12x2jl3v267xggmbvqm0000gp/C/com.apple.DeveloperTools/10.1-10B61/Xcode
210:info:build     export CCHROOT=/var/folders/4m/ntl3h12x2jl3v267xggmbvqm0000gp/C/com.apple.DeveloperTools/10.1-10B61/Xcode
211:info:build     export CHMOD=/bin/chmod
212:info:build     export CHOWN=/usr/sbin/chown
213:info:build     export CLANG_ANALYZER_LOCALIZABILITY_NONLOCALIZED=YES
214:info:build     export CLANG_MODULES_BUILD_SESSION_FILE=/var/folders/4m/ntl3h12x2jl3v267xggmbvqm0000gp/C/org.llvm.clang/ModuleCache.noindex/Session.modulevalidation
215:info:build     export CLANG_WARN_BOOL_CONVERSION=YES
216:info:build     export CLANG_WARN_CONSTANT_CONVERSION=YES
217:info:build     export CLANG_WARN_EMPTY_BODY=YES
218:info:build     export CLANG_WARN_ENUM_CONVERSION=YES
219:info:build     export CLANG_WARN_INFINITE_RECURSION=YES
220:info:build     export CLANG_WARN_INT_CONVERSION=YES
221:info:build     export CLANG_WARN_SUSPICIOUS_MOVE=YES
222:info:build     export CLANG_WARN_UNREACHABLE_CODE=YES
223:info:build     export CLANG_WARN__DUPLICATE_METHOD_MATCH=YES
224:info:build     export CLASS_FILE_DIR="/opt/local/var/macports/build/_opt_local_var_macports_sources_rsync.macports.org_macports_release_tarballs_ports_net_unison/unison/work/unison-2.51.2/src/uimac14/build/uimacnew.build/Default/Create ExternalSettings.build/JavaClasses"
225:info:build     export CLEAN_PRECOMPS=YES
226:info:build     export CLONE_HEADERS=NO
227:info:build     export CODESIGNING_FOLDER_PATH=/opt/local/var/macports/build/_opt_local_var_macports_sources_rsync.macports.org_macports_release_tarballs_ports_net_unison/unison/work/unison-2.51.2/src/uimac14/build/Default/
228:info:build     export CODE_SIGNING_ALLOWED=NO
229:info:build     export CODE_SIGN_INJECT_BASE_ENTITLEMENTS=YES
230:info:build     export COLOR_DIAGNOSTICS=NO
231:info:build     export COMBINE_HIDPI_IMAGES=NO
232:info:build     export COMMAND_MODE=legacy
233:info:build     export COMPILER_INDEX_STORE_ENABLE=Default
234:info:build     export COMPOSITE_SDK_DIRS=/opt/local/var/macports/build/_opt_local_var_macports_sources_rsync.macports.org_macports_release_tarballs_ports_net_unison/unison/work/unison-2.51.2/src/uimac14/build/CompositeSDKs
235:info:build     export COMPRESS_PNG_FILES=NO
236:info:build     export CONFIGURATION=Default
237:info:build     export CONFIGURATION_BUILD_DIR=/opt/local/var/macports/build/_opt_local_var_macports_sources_rsync.macports.org_macports_release_tarballs_ports_net_unison/unison/work/unison-2.51.2/src/uimac14/build/Default
238:info:build     export CONFIGURATION_TEMP_DIR=/opt/local/var/macports/build/_opt_local_var_macports_sources_rsync.macports.org_macports_release_tarballs_ports_net_unison/unison/work/unison-2.51.2/src/uimac14/build/uimacnew.build/Default
239:info:build     export COPYING_PRESERVES_HFS_DATA=NO
240:info:build     export COPY_HEADERS_RUN_UNIFDEF=NO
241:info:build     export COPY_PHASE_STRIP=YES
242:info:build     export COPY_RESOURCES_FROM_STATIC_FRAMEWORKS=YES
243:info:build     export CP=/bin/cp
244:info:build     export CREATE_INFOPLIST_SECTION_IN_BINARY=NO
245:info:build     export CURRENT_ARCH=x86_64
246:info:build     export CURRENT_VARIANT=normal
247:info:build     export DEAD_CODE_STRIPPING=NO
248:info:build     export DEBUGGING_SYMBOLS=YES
249:info:build     export DEBUG_INFORMATION_FORMAT=dwarf
250:info:build     export DEFAULT_COMPILER=com.apple.compilers.llvm.clang.1_0
251:info:build     export DEFAULT_KEXT_INSTALL_PATH=/System/Library/Extensions
252:info:build     export DEFINES_MODULE=NO
253:info:build     export DEPLOYMENT_LOCATION=NO
254:info:build     export DEPLOYMENT_POSTPROCESSING=NO
255:info:build     export DEPLOYMENT_TARGET_CLANG_ENV_NAME=MACOSX_DEPLOYMENT_TARGET
256:info:build     export DEPLOYMENT_TARGET_CLANG_FLAG_NAME=mmacosx-version-min
257:info:build     export DEPLOYMENT_TARGET_LD_ENV_NAME=MACOSX_DEPLOYMENT_TARGET
258:info:build     export DEPLOYMENT_TARGET_LD_FLAG_NAME=macosx_version_min
259:info:build     export DEPLOYMENT_TARGET_SETTING_NAME=MACOSX_DEPLOYMENT_TARGET
260:info:build     export DEPLOYMENT_TARGET_SUGGESTED_VALUES="10.6 10.7 10.8 10.9 10.10 10.11 10.12 10.13 10.14"
261:info:build     export DERIVED_FILES_DIR="/opt/local/var/macports/build/_opt_local_var_macports_sources_rsync.macports.org_macports_release_tarballs_ports_net_unison/unison/work/unison-2.51.2/src/uimac14/build/uimacnew.build/Default/Create ExternalSettings.build/DerivedSources"
262:info:build     export DERIVED_FILE_DIR="/opt/local/var/macports/build/_opt_local_var_macports_sources_rsync.macports.org_macports_release_tarballs_ports_net_unison/unison/work/unison-2.51.2/src/uimac14/build/uimacnew.build/Default/Create ExternalSettings.build/DerivedSources"
263:info:build     export DERIVED_SOURCES_DIR="/opt/local/var/macports/build/_opt_local_var_macports_sources_rsync.macports.org_macports_release_tarballs_ports_net_unison/unison/work/unison-2.51.2/src/uimac14/build/uimacnew.build/Default/Create ExternalSettings.build/DerivedSources"
264:info:build     export DEVELOPER_APPLICATIONS_DIR=/Applications/Xcode.app/Contents/Developer/Applications
265:info:build     export DEVELOPER_BIN_DIR=/Applications/Xcode.app/Contents/Developer/usr/bin
266:info:build     export DEVELOPER_DIR=/Applications/Xcode.app/Contents/Developer
267:info:build     export DEVELOPER_FRAMEWORKS_DIR=/Applications/Xcode.app/Contents/Developer/Library/Frameworks
268:info:build     export DEVELOPER_FRAMEWORKS_DIR_QUOTED=/Applications/Xcode.app/Contents/Developer/Library/Frameworks
269:info:build     export DEVELOPER_LIBRARY_DIR=/Applications/Xcode.app/Contents/Developer/Library
270:info:build     export DEVELOPER_SDK_DIR=/Applications/Xcode.app/Contents/Developer/Platforms/MacOSX.platform/Developer/SDKs
271:info:build     export DEVELOPER_TOOLS_DIR=/Applications/Xcode.app/Contents/Developer/Tools
272:info:build     export DEVELOPER_USR_DIR=/Applications/Xcode.app/Contents/Developer/usr
273:info:build     export DEVELOPMENT_LANGUAGE=English
274:info:build     export DO_HEADER_SCANNING_IN_JAM=NO
275:info:build     export DSTROOT=/tmp/uimacnew.dst
276:info:build     export DT_TOOLCHAIN_DIR=/Applications/Xcode.app/Contents/Developer/Toolchains/XcodeDefault.xctoolchain
277:info:build     export DWARF_DSYM_FILE_NAME=.dSYM
278:info:build     export DWARF_DSYM_FILE_SHOULD_ACCOMPANY_PRODUCT=NO
279:info:build     export DWARF_DSYM_FOLDER_PATH=/opt/local/var/macports/build/_opt_local_var_macports_sources_rsync.macports.org_macports_release_tarballs_ports_net_unison/unison/work/unison-2.51.2/src/uimac14/build/Default
280:info:build     export EMBEDDED_CONTENT_CONTAINS_SWIFT=NO
281:info:build     export EMBEDDED_PROFILE_NAME=embedded.provisionprofile
282:info:build     export EMBED_ASSET_PACKS_IN_PRODUCT_BUNDLE=NO
283:info:build     export ENABLE_BITCODE=NO
284:info:build     export ENABLE_DEFAULT_HEADER_SEARCH_PATHS=YES
285:info:build     export ENABLE_HEADER_DEPENDENCIES=YES
286:info:build     export ENABLE_ON_DEMAND_RESOURCES=NO
287:info:build     export ENABLE_STRICT_OBJC_MSGSEND=YES
288:info:build     export ENABLE_TESTABILITY=NO
289:info:build     export EXCLUDED_INSTALLSRC_SUBDIRECTORY_PATTERNS=".DS_Store .svn .git .hg CVS"
290:info:build     export EXCLUDED_RECURSIVE_SEARCH_PATH_SUBDIRECTORIES="*.nib *.lproj *.framework *.gch *.xcode* *.xcassets (*) .DS_Store CVS .svn .git .hg *.pbproj *.pbxproj"
291:info:build     export EXPANDED_CODE_SIGN_IDENTITY=
292:info:build     export EXPANDED_CODE_SIGN_IDENTITY_NAME=
293:info:build     export EXPANDED_PROVISIONING_PROFILE=
294:info:build     export FILE_LIST="/opt/local/var/macports/build/_opt_local_var_macports_sources_rsync.macports.org_macports_release_tarballs_ports_net_unison/unison/work/unison-2.51.2/src/uimac14/build/uimacnew.build/Default/Create ExternalSettings.build/Objects/LinkFileList"
295:info:build     export FIXED_FILES_DIR="/opt/local/var/macports/build/_opt_local_var_macports_sources_rsync.macports.org_macports_release_tarballs_ports_net_unison/unison/work/unison-2.51.2/src/uimac14/build/uimacnew.build/Default/Create ExternalSettings.build/FixedFiles"
296:info:build     export FRAMEWORK_VERSION=A
297:info:build     export GCC3_VERSION=3.3
298:info:build     export GCC_NO_COMMON_BLOCKS=YES
299:info:build     export GCC_PFE_FILE_C_DIALECTS="c objective-c c++ objective-c++"
300:info:build     export GCC_TREAT_WARNINGS_AS_ERRORS=NO
301:info:build     export GCC_VERSION=com.apple.compilers.llvm.clang.1_0
302:info:build     export GCC_VERSION_IDENTIFIER=com_apple_compilers_llvm_clang_1_0
303:info:build     export GCC_WARN_64_TO_32_BIT_CONVERSION=YES
304:info:build     export GCC_WARN_ABOUT_RETURN_TYPE=YES
305:info:build     export GCC_WARN_UNDECLARED_SELECTOR=YES
306:info:build     export GCC_WARN_UNINITIALIZED_AUTOS=YES
307:info:build     export GCC_WARN_UNUSED_FUNCTION=YES
308:info:build     export GCC_WARN_UNUSED_VARIABLE=YES
309:info:build     export GENERATE_MASTER_OBJECT_FILE=NO
310:info:build     export GENERATE_PKGINFO_FILE=NO
311:info:build     export GENERATE_PROFILING_CODE=NO
312:info:build     export GENERATE_TEXT_BASED_STUBS=NO
313:info:build     export GID=501
314:info:build     export GROUP=macports
315:info:build     export HEADERMAP_INCLUDES_FLAT_ENTRIES_FOR_TARGET_BEING_BUILT=YES
316:info:build     export HEADERMAP_INCLUDES_FRAMEWORK_ENTRIES_FOR_ALL_PRODUCT_TYPES=YES
317:info:build     export HEADERMAP_INCLUDES_NONPUBLIC_NONPRIVATE_HEADERS=YES
318:info:build     export HEADERMAP_INCLUDES_PROJECT_HEADERS=YES
319:info:build     export HEADERMAP_USES_FRAMEWORK_PREFIX_ENTRIES=YES
320:info:build     export HEADERMAP_USES_VFS=NO
321:info:build     export HIDE_BITCODE_SYMBOLS=YES
322:info:build     export HOME=/opt/local/var/macports/home
323:info:build     export ICONV=/usr/bin/iconv
324:info:build     export INFOPLIST_EXPAND_BUILD_SETTINGS=YES
325:info:build     export INFOPLIST_OUTPUT_FORMAT=same-as-input
326:info:build     export INFOPLIST_PREPROCESS=NO
327:info:build     export INLINE_PRIVATE_FRAMEWORKS=NO
328:info:build     export INSTALLHDRS_COPY_PHASE=NO
329:info:build     export INSTALLHDRS_SCRIPT_PHASE=NO
330:info:build     export INSTALL_DIR=/tmp/uimacnew.dst
331:info:build     export INSTALL_GROUP=macports
332:info:build     export INSTALL_MODE_FLAG=u+w,go-w,a+rX
333:info:build     export INSTALL_OWNER=macports
334:info:build     export INSTALL_ROOT=/tmp/uimacnew.dst
335:info:build     export JAVAC_DEFAULT_FLAGS="-J-Xms64m -J-XX:NewSize=4M -J-Dfile.encoding=UTF8"
336:info:build     export JAVA_APP_STUB=/System/Library/Frameworks/JavaVM.framework/Resources/MacOS/JavaApplicationStub
337:info:build     export JAVA_ARCHIVE_CLASSES=YES
338:info:build     export JAVA_ARCHIVE_TYPE=JAR
339:info:build     export JAVA_COMPILER=/usr/bin/javac
340:info:build     export JAVA_FRAMEWORK_RESOURCES_DIRS=Resources
341:info:build     export JAVA_JAR_FLAGS=cv
342:info:build     export JAVA_SOURCE_SUBDIR=.
343:info:build     export JAVA_USE_DEPENDENCIES=YES
344:info:build     export JAVA_ZIP_FLAGS=-urg
345:info:build     export JIKES_DEFAULT_FLAGS="+E +OLDCSO"
346:info:build     export KASAN_DEFAULT_CFLAGS="-DKASAN=1 -fsanitize=address -mllvm -asan-globals-live-support -mllvm -asan-force-dynamic-shadow"
347:info:build     export KEEP_PRIVATE_EXTERNS=NO
348:info:build     export LD_DEPENDENCY_INFO_FILE="/opt/local/var/macports/build/_opt_local_var_macports_sources_rsync.macports.org_macports_release_tarballs_ports_net_unison/unison/work/unison-2.51.2/src/uimac14/build/uimacnew.build/Default/Create ExternalSettings.build/Objects-normal/x86_64/Create ExternalSettings_dependency_info.dat"
349:info:build     export LD_GENERATE_MAP_FILE=NO
350:info:build     export LD_MAP_FILE_PATH="/opt/local/var/macports/build/_opt_local_var_macports_sources_rsync.macports.org_macports_release_tarballs_ports_net_unison/unison/work/unison-2.51.2/src/uimac14/build/uimacnew.build/Default/Create ExternalSettings.build/Create ExternalSettings-LinkMap-normal-x86_64.txt"
351:info:build     export LD_NO_PIE=NO
352:info:build     export LD_QUOTE_LINKER_ARGUMENTS_FOR_COMPILER_DRIVER=YES
353:info:build     export LEGACY_DEVELOPER_DIR=/Applications/Xcode.app/Contents/PlugIns/Xcode3Core.ideplugin/Contents/SharedSupport/Developer
354:info:build     export LEX=lex
355:info:build     export LIBRARY_FLAG_NOSPACE=YES
356:info:build     export LIBRARY_KEXT_INSTALL_PATH=/Library/Extensions
357:info:build     export LINKER_DISPLAYS_MANGLED_NAMES=NO
358:info:build     export LINK_FILE_LIST_normal_x86_64=
359:info:build     export LINK_WITH_STANDARD_LIBRARIES=YES
360:info:build     export LOCALIZABLE_CONTENT_DIR=
361:info:build     export LOCALIZED_STRING_MACRO_NAMES="NSLocalizedString CFLocalizedString"
362:info:build     export LOCAL_ADMIN_APPS_DIR=/Applications/Utilities
363:info:build     export LOCAL_APPS_DIR=/Applications
364:info:build     export LOCAL_DEVELOPER_DIR=/Library/Developer
365:info:build     export LOCAL_LIBRARY_DIR=/Library
366:info:build     export LOCROOT=
367:info:build     export LOCSYMROOT=
368:info:build     export MACOSX_DEPLOYMENT_TARGET=10.14
369:info:build     export MAC_OS_X_PRODUCT_BUILD_VERSION=18B75
370:info:build     export MAC_OS_X_VERSION_ACTUAL=101401
371:info:build     export MAC_OS_X_VERSION_MAJOR=101400
372:info:build     export MAC_OS_X_VERSION_MINOR=1401
373:info:build     export METAL_LIBRARY_FILE_BASE=default
374:info:build     export METAL_LIBRARY_OUTPUT_DIR=/opt/local/var/macports/build/_opt_local_var_macports_sources_rsync.macports.org_macports_release_tarballs_ports_net_unison/unison/work/unison-2.51.2/src/uimac14/build/Default/
375:info:build     export NATIVE_ARCH=i386
376:info:build     export NATIVE_ARCH_32_BIT=i386
377:info:build     export NATIVE_ARCH_64_BIT=x86_64
378:info:build     export NATIVE_ARCH_ACTUAL=x86_64
379:info:build     export NO_COMMON=YES
380:info:build     export OBJECT_FILE_DIR="/opt/local/var/macports/build/_opt_local_var_macports_sources_rsync.macports.org_macports_release_tarballs_ports_net_unison/unison/work/unison-2.51.2/src/uimac14/build/uimacnew.build/Default/Create ExternalSettings.build/Objects"
381:info:build     export OBJECT_FILE_DIR_normal="/opt/local/var/macports/build/_opt_local_var_macports_sources_rsync.macports.org_macports_release_tarballs_ports_net_unison/unison/work/unison-2.51.2/src/uimac14/build/uimacnew.build/Default/Create ExternalSettings.build/Objects-normal"
382:info:build     export OBJROOT=/opt/local/var/macports/build/_opt_local_var_macports_sources_rsync.macports.org_macports_release_tarballs_ports_net_unison/unison/work/unison-2.51.2/src/uimac14/build
383:info:build     export OCAMLLIBDIR=/opt/local/lib/ocaml
384:info:build     export ONLY_ACTIVE_ARCH=NO
385:info:build     export OS=MACOS
386:info:build     export OSAC=/usr/bin/osacompile
387:info:build     export PASCAL_STRINGS=YES
388:info:build     export PATH="/Applications/Xcode.app/Contents/Developer/Toolchains/XcodeDefault.xctoolchain/usr/bin:/Applications/Xcode.app/Contents/Developer/Toolchains/XcodeDefault.xctoolchain/usr/local/bin:/Applications/Xcode.app/Contents/Developer/Toolchains/XcodeDefault.xctoolchain/usr/libexec:/Applications/Xcode.app/Contents/Developer/Platforms/MacOSX.platform/Developer/usr/bin:/Applications/Xcode.app/Contents/Developer/Platforms/MacOSX.platform/Developer/usr/local/bin:/Applications/Xcode.app/Contents/Developer/Platforms/MacOSX.platform/usr/bin:/Applications/Xcode.app/Contents/Developer/Platforms/MacOSX.platform/usr/local/bin:/Applications/Xcode.app/Contents/Developer/usr/bin:/Applications/Xcode.app/Contents/Developer/usr/local/bin:/Applications/Xcode.app/Contents/Developer/Tools:/opt/local/bin:/opt/local/sbin:/bin:/sbin:/usr/bin:/usr/sbin"
389:info:build     export PATH_PREFIXES_EXCLUDED_FROM_HEADER_DEPENDENCIES="/usr/include /usr/local/include /System/Library/Frameworks /System/Library/PrivateFrameworks /Applications/Xcode.app/Contents/Developer/Headers /Applications/Xcode.app/Contents/Developer/SDKs /Applications/Xcode.app/Contents/Developer/Platforms"
390:info:build     export PKGINFO_FILE_PATH="/opt/local/var/macports/build/_opt_local_var_macports_sources_rsync.macports.org_macports_release_tarballs_ports_net_unison/unison/work/unison-2.51.2/src/uimac14/build/uimacnew.build/Default/Create ExternalSettings.build/PkgInfo"
391:info:build     export PLATFORM_DEVELOPER_APPLICATIONS_DIR=/Applications/Xcode.app/Contents/Developer/Applications
392:info:build     export PLATFORM_DEVELOPER_BIN_DIR=/Applications/Xcode.app/Contents/Developer/usr/bin
393:info:build     export PLATFORM_DEVELOPER_LIBRARY_DIR=/Applications/Xcode.app/Contents/Developer/Library
394:info:build     export PLATFORM_DEVELOPER_SDK_DIR=/Applications/Xcode.app/Contents/Developer/Platforms/MacOSX.platform/Developer/SDKs
395:info:build     export PLATFORM_DEVELOPER_TOOLS_DIR=/Applications/Xcode.app/Contents/Developer/Tools
396:info:build     export PLATFORM_DEVELOPER_USR_DIR=/Applications/Xcode.app/Contents/Developer/usr
397:info:build     export PLATFORM_DIR=/Applications/Xcode.app/Contents/Developer/Platforms/MacOSX.platform
398:info:build     export PLATFORM_DISPLAY_NAME=macOS
399:info:build     export PLATFORM_NAME=macosx
400:info:build     export PLATFORM_PREFERRED_ARCH=x86_64
401:info:build     export PLATFORM_PRODUCT_BUILD_VERSION=10B61
402:info:build     export PLIST_FILE_OUTPUT_FORMAT=same-as-input
403:info:build     export PRECOMPS_INCLUDE_HEADERS_FROM_BUILT_PRODUCTS_DIR=YES
404:info:build     export PRECOMP_DESTINATION_DIR="/opt/local/var/macports/build/_opt_local_var_macports_sources_rsync.macports.org_macports_release_tarballs_ports_net_unison/unison/work/unison-2.51.2/src/uimac14/build/uimacnew.build/Default/Create ExternalSettings.build/PrefixHeaders"
405:info:build     export PRESERVE_DEAD_CODE_INITS_AND_TERMS=NO
406:info:build     export PRODUCT_BUNDLE_IDENTIFIER=edu.upenn.cis.Unison
407:info:build     export PRODUCT_MODULE_NAME=Create_ExternalSettings
408:info:build     export PRODUCT_NAME="Create ExternalSettings"
409:info:build     export PRODUCT_SETTINGS_PATH=
410:info:build     export PROFILING_CODE=NO
411:info:build     export PROJECT=uimacnew
412:info:build     export PROJECT_DERIVED_FILE_DIR=/opt/local/var/macports/build/_opt_local_var_macports_sources_rsync.macports.org_macports_release_tarballs_ports_net_unison/unison/work/unison-2.51.2/src/uimac14/build/uimacnew.build/DerivedSources
413:info:build     export PROJECT_DIR=/opt/local/var/macports/build/_opt_local_var_macports_sources_rsync.macports.org_macports_release_tarballs_ports_net_unison/unison/work/unison-2.51.2/src/uimac14
414:info:build     export PROJECT_FILE_PATH=/opt/local/var/macports/build/_opt_local_var_macports_sources_rsync.macports.org_macports_release_tarballs_ports_net_unison/unison/work/unison-2.51.2/src/uimac14/uimacnew.xcodeproj
415:info:build     export PROJECT_NAME=uimacnew
416:info:build     export PROJECT_TEMP_DIR=/opt/local/var/macports/build/_opt_local_var_macports_sources_rsync.macports.org_macports_release_tarballs_ports_net_unison/unison/work/unison-2.51.2/src/uimac14/build/uimacnew.build
417:info:build     export PROJECT_TEMP_ROOT=/opt/local/var/macports/build/_opt_local_var_macports_sources_rsync.macports.org_macports_release_tarballs_ports_net_unison/unison/work/unison-2.51.2/src/uimac14/build
418:info:build     export RECURSIVE_SEARCH_PATHS_FOLLOW_SYMLINKS=YES
419:info:build     export REMOVE_CVS_FROM_RESOURCES=YES
420:info:build     export REMOVE_GIT_FROM_RESOURCES=YES
421:info:build     export REMOVE_HEADERS_FROM_EMBEDDED_BUNDLES=YES
422:info:build     export REMOVE_HG_FROM_RESOURCES=YES
423:info:build     export REMOVE_SVN_FROM_RESOURCES=YES
424:info:build     export REZ_COLLECTOR_DIR="/opt/local/var/macports/build/_opt_local_var_macports_sources_rsync.macports.org_macports_release_tarballs_ports_net_unison/unison/work/unison-2.51.2/src/uimac14/build/uimacnew.build/Default/Create ExternalSettings.build/ResourceManagerResources"
425:info:build     export REZ_OBJECTS_DIR="/opt/local/var/macports/build/_opt_local_var_macports_sources_rsync.macports.org_macports_release_tarballs_ports_net_unison/unison/work/unison-2.51.2/src/uimac14/build/uimacnew.build/Default/Create ExternalSettings.build/ResourceManagerResources/Objects"
426:info:build     export SCAN_ALL_SOURCE_FILES_FOR_INCLUDES=NO
427:info:build     export SCRIPT_INPUT_FILE_COUNT=0
428:info:build     export SCRIPT_INPUT_FILE_LIST_COUNT=0
429:info:build     export SCRIPT_OUTPUT_FILE_COUNT=0
430:info:build     export SCRIPT_OUTPUT_FILE_LIST_COUNT=0
431:info:build     export SDKROOT=/Applications/Xcode.app/Contents/Developer/Platforms/MacOSX.platform/Developer/SDKs/MacOSX10.14.sdk
432:info:build     export SDK_DIR=/Applications/Xcode.app/Contents/Developer/Platforms/MacOSX.platform/Developer/SDKs/MacOSX10.14.sdk
433:info:build     export SDK_DIR_macosx10_14=/Applications/Xcode.app/Contents/Developer/Platforms/MacOSX.platform/Developer/SDKs/MacOSX10.14.sdk
434:info:build     export SDK_NAME=macosx10.14
435:info:build     export SDK_NAMES=macosx10.14
436:info:build     export SDK_PRODUCT_BUILD_VERSION=18B71
437:info:build     export SDK_VERSION=10.14
438:info:build     export SDK_VERSION_ACTUAL=101400
439:info:build     export SDK_VERSION_MAJOR=101400
440:info:build     export SDK_VERSION_MINOR=1400
441:info:build     export SED=/usr/bin/sed
442:info:build     export SEPARATE_STRIP=NO
443:info:build     export SEPARATE_SYMBOL_EDIT=NO
444:info:build     export SET_DIR_MODE_OWNER_GROUP=YES
445:info:build     export SET_FILE_MODE_OWNER_GROUP=NO
446:info:build     export SHALLOW_BUNDLE=NO
447:info:build     export SHARED_DERIVED_FILE_DIR=/opt/local/var/macports/build/_opt_local_var_macports_sources_rsync.macports.org_macports_release_tarballs_ports_net_unison/unison/work/unison-2.51.2/src/uimac14/build/Default/DerivedSources
448:info:build     export SHARED_PRECOMPS_DIR=/opt/local/var/macports/build/_opt_local_var_macports_sources_rsync.macports.org_macports_release_tarballs_ports_net_unison/unison/work/unison-2.51.2/src/uimac14/build/SharedPrecompiledHeaders
449:info:build     export SKIP_INSTALL=YES
450:info:build     export SOURCE_ROOT=/opt/local/var/macports/build/_opt_local_var_macports_sources_rsync.macports.org_macports_release_tarballs_ports_net_unison/unison/work/unison-2.51.2/src/uimac14
451:info:build     export SRCROOT=/opt/local/var/macports/build/_opt_local_var_macports_sources_rsync.macports.org_macports_release_tarballs_ports_net_unison/unison/work/unison-2.51.2/src/uimac14
452:info:build     export STRINGS_FILE_OUTPUT_ENCODING=UTF-16
453:info:build     export STRIP_BITCODE_FROM_COPIED_FILES=NO
454:info:build     export STRIP_INSTALLED_PRODUCT=YES
455:info:build     export STRIP_PNG_TEXT=NO
456:info:build     export STRIP_STYLE=all
457:info:build     export STRIP_SWIFT_SYMBOLS=YES
458:info:build     export SUPPORTED_PLATFORMS=macosx
459:info:build     export SUPPORTS_TEXT_BASED_API=NO
460:info:build     export SWIFT_PLATFORM_TARGET_PREFIX=macosx
461:info:build     export SYMROOT=/opt/local/var/macports/build/_opt_local_var_macports_sources_rsync.macports.org_macports_release_tarballs_ports_net_unison/unison/work/unison-2.51.2/src/uimac14/build
462:info:build     export SYSTEM_ADMIN_APPS_DIR=/Applications/Utilities
463:info:build     export SYSTEM_APPS_DIR=/Applications
464:info:build     export SYSTEM_CORE_SERVICES_DIR=/System/Library/CoreServices
465:info:build     export SYSTEM_DEMOS_DIR=/Applications/Extras
466:info:build     export SYSTEM_DEVELOPER_APPS_DIR=/Applications/Xcode.app/Contents/Developer/Applications
467:info:build     export SYSTEM_DEVELOPER_BIN_DIR=/Applications/Xcode.app/Contents/Developer/usr/bin
468:info:build     export SYSTEM_DEVELOPER_DEMOS_DIR="/Applications/Xcode.app/Contents/Developer/Applications/Utilities/Built Examples"
469:info:build     export SYSTEM_DEVELOPER_DIR=/Applications/Xcode.app/Contents/Developer
470:info:build     export SYSTEM_DEVELOPER_DOC_DIR="/Applications/Xcode.app/Contents/Developer/ADC Reference Library"
471:info:build     export SYSTEM_DEVELOPER_GRAPHICS_TOOLS_DIR="/Applications/Xcode.app/Contents/Developer/Applications/Graphics Tools"
472:info:build     export SYSTEM_DEVELOPER_JAVA_TOOLS_DIR="/Applications/Xcode.app/Contents/Developer/Applications/Java Tools"
473:info:build     export SYSTEM_DEVELOPER_PERFORMANCE_TOOLS_DIR="/Applications/Xcode.app/Contents/Developer/Applications/Performance Tools"
474:info:build     export SYSTEM_DEVELOPER_RELEASENOTES_DIR="/Applications/Xcode.app/Contents/Developer/ADC Reference Library/releasenotes"
475:info:build     export SYSTEM_DEVELOPER_TOOLS=/Applications/Xcode.app/Contents/Developer/Tools
476:info:build     export SYSTEM_DEVELOPER_TOOLS_DOC_DIR="/Applications/Xcode.app/Contents/Developer/ADC Reference Library/documentation/DeveloperTools"
477:info:build     export SYSTEM_DEVELOPER_TOOLS_RELEASENOTES_DIR="/Applications/Xcode.app/Contents/Developer/ADC Reference Library/releasenotes/DeveloperTools"
478:info:build     export SYSTEM_DEVELOPER_USR_DIR=/Applications/Xcode.app/Contents/Developer/usr
479:info:build     export SYSTEM_DEVELOPER_UTILITIES_DIR=/Applications/Xcode.app/Contents/Developer/Applications/Utilities
480:info:build     export SYSTEM_DOCUMENTATION_DIR=/Library/Documentation
481:info:build     export SYSTEM_KEXT_INSTALL_PATH=/System/Library/Extensions
482:info:build     export SYSTEM_LIBRARY_DIR=/System/Library
483:info:build     export TAPI_VERIFY_MODE=ErrorsOnly
484:info:build     export TARGETNAME="Create ExternalSettings"
485:info:build     export TARGET_BUILD_DIR=/opt/local/var/macports/build/_opt_local_var_macports_sources_rsync.macports.org_macports_release_tarballs_ports_net_unison/unison/work/unison-2.51.2/src/uimac14/build/Default
486:info:build     export TARGET_NAME="Create ExternalSettings"
487:info:build     export TARGET_TEMP_DIR="/opt/local/var/macports/build/_opt_local_var_macports_sources_rsync.macports.org_macports_release_tarballs_ports_net_unison/unison/work/unison-2.51.2/src/uimac14/build/uimacnew.build/Default/Create ExternalSettings.build"
488:info:build     export TEMP_DIR="/opt/local/var/macports/build/_opt_local_var_macports_sources_rsync.macports.org_macports_release_tarballs_ports_net_unison/unison/work/unison-2.51.2/src/uimac14/build/uimacnew.build/Default/Create ExternalSettings.build"
489:info:build     export TEMP_FILES_DIR="/opt/local/var/macports/build/_opt_local_var_macports_sources_rsync.macports.org_macports_release_tarballs_ports_net_unison/unison/work/unison-2.51.2/src/uimac14/build/uimacnew.build/Default/Create ExternalSettings.build"
490:info:build     export TEMP_FILE_DIR="/opt/local/var/macports/build/_opt_local_var_macports_sources_rsync.macports.org_macports_release_tarballs_ports_net_unison/unison/work/unison-2.51.2/src/uimac14/build/uimacnew.build/Default/Create ExternalSettings.build"
491:info:build     export TEMP_ROOT=/opt/local/var/macports/build/_opt_local_var_macports_sources_rsync.macports.org_macports_release_tarballs_ports_net_unison/unison/work/unison-2.51.2/src/uimac14/build
492:info:build     export TOOLCHAINS=com.apple.dt.toolchain.XcodeDefault
493:info:build     export TOOLCHAIN_DIR=/Applications/Xcode.app/Contents/Developer/Toolchains/XcodeDefault.xctoolchain
494:info:build     export TREAT_MISSING_BASELINES_AS_TEST_FAILURES=NO
495:info:build     export UID=502
496:info:build     export UNSTRIPPED_PRODUCT=NO
497:info:build     export USER=macports
498:info:build     export USER_APPS_DIR=/opt/local/var/macports/home/Applications
499:info:build     export USER_HEADER_SEARCH_PATHS=/opt/local/lib/ocaml
500:info:build     export USER_LIBRARY_DIR=/opt/local/var/macports/home/Library
501:info:build     export USE_DYNAMIC_NO_PIC=YES
502:info:build     export USE_HEADERMAP=YES
503:info:build     export USE_HEADER_SYMLINKS=NO
504:info:build     export VALIDATE_PRODUCT=NO
505:info:build     export VALID_ARCHS="i386 x86_64"
506:info:build     export VERBOSE_PBXCP=NO
507:info:build     export VERSION_INFO_BUILDER=macports
508:info:build     export VERSION_INFO_FILE="Create ExternalSettings_vers.c"
509:info:build     export VERSION_INFO_STRING="\"@(#)PROGRAM:Create ExternalSettings  PROJECT:uimacnew-\""
510:info:build     export WRAP_ASSET_PACKS_IN_SEPARATE_DIRECTORIES=NO
511:info:build     export XCODE_APP_SUPPORT_DIR=/Applications/Xcode.app/Contents/Developer/Library/Xcode
512:info:build     export XCODE_PRODUCT_BUILD_VERSION=10B61
513:info:build     export XCODE_VERSION_ACTUAL=1010
514:info:build     export XCODE_VERSION_MAJOR=1000
515:info:build     export XCODE_VERSION_MINOR=1010
516:info:build     export XPCSERVICES_FOLDER_PATH=/XPCServices
517:info:build     export YACC=yacc
518:info:build     export arch=x86_64
519:info:build     export variant=normal
520:info:build     /bin/sh -c \"/opt/local/var/macports/build/_opt_local_var_macports_sources_rsync.macports.org_macports_release_tarballs_ports_net_unison/unison/work/unison-2.51.2/src/uimac14/build/uimacnew.build/Default/Create\ ExternalSettings.build/Script-2A124E7E0DE1C4BE00524237.sh\"
521:info:build /opt/local/var/macports/build/_opt_local_var_macports_sources_rsync.macports.org_macports_release_tarballs_ports_net_unison/unison/work/unison-2.51.2/src/uimac14/build/uimacnew.build/Default/Create ExternalSettings.build/Script-2A124E7E0DE1C4BE00524237.sh: line 6: opam: command not found
522:info:build === BUILD TARGET uimac OF PROJECT uimacnew WITH THE DEFAULT CONFIGURATION (Default) ===
523:info:build Check dependencies
524:info:build The file “ExternalSettings.xcconfig” couldn’t be opened because there is no such file. (/opt/local/var/macports/build/_opt_local_var_macports_sources_rsync.macports.org_macports_release_tarballs_ports_net_unison/unison/work/unison-2.51.2/src/uimac14/ExternalSettings.xcconfig)
525:info:build Write auxiliary files
526:info:build write-file /opt/local/var/macports/build/_opt_local_var_macports_sources_rsync.macports.org_macports_release_tarballs_ports_net_unison/unison/work/unison-2.51.2/src/uimac14/build/uimacnew.build/Default/uimac.build/Unison-all-target-headers.hmap
527:info:build write-file /opt/local/var/macports/build/_opt_local_var_macports_sources_rsync.macports.org_macports_release_tarballs_ports_net_unison/unison/work/unison-2.51.2/src/uimac14/build/uimacnew.build/Default/uimac.build/Unison-own-target-headers.hmap
528:info:build write-file /opt/local/var/macports/build/_opt_local_var_macports_sources_rsync.macports.org_macports_release_tarballs_ports_net_unison/unison/work/unison-2.51.2/src/uimac14/build/uimacnew.build/Default/uimac.build/Unison-project-headers.hmap
529:info:build write-file /opt/local/var/macports/build/_opt_local_var_macports_sources_rsync.macports.org_macports_release_tarballs_ports_net_unison/unison/work/unison-2.51.2/src/uimac14/build/uimacnew.build/Default/uimac.build/Script-2E282CBA0D9AE17300439D01.sh
530:info:build chmod 0755 /opt/local/var/macports/build/_opt_local_var_macports_sources_rsync.macports.org_macports_release_tarballs_ports_net_unison/unison/work/unison-2.51.2/src/uimac14/build/uimacnew.build/Default/uimac.build/Script-2E282CBA0D9AE17300439D01.sh
531:info:build write-file /opt/local/var/macports/build/_opt_local_var_macports_sources_rsync.macports.org_macports_release_tarballs_ports_net_unison/unison/work/unison-2.51.2/src/uimac14/build/uimacnew.build/Default/uimac.build/Unison.hmap
532:info:build write-file /opt/local/var/macports/build/_opt_local_var_macports_sources_rsync.macports.org_macports_release_tarballs_ports_net_unison/unison/work/unison-2.51.2/src/uimac14/build/uimacnew.build/Default/uimac.build/Unison-all-non-framework-target-headers.hmap
533:info:build write-file /opt/local/var/macports/build/_opt_local_var_macports_sources_rsync.macports.org_macports_release_tarballs_ports_net_unison/unison/work/unison-2.51.2/src/uimac14/build/uimacnew.build/Default/uimac.build/Unison-generated-files.hmap
534:info:build /bin/mkdir -p /opt/local/var/macports/build/_opt_local_var_macports_sources_rsync.macports.org_macports_release_tarballs_ports_net_unison/unison/work/unison-2.51.2/src/uimac14/build/uimacnew.build/Default/uimac.build/Objects-normal/x86_64
535:info:build write-file /opt/local/var/macports/build/_opt_local_var_macports_sources_rsync.macports.org_macports_release_tarballs_ports_net_unison/unison/work/unison-2.51.2/src/uimac14/build/uimacnew.build/Default/uimac.build/Objects-normal/x86_64/Unison.LinkFileList
536:info:build Create product structure
537:info:build /bin/mkdir -p /opt/local/var/macports/build/_opt_local_var_macports_sources_rsync.macports.org_macports_release_tarballs_ports_net_unison/unison/work/unison-2.51.2/src/uimac14/build/Default/Unison.app/Contents
538:info:build /bin/mkdir -p /opt/local/var/macports/build/_opt_local_var_macports_sources_rsync.macports.org_macports_release_tarballs_ports_net_unison/unison/work/unison-2.51.2/src/uimac14/build/Default/Unison.app/Contents/MacOS
539:info:build /bin/mkdir -p /opt/local/var/macports/build/_opt_local_var_macports_sources_rsync.macports.org_macports_release_tarballs_ports_net_unison/unison/work/unison-2.51.2/src/uimac14/build/Default/Unison.app/Contents/Resources
540:info:build PhaseScriptExecution Run\ Script\ (make\ unison-blob.o) build/uimacnew.build/Default/uimac.build/Script-2E282CBA0D9AE17300439D01.sh
541:info:build     cd /opt/local/var/macports/build/_opt_local_var_macports_sources_rsync.macports.org_macports_release_tarballs_ports_net_unison/unison/work/unison-2.51.2/src/uimac14
542:info:build     export ACTION=build
543:info:build     export ALTERNATE_GROUP=macports
544:info:build     export ALTERNATE_MODE=u+w,go-w,a+rX
545:info:build     export ALTERNATE_OWNER=macports
546:info:build     export ALWAYS_EMBED_SWIFT_STANDARD_LIBRARIES=NO
547:info:build     export ALWAYS_SEARCH_USER_PATHS=YES
548:info:build     export ALWAYS_USE_SEPARATE_HEADERMAPS=NO
549:info:build     export APPLE_INTERNAL_DEVELOPER_DIR=/AppleInternal/Developer
550:info:build     export APPLE_INTERNAL_DIR=/AppleInternal
551:info:build     export APPLE_INTERNAL_DOCUMENTATION_DIR=/AppleInternal/Documentation
552:info:build     export APPLE_INTERNAL_LIBRARY_DIR=/AppleInternal/Library
553:info:build     export APPLE_INTERNAL_TOOLS=/AppleInternal/Developer/Tools
554:info:build     export APPLICATION_EXTENSION_API_ONLY=NO
555:info:build     export APPLY_RULES_IN_COPY_FILES=NO
556:info:build     export ARCHS=x86_64
557:info:build     export ARCHS_STANDARD=x86_64
558:info:build     export ARCHS_STANDARD_32_64_BIT="x86_64 i386"
559:info:build     export ARCHS_STANDARD_32_BIT=i386
560:info:build     export ARCHS_STANDARD_64_BIT=x86_64
561:info:build     export ARCHS_STANDARD_INCLUDING_64_BIT=x86_64
562:info:build     export AVAILABLE_PLATFORMS="appletvos appletvsimulator iphoneos iphonesimulator macosx watchos watchsimulator"
563:info:build     export BITCODE_GENERATION_MODE=marker
564:info:build     export BUILD_ACTIVE_RESOURCES_ONLY=NO
565:info:build     export BUILD_COMPONENTS="headers build"
566:info:build     export BUILD_DIR=/opt/local/var/macports/build/_opt_local_var_macports_sources_rsync.macports.org_macports_release_tarballs_ports_net_unison/unison/work/unison-2.51.2/src/uimac14/build
567:info:build     export BUILD_ROOT=/opt/local/var/macports/build/_opt_local_var_macports_sources_rsync.macports.org_macports_release_tarballs_ports_net_unison/unison/work/unison-2.51.2/src/uimac14/build
568:info:build     export BUILD_STYLE=
569:info:build     export BUILD_VARIANTS=normal
570:info:build     export BUILT_PRODUCTS_DIR=/opt/local/var/macports/build/_opt_local_var_macports_sources_rsync.macports.org_macports_release_tarballs_ports_net_unison/unison/work/unison-2.51.2/src/uimac14/build/Default
571:info:build     export CACHE_ROOT=/var/folders/4m/ntl3h12x2jl3v267xggmbvqm0000gp/C/com.apple.DeveloperTools/10.1-10B61/Xcode
572:info:build     export CCHROOT=/var/folders/4m/ntl3h12x2jl3v267xggmbvqm0000gp/C/com.apple.DeveloperTools/10.1-10B61/Xcode
573:info:build     export CHMOD=/bin/chmod
574:info:build     export CHOWN=/usr/sbin/chown
575:info:build     export CLANG_ANALYZER_LOCALIZABILITY_NONLOCALIZED=YES
576:info:build     export CLANG_MODULES_BUILD_SESSION_FILE=/var/folders/4m/ntl3h12x2jl3v267xggmbvqm0000gp/C/org.llvm.clang/ModuleCache.noindex/Session.modulevalidation
577:info:build     export CLANG_WARN_BOOL_CONVERSION=YES
578:info:build     export CLANG_WARN_CONSTANT_CONVERSION=YES
579:info:build     export CLANG_WARN_EMPTY_BODY=YES
580:info:build     export CLANG_WARN_ENUM_CONVERSION=YES
581:info:build     export CLANG_WARN_INFINITE_RECURSION=YES
582:info:build     export CLANG_WARN_INT_CONVERSION=YES
583:info:build     export CLANG_WARN_SUSPICIOUS_MOVE=YES
584:info:build     export CLANG_WARN_UNREACHABLE_CODE=YES
585:info:build     export CLANG_WARN__DUPLICATE_METHOD_MATCH=YES
586:info:build     export CLASS_FILE_DIR=/opt/local/var/macports/build/_opt_local_var_macports_sources_rsync.macports.org_macports_release_tarballs_ports_net_unison/unison/work/unison-2.51.2/src/uimac14/build/uimacnew.build/Default/uimac.build/JavaClasses
587:info:build     export CLEAN_PRECOMPS=YES
588:info:build     export CLONE_HEADERS=NO
589:info:build     export CODESIGNING_FOLDER_PATH=/opt/local/var/macports/build/_opt_local_var_macports_sources_rsync.macports.org_macports_release_tarballs_ports_net_unison/unison/work/unison-2.51.2/src/uimac14/build/Default/Unison.app
590:info:build     export CODE_SIGNING_ALLOWED=YES
591:info:build     export CODE_SIGN_INJECT_BASE_ENTITLEMENTS=YES
592:info:build     export COLOR_DIAGNOSTICS=NO
593:info:build     export COMBINE_HIDPI_IMAGES=YES
594:info:build     export COMMAND_MODE=legacy
595:info:build     export COMPILER_INDEX_STORE_ENABLE=Default
596:info:build     export COMPOSITE_SDK_DIRS=/opt/local/var/macports/build/_opt_local_var_macports_sources_rsync.macports.org_macports_release_tarballs_ports_net_unison/unison/work/unison-2.51.2/src/uimac14/build/CompositeSDKs
597:info:build     export COMPRESS_PNG_FILES=NO
598:info:build     export CONFIGURATION=Default
599:info:build     export CONFIGURATION_BUILD_DIR=/opt/local/var/macports/build/_opt_local_var_macports_sources_rsync.macports.org_macports_release_tarballs_ports_net_unison/unison/work/unison-2.51.2/src/uimac14/build/Default
600:info:build     export CONFIGURATION_TEMP_DIR=/opt/local/var/macports/build/_opt_local_var_macports_sources_rsync.macports.org_macports_release_tarballs_ports_net_unison/unison/work/unison-2.51.2/src/uimac14/build/uimacnew.build/Default
601:info:build     export CONTENTS_FOLDER_PATH=Unison.app/Contents
602:info:build     export COPYING_PRESERVES_HFS_DATA=NO
603:info:build     export COPY_HEADERS_RUN_UNIFDEF=NO
604:info:build     export COPY_PHASE_STRIP=YES
605:info:build     export COPY_RESOURCES_FROM_STATIC_FRAMEWORKS=YES
606:info:build     export CP=/bin/cp
607:info:build     export CREATE_INFOPLIST_SECTION_IN_BINARY=NO
608:info:build     export CURRENT_ARCH=x86_64
609:info:build     export CURRENT_VARIANT=normal
610:info:build     export DEAD_CODE_STRIPPING=NO
611:info:build     export DEBUGGING_SYMBOLS=YES
612:info:build     export DEBUG_INFORMATION_FORMAT=dwarf
613:info:build     export DEFAULT_COMPILER=com.apple.compilers.llvm.clang.1_0
614:info:build     export DEFAULT_KEXT_INSTALL_PATH=/System/Library/Extensions
615:info:build     export DEFINES_MODULE=NO
616:info:build     export DEPLOYMENT_LOCATION=NO
617:info:build     export DEPLOYMENT_POSTPROCESSING=NO
618:info:build     export DEPLOYMENT_TARGET_CLANG_ENV_NAME=MACOSX_DEPLOYMENT_TARGET
619:info:build     export DEPLOYMENT_TARGET_CLANG_FLAG_NAME=mmacosx-version-min
620:info:build     export DEPLOYMENT_TARGET_LD_ENV_NAME=MACOSX_DEPLOYMENT_TARGET
621:info:build     export DEPLOYMENT_TARGET_LD_FLAG_NAME=macosx_version_min
622:info:build     export DEPLOYMENT_TARGET_SETTING_NAME=MACOSX_DEPLOYMENT_TARGET
623:info:build     export DEPLOYMENT_TARGET_SUGGESTED_VALUES="10.6 10.7 10.8 10.9 10.10 10.11 10.12 10.13 10.14"
624:info:build     export DERIVED_FILES_DIR=/opt/local/var/macports/build/_opt_local_var_macports_sources_rsync.macports.org_macports_release_tarballs_ports_net_unison/unison/work/unison-2.51.2/src/uimac14/build/uimacnew.build/Default/uimac.build/DerivedSources
625:info:build     export DERIVED_FILE_DIR=/opt/local/var/macports/build/_opt_local_var_macports_sources_rsync.macports.org_macports_release_tarballs_ports_net_unison/unison/work/unison-2.51.2/src/uimac14/build/uimacnew.build/Default/uimac.build/DerivedSources
626:info:build     export DERIVED_SOURCES_DIR=/opt/local/var/macports/build/_opt_local_var_macports_sources_rsync.macports.org_macports_release_tarballs_ports_net_unison/unison/work/unison-2.51.2/src/uimac14/build/uimacnew.build/Default/uimac.build/DerivedSources
627:info:build     export DEVELOPER_APPLICATIONS_DIR=/Applications/Xcode.app/Contents/Developer/Applications
628:info:build     export DEVELOPER_BIN_DIR=/Applications/Xcode.app/Contents/Developer/usr/bin
629:info:build     export DEVELOPER_DIR=/Applications/Xcode.app/Contents/Developer
630:info:build     export DEVELOPER_FRAMEWORKS_DIR=/Applications/Xcode.app/Contents/Developer/Library/Frameworks
631:info:build     export DEVELOPER_FRAMEWORKS_DIR_QUOTED=/Applications/Xcode.app/Contents/Developer/Library/Frameworks
632:info:build     export DEVELOPER_LIBRARY_DIR=/Applications/Xcode.app/Contents/Developer/Library
633:info:build     export DEVELOPER_SDK_DIR=/Applications/Xcode.app/Contents/Developer/Platforms/MacOSX.platform/Developer/SDKs
634:info:build     export DEVELOPER_TOOLS_DIR=/Applications/Xcode.app/Contents/Developer/Tools
635:info:build     export DEVELOPER_USR_DIR=/Applications/Xcode.app/Contents/Developer/usr
636:info:build     export DEVELOPMENT_LANGUAGE=English
637:info:build     export DOCUMENTATION_FOLDER_PATH=Unison.app/Contents/Resources/English.lproj/Documentation
638:info:build     export DO_HEADER_SCANNING_IN_JAM=NO
639:info:build     export DSTROOT=/tmp/uimacnew.dst
640:info:build     export DT_TOOLCHAIN_DIR=/Applications/Xcode.app/Contents/Developer/Toolchains/XcodeDefault.xctoolchain
641:info:build     export DWARF_DSYM_FILE_NAME=Unison.app.dSYM
642:info:build     export DWARF_DSYM_FILE_SHOULD_ACCOMPANY_PRODUCT=NO
643:info:build     export DWARF_DSYM_FOLDER_PATH=/opt/local/var/macports/build/_opt_local_var_macports_sources_rsync.macports.org_macports_release_tarballs_ports_net_unison/unison/work/unison-2.51.2/src/uimac14/build/Default
644:info:build     export EMBEDDED_CONTENT_CONTAINS_SWIFT=NO
645:info:build     export EMBEDDED_PROFILE_NAME=embedded.provisionprofile
646:info:build     export EMBED_ASSET_PACKS_IN_PRODUCT_BUNDLE=NO
647:info:build     export ENABLE_BITCODE=NO
648:info:build     export ENABLE_DEFAULT_HEADER_SEARCH_PATHS=YES
649:info:build     export ENABLE_HEADER_DEPENDENCIES=YES
650:info:build     export ENABLE_ON_DEMAND_RESOURCES=NO
651:info:build     export ENABLE_STRICT_OBJC_MSGSEND=YES
652:info:build     export ENABLE_TESTABILITY=NO
653:info:build     export EXCLUDED_INSTALLSRC_SUBDIRECTORY_PATTERNS=".DS_Store .svn .git .hg CVS"
654:info:build     export EXCLUDED_RECURSIVE_SEARCH_PATH_SUBDIRECTORIES="*.nib *.lproj *.framework *.gch *.xcode* *.xcassets (*) .DS_Store CVS .svn .git .hg *.pbproj *.pbxproj"
655:info:build     export EXECUTABLES_FOLDER_PATH=Unison.app/Contents/Executables
656:info:build     export EXECUTABLE_FOLDER_PATH=Unison.app/Contents/MacOS
657:info:build     export EXECUTABLE_NAME=Unison
658:info:build     export EXECUTABLE_PATH=Unison.app/Contents/MacOS/Unison
659:info:build     export EXPANDED_CODE_SIGN_IDENTITY=
660:info:build     export EXPANDED_CODE_SIGN_IDENTITY_NAME=
661:info:build     export EXPANDED_PROVISIONING_PROFILE=
662:info:build     export FILE_LIST=/opt/local/var/macports/build/_opt_local_var_macports_sources_rsync.macports.org_macports_release_tarballs_ports_net_unison/unison/work/unison-2.51.2/src/uimac14/build/uimacnew.build/Default/uimac.build/Objects/LinkFileList
663:info:build     export FIXED_FILES_DIR=/opt/local/var/macports/build/_opt_local_var_macports_sources_rsync.macports.org_macports_release_tarballs_ports_net_unison/unison/work/unison-2.51.2/src/uimac14/build/uimacnew.build/Default/uimac.build/FixedFiles
664:info:build     export FRAMEWORKS_FOLDER_PATH=Unison.app/Contents/Frameworks
665:info:build     export FRAMEWORK_FLAG_PREFIX=-framework
666:info:build     export FRAMEWORK_SEARCH_PATHS="/opt/local/var/macports/build/_opt_local_var_macports_sources_rsync.macports.org_macports_release_tarballs_ports_net_unison/unison/work/unison-2.51.2/src/uimac14/build/Default  /opt/local/var/macports/build/_opt_local_var_macports_sources_rsync.macports.org_macports_release_tarballs_ports_net_unison/unison/work/unison-2.51.2/src/uimac14 "
667:info:build     export FRAMEWORK_VERSION=A
668:info:build     export FULL_PRODUCT_NAME=Unison.app
669:info:build     export GCC3_VERSION=3.3
670:info:build     export GCC_DYNAMIC_NO_PIC=NO
671:info:build     export GCC_ENABLE_OBJC_EXCEPTIONS=YES
672:info:build     export GCC_INLINES_ARE_PRIVATE_EXTERN=YES
673:info:build     export GCC_NO_COMMON_BLOCKS=YES
674:info:build     export GCC_PFE_FILE_C_DIALECTS="c objective-c c++ objective-c++"
675:info:build     export GCC_PRECOMPILE_PREFIX_HEADER=YES
676:info:build     export GCC_SYMBOLS_PRIVATE_EXTERN=YES
677:info:build     export GCC_TREAT_WARNINGS_AS_ERRORS=NO
678:info:build     export GCC_VERSION=com.apple.compilers.llvm.clang.1_0
679:info:build     export GCC_VERSION_IDENTIFIER=com_apple_compilers_llvm_clang_1_0
680:info:build     export GCC_WARN_64_TO_32_BIT_CONVERSION=YES
681:info:build     export GCC_WARN_ABOUT_RETURN_TYPE=YES
682:info:build     export GCC_WARN_UNDECLARED_SELECTOR=YES
683:info:build     export GCC_WARN_UNINITIALIZED_AUTOS=YES
684:info:build     export GCC_WARN_UNUSED_FUNCTION=YES
685:info:build     export GCC_WARN_UNUSED_VARIABLE=YES
686:info:build     export GENERATE_MASTER_OBJECT_FILE=NO
687:info:build     export GENERATE_PKGINFO_FILE=YES
688:info:build     export GENERATE_PROFILING_CODE=NO
689:info:build     export GENERATE_TEXT_BASED_STUBS=NO
690:info:build     export GID=501
691:info:build     export GROUP=macports
692:info:build     export HEADERMAP_INCLUDES_FLAT_ENTRIES_FOR_TARGET_BEING_BUILT=YES
693:info:build     export HEADERMAP_INCLUDES_FRAMEWORK_ENTRIES_FOR_ALL_PRODUCT_TYPES=YES
694:info:build     export HEADERMAP_INCLUDES_NONPUBLIC_NONPRIVATE_HEADERS=YES
695:info:build     export HEADERMAP_INCLUDES_PROJECT_HEADERS=YES
696:info:build     export HEADERMAP_USES_FRAMEWORK_PREFIX_ENTRIES=YES
697:info:build     export HEADERMAP_USES_VFS=NO
698:info:build     export HEADER_SEARCH_PATHS="/opt/local/var/macports/build/_opt_local_var_macports_sources_rsync.macports.org_macports_release_tarballs_ports_net_unison/unison/work/unison-2.51.2/src/uimac14/build/Default/include "
699:info:build     export HIDE_BITCODE_SYMBOLS=YES
700:info:build     export HOME=/opt/local/var/macports/home
701:info:build     export ICONV=/usr/bin/iconv
702:info:build     export INFOPLIST_EXPAND_BUILD_SETTINGS=YES
703:info:build     export INFOPLIST_FILE=Info.plist
704:info:build     export INFOPLIST_OUTPUT_FORMAT=same-as-input
705:info:build     export INFOPLIST_PATH=Unison.app/Contents/Info.plist
706:info:build     export INFOPLIST_PREPROCESS=NO
707:info:build     export INFOSTRINGS_PATH=Unison.app/Contents/Resources/English.lproj/InfoPlist.strings
708:info:build     export INLINE_PRIVATE_FRAMEWORKS=NO
709:info:build     export INSTALLHDRS_COPY_PHASE=NO
710:info:build     export INSTALLHDRS_SCRIPT_PHASE=NO
711:info:build     export INSTALL_DIR=/tmp/uimacnew.dst/opt/local/var/macports/home/Applications
712:info:build     export INSTALL_GROUP=macports
713:info:build     export INSTALL_MODE_FLAG=u+w,go-w,a+rX
714:info:build     export INSTALL_OWNER=macports
715:info:build     export INSTALL_PATH=/opt/local/var/macports/home/Applications
716:info:build     export INSTALL_ROOT=/tmp/uimacnew.dst
717:info:build     export JAVAC_DEFAULT_FLAGS="-J-Xms64m -J-XX:NewSize=4M -J-Dfile.encoding=UTF8"
718:info:build     export JAVA_APP_STUB=/System/Library/Frameworks/JavaVM.framework/Resources/MacOS/JavaApplicationStub
719:info:build     export JAVA_ARCHIVE_CLASSES=YES
720:info:build     export JAVA_ARCHIVE_TYPE=JAR
721:info:build     export JAVA_COMPILER=/usr/bin/javac
722:info:build     export JAVA_FOLDER_PATH=Unison.app/Contents/Resources/Java
723:info:build     export JAVA_FRAMEWORK_RESOURCES_DIRS=Resources
724:info:build     export JAVA_JAR_FLAGS=cv
725:info:build     export JAVA_SOURCE_SUBDIR=.
726:info:build     export JAVA_USE_DEPENDENCIES=YES
727:info:build     export JAVA_ZIP_FLAGS=-urg
728:info:build     export JIKES_DEFAULT_FLAGS="+E +OLDCSO"
729:info:build     export KASAN_DEFAULT_CFLAGS="-DKASAN=1 -fsanitize=address -mllvm -asan-globals-live-support -mllvm -asan-force-dynamic-shadow"
730:info:build     export KEEP_PRIVATE_EXTERNS=NO
731:info:build     export LD_DEPENDENCY_INFO_FILE=/opt/local/var/macports/build/_opt_local_var_macports_sources_rsync.macports.org_macports_release_tarballs_ports_net_unison/unison/work/unison-2.51.2/src/uimac14/build/uimacnew.build/Default/uimac.build/Objects-normal/x86_64/Unison_dependency_info.dat
732:info:build     export LD_GENERATE_MAP_FILE=NO
733:info:build     export LD_MAP_FILE_PATH=/opt/local/var/macports/build/_opt_local_var_macports_sources_rsync.macports.org_macports_release_tarballs_ports_net_unison/unison/work/unison-2.51.2/src/uimac14/build/uimacnew.build/Default/uimac.build/Unison-LinkMap-normal-x86_64.txt
734:info:build     export LD_NO_PIE=NO
735:info:build     export LD_QUOTE_LINKER_ARGUMENTS_FOR_COMPILER_DRIVER=YES
736:info:build     export LEGACY_DEVELOPER_DIR=/Applications/Xcode.app/Contents/PlugIns/Xcode3Core.ideplugin/Contents/SharedSupport/Developer
737:info:build     export LEX=lex
738:info:build     export LIBRARY_FLAG_NOSPACE=YES
739:info:build     export LIBRARY_FLAG_PREFIX=-l
740:info:build     export LIBRARY_KEXT_INSTALL_PATH=/Library/Extensions
741:info:build     export LIBRARY_SEARCH_PATHS="/opt/local/var/macports/build/_opt_local_var_macports_sources_rsync.macports.org_macports_release_tarballs_ports_net_unison/unison/work/unison-2.51.2/src/uimac14/build/Default "
742:info:build     export LINKER_DISPLAYS_MANGLED_NAMES=NO
743:info:build     export LINK_FILE_LIST_normal_x86_64=/opt/local/var/macports/build/_opt_local_var_macports_sources_rsync.macports.org_macports_release_tarballs_ports_net_unison/unison/work/unison-2.51.2/src/uimac14/build/uimacnew.build/Default/uimac.build/Objects-normal/x86_64/Unison.LinkFileList
744:info:build     export LINK_WITH_STANDARD_LIBRARIES=YES
745:info:build     export LOCALIZABLE_CONTENT_DIR=
746:info:build     export LOCALIZED_RESOURCES_FOLDER_PATH=Unison.app/Contents/Resources/English.lproj
747:info:build     export LOCALIZED_STRING_MACRO_NAMES="NSLocalizedString CFLocalizedString"
748:info:build     export LOCAL_ADMIN_APPS_DIR=/Applications/Utilities
749:info:build     export LOCAL_APPS_DIR=/Applications
750:info:build     export LOCAL_DEVELOPER_DIR=/Library/Developer
751:info:build     export LOCAL_LIBRARY_DIR=/Library
752:info:build     export LOCROOT=
753:info:build     export LOCSYMROOT=
754:info:build     export MACH_O_TYPE=mh_execute
755:info:build     export MACOSX_DEPLOYMENT_TARGET=10.14
756:info:build     export MAC_OS_X_PRODUCT_BUILD_VERSION=18B75
757:info:build     export MAC_OS_X_VERSION_ACTUAL=101401
758:info:build     export MAC_OS_X_VERSION_MAJOR=101400
759:info:build     export MAC_OS_X_VERSION_MINOR=1401
760:info:build     export METAL_LIBRARY_FILE_BASE=default
761:info:build     export METAL_LIBRARY_OUTPUT_DIR=/opt/local/var/macports/build/_opt_local_var_macports_sources_rsync.macports.org_macports_release_tarballs_ports_net_unison/unison/work/unison-2.51.2/src/uimac14/build/Default/Unison.app/Contents/Resources
762:info:build     export NATIVE_ARCH=i386
763:info:build     export NATIVE_ARCH_32_BIT=i386
764:info:build     export NATIVE_ARCH_64_BIT=x86_64
765:info:build     export NATIVE_ARCH_ACTUAL=x86_64
766:info:build     export NO_COMMON=YES
767:info:build     export OBJECT_FILE_DIR=/opt/local/var/macports/build/_opt_local_var_macports_sources_rsync.macports.org_macports_release_tarballs_ports_net_unison/unison/work/unison-2.51.2/src/uimac14/build/uimacnew.build/Default/uimac.build/Objects
768:info:build     export OBJECT_FILE_DIR_normal=/opt/local/var/macports/build/_opt_local_var_macports_sources_rsync.macports.org_macports_release_tarballs_ports_net_unison/unison/work/unison-2.51.2/src/uimac14/build/uimacnew.build/Default/uimac.build/Objects-normal
769:info:build     export OBJROOT=/opt/local/var/macports/build/_opt_local_var_macports_sources_rsync.macports.org_macports_release_tarballs_ports_net_unison/unison/work/unison-2.51.2/src/uimac14/build
770:info:build     export OCAMLLIBDIR=/opt/local/lib/ocaml
771:info:build     export ONLY_ACTIVE_ARCH=NO
772:info:build     export OS=MACOS
773:info:build     export OSAC=/usr/bin/osacompile
774:info:build     export OTHER_LDFLAGS="-L/opt/local/lib/ocaml -lunix -lthreadsnat -lcamlstr -lbigarray -lasmrun"
775:info:build     export PACKAGE_TYPE=com.apple.package-type.wrapper.application
776:info:build     export PASCAL_STRINGS=YES
777:info:build     export PATH="/Applications/Xcode.app/Contents/Developer/Toolchains/XcodeDefault.xctoolchain/usr/bin:/Applications/Xcode.app/Contents/Developer/Toolchains/XcodeDefault.xctoolchain/usr/local/bin:/Applications/Xcode.app/Contents/Developer/Toolchains/XcodeDefault.xctoolchain/usr/libexec:/Applications/Xcode.app/Contents/Developer/Platforms/MacOSX.platform/Developer/usr/bin:/Applications/Xcode.app/Contents/Developer/Platforms/MacOSX.platform/Developer/usr/local/bin:/Applications/Xcode.app/Contents/Developer/Platforms/MacOSX.platform/usr/bin:/Applications/Xcode.app/Contents/Developer/Platforms/MacOSX.platform/usr/local/bin:/Applications/Xcode.app/Contents/Developer/usr/bin:/Applications/Xcode.app/Contents/Developer/usr/local/bin:/Applications/Xcode.app/Contents/Developer/Tools:/opt/local/bin:/opt/local/sbin:/bin:/sbin:/usr/bin:/usr/sbin"
778:info:build     export PATH_PREFIXES_EXCLUDED_FROM_HEADER_DEPENDENCIES="/usr/include /usr/local/include /System/Library/Frameworks /System/Library/PrivateFrameworks /Applications/Xcode.app/Contents/Developer/Headers /Applications/Xcode.app/Contents/Developer/SDKs /Applications/Xcode.app/Contents/Developer/Platforms"
779:info:build     export PBDEVELOPMENTPLIST_PATH=Unison.app/Contents/pbdevelopment.plist
780:info:build     export PFE_FILE_C_DIALECTS=objective-c
781:info:build     export PKGINFO_FILE_PATH=/opt/local/var/macports/build/_opt_local_var_macports_sources_rsync.macports.org_macports_release_tarballs_ports_net_unison/unison/work/unison-2.51.2/src/uimac14/build/uimacnew.build/Default/uimac.build/PkgInfo
782:info:build     export PKGINFO_PATH=Unison.app/Contents/PkgInfo
783:info:build     export PLATFORM_DEVELOPER_APPLICATIONS_DIR=/Applications/Xcode.app/Contents/Developer/Applications
784:info:build     export PLATFORM_DEVELOPER_BIN_DIR=/Applications/Xcode.app/Contents/Developer/usr/bin
785:info:build     export PLATFORM_DEVELOPER_LIBRARY_DIR=/Applications/Xcode.app/Contents/Developer/Library
786:info:build     export PLATFORM_DEVELOPER_SDK_DIR=/Applications/Xcode.app/Contents/Developer/Platforms/MacOSX.platform/Developer/SDKs
787:info:build     export PLATFORM_DEVELOPER_TOOLS_DIR=/Applications/Xcode.app/Contents/Developer/Tools
788:info:build     export PLATFORM_DEVELOPER_USR_DIR=/Applications/Xcode.app/Contents/Developer/usr
789:info:build     export PLATFORM_DIR=/Applications/Xcode.app/Contents/Developer/Platforms/MacOSX.platform
790:info:build     export PLATFORM_DISPLAY_NAME=macOS
791:info:build     export PLATFORM_NAME=macosx
792:info:build     export PLATFORM_PREFERRED_ARCH=x86_64
793:info:build     export PLATFORM_PRODUCT_BUILD_VERSION=10B61
794:info:build     export PLIST_FILE_OUTPUT_FORMAT=same-as-input
795:info:build     export PLUGINS_FOLDER_PATH=Unison.app/Contents/PlugIns
796:info:build     export PRECOMPS_INCLUDE_HEADERS_FROM_BUILT_PRODUCTS_DIR=YES
797:info:build     export PRECOMP_DESTINATION_DIR=/opt/local/var/macports/build/_opt_local_var_macports_sources_rsync.macports.org_macports_release_tarballs_ports_net_unison/unison/work/unison-2.51.2/src/uimac14/build/uimacnew.build/Default/uimac.build/PrefixHeaders
798:info:build     export PRESERVE_DEAD_CODE_INITS_AND_TERMS=NO
799:info:build     export PRIVATE_HEADERS_FOLDER_PATH=Unison.app/Contents/PrivateHeaders
800:info:build     export PRODUCT_BUNDLE_IDENTIFIER=edu.upenn.cis.Unison
801:info:build     export PRODUCT_MODULE_NAME=Unison
802:info:build     export PRODUCT_NAME=Unison
803:info:build     export PRODUCT_SETTINGS_PATH=/opt/local/var/macports/build/_opt_local_var_macports_sources_rsync.macports.org_macports_release_tarballs_ports_net_unison/unison/work/unison-2.51.2/src/uimac14/Info.plist
804:info:build     export PRODUCT_TYPE=com.apple.product-type.application
805:info:build     export PROFILING_CODE=NO
806:info:build     export PROJECT=uimacnew
807:info:build     export PROJECT_DERIVED_FILE_DIR=/opt/local/var/macports/build/_opt_local_var_macports_sources_rsync.macports.org_macports_release_tarballs_ports_net_unison/unison/work/unison-2.51.2/src/uimac14/build/uimacnew.build/DerivedSources
808:info:build     export PROJECT_DIR=/opt/local/var/macports/build/_opt_local_var_macports_sources_rsync.macports.org_macports_release_tarballs_ports_net_unison/unison/work/unison-2.51.2/src/uimac14
809:info:build     export PROJECT_FILE_PATH=/opt/local/var/macports/build/_opt_local_var_macports_sources_rsync.macports.org_macports_release_tarballs_ports_net_unison/unison/work/unison-2.51.2/src/uimac14/uimacnew.xcodeproj
810:info:build     export PROJECT_NAME=uimacnew
811:info:build     export PROJECT_TEMP_DIR=/opt/local/var/macports/build/_opt_local_var_macports_sources_rsync.macports.org_macports_release_tarballs_ports_net_unison/unison/work/unison-2.51.2/src/uimac14/build/uimacnew.build
812:info:build     export PROJECT_TEMP_ROOT=/opt/local/var/macports/build/_opt_local_var_macports_sources_rsync.macports.org_macports_release_tarballs_ports_net_unison/unison/work/unison-2.51.2/src/uimac14/build
813:info:build     export PUBLIC_HEADERS_FOLDER_PATH=Unison.app/Contents/Headers
814:info:build     export RECURSIVE_SEARCH_PATHS_FOLLOW_SYMLINKS=YES
815:info:build     export REMOVE_CVS_FROM_RESOURCES=YES
816:info:build     export REMOVE_GIT_FROM_RESOURCES=YES
817:info:build     export REMOVE_HEADERS_FROM_EMBEDDED_BUNDLES=YES
818:info:build     export REMOVE_HG_FROM_RESOURCES=YES
819:info:build     export REMOVE_SVN_FROM_RESOURCES=YES
820:info:build     export REZ_COLLECTOR_DIR=/opt/local/var/macports/build/_opt_local_var_macports_sources_rsync.macports.org_macports_release_tarballs_ports_net_unison/unison/work/unison-2.51.2/src/uimac14/build/uimacnew.build/Default/uimac.build/ResourceManagerResources
821:info:build     export REZ_OBJECTS_DIR=/opt/local/var/macports/build/_opt_local_var_macports_sources_rsync.macports.org_macports_release_tarballs_ports_net_unison/unison/work/unison-2.51.2/src/uimac14/build/uimacnew.build/Default/uimac.build/ResourceManagerResources/Objects
822:info:build     export REZ_SEARCH_PATHS="/opt/local/var/macports/build/_opt_local_var_macports_sources_rsync.macports.org_macports_release_tarballs_ports_net_unison/unison/work/unison-2.51.2/src/uimac14/build/Default "
823:info:build     export SCAN_ALL_SOURCE_FILES_FOR_INCLUDES=NO
824:info:build     export SCRIPTS_FOLDER_PATH=Unison.app/Contents/Resources/Scripts
825:info:build     export SCRIPT_INPUT_FILE_COUNT=0
826:info:build     export SCRIPT_INPUT_FILE_LIST_COUNT=0
827:info:build     export SCRIPT_OUTPUT_FILE_COUNT=0
828:info:build     export SCRIPT_OUTPUT_FILE_LIST_COUNT=0
829:info:build     export SDKROOT=/Applications/Xcode.app/Contents/Developer/Platforms/MacOSX.platform/Developer/SDKs/MacOSX10.14.sdk
830:info:build     export SDK_DIR=/Applications/Xcode.app/Contents/Developer/Platforms/MacOSX.platform/Developer/SDKs/MacOSX10.14.sdk
831:info:build     export SDK_DIR_macosx10_14=/Applications/Xcode.app/Contents/Developer/Platforms/MacOSX.platform/Developer/SDKs/MacOSX10.14.sdk
832:info:build     export SDK_NAME=macosx10.14
833:info:build     export SDK_NAMES=macosx10.14
834:info:build     export SDK_PRODUCT_BUILD_VERSION=18B71
835:info:build     export SDK_VERSION=10.14
836:info:build     export SDK_VERSION_ACTUAL=101400
837:info:build     export SDK_VERSION_MAJOR=101400
838:info:build     export SDK_VERSION_MINOR=1400
839:info:build     export SED=/usr/bin/sed
840:info:build     export SEPARATE_STRIP=NO
841:info:build     export SEPARATE_SYMBOL_EDIT=NO
842:info:build     export SET_DIR_MODE_OWNER_GROUP=YES
843:info:build     export SET_FILE_MODE_OWNER_GROUP=NO
844:info:build     export SHALLOW_BUNDLE=NO
845:info:build     export SHARED_DERIVED_FILE_DIR=/opt/local/var/macports/build/_opt_local_var_macports_sources_rsync.macports.org_macports_release_tarballs_ports_net_unison/unison/work/unison-2.51.2/src/uimac14/build/Default/DerivedSources
846:info:build     export SHARED_FRAMEWORKS_FOLDER_PATH=Unison.app/Contents/SharedFrameworks
847:info:build     export SHARED_PRECOMPS_DIR=/opt/local/var/macports/build/_opt_local_var_macports_sources_rsync.macports.org_macports_release_tarballs_ports_net_unison/unison/work/unison-2.51.2/src/uimac14/build/SharedPrecompiledHeaders
848:info:build     export SHARED_SUPPORT_FOLDER_PATH=Unison.app/Contents/SharedSupport
849:info:build     export SKIP_INSTALL=NO
850:info:build     export SOURCE_ROOT=/opt/local/var/macports/build/_opt_local_var_macports_sources_rsync.macports.org_macports_release_tarballs_ports_net_unison/unison/work/unison-2.51.2/src/uimac14
851:info:build     export SRCROOT=/opt/local/var/macports/build/_opt_local_var_macports_sources_rsync.macports.org_macports_release_tarballs_ports_net_unison/unison/work/unison-2.51.2/src/uimac14
852:info:build     export STRINGS_FILE_OUTPUT_ENCODING=UTF-16
853:info:build     export STRIP_BITCODE_FROM_COPIED_FILES=NO
854:info:build     export STRIP_INSTALLED_PRODUCT=YES
855:info:build     export STRIP_PNG_TEXT=NO
856:info:build     export STRIP_STYLE=all
857:info:build     export STRIP_SWIFT_SYMBOLS=YES
858:info:build     export SUPPORTED_PLATFORMS=macosx
859:info:build     export SUPPORTS_TEXT_BASED_API=NO
860:info:build     export SWIFT_PLATFORM_TARGET_PREFIX=macosx
861:info:build     export SYMROOT=/opt/local/var/macports/build/_opt_local_var_macports_sources_rsync.macports.org_macports_release_tarballs_ports_net_unison/unison/work/unison-2.51.2/src/uimac14/build
862:info:build     export SYSTEM_ADMIN_APPS_DIR=/Applications/Utilities
863:info:build     export SYSTEM_APPS_DIR=/Applications
864:info:build     export SYSTEM_CORE_SERVICES_DIR=/System/Library/CoreServices
865:info:build     export SYSTEM_DEMOS_DIR=/Applications/Extras
866:info:build     export SYSTEM_DEVELOPER_APPS_DIR=/Applications/Xcode.app/Contents/Developer/Applications
867:info:build     export SYSTEM_DEVELOPER_BIN_DIR=/Applications/Xcode.app/Contents/Developer/usr/bin
868:info:build     export SYSTEM_DEVELOPER_DEMOS_DIR="/Applications/Xcode.app/Contents/Developer/Applications/Utilities/Built Examples"
869:info:build     export SYSTEM_DEVELOPER_DIR=/Applications/Xcode.app/Contents/Developer
870:info:build     export SYSTEM_DEVELOPER_DOC_DIR="/Applications/Xcode.app/Contents/Developer/ADC Reference Library"
871:info:build     export SYSTEM_DEVELOPER_GRAPHICS_TOOLS_DIR="/Applications/Xcode.app/Contents/Developer/Applications/Graphics Tools"
872:info:build     export SYSTEM_DEVELOPER_JAVA_TOOLS_DIR="/Applications/Xcode.app/Contents/Developer/Applications/Java Tools"
873:info:build     export SYSTEM_DEVELOPER_PERFORMANCE_TOOLS_DIR="/Applications/Xcode.app/Contents/Developer/Applications/Performance Tools"
874:info:build     export SYSTEM_DEVELOPER_RELEASENOTES_DIR="/Applications/Xcode.app/Contents/Developer/ADC Reference Library/releasenotes"
875:info:build     export SYSTEM_DEVELOPER_TOOLS=/Applications/Xcode.app/Contents/Developer/Tools
876:info:build     export SYSTEM_DEVELOPER_TOOLS_DOC_DIR="/Applications/Xcode.app/Contents/Developer/ADC Reference Library/documentation/DeveloperTools"
877:info:build     export SYSTEM_DEVELOPER_TOOLS_RELEASENOTES_DIR="/Applications/Xcode.app/Contents/Developer/ADC Reference Library/releasenotes/DeveloperTools"
878:info:build     export SYSTEM_DEVELOPER_USR_DIR=/Applications/Xcode.app/Contents/Developer/usr
879:info:build     export SYSTEM_DEVELOPER_UTILITIES_DIR=/Applications/Xcode.app/Contents/Developer/Applications/Utilities
880:info:build     export SYSTEM_DOCUMENTATION_DIR=/Library/Documentation
881:info:build     export SYSTEM_KEXT_INSTALL_PATH=/System/Library/Extensions
882:info:build     export SYSTEM_LIBRARY_DIR=/System/Library
883:info:build     export TAPI_VERIFY_MODE=ErrorsOnly
884:info:build     export TARGETNAME=uimac
885:info:build     export TARGET_BUILD_DIR=/opt/local/var/macports/build/_opt_local_var_macports_sources_rsync.macports.org_macports_release_tarballs_ports_net_unison/unison/work/unison-2.51.2/src/uimac14/build/Default
886:info:build     export TARGET_NAME=uimac
887:info:build     export TARGET_TEMP_DIR=/opt/local/var/macports/build/_opt_local_var_macports_sources_rsync.macports.org_macports_release_tarballs_ports_net_unison/unison/work/unison-2.51.2/src/uimac14/build/uimacnew.build/Default/uimac.build
888:info:build     export TEMP_DIR=/opt/local/var/macports/build/_opt_local_var_macports_sources_rsync.macports.org_macports_release_tarballs_ports_net_unison/unison/work/unison-2.51.2/src/uimac14/build/uimacnew.build/Default/uimac.build
889:info:build     export TEMP_FILES_DIR=/opt/local/var/macports/build/_opt_local_var_macports_sources_rsync.macports.org_macports_release_tarballs_ports_net_unison/unison/work/unison-2.51.2/src/uimac14/build/uimacnew.build/Default/uimac.build
890:info:build     export TEMP_FILE_DIR=/opt/local/var/macports/build/_opt_local_var_macports_sources_rsync.macports.org_macports_release_tarballs_ports_net_unison/unison/work/unison-2.51.2/src/uimac14/build/uimacnew.build/Default/uimac.build
891:info:build     export TEMP_ROOT=/opt/local/var/macports/build/_opt_local_var_macports_sources_rsync.macports.org_macports_release_tarballs_ports_net_unison/unison/work/unison-2.51.2/src/uimac14/build
892:info:build     export TOOLCHAINS=com.apple.dt.toolchain.XcodeDefault
893:info:build     export TOOLCHAIN_DIR=/Applications/Xcode.app/Contents/Developer/Toolchains/XcodeDefault.xctoolchain
894:info:build     export TREAT_MISSING_BASELINES_AS_TEST_FAILURES=NO
895:info:build     export UID=502
896:info:build     export UNLOCALIZED_RESOURCES_FOLDER_PATH=Unison.app/Contents/Resources
897:info:build     export UNSTRIPPED_PRODUCT=NO
898:info:build     export USER=macports
899:info:build     export USER_APPS_DIR=/opt/local/var/macports/home/Applications
900:info:build     export USER_HEADER_SEARCH_PATHS=/opt/local/lib/ocaml
901:info:build     export USER_LIBRARY_DIR=/opt/local/var/macports/home/Library
902:info:build     export USE_DYNAMIC_NO_PIC=YES
903:info:build     export USE_HEADERMAP=YES
904:info:build     export USE_HEADER_SYMLINKS=NO
905:info:build     export VALIDATE_PRODUCT=NO
906:info:build     export VALID_ARCHS="i386 x86_64"
907:info:build     export VERBOSE_PBXCP=NO
908:info:build     export VERSIONPLIST_PATH=Unison.app/Contents/version.plist
909:info:build     export VERSION_INFO_BUILDER=macports
910:info:build     export VERSION_INFO_FILE=Unison_vers.c
911:info:build     export VERSION_INFO_STRING="\"@(#)PROGRAM:Unison  PROJECT:uimacnew-\""
912:info:build     export WARNING_CFLAGS="-Wmost -Wno-four-char-constants -Wno-unknown-pragmas"
913:info:build     export WRAPPER_EXTENSION=app
914:info:build     export WRAPPER_NAME=Unison.app
915:info:build     export WRAPPER_SUFFIX=.app
916:info:build     export WRAP_ASSET_PACKS_IN_SEPARATE_DIRECTORIES=NO
917:info:build     export XCODE_APP_SUPPORT_DIR=/Applications/Xcode.app/Contents/Developer/Library/Xcode
918:info:build     export XCODE_PRODUCT_BUILD_VERSION=10B61
919:info:build     export XCODE_VERSION_ACTUAL=1010
920:info:build     export XCODE_VERSION_MAJOR=1000
921:info:build     export XCODE_VERSION_MINOR=1010
922:info:build     export XPCSERVICES_FOLDER_PATH=Unison.app/Contents/XPCServices
923:info:build     export YACC=yacc
924:info:build     export ZERO_LINK=NO
925:info:build     export arch=x86_64
926:info:build     export variant=normal
927:info:build     /bin/sh -c /opt/local/var/macports/build/_opt_local_var_macports_sources_rsync.macports.org_macports_release_tarballs_ports_net_unison/unison/work/unison-2.51.2/src/uimac14/build/uimacnew.build/Default/uimac.build/Script-2E282CBA0D9AE17300439D01.sh
928:info:build Building unison-blob.o...
929:info:build make[2]: Entering directory `/opt/local/var/macports/build/_opt_local_var_macports_sources_rsync.macports.org_macports_release_tarballs_ports_net_unison/unison/work/unison-2.51.2/src'
930:info:build ocamlopt: ubase/rx.mli ---> ubase/rx.cmi
931:info:build ocamlopt -g -unsafe-string -I lwt -I ubase -I system -thread -I fsmonitor -I fsmonitor/linux -I fsmonitor/windows -I system/generic -I lwt/generic -ccopt -mmacosx-version-min=10.14 -c /opt/local/var/macports/build/_opt_local_var_macports_sources_rsync.macports.org_macports_release_tarballs_ports_net_unison/unison/work/unison-2.51.2/src/ubase/rx.mli
932:info:build ocamlopt: ubase/rx.ml ---> ubase/rx.cmx
933:info:build ocamlopt -g -unsafe-string -I lwt -I ubase -I system -thread -I fsmonitor -I fsmonitor/linux -I fsmonitor/windows -I system/generic -I lwt/generic -ccopt -mmacosx-version-min=10.14 -c /opt/local/var/macports/build/_opt_local_var_macports_sources_rsync.macports.org_macports_release_tarballs_ports_net_unison/unison/work/unison-2.51.2/src/ubase/rx.ml
934:info:build ocamlopt: unicode_tables.ml ---> unicode_tables.cmx
935:info:build ocamlopt -g -unsafe-string -I lwt -I ubase -I system -thread -I fsmonitor -I fsmonitor/linux -I fsmonitor/windows -I system/generic -I lwt/generic -ccopt -mmacosx-version-min=10.14 -c /opt/local/var/macports/build/_opt_local_var_macports_sources_rsync.macports.org_macports_release_tarballs_ports_net_unison/unison/work/unison-2.51.2/src/unicode_tables.ml
936:info:build ocamlopt: unicode.mli ---> unicode.cmi
937:info:build ocamlopt -g -unsafe-string -I lwt -I ubase -I system -thread -I fsmonitor -I fsmonitor/linux -I fsmonitor/windows -I system/generic -I lwt/generic -ccopt -mmacosx-version-min=10.14 -c /opt/local/var/macports/build/_opt_local_var_macports_sources_rsync.macports.org_macports_release_tarballs_ports_net_unison/unison/work/unison-2.51.2/src/unicode.mli
938:info:build ocamlopt: unicode.ml ---> unicode.cmx
939:info:build ocamlopt -g -unsafe-string -I lwt -I ubase -I system -thread -I fsmonitor -I fsmonitor/linux -I fsmonitor/windows -I system/generic -I lwt/generic -ccopt -mmacosx-version-min=10.14 -c /opt/local/var/macports/build/_opt_local_var_macports_sources_rsync.macports.org_macports_release_tarballs_ports_net_unison/unison/work/unison-2.51.2/src/unicode.ml
940:info:build File "/opt/local/var/macports/build/_opt_local_var_macports_sources_rsync.macports.org_macports_release_tarballs_ports_net_unison/unison/work/unison-2.51.2/src/unicode.ml", line 25, characters 16-33:
941:info:build Warning 3: deprecated: Stdlib.String.unsafe_set
942:info:build File "/opt/local/var/macports/build/_opt_local_var_macports_sources_rsync.macports.org_macports_release_tarballs_ports_net_unison/unison/work/unison-2.51.2/src/unicode.ml", line 941, characters 4-20:
943:info:build Warning 3: deprecated: Stdlib.String.lowercase
944:info:build Use String.lowercase_ascii instead.
945:info:build File "/opt/local/var/macports/build/_opt_local_var_macports_sources_rsync.macports.org_macports_release_tarballs_ports_net_unison/unison/work/unison-2.51.2/src/unicode.ml", line 1587, characters 19-30:
946:info:build Warning 3: deprecated: Stdlib.String.copy
947:info:build ocamlopt: bytearray.mli ---> bytearray.cmi
948:info:build ocamlopt -g -unsafe-string -I lwt -I ubase -I system -thread -I fsmonitor -I fsmonitor/linux -I fsmonitor/windows -I system/generic -I lwt/generic -ccopt -mmacosx-version-min=10.14 -c /opt/local/var/macports/build/_opt_local_var_macports_sources_rsync.macports.org_macports_release_tarballs_ports_net_unison/unison/work/unison-2.51.2/src/bytearray.mli
949:info:build ocamlopt: bytearray.ml ---> bytearray.cmx
950:info:build ocamlopt -g -unsafe-string -I lwt -I ubase -I system -thread -I fsmonitor -I fsmonitor/linux -I fsmonitor/windows -I system/generic -I lwt/generic -ccopt -mmacosx-version-min=10.14 -c /opt/local/var/macports/build/_opt_local_var_macports_sources_rsync.macports.org_macports_release_tarballs_ports_net_unison/unison/work/unison-2.51.2/src/bytearray.ml
951:info:build File "/opt/local/var/macports/build/_opt_local_var_macports_sources_rsync.macports.org_macports_release_tarballs_ports_net_unison/unison/work/unison-2.51.2/src/bytearray.ml", line 38, characters 0-118:
952:info:build Warning 3: deprecated: [@@noalloc] should be used instead of "noalloc"
953:info:build File "/opt/local/var/macports/build/_opt_local_var_macports_sources_rsync.macports.org_macports_release_tarballs_ports_net_unison/unison/work/unison-2.51.2/src/bytearray.ml", line 41, characters 0-116:
954:info:build Warning 3: deprecated: [@@noalloc] should be used instead of "noalloc"
955:info:build ocamlopt: system/system_generic.ml ---> system/system_generic.cmx
956:info:build ocamlopt -g -unsafe-string -I lwt -I ubase -I system -thread -I fsmonitor -I fsmonitor/linux -I fsmonitor/windows -I system/generic -I lwt/generic -ccopt -mmacosx-version-min=10.14 -c /opt/local/var/macports/build/_opt_local_var_macports_sources_rsync.macports.org_macports_release_tarballs_ports_net_unison/unison/work/unison-2.51.2/src/system/system_generic.ml
957:info:build ocamlopt: system/generic/system_impl.ml ---> system/generic/system_impl.cmx
958:info:build ocamlopt -g -unsafe-string -I lwt -I ubase -I system -thread -I fsmonitor -I fsmonitor/linux -I fsmonitor/windows -I system/generic -I lwt/generic -ccopt -mmacosx-version-min=10.14 -c /opt/local/var/macports/build/_opt_local_var_macports_sources_rsync.macports.org_macports_release_tarballs_ports_net_unison/unison/work/unison-2.51.2/src/system/generic/system_impl.ml
959:info:build ocamlc: system/system_intf.ml ---> system/system_intf.cmo
960:info:build ocamlc -g -unsafe-string -I lwt -I ubase -I system -thread -I fsmonitor -I fsmonitor/linux -I fsmonitor/windows -I system/generic -I lwt/generic -ccopt -mmacosx-version-min=10.14 -c /opt/local/var/macports/build/_opt_local_var_macports_sources_rsync.macports.org_macports_release_tarballs_ports_net_unison/unison/work/unison-2.51.2/src/system/system_intf.ml
961:info:build ocamlopt: system.mli ---> system.cmi
962:info:build ocamlopt -g -unsafe-string -I lwt -I ubase -I system -thread -I fsmonitor -I fsmonitor/linux -I fsmonitor/windows -I system/generic -I lwt/generic -ccopt -mmacosx-version-min=10.14 -c /opt/local/var/macports/build/_opt_local_var_macports_sources_rsync.macports.org_macports_release_tarballs_ports_net_unison/unison/work/unison-2.51.2/src/system.mli
963:info:build ocamlopt: system.ml ---> system.cmx
964:info:build ocamlopt -g -unsafe-string -I lwt -I ubase -I system -thread -I fsmonitor -I fsmonitor/linux -I fsmonitor/windows -I system/generic -I lwt/generic -ccopt -mmacosx-version-min=10.14 -c /opt/local/var/macports/build/_opt_local_var_macports_sources_rsync.macports.org_macports_release_tarballs_ports_net_unison/unison/work/unison-2.51.2/src/system.ml
965:info:build echo 'let myName = "'unison'";;' > ubase/projectInfo.ml
966:info:build echo 'let myVersion = "'2.51.2'";;' >> ubase/projectInfo.ml
967:info:build echo 'let myMajorVersion = "'2.51'";;' >> ubase/projectInfo.ml
968:info:build ocamlopt: ubase/projectInfo.ml ---> ubase/projectInfo.cmx
969:info:build ocamlopt -g -unsafe-string -I lwt -I ubase -I system -thread -I fsmonitor -I fsmonitor/linux -I fsmonitor/windows -I system/generic -I lwt/generic -ccopt -mmacosx-version-min=10.14 -c /opt/local/var/macports/build/_opt_local_var_macports_sources_rsync.macports.org_macports_release_tarballs_ports_net_unison/unison/work/unison-2.51.2/src/ubase/projectInfo.ml
970:info:build ocamlopt: ubase/myMap.mli ---> ubase/myMap.cmi
971:info:build ocamlopt -g -unsafe-string -I lwt -I ubase -I system -thread -I fsmonitor -I fsmonitor/linux -I fsmonitor/windows -I system/generic -I lwt/generic -ccopt -mmacosx-version-min=10.14 -c /opt/local/var/macports/build/_opt_local_var_macports_sources_rsync.macports.org_macports_release_tarballs_ports_net_unison/unison/work/unison-2.51.2/src/ubase/myMap.mli
972:info:build ocamlopt: ubase/myMap.ml ---> ubase/myMap.cmx
973:info:build ocamlopt -g -unsafe-string -I lwt -I ubase -I system -thread -I fsmonitor -I fsmonitor/linux -I fsmonitor/windows -I system/generic -I lwt/generic -ccopt -mmacosx-version-min=10.14 -c /opt/local/var/macports/build/_opt_local_var_macports_sources_rsync.macports.org_macports_release_tarballs_ports_net_unison/unison/work/unison-2.51.2/src/ubase/myMap.ml
974:info:build ocamlopt: ubase/safelist.mli ---> ubase/safelist.cmi
975:info:build ocamlopt -g -unsafe-string -I lwt -I ubase -I system -thread -I fsmonitor -I fsmonitor/linux -I fsmonitor/windows -I system/generic -I lwt/generic -ccopt -mmacosx-version-min=10.14 -c /opt/local/var/macports/build/_opt_local_var_macports_sources_rsync.macports.org_macports_release_tarballs_ports_net_unison/unison/work/unison-2.51.2/src/ubase/safelist.mli
976:info:build ocamlopt: ubase/safelist.ml ---> ubase/safelist.cmx
977:info:build ocamlopt -g -unsafe-string -I lwt -I ubase -I system -thread -I fsmonitor -I fsmonitor/linux -I fsmonitor/windows -I system/generic -I lwt/generic -ccopt -mmacosx-version-min=10.14 -c /opt/local/var/macports/build/_opt_local_var_macports_sources_rsync.macports.org_macports_release_tarballs_ports_net_unison/unison/work/unison-2.51.2/src/ubase/safelist.ml
978:info:build ocamlopt: ubase/util.mli ---> ubase/util.cmi
979:info:build ocamlopt -g -unsafe-string -I lwt -I ubase -I system -thread -I fsmonitor -I fsmonitor/linux -I fsmonitor/windows -I system/generic -I lwt/generic -ccopt -mmacosx-version-min=10.14 -c /opt/local/var/macports/build/_opt_local_var_macports_sources_rsync.macports.org_macports_release_tarballs_ports_net_unison/unison/work/unison-2.51.2/src/ubase/util.mli
980:info:build ocamlopt: ubase/util.ml ---> ubase/util.cmx
981:info:build ocamlopt -g -unsafe-string -I lwt -I ubase -I system -thread -I fsmonitor -I fsmonitor/linux -I fsmonitor/windows -I system/generic -I lwt/generic -ccopt -mmacosx-version-min=10.14 -c /opt/local/var/macports/build/_opt_local_var_macports_sources_rsync.macports.org_macports_release_tarballs_ports_net_unison/unison/work/unison-2.51.2/src/ubase/util.ml
982:info:build File "/opt/local/var/macports/build/_opt_local_var_macports_sources_rsync.macports.org_macports_release_tarballs_ports_net_unison/unison/work/unison-2.51.2/src/ubase/util.ml", line 30, characters 17-31:
983:info:build Warning 3: deprecated: Stdlib.Char.lowercase
984:info:build Use Char.lowercase_ascii instead.
985:info:build File "/opt/local/var/macports/build/_opt_local_var_macports_sources_rsync.macports.org_macports_release_tarballs_ports_net_unison/unison/work/unison-2.51.2/src/ubase/util.ml", line 30, characters 50-64:
986:info:build Warning 3: deprecated: Stdlib.Char.lowercase
987:info:build Use Char.lowercase_ascii instead.
988:info:build ocamlopt: ubase/uarg.mli ---> ubase/uarg.cmi
989:info:build ocamlopt -g -unsafe-string -I lwt -I ubase -I system -thread -I fsmonitor -I fsmonitor/linux -I fsmonitor/windows -I system/generic -I lwt/generic -ccopt -mmacosx-version-min=10.14 -c /opt/local/var/macports/build/_opt_local_var_macports_sources_rsync.macports.org_macports_release_tarballs_ports_net_unison/unison/work/unison-2.51.2/src/ubase/uarg.mli
990:info:build ocamlopt: ubase/uarg.ml ---> ubase/uarg.cmx
991:info:build ocamlopt -g -unsafe-string -I lwt -I ubase -I system -thread -I fsmonitor -I fsmonitor/linux -I fsmonitor/windows -I system/generic -I lwt/generic -ccopt -mmacosx-version-min=10.14 -c /opt/local/var/macports/build/_opt_local_var_macports_sources_rsync.macports.org_macports_release_tarballs_ports_net_unison/unison/work/unison-2.51.2/src/ubase/uarg.ml
992:info:build File "/opt/local/var/macports/build/_opt_local_var_macports_sources_rsync.macports.org_macports_release_tarballs_ports_net_unison/unison/work/unison-2.51.2/src/ubase/uarg.ml", line 71, characters 29-30:
993:info:build Warning 3: deprecated: Stdlib.&
994:info:build Use (&&) instead.
995:info:build ocamlopt: ubase/prefs.mli ---> ubase/prefs.cmi
996:info:build ocamlopt -g -unsafe-string -I lwt -I ubase -I system -thread -I fsmonitor -I fsmonitor/linux -I fsmonitor/windows -I system/generic -I lwt/generic -ccopt -mmacosx-version-min=10.14 -c /opt/local/var/macports/build/_opt_local_var_macports_sources_rsync.macports.org_macports_release_tarballs_ports_net_unison/unison/work/unison-2.51.2/src/ubase/prefs.mli
997:info:build ocamlopt: ubase/prefs.ml ---> ubase/prefs.cmx
998:info:build ocamlopt -g -unsafe-string -I lwt -I ubase -I system -thread -I fsmonitor -I fsmonitor/linux -I fsmonitor/windows -I system/generic -I lwt/generic -ccopt -mmacosx-version-min=10.14 -c /opt/local/var/macports/build/_opt_local_var_macports_sources_rsync.macports.org_macports_release_tarballs_ports_net_unison/unison/work/unison-2.51.2/src/ubase/prefs.ml
999:info:build File "/opt/local/var/macports/build/_opt_local_var_macports_sources_rsync.macports.org_macports_release_tarballs_ports_net_unison/unison/work/unison-2.51.2/src/ubase/prefs.ml", line 344, characters 14-29:
1000:info:build Warning 52: Code should not depend on the actual values of
1001:info:build this constructor's arguments. They are only for information
1002:info:build and may change in future versions. (See manual section 9.5)
1003:info:build ocamlopt: ubase/trace.mli ---> ubase/trace.cmi
1004:info:build ocamlopt -g -unsafe-string -I lwt -I ubase -I system -thread -I fsmonitor -I fsmonitor/linux -I fsmonitor/windows -I system/generic -I lwt/generic -ccopt -mmacosx-version-min=10.14 -c /opt/local/var/macports/build/_opt_local_var_macports_sources_rsync.macports.org_macports_release_tarballs_ports_net_unison/unison/work/unison-2.51.2/src/ubase/trace.mli
1005:info:build ocamlopt: ubase/trace.ml ---> ubase/trace.cmx
1006:info:build ocamlopt -g -unsafe-string -I lwt -I ubase -I system -thread -I fsmonitor -I fsmonitor/linux -I fsmonitor/windows -I system/generic -I lwt/generic -ccopt -mmacosx-version-min=10.14 -c /opt/local/var/macports/build/_opt_local_var_macports_sources_rsync.macports.org_macports_release_tarballs_ports_net_unison/unison/work/unison-2.51.2/src/ubase/trace.ml
1007:info:build ocamlopt: ubase/proplist.mli ---> ubase/proplist.cmi
1008:info:build ocamlopt -g -unsafe-string -I lwt -I ubase -I system -thread -I fsmonitor -I fsmonitor/linux -I fsmonitor/windows -I system/generic -I lwt/generic -ccopt -mmacosx-version-min=10.14 -c /opt/local/var/macports/build/_opt_local_var_macports_sources_rsync.macports.org_macports_release_tarballs_ports_net_unison/unison/work/unison-2.51.2/src/ubase/proplist.mli
1009:info:build ocamlopt: ubase/proplist.ml ---> ubase/proplist.cmx
1010:info:build ocamlopt -g -unsafe-string -I lwt -I ubase -I system -thread -I fsmonitor -I fsmonitor/linux -I fsmonitor/windows -I system/generic -I lwt/generic -ccopt -mmacosx-version-min=10.14 -c /opt/local/var/macports/build/_opt_local_var_macports_sources_rsync.macports.org_macports_release_tarballs_ports_net_unison/unison/work/unison-2.51.2/src/ubase/proplist.ml
1011:info:build ocamlopt: lwt/pqueue.mli ---> lwt/pqueue.cmi
1012:info:build ocamlopt -g -unsafe-string -I lwt -I ubase -I system -thread -I fsmonitor -I fsmonitor/linux -I fsmonitor/windows -I system/generic -I lwt/generic -ccopt -mmacosx-version-min=10.14 -c /opt/local/var/macports/build/_opt_local_var_macports_sources_rsync.macports.org_macports_release_tarballs_ports_net_unison/unison/work/unison-2.51.2/src/lwt/pqueue.mli
1013:info:build ocamlopt: lwt/pqueue.ml ---> lwt/pqueue.cmx
1014:info:build ocamlopt -g -unsafe-string -I lwt -I ubase -I system -thread -I fsmonitor -I fsmonitor/linux -I fsmonitor/windows -I system/generic -I lwt/generic -ccopt -mmacosx-version-min=10.14 -c /opt/local/var/macports/build/_opt_local_var_macports_sources_rsync.macports.org_macports_release_tarballs_ports_net_unison/unison/work/unison-2.51.2/src/lwt/pqueue.ml
1015:info:build ocamlopt: lwt/lwt.mli ---> lwt/lwt.cmi
1016:info:build ocamlopt -g -unsafe-string -I lwt -I ubase -I system -thread -I fsmonitor -I fsmonitor/linux -I fsmonitor/windows -I system/generic -I lwt/generic -ccopt -mmacosx-version-min=10.14 -c /opt/local/var/macports/build/_opt_local_var_macports_sources_rsync.macports.org_macports_release_tarballs_ports_net_unison/unison/work/unison-2.51.2/src/lwt/lwt.mli
1017:info:build ocamlopt: lwt/lwt.ml ---> lwt/lwt.cmx
1018:info:build ocamlopt -g -unsafe-string -I lwt -I ubase -I system -thread -I fsmonitor -I fsmonitor/linux -I fsmonitor/windows -I system/generic -I lwt/generic -ccopt -mmacosx-version-min=10.14 -c /opt/local/var/macports/build/_opt_local_var_macports_sources_rsync.macports.org_macports_release_tarballs_ports_net_unison/unison/work/unison-2.51.2/src/lwt/lwt.ml
1019:info:build ocamlopt: lwt/lwt_util.mli ---> lwt/lwt_util.cmi
1020:info:build ocamlopt -g -unsafe-string -I lwt -I ubase -I system -thread -I fsmonitor -I fsmonitor/linux -I fsmonitor/windows -I system/generic -I lwt/generic -ccopt -mmacosx-version-min=10.14 -c /opt/local/var/macports/build/_opt_local_var_macports_sources_rsync.macports.org_macports_release_tarballs_ports_net_unison/unison/work/unison-2.51.2/src/lwt/lwt_util.mli
1021:info:build ocamlopt: lwt/lwt_util.ml ---> lwt/lwt_util.cmx
1022:info:build ocamlopt -g -unsafe-string -I lwt -I ubase -I system -thread -I fsmonitor -I fsmonitor/linux -I fsmonitor/windows -I system/generic -I lwt/generic -ccopt -mmacosx-version-min=10.14 -c /opt/local/var/macports/build/_opt_local_var_macports_sources_rsync.macports.org_macports_release_tarballs_ports_net_unison/unison/work/unison-2.51.2/src/lwt/lwt_util.ml
1023:info:build ocamlopt: lwt/generic/lwt_unix_impl.ml ---> lwt/generic/lwt_unix_impl.cmx
1024:info:build ocamlopt -g -unsafe-string -I lwt -I ubase -I system -thread -I fsmonitor -I fsmonitor/linux -I fsmonitor/windows -I system/generic -I lwt/generic -ccopt -mmacosx-version-min=10.14 -c /opt/local/var/macports/build/_opt_local_var_macports_sources_rsync.macports.org_macports_release_tarballs_ports_net_unison/unison/work/unison-2.51.2/src/lwt/generic/lwt_unix_impl.ml
1025:info:build File "/opt/local/var/macports/build/_opt_local_var_macports_sources_rsync.macports.org_macports_release_tarballs_ports_net_unison/unison/work/unison-2.51.2/src/lwt/generic/lwt_unix_impl.ml", line 384, characters 6-22:
1026:info:build Warning 3: deprecated: Stdlib.String.set
1027:info:build Use Bytes.set instead.
1028:info:build ocamlopt: lwt/lwt_unix.mli ---> lwt/lwt_unix.cmi
1029:info:build ocamlopt -g -unsafe-string -I lwt -I ubase -I system -thread -I fsmonitor -I fsmonitor/linux -I fsmonitor/windows -I system/generic -I lwt/generic -ccopt -mmacosx-version-min=10.14 -c /opt/local/var/macports/build/_opt_local_var_macports_sources_rsync.macports.org_macports_release_tarballs_ports_net_unison/unison/work/unison-2.51.2/src/lwt/lwt_unix.mli
1030:info:build ocamlopt: lwt/lwt_unix.ml ---> lwt/lwt_unix.cmx
1031:info:build ocamlopt -g -unsafe-string -I lwt -I ubase -I system -thread -I fsmonitor -I fsmonitor/linux -I fsmonitor/windows -I system/generic -I lwt/generic -ccopt -mmacosx-version-min=10.14 -c /opt/local/var/macports/build/_opt_local_var_macports_sources_rsync.macports.org_macports_release_tarballs_ports_net_unison/unison/work/unison-2.51.2/src/lwt/lwt_unix.ml
1032:info:build ocamlopt: uutil.mli ---> uutil.cmi
1033:info:build ocamlopt -g -unsafe-string -I lwt -I ubase -I system -thread -I fsmonitor -I fsmonitor/linux -I fsmonitor/windows -I system/generic -I lwt/generic -ccopt -mmacosx-version-min=10.14 -c /opt/local/var/macports/build/_opt_local_var_macports_sources_rsync.macports.org_macports_release_tarballs_ports_net_unison/unison/work/unison-2.51.2/src/uutil.mli
1034:info:build ocamlopt: uutil.ml ---> uutil.cmx
1035:info:build ocamlopt -g -unsafe-string -I lwt -I ubase -I system -thread -I fsmonitor -I fsmonitor/linux -I fsmonitor/windows -I system/generic -I lwt/generic -ccopt -mmacosx-version-min=10.14 -c /opt/local/var/macports/build/_opt_local_var_macports_sources_rsync.macports.org_macports_release_tarballs_ports_net_unison/unison/work/unison-2.51.2/src/uutil.ml
1036:info:build File "/opt/local/var/macports/build/_opt_local_var_macports_sources_rsync.macports.org_macports_release_tarballs_ports_net_unison/unison/work/unison-2.51.2/src/uutil.ml", line 37, characters 0-80:
1037:info:build Warning 3: deprecated: [@@noalloc] should be used instead of "noalloc"
1038:info:build ocamlopt: case.mli ---> case.cmi
1039:info:build ocamlopt -g -unsafe-string -I lwt -I ubase -I system -thread -I fsmonitor -I fsmonitor/linux -I fsmonitor/windows -I system/generic -I lwt/generic -ccopt -mmacosx-version-min=10.14 -c /opt/local/var/macports/build/_opt_local_var_macports_sources_rsync.macports.org_macports_release_tarballs_ports_net_unison/unison/work/unison-2.51.2/src/case.mli
1040:info:build ocamlopt: case.ml ---> case.cmx
1041:info:build ocamlopt -g -unsafe-string -I lwt -I ubase -I system -thread -I fsmonitor -I fsmonitor/linux -I fsmonitor/windows -I system/generic -I lwt/generic -ccopt -mmacosx-version-min=10.14 -c /opt/local/var/macports/build/_opt_local_var_macports_sources_rsync.macports.org_macports_release_tarballs_ports_net_unison/unison/work/unison-2.51.2/src/case.ml
1042:info:build File "/opt/local/var/macports/build/_opt_local_var_macports_sources_rsync.macports.org_macports_release_tarballs_ports_net_unison/unison/work/unison-2.51.2/src/case.ml", line 155, characters 30-46:
1043:info:build Warning 3: deprecated: Stdlib.String.lowercase
1044:info:build Use String.lowercase_ascii instead.
1045:info:build ocamlopt: pred.mli ---> pred.cmi
1046:info:build ocamlopt -g -unsafe-string -I lwt -I ubase -I system -thread -I fsmonitor -I fsmonitor/linux -I fsmonitor/windows -I system/generic -I lwt/generic -ccopt -mmacosx-version-min=10.14 -c /opt/local/var/macports/build/_opt_local_var_macports_sources_rsync.macports.org_macports_release_tarballs_ports_net_unison/unison/work/unison-2.51.2/src/pred.mli
1047:info:build ocamlopt: pred.ml ---> pred.cmx
1048:info:build ocamlopt -g -unsafe-string -I lwt -I ubase -I system -thread -I fsmonitor -I fsmonitor/linux -I fsmonitor/windows -I system/generic -I lwt/generic -ccopt -mmacosx-version-min=10.14 -c /opt/local/var/macports/build/_opt_local_var_macports_sources_rsync.macports.org_macports_release_tarballs_ports_net_unison/unison/work/unison-2.51.2/src/pred.ml
1049:info:build ocamlopt: fileutil.mli ---> fileutil.cmi
1050:info:build ocamlopt -g -unsafe-string -I lwt -I ubase -I system -thread -I fsmonitor -I fsmonitor/linux -I fsmonitor/windows -I system/generic -I lwt/generic -ccopt -mmacosx-version-min=10.14 -c /opt/local/var/macports/build/_opt_local_var_macports_sources_rsync.macports.org_macports_release_tarballs_ports_net_unison/unison/work/unison-2.51.2/src/fileutil.mli
1051:info:build ocamlopt: fileutil.ml ---> fileutil.cmx
1052:info:build ocamlopt -g -unsafe-string -I lwt -I ubase -I system -thread -I fsmonitor -I fsmonitor/linux -I fsmonitor/windows -I system/generic -I lwt/generic -ccopt -mmacosx-version-min=10.14 -c /opt/local/var/macports/build/_opt_local_var_macports_sources_rsync.macports.org_macports_release_tarballs_ports_net_unison/unison/work/unison-2.51.2/src/fileutil.ml
1053:info:build ocamlopt: name.mli ---> name.cmi
1054:info:build ocamlopt -g -unsafe-string -I lwt -I ubase -I system -thread -I fsmonitor -I fsmonitor/linux -I fsmonitor/windows -I system/generic -I lwt/generic -ccopt -mmacosx-version-min=10.14 -c /opt/local/var/macports/build/_opt_local_var_macports_sources_rsync.macports.org_macports_release_tarballs_ports_net_unison/unison/work/unison-2.51.2/src/name.mli
1055:info:build ocamlopt: name.ml ---> name.cmx
1056:info:build ocamlopt -g -unsafe-string -I lwt -I ubase -I system -thread -I fsmonitor -I fsmonitor/linux -I fsmonitor/windows -I system/generic -I lwt/generic -ccopt -mmacosx-version-min=10.14 -c /opt/local/var/macports/build/_opt_local_var_macports_sources_rsync.macports.org_macports_release_tarballs_ports_net_unison/unison/work/unison-2.51.2/src/name.ml
1057:info:build ocamlopt: path.mli ---> path.cmi
1058:info:build ocamlopt -g -unsafe-string -I lwt -I ubase -I system -thread -I fsmonitor -I fsmonitor/linux -I fsmonitor/windows -I system/generic -I lwt/generic -ccopt -mmacosx-version-min=10.14 -c /opt/local/var/macports/build/_opt_local_var_macports_sources_rsync.macports.org_macports_release_tarballs_ports_net_unison/unison/work/unison-2.51.2/src/path.mli
1059:info:build ocamlopt: path.ml ---> path.cmx
1060:info:build ocamlopt -g -unsafe-string -I lwt -I ubase -I system -thread -I fsmonitor -I fsmonitor/linux -I fsmonitor/windows -I system/generic -I lwt/generic -ccopt -mmacosx-version-min=10.14 -c /opt/local/var/macports/build/_opt_local_var_macports_sources_rsync.macports.org_macports_release_tarballs_ports_net_unison/unison/work/unison-2.51.2/src/path.ml
1061:info:build File "/opt/local/var/macports/build/_opt_local_var_macports_sources_rsync.macports.org_macports_release_tarballs_ports_net_unison/unison/work/unison-2.51.2/src/path.ml", line 35, characters 2-30:
1062:info:build Warning 3: deprecated: Stdlib.String.set
1063:info:build Use Bytes.set instead.
1064:info:build ocamlopt: fspath.mli ---> fspath.cmi
1065:info:build ocamlopt -g -unsafe-string -I lwt -I ubase -I system -thread -I fsmonitor -I fsmonitor/linux -I fsmonitor/windows -I system/generic -I lwt/generic -ccopt -mmacosx-version-min=10.14 -c /opt/local/var/macports/build/_opt_local_var_macports_sources_rsync.macports.org_macports_release_tarballs_ports_net_unison/unison/work/unison-2.51.2/src/fspath.mli
1066:info:build ocamlopt: fspath.ml ---> fspath.cmx
1067:info:build ocamlopt -g -unsafe-string -I lwt -I ubase -I system -thread -I fsmonitor -I fsmonitor/linux -I fsmonitor/windows -I system/generic -I lwt/generic -ccopt -mmacosx-version-min=10.14 -c /opt/local/var/macports/build/_opt_local_var_macports_sources_rsync.macports.org_macports_release_tarballs_ports_net_unison/unison/work/unison-2.51.2/src/fspath.ml
1068:info:build File "/opt/local/var/macports/build/_opt_local_var_macports_sources_rsync.macports.org_macports_release_tarballs_ports_net_unison/unison/work/unison-2.51.2/src/fspath.ml", line 58, characters 18-20:
1069:info:build Warning 3: deprecated: Stdlib.or
1070:info:build Use (||) instead.
1071:info:build File "/opt/local/var/macports/build/_opt_local_var_macports_sources_rsync.macports.org_macports_release_tarballs_ports_net_unison/unison/work/unison-2.51.2/src/fspath.ml", line 97, characters 4-18:
1072:info:build Warning 3: deprecated: Stdlib.String.set
1073:info:build Use Bytes.set instead.
1074:info:build File "/opt/local/var/macports/build/_opt_local_var_macports_sources_rsync.macports.org_macports_release_tarballs_ports_net_unison/unison/work/unison-2.51.2/src/fspath.ml", line 98, characters 4-22:
1075:info:build Warning 3: deprecated: Stdlib.String.set
1076:info:build Use Bytes.set instead.
1077:info:build File "/opt/local/var/macports/build/_opt_local_var_macports_sources_rsync.macports.org_macports_release_tarballs_ports_net_unison/unison/work/unison-2.51.2/src/fspath.ml", line 197, characters 6-18:
1078:info:build Warning 3: deprecated: Stdlib.String.set
1079:info:build Use Bytes.set instead.
1080:info:build ocamlopt: fs.mli ---> fs.cmi
1081:info:build ocamlopt -g -unsafe-string -I lwt -I ubase -I system -thread -I fsmonitor -I fsmonitor/linux -I fsmonitor/windows -I system/generic -I lwt/generic -ccopt -mmacosx-version-min=10.14 -c /opt/local/var/macports/build/_opt_local_var_macports_sources_rsync.macports.org_macports_release_tarballs_ports_net_unison/unison/work/unison-2.51.2/src/fs.mli
1082:info:build ocamlopt: fs.ml ---> fs.cmx
1083:info:build ocamlopt -g -unsafe-string -I lwt -I ubase -I system -thread -I fsmonitor -I fsmonitor/linux -I fsmonitor/windows -I system/generic -I lwt/generic -ccopt -mmacosx-version-min=10.14 -c /opt/local/var/macports/build/_opt_local_var_macports_sources_rsync.macports.org_macports_release_tarballs_ports_net_unison/unison/work/unison-2.51.2/src/fs.ml
1084:info:build ocamlopt: fingerprint.mli ---> fingerprint.cmi
1085:info:build ocamlopt -g -unsafe-string -I lwt -I ubase -I system -thread -I fsmonitor -I fsmonitor/linux -I fsmonitor/windows -I system/generic -I lwt/generic -ccopt -mmacosx-version-min=10.14 -c /opt/local/var/macports/build/_opt_local_var_macports_sources_rsync.macports.org_macports_release_tarballs_ports_net_unison/unison/work/unison-2.51.2/src/fingerprint.mli
1086:info:build ocamlopt: fingerprint.ml ---> fingerprint.cmx
1087:info:build ocamlopt -g -unsafe-string -I lwt -I ubase -I system -thread -I fsmonitor -I fsmonitor/linux -I fsmonitor/windows -I system/generic -I lwt/generic -ccopt -mmacosx-version-min=10.14 -c /opt/local/var/macports/build/_opt_local_var_macports_sources_rsync.macports.org_macports_release_tarballs_ports_net_unison/unison/work/unison-2.51.2/src/fingerprint.ml
1088:info:build File "/opt/local/var/macports/build/_opt_local_var_macports_sources_rsync.macports.org_macports_release_tarballs_ports_net_unison/unison/work/unison-2.51.2/src/fingerprint.ml", line 81, characters 6-24:
1089:info:build Warning 3: deprecated: Stdlib.String.set
1090:info:build Use Bytes.set instead.
1091:info:build File "/opt/local/var/macports/build/_opt_local_var_macports_sources_rsync.macports.org_macports_release_tarballs_ports_net_unison/unison/work/unison-2.51.2/src/fingerprint.ml", line 82, characters 6-28:
1092:info:build Warning 3: deprecated: Stdlib.String.set
1093:info:build Use Bytes.set instead.
1094:info:build ocamlopt: abort.mli ---> abort.cmi
1095:info:build ocamlopt -g -unsafe-string -I lwt -I ubase -I system -thread -I fsmonitor -I fsmonitor/linux -I fsmonitor/windows -I system/generic -I lwt/generic -ccopt -mmacosx-version-min=10.14 -c /opt/local/var/macports/build/_opt_local_var_macports_sources_rsync.macports.org_macports_release_tarballs_ports_net_unison/unison/work/unison-2.51.2/src/abort.mli
1096:info:build ocamlopt: abort.ml ---> abort.cmx
1097:info:build ocamlopt -g -unsafe-string -I lwt -I ubase -I system -thread -I fsmonitor -I fsmonitor/linux -I fsmonitor/windows -I system/generic -I lwt/generic -ccopt -mmacosx-version-min=10.14 -c /opt/local/var/macports/build/_opt_local_var_macports_sources_rsync.macports.org_macports_release_tarballs_ports_net_unison/unison/work/unison-2.51.2/src/abort.ml
1098:info:build ocamlopt: osx.mli ---> osx.cmi
1099:info:build ocamlopt -g -unsafe-string -I lwt -I ubase -I system -thread -I fsmonitor -I fsmonitor/linux -I fsmonitor/windows -I system/generic -I lwt/generic -ccopt -mmacosx-version-min=10.14 -c /opt/local/var/macports/build/_opt_local_var_macports_sources_rsync.macports.org_macports_release_tarballs_ports_net_unison/unison/work/unison-2.51.2/src/osx.mli
1100:info:build ocamlopt: osx.ml ---> osx.cmx
1101:info:build ocamlopt -g -unsafe-string -I lwt -I ubase -I system -thread -I fsmonitor -I fsmonitor/linux -I fsmonitor/windows -I system/generic -I lwt/generic -ccopt -mmacosx-version-min=10.14 -c /opt/local/var/macports/build/_opt_local_var_macports_sources_rsync.macports.org_macports_release_tarballs_ports_net_unison/unison/work/unison-2.51.2/src/osx.ml
1102:info:build File "/opt/local/var/macports/build/_opt_local_var_macports_sources_rsync.macports.org_macports_release_tarballs_ports_net_unison/unison/work/unison-2.51.2/src/osx.ml", line 113, characters 4-128:
1103:info:build Warning 3: deprecated: Stdlib.String.set
1104:info:build Use Bytes.set instead.
1105:info:build File "/opt/local/var/macports/build/_opt_local_var_macports_sources_rsync.macports.org_macports_release_tarballs_ports_net_unison/unison/work/unison-2.51.2/src/osx.ml", line 227, characters 2-55:
1106:info:build Warning 3: deprecated: Stdlib.String.set
1107:info:build Use Bytes.set instead.
1108:info:build ocamlopt: external.mli ---> external.cmi
1109:info:build ocamlopt -g -unsafe-string -I lwt -I ubase -I system -thread -I fsmonitor -I fsmonitor/linux -I fsmonitor/windows -I system/generic -I lwt/generic -ccopt -mmacosx-version-min=10.14 -c /opt/local/var/macports/build/_opt_local_var_macports_sources_rsync.macports.org_macports_release_tarballs_ports_net_unison/unison/work/unison-2.51.2/src/external.mli
1110:info:build ocamlopt: external.ml ---> external.cmx
1111:info:build ocamlopt -g -unsafe-string -I lwt -I ubase -I system -thread -I fsmonitor -I fsmonitor/linux -I fsmonitor/windows -I system/generic -I lwt/generic -ccopt -mmacosx-version-min=10.14 -c /opt/local/var/macports/build/_opt_local_var_macports_sources_rsync.macports.org_macports_release_tarballs_ports_net_unison/unison/work/unison-2.51.2/src/external.ml
1112:info:build ocamlopt: fswatch.mli ---> fswatch.cmi
1113:info:build ocamlopt -g -unsafe-string -I lwt -I ubase -I system -thread -I fsmonitor -I fsmonitor/linux -I fsmonitor/windows -I system/generic -I lwt/generic -ccopt -mmacosx-version-min=10.14 -c /opt/local/var/macports/build/_opt_local_var_macports_sources_rsync.macports.org_macports_release_tarballs_ports_net_unison/unison/work/unison-2.51.2/src/fswatch.mli
1114:info:build ocamlopt: fswatch.ml ---> fswatch.cmx
1115:info:build ocamlopt -g -unsafe-string -I lwt -I ubase -I system -thread -I fsmonitor -I fsmonitor/linux -I fsmonitor/windows -I system/generic -I lwt/generic -ccopt -mmacosx-version-min=10.14 -c /opt/local/var/macports/build/_opt_local_var_macports_sources_rsync.macports.org_macports_release_tarballs_ports_net_unison/unison/work/unison-2.51.2/src/fswatch.ml
1116:info:build File "/opt/local/var/macports/build/_opt_local_var_macports_sources_rsync.macports.org_macports_release_tarballs_ports_net_unison/unison/work/unison-2.51.2/src/fswatch.ml", line 119, characters 8-21:
1117:info:build Warning 3: deprecated: Stdlib.String.set
1118:info:build Use Bytes.set instead.
1119:info:build File "/opt/local/var/macports/build/_opt_local_var_macports_sources_rsync.macports.org_macports_release_tarballs_ports_net_unison/unison/work/unison-2.51.2/src/fswatch.ml", line 120, characters 8-45:
1120:info:build Warning 3: deprecated: Stdlib.String.set
1121:info:build Use Bytes.set instead.
1122:info:build File "/opt/local/var/macports/build/_opt_local_var_macports_sources_rsync.macports.org_macports_release_tarballs_ports_net_unison/unison/work/unison-2.51.2/src/fswatch.ml", line 121, characters 8-47:
1123:info:build Warning 3: deprecated: Stdlib.String.set
1124:info:build Use Bytes.set instead.
1125:info:build File "/opt/local/var/macports/build/_opt_local_var_macports_sources_rsync.macports.org_macports_release_tarballs_ports_net_unison/unison/work/unison-2.51.2/src/fswatch.ml", line 124, characters 8-19:
1126:info:build Warning 3: deprecated: Stdlib.String.set
1127:info:build Use Bytes.set instead.
1128:info:build File "/opt/local/var/macports/build/_opt_local_var_macports_sources_rsync.macports.org_macports_release_tarballs_ports_net_unison/unison/work/unison-2.51.2/src/fswatch.ml", line 148, characters 8-77:
1129:info:build Warning 3: deprecated: Stdlib.String.set
1130:info:build Use Bytes.set instead.
1131:info:build File "/opt/local/var/macports/build/_opt_local_var_macports_sources_rsync.macports.org_macports_release_tarballs_ports_net_unison/unison/work/unison-2.51.2/src/fswatch.ml", line 151, characters 8-18:
1132:info:build Warning 3: deprecated: Stdlib.String.set
1133:info:build Use Bytes.set instead.
1134:info:build ocamlopt: props.mli ---> props.cmi
1135:info:build ocamlopt -g -unsafe-string -I lwt -I ubase -I system -thread -I fsmonitor -I fsmonitor/linux -I fsmonitor/windows -I system/generic -I lwt/generic -ccopt -mmacosx-version-min=10.14 -c /opt/local/var/macports/build/_opt_local_var_macports_sources_rsync.macports.org_macports_release_tarballs_ports_net_unison/unison/work/unison-2.51.2/src/props.mli
1136:info:build ocamlopt: props.ml ---> props.cmx
1137:info:build ocamlopt -g -unsafe-string -I lwt -I ubase -I system -thread -I fsmonitor -I fsmonitor/linux -I fsmonitor/windows -I system/generic -I lwt/generic -ccopt -mmacosx-version-min=10.14 -c /opt/local/var/macports/build/_opt_local_var_macports_sources_rsync.macports.org_macports_release_tarballs_ports_net_unison/unison/work/unison-2.51.2/src/props.ml
1138:info:build ocamlopt: fileinfo.mli ---> fileinfo.cmi
1139:info:build ocamlopt -g -unsafe-string -I lwt -I ubase -I system -thread -I fsmonitor -I fsmonitor/linux -I fsmonitor/windows -I system/generic -I lwt/generic -ccopt -mmacosx-version-min=10.14 -c /opt/local/var/macports/build/_opt_local_var_macports_sources_rsync.macports.org_macports_release_tarballs_ports_net_unison/unison/work/unison-2.51.2/src/fileinfo.mli
1140:info:build ocamlopt: fileinfo.ml ---> fileinfo.cmx
1141:info:build ocamlopt -g -unsafe-string -I lwt -I ubase -I system -thread -I fsmonitor -I fsmonitor/linux -I fsmonitor/windows -I system/generic -I lwt/generic -ccopt -mmacosx-version-min=10.14 -c /opt/local/var/macports/build/_opt_local_var_macports_sources_rsync.macports.org_macports_release_tarballs_ports_net_unison/unison/work/unison-2.51.2/src/fileinfo.ml
1142:info:build ocamlopt: os.mli ---> os.cmi
1143:info:build ocamlopt -g -unsafe-string -I lwt -I ubase -I system -thread -I fsmonitor -I fsmonitor/linux -I fsmonitor/windows -I system/generic -I lwt/generic -ccopt -mmacosx-version-min=10.14 -c /opt/local/var/macports/build/_opt_local_var_macports_sources_rsync.macports.org_macports_release_tarballs_ports_net_unison/unison/work/unison-2.51.2/src/os.mli
1144:info:build ocamlopt: os.ml ---> os.cmx
1145:info:build ocamlopt -g -unsafe-string -I lwt -I ubase -I system -thread -I fsmonitor -I fsmonitor/linux -I fsmonitor/windows -I system/generic -I lwt/generic -ccopt -mmacosx-version-min=10.14 -c /opt/local/var/macports/build/_opt_local_var_macports_sources_rsync.macports.org_macports_release_tarballs_ports_net_unison/unison/work/unison-2.51.2/src/os.ml
1146:info:build ocamlopt: lock.mli ---> lock.cmi
1147:info:build ocamlopt -g -unsafe-string -I lwt -I ubase -I system -thread -I fsmonitor -I fsmonitor/linux -I fsmonitor/windows -I system/generic -I lwt/generic -ccopt -mmacosx-version-min=10.14 -c /opt/local/var/macports/build/_opt_local_var_macports_sources_rsync.macports.org_macports_release_tarballs_ports_net_unison/unison/work/unison-2.51.2/src/lock.mli
1148:info:build ocamlopt: lock.ml ---> lock.cmx
1149:info:build ocamlopt -g -unsafe-string -I lwt -I ubase -I system -thread -I fsmonitor -I fsmonitor/linux -I fsmonitor/windows -I system/generic -I lwt/generic -ccopt -mmacosx-version-min=10.14 -c /opt/local/var/macports/build/_opt_local_var_macports_sources_rsync.macports.org_macports_release_tarballs_ports_net_unison/unison/work/unison-2.51.2/src/lock.ml
1150:info:build ocamlopt: clroot.mli ---> clroot.cmi
1151:info:build ocamlopt -g -unsafe-string -I lwt -I ubase -I system -thread -I fsmonitor -I fsmonitor/linux -I fsmonitor/windows -I system/generic -I lwt/generic -ccopt -mmacosx-version-min=10.14 -c /opt/local/var/macports/build/_opt_local_var_macports_sources_rsync.macports.org_macports_release_tarballs_ports_net_unison/unison/work/unison-2.51.2/src/clroot.mli
1152:info:build ocamlopt: clroot.ml ---> clroot.cmx
1153:info:build ocamlopt -g -unsafe-string -I lwt -I ubase -I system -thread -I fsmonitor -I fsmonitor/linux -I fsmonitor/windows -I system/generic -I lwt/generic -ccopt -mmacosx-version-min=10.14 -c /opt/local/var/macports/build/_opt_local_var_macports_sources_rsync.macports.org_macports_release_tarballs_ports_net_unison/unison/work/unison-2.51.2/src/clroot.ml
1154:info:build ocamlopt: common.mli ---> common.cmi
1155:info:build ocamlopt -g -unsafe-string -I lwt -I ubase -I system -thread -I fsmonitor -I fsmonitor/linux -I fsmonitor/windows -I system/generic -I lwt/generic -ccopt -mmacosx-version-min=10.14 -c /opt/local/var/macports/build/_opt_local_var_macports_sources_rsync.macports.org_macports_release_tarballs_ports_net_unison/unison/work/unison-2.51.2/src/common.mli
1156:info:build ocamlopt: common.ml ---> common.cmx
1157:info:build ocamlopt -g -unsafe-string -I lwt -I ubase -I system -thread -I fsmonitor -I fsmonitor/linux -I fsmonitor/windows -I system/generic -I lwt/generic -ccopt -mmacosx-version-min=10.14 -c /opt/local/var/macports/build/_opt_local_var_macports_sources_rsync.macports.org_macports_release_tarballs_ports_net_unison/unison/work/unison-2.51.2/src/common.ml
1158:info:build ocamlopt: tree.mli ---> tree.cmi
1159:info:build ocamlopt -g -unsafe-string -I lwt -I ubase -I system -thread -I fsmonitor -I fsmonitor/linux -I fsmonitor/windows -I system/generic -I lwt/generic -ccopt -mmacosx-version-min=10.14 -c /opt/local/var/macports/build/_opt_local_var_macports_sources_rsync.macports.org_macports_release_tarballs_ports_net_unison/unison/work/unison-2.51.2/src/tree.mli
1160:info:build ocamlopt: tree.ml ---> tree.cmx
1161:info:build ocamlopt -g -unsafe-string -I lwt -I ubase -I system -thread -I fsmonitor -I fsmonitor/linux -I fsmonitor/windows -I system/generic -I lwt/generic -ccopt -mmacosx-version-min=10.14 -c /opt/local/var/macports/build/_opt_local_var_macports_sources_rsync.macports.org_macports_release_tarballs_ports_net_unison/unison/work/unison-2.51.2/src/tree.ml
1162:info:build ocamlopt: checksum.mli ---> checksum.cmi
1163:info:build ocamlopt -g -unsafe-string -I lwt -I ubase -I system -thread -I fsmonitor -I fsmonitor/linux -I fsmonitor/windows -I system/generic -I lwt/generic -ccopt -mmacosx-version-min=10.14 -c /opt/local/var/macports/build/_opt_local_var_macports_sources_rsync.macports.org_macports_release_tarballs_ports_net_unison/unison/work/unison-2.51.2/src/checksum.mli
1164:info:build ocamlopt: checksum.ml ---> checksum.cmx
1165:info:build ocamlopt -g -unsafe-string -I lwt -I ubase -I system -thread -I fsmonitor -I fsmonitor/linux -I fsmonitor/windows -I system/generic -I lwt/generic -ccopt -mmacosx-version-min=10.14 -c /opt/local/var/macports/build/_opt_local_var_macports_sources_rsync.macports.org_macports_release_tarballs_ports_net_unison/unison/work/unison-2.51.2/src/checksum.ml
1166:info:build ocamlopt: terminal.mli ---> terminal.cmi
1167:info:build ocamlopt -g -unsafe-string -I lwt -I ubase -I system -thread -I fsmonitor -I fsmonitor/linux -I fsmonitor/windows -I system/generic -I lwt/generic -ccopt -mmacosx-version-min=10.14 -c /opt/local/var/macports/build/_opt_local_var_macports_sources_rsync.macports.org_macports_release_tarballs_ports_net_unison/unison/work/unison-2.51.2/src/terminal.mli
1168:info:build ocamlopt: terminal.ml ---> terminal.cmx
1169:info:build ocamlopt -g -unsafe-string -I lwt -I ubase -I system -thread -I fsmonitor -I fsmonitor/linux -I fsmonitor/windows -I system/generic -I lwt/generic -ccopt -mmacosx-version-min=10.14 -c /opt/local/var/macports/build/_opt_local_var_macports_sources_rsync.macports.org_macports_release_tarballs_ports_net_unison/unison/work/unison-2.51.2/src/terminal.ml
1170:info:build ocamlopt: transfer.mli ---> transfer.cmi
1171:info:build ocamlopt -g -unsafe-string -I lwt -I ubase -I system -thread -I fsmonitor -I fsmonitor/linux -I fsmonitor/windows -I system/generic -I lwt/generic -ccopt -mmacosx-version-min=10.14 -c /opt/local/var/macports/build/_opt_local_var_macports_sources_rsync.macports.org_macports_release_tarballs_ports_net_unison/unison/work/unison-2.51.2/src/transfer.mli
1172:info:build ocamlopt: transfer.ml ---> transfer.cmx
1173:info:build ocamlopt -g -unsafe-string -I lwt -I ubase -I system -thread -I fsmonitor -I fsmonitor/linux -I fsmonitor/windows -I system/generic -I lwt/generic -ccopt -mmacosx-version-min=10.14 -c /opt/local/var/macports/build/_opt_local_var_macports_sources_rsync.macports.org_macports_release_tarballs_ports_net_unison/unison/work/unison-2.51.2/src/transfer.ml
1174:info:build File "/opt/local/var/macports/build/_opt_local_var_macports_sources_rsync.macports.org_macports_release_tarballs_ports_net_unison/unison/work/unison-2.51.2/src/transfer.ml", line 550, characters 6-62:
1175:info:build Warning 3: deprecated: Stdlib.String.set
1176:info:build Use Bytes.set instead.
1177:info:build ocamlopt: xferhint.mli ---> xferhint.cmi
1178:info:build ocamlopt -g -unsafe-string -I lwt -I ubase -I system -thread -I fsmonitor -I fsmonitor/linux -I fsmonitor/windows -I system/generic -I lwt/generic -ccopt -mmacosx-version-min=10.14 -c /opt/local/var/macports/build/_opt_local_var_macports_sources_rsync.macports.org_macports_release_tarballs_ports_net_unison/unison/work/unison-2.51.2/src/xferhint.mli
1179:info:build ocamlopt: xferhint.ml ---> xferhint.cmx
1180:info:build ocamlopt -g -unsafe-string -I lwt -I ubase -I system -thread -I fsmonitor -I fsmonitor/linux -I fsmonitor/windows -I system/generic -I lwt/generic -ccopt -mmacosx-version-min=10.14 -c /opt/local/var/macports/build/_opt_local_var_macports_sources_rsync.macports.org_macports_release_tarballs_ports_net_unison/unison/work/unison-2.51.2/src/xferhint.ml
1181:info:build ocamlopt: remote.mli ---> remote.cmi
1182:info:build ocamlopt -g -unsafe-string -I lwt -I ubase -I system -thread -I fsmonitor -I fsmonitor/linux -I fsmonitor/windows -I system/generic -I lwt/generic -ccopt -mmacosx-version-min=10.14 -c /opt/local/var/macports/build/_opt_local_var_macports_sources_rsync.macports.org_macports_release_tarballs_ports_net_unison/unison/work/unison-2.51.2/src/remote.mli
1183:info:build ocamlopt: remote.ml ---> remote.cmx
1184:info:build ocamlopt -g -unsafe-string -I lwt -I ubase -I system -thread -I fsmonitor -I fsmonitor/linux -I fsmonitor/windows -I system/generic -I lwt/generic -ccopt -mmacosx-version-min=10.14 -c /opt/local/var/macports/build/_opt_local_var_macports_sources_rsync.macports.org_macports_release_tarballs_ports_net_unison/unison/work/unison-2.51.2/src/remote.ml
1185:info:build ocamlopt: globals.mli ---> globals.cmi
1186:info:build ocamlopt -g -unsafe-string -I lwt -I ubase -I system -thread -I fsmonitor -I fsmonitor/linux -I fsmonitor/windows -I system/generic -I lwt/generic -ccopt -mmacosx-version-min=10.14 -c /opt/local/var/macports/build/_opt_local_var_macports_sources_rsync.macports.org_macports_release_tarballs_ports_net_unison/unison/work/unison-2.51.2/src/globals.mli
1187:info:build ocamlopt: globals.ml ---> globals.cmx
1188:info:build ocamlopt -g -unsafe-string -I lwt -I ubase -I system -thread -I fsmonitor -I fsmonitor/linux -I fsmonitor/windows -I system/generic -I lwt/generic -ccopt -mmacosx-version-min=10.14 -c /opt/local/var/macports/build/_opt_local_var_macports_sources_rsync.macports.org_macports_release_tarballs_ports_net_unison/unison/work/unison-2.51.2/src/globals.ml
1189:info:build ocamlopt: fswatchold.mli ---> fswatchold.cmi
1190:info:build ocamlopt -g -unsafe-string -I lwt -I ubase -I system -thread -I fsmonitor -I fsmonitor/linux -I fsmonitor/windows -I system/generic -I lwt/generic -ccopt -mmacosx-version-min=10.14 -c /opt/local/var/macports/build/_opt_local_var_macports_sources_rsync.macports.org_macports_release_tarballs_ports_net_unison/unison/work/unison-2.51.2/src/fswatchold.mli
1191:info:build ocamlopt: fswatchold.ml ---> fswatchold.cmx
1192:info:build ocamlopt -g -unsafe-string -I lwt -I ubase -I system -thread -I fsmonitor -I fsmonitor/linux -I fsmonitor/windows -I system/generic -I lwt/generic -ccopt -mmacosx-version-min=10.14 -c /opt/local/var/macports/build/_opt_local_var_macports_sources_rsync.macports.org_macports_release_tarballs_ports_net_unison/unison/work/unison-2.51.2/src/fswatchold.ml
1193:info:build ocamlopt: fpcache.mli ---> fpcache.cmi
1194:info:build ocamlopt -g -unsafe-string -I lwt -I ubase -I system -thread -I fsmonitor -I fsmonitor/linux -I fsmonitor/windows -I system/generic -I lwt/generic -ccopt -mmacosx-version-min=10.14 -c /opt/local/var/macports/build/_opt_local_var_macports_sources_rsync.macports.org_macports_release_tarballs_ports_net_unison/unison/work/unison-2.51.2/src/fpcache.mli
1195:info:build ocamlopt: fpcache.ml ---> fpcache.cmx
1196:info:build ocamlopt -g -unsafe-string -I lwt -I ubase -I system -thread -I fsmonitor -I fsmonitor/linux -I fsmonitor/windows -I system/generic -I lwt/generic -ccopt -mmacosx-version-min=10.14 -c /opt/local/var/macports/build/_opt_local_var_macports_sources_rsync.macports.org_macports_release_tarballs_ports_net_unison/unison/work/unison-2.51.2/src/fpcache.ml
1197:info:build ocamlopt: update.mli ---> update.cmi
1198:info:build ocamlopt -g -unsafe-string -I lwt -I ubase -I system -thread -I fsmonitor -I fsmonitor/linux -I fsmonitor/windows -I system/generic -I lwt/generic -ccopt -mmacosx-version-min=10.14 -c /opt/local/var/macports/build/_opt_local_var_macports_sources_rsync.macports.org_macports_release_tarballs_ports_net_unison/unison/work/unison-2.51.2/src/update.mli
1199:info:build ocamlopt: update.ml ---> update.cmx
1200:info:build ocamlopt -g -unsafe-string -I lwt -I ubase -I system -thread -I fsmonitor -I fsmonitor/linux -I fsmonitor/windows -I system/generic -I lwt/generic -ccopt -mmacosx-version-min=10.14 -c /opt/local/var/macports/build/_opt_local_var_macports_sources_rsync.macports.org_macports_release_tarballs_ports_net_unison/unison/work/unison-2.51.2/src/update.ml
1201:info:build ocamlopt: copy.mli ---> copy.cmi
1202:info:build ocamlopt -g -unsafe-string -I lwt -I ubase -I system -thread -I fsmonitor -I fsmonitor/linux -I fsmonitor/windows -I system/generic -I lwt/generic -ccopt -mmacosx-version-min=10.14 -c /opt/local/var/macports/build/_opt_local_var_macports_sources_rsync.macports.org_macports_release_tarballs_ports_net_unison/unison/work/unison-2.51.2/src/copy.mli
1203:info:build ocamlopt: copy.ml ---> copy.cmx
1204:info:build ocamlopt -g -unsafe-string -I lwt -I ubase -I system -thread -I fsmonitor -I fsmonitor/linux -I fsmonitor/windows -I system/generic -I lwt/generic -ccopt -mmacosx-version-min=10.14 -c /opt/local/var/macports/build/_opt_local_var_macports_sources_rsync.macports.org_macports_release_tarballs_ports_net_unison/unison/work/unison-2.51.2/src/copy.ml
1205:info:build ocamlopt: stasher.mli ---> stasher.cmi
1206:info:build ocamlopt -g -unsafe-string -I lwt -I ubase -I system -thread -I fsmonitor -I fsmonitor/linux -I fsmonitor/windows -I system/generic -I lwt/generic -ccopt -mmacosx-version-min=10.14 -c /opt/local/var/macports/build/_opt_local_var_macports_sources_rsync.macports.org_macports_release_tarballs_ports_net_unison/unison/work/unison-2.51.2/src/stasher.mli
1207:info:build ocamlopt: stasher.ml ---> stasher.cmx
1208:info:build ocamlopt -g -unsafe-string -I lwt -I ubase -I system -thread -I fsmonitor -I fsmonitor/linux -I fsmonitor/windows -I system/generic -I lwt/generic -ccopt -mmacosx-version-min=10.14 -c /opt/local/var/macports/build/_opt_local_var_macports_sources_rsync.macports.org_macports_release_tarballs_ports_net_unison/unison/work/unison-2.51.2/src/stasher.ml
1209:info:build ocamlopt: files.mli ---> files.cmi
1210:info:build ocamlopt -g -unsafe-string -I lwt -I ubase -I system -thread -I fsmonitor -I fsmonitor/linux -I fsmonitor/windows -I system/generic -I lwt/generic -ccopt -mmacosx-version-min=10.14 -c /opt/local/var/macports/build/_opt_local_var_macports_sources_rsync.macports.org_macports_release_tarballs_ports_net_unison/unison/work/unison-2.51.2/src/files.mli
1211:info:build ocamlopt: files.ml ---> files.cmx
1212:info:build ocamlopt -g -unsafe-string -I lwt -I ubase -I system -thread -I fsmonitor -I fsmonitor/linux -I fsmonitor/windows -I system/generic -I lwt/generic -ccopt -mmacosx-version-min=10.14 -c /opt/local/var/macports/build/_opt_local_var_macports_sources_rsync.macports.org_macports_release_tarballs_ports_net_unison/unison/work/unison-2.51.2/src/files.ml
1213:info:build File "/opt/local/var/macports/build/_opt_local_var_macports_sources_rsync.macports.org_macports_release_tarballs_ports_net_unison/unison/work/unison-2.51.2/src/files.ml", line 737, characters 2-11:
1214:info:build Warning 3: deprecated: Stdlib.Sort.list
1215:info:build Use List.sort instead.
1216:info:build ocamlopt: sortri.mli ---> sortri.cmi
1217:info:build ocamlopt -g -unsafe-string -I lwt -I ubase -I system -thread -I fsmonitor -I fsmonitor/linux -I fsmonitor/windows -I system/generic -I lwt/generic -ccopt -mmacosx-version-min=10.14 -c /opt/local/var/macports/build/_opt_local_var_macports_sources_rsync.macports.org_macports_release_tarballs_ports_net_unison/unison/work/unison-2.51.2/src/sortri.mli
1218:info:build ocamlopt: sortri.ml ---> sortri.cmx
1219:info:build ocamlopt -g -unsafe-string -I lwt -I ubase -I system -thread -I fsmonitor -I fsmonitor/linux -I fsmonitor/windows -I system/generic -I lwt/generic -ccopt -mmacosx-version-min=10.14 -c /opt/local/var/macports/build/_opt_local_var_macports_sources_rsync.macports.org_macports_release_tarballs_ports_net_unison/unison/work/unison-2.51.2/src/sortri.ml
1220:info:build ocamlopt: recon.mli ---> recon.cmi
1221:info:build ocamlopt -g -unsafe-string -I lwt -I ubase -I system -thread -I fsmonitor -I fsmonitor/linux -I fsmonitor/windows -I system/generic -I lwt/generic -ccopt -mmacosx-version-min=10.14 -c /opt/local/var/macports/build/_opt_local_var_macports_sources_rsync.macports.org_macports_release_tarballs_ports_net_unison/unison/work/unison-2.51.2/src/recon.mli
1222:info:build ocamlopt: recon.ml ---> recon.cmx
1223:info:build ocamlopt -g -unsafe-string -I lwt -I ubase -I system -thread -I fsmonitor -I fsmonitor/linux -I fsmonitor/windows -I system/generic -I lwt/generic -ccopt -mmacosx-version-min=10.14 -c /opt/local/var/macports/build/_opt_local_var_macports_sources_rsync.macports.org_macports_release_tarballs_ports_net_unison/unison/work/unison-2.51.2/src/recon.ml
1224:info:build File "/opt/local/var/macports/build/_opt_local_var_macports_sources_rsync.macports.org_macports_release_tarballs_ports_net_unison/unison/work/unison-2.51.2/src/recon.ml", line 664, characters 2-11:
1225:info:build Warning 3: deprecated: Stdlib.Sort.list
1226:info:build Use List.sort instead.
1227:info:build ocamlopt: transport.mli ---> transport.cmi
1228:info:build ocamlopt -g -unsafe-string -I lwt -I ubase -I system -thread -I fsmonitor -I fsmonitor/linux -I fsmonitor/windows -I system/generic -I lwt/generic -ccopt -mmacosx-version-min=10.14 -c /opt/local/var/macports/build/_opt_local_var_macports_sources_rsync.macports.org_macports_release_tarballs_ports_net_unison/unison/work/unison-2.51.2/src/transport.mli
1229:info:build ocamlopt: transport.ml ---> transport.cmx
1230:info:build ocamlopt -g -unsafe-string -I lwt -I ubase -I system -thread -I fsmonitor -I fsmonitor/linux -I fsmonitor/windows -I system/generic -I lwt/generic -ccopt -mmacosx-version-min=10.14 -c /opt/local/var/macports/build/_opt_local_var_macports_sources_rsync.macports.org_macports_release_tarballs_ports_net_unison/unison/work/unison-2.51.2/src/transport.ml
1231:info:build File "/opt/local/var/macports/build/_opt_local_var_macports_sources_rsync.macports.org_macports_release_tarballs_ports_net_unison/unison/work/unison-2.51.2/src/transport.ml", line 186, characters 7-23:
1232:info:build Warning 3: deprecated: Stdlib.String.uppercase
1233:info:build Use String.uppercase_ascii instead.
1234:info:build File "/opt/local/var/macports/build/_opt_local_var_macports_sources_rsync.macports.org_macports_release_tarballs_ports_net_unison/unison/work/unison-2.51.2/src/transport.ml", line 199, characters 7-23:
1235:info:build Warning 3: deprecated: Stdlib.String.uppercase
1236:info:build Use String.uppercase_ascii instead.
1237:info:build ocamlopt: strings.mli ---> strings.cmi
1238:info:build ocamlopt -g -unsafe-string -I lwt -I ubase -I system -thread -I fsmonitor -I fsmonitor/linux -I fsmonitor/windows -I system/generic -I lwt/generic -ccopt -mmacosx-version-min=10.14 -c /opt/local/var/macports/build/_opt_local_var_macports_sources_rsync.macports.org_macports_release_tarballs_ports_net_unison/unison/work/unison-2.51.2/src/strings.mli
1239:info:build ocamlopt: strings.ml ---> strings.cmx
1240:info:build ocamlopt -g -unsafe-string -I lwt -I ubase -I system -thread -I fsmonitor -I fsmonitor/linux -I fsmonitor/windows -I system/generic -I lwt/generic -ccopt -mmacosx-version-min=10.14 -c /opt/local/var/macports/build/_opt_local_var_macports_sources_rsync.macports.org_macports_release_tarballs_ports_net_unison/unison/work/unison-2.51.2/src/strings.ml
1241:info:build ocamlopt: uicommon.mli ---> uicommon.cmi
1242:info:build ocamlopt -g -unsafe-string -I lwt -I ubase -I system -thread -I fsmonitor -I fsmonitor/linux -I fsmonitor/windows -I system/generic -I lwt/generic -ccopt -mmacosx-version-min=10.14 -c /opt/local/var/macports/build/_opt_local_var_macports_sources_rsync.macports.org_macports_release_tarballs_ports_net_unison/unison/work/unison-2.51.2/src/uicommon.mli
1243:info:build ocamlopt: uicommon.ml ---> uicommon.cmx
1244:info:build ocamlopt -g -unsafe-string -I lwt -I ubase -I system -thread -I fsmonitor -I fsmonitor/linux -I fsmonitor/windows -I system/generic -I lwt/generic -ccopt -mmacosx-version-min=10.14 -c /opt/local/var/macports/build/_opt_local_var_macports_sources_rsync.macports.org_macports_release_tarballs_ports_net_unison/unison/work/unison-2.51.2/src/uicommon.ml
1245:info:build File "/opt/local/var/macports/build/_opt_local_var_macports_sources_rsync.macports.org_macports_release_tarballs_ports_net_unison/unison/work/unison-2.51.2/src/uicommon.ml", line 366, characters 8-26:
1246:info:build Warning 3: deprecated: Stdlib.String.set
1247:info:build Use Bytes.set instead.
1248:info:build File "/opt/local/var/macports/build/_opt_local_var_macports_sources_rsync.macports.org_macports_release_tarballs_ports_net_unison/unison/work/unison-2.51.2/src/uicommon.ml", line 366, characters 28-47:
1249:info:build Warning 3: deprecated: Stdlib.String.set
1250:info:build Use Bytes.set instead.
1251:info:build File "/opt/local/var/macports/build/_opt_local_var_macports_sources_rsync.macports.org_macports_release_tarballs_ports_net_unison/unison/work/unison-2.51.2/src/uicommon.ml", line 368, characters 8-23:
1252:info:build Warning 3: deprecated: Stdlib.String.set
1253:info:build Use Bytes.set instead.
1254:info:build ocamlopt: uitext.mli ---> uitext.cmi
1255:info:build ocamlopt -g -unsafe-string -I lwt -I ubase -I system -thread -I fsmonitor -I fsmonitor/linux -I fsmonitor/windows -I system/generic -I lwt/generic -ccopt -mmacosx-version-min=10.14 -c /opt/local/var/macports/build/_opt_local_var_macports_sources_rsync.macports.org_macports_release_tarballs_ports_net_unison/unison/work/unison-2.51.2/src/uitext.mli
1256:info:build ocamlopt: uitext.ml ---> uitext.cmx
1257:info:build ocamlopt -g -unsafe-string -I lwt -I ubase -I system -thread -I fsmonitor -I fsmonitor/linux -I fsmonitor/windows -I system/generic -I lwt/generic -ccopt -mmacosx-version-min=10.14 -c /opt/local/var/macports/build/_opt_local_var_macports_sources_rsync.macports.org_macports_release_tarballs_ports_net_unison/unison/work/unison-2.51.2/src/uitext.ml
1258:info:build ocamlopt: test.mli ---> test.cmi
1259:info:build ocamlopt -g -unsafe-string -I lwt -I ubase -I system -thread -I fsmonitor -I fsmonitor/linux -I fsmonitor/windows -I system/generic -I lwt/generic -ccopt -mmacosx-version-min=10.14 -c /opt/local/var/macports/build/_opt_local_var_macports_sources_rsync.macports.org_macports_release_tarballs_ports_net_unison/unison/work/unison-2.51.2/src/test.mli
1260:info:build ocamlopt: test.ml ---> test.cmx
1261:info:build ocamlopt -g -unsafe-string -I lwt -I ubase -I system -thread -I fsmonitor -I fsmonitor/linux -I fsmonitor/windows -I system/generic -I lwt/generic -ccopt -mmacosx-version-min=10.14 -c /opt/local/var/macports/build/_opt_local_var_macports_sources_rsync.macports.org_macports_release_tarballs_ports_net_unison/unison/work/unison-2.51.2/src/test.ml
1262:info:build ocamlopt: main.ml ---> main.cmx
1263:info:build ocamlopt -g -unsafe-string -I lwt -I ubase -I system -thread -I fsmonitor -I fsmonitor/linux -I fsmonitor/windows -I system/generic -I lwt/generic -ccopt -mmacosx-version-min=10.14 -c /opt/local/var/macports/build/_opt_local_var_macports_sources_rsync.macports.org_macports_release_tarballs_ports_net_unison/unison/work/unison-2.51.2/src/main.ml
1264:info:build ocamlopt: uimacbridgenew.ml ---> uimacbridgenew.cmx
1265:info:build ocamlopt -g -unsafe-string -I lwt -I ubase -I system -thread -I fsmonitor -I fsmonitor/linux -I fsmonitor/windows -I system/generic -I lwt/generic -ccopt -mmacosx-version-min=10.14 -c /opt/local/var/macports/build/_opt_local_var_macports_sources_rsync.macports.org_macports_release_tarballs_ports_net_unison/unison/work/unison-2.51.2/src/uimacbridgenew.ml
1266:info:build ocamlopt: osxsupport.c ---> osxsupport.o
1267:info:build ocamlopt -g -unsafe-string -I lwt -I ubase -I system -thread -I fsmonitor -I fsmonitor/linux -I fsmonitor/windows -I system/generic -I lwt/generic -ccopt -mmacosx-version-min=10.14 -ccopt "-o "/opt/local/var/macports/build/_opt_local_var_macports_sources_rsync.macports.org_macports_release_tarballs_ports_net_unison/unison/work/unison-2.51.2/src/osxsupport.o -c /opt/local/var/macports/build/_opt_local_var_macports_sources_rsync.macports.org_macports_release_tarballs_ports_net_unison/unison/work/unison-2.51.2/src/osxsupport.c
1268:info:build ocamlopt: pty.c ---> pty.o
1269:info:build ocamlopt -g -unsafe-string -I lwt -I ubase -I system -thread -I fsmonitor -I fsmonitor/linux -I fsmonitor/windows -I system/generic -I lwt/generic -ccopt -mmacosx-version-min=10.14 -ccopt "-o "/opt/local/var/macports/build/_opt_local_var_macports_sources_rsync.macports.org_macports_release_tarballs_ports_net_unison/unison/work/unison-2.51.2/src/pty.o -c /opt/local/var/macports/build/_opt_local_var_macports_sources_rsync.macports.org_macports_release_tarballs_ports_net_unison/unison/work/unison-2.51.2/src/pty.c
1270:info:build ocamlopt: bytearray_stubs.c ---> bytearray_stubs.o
1271:info:build ocamlopt -g -unsafe-string -I lwt -I ubase -I system -thread -I fsmonitor -I fsmonitor/linux -I fsmonitor/windows -I system/generic -I lwt/generic -ccopt -mmacosx-version-min=10.14 -ccopt "-o "/opt/local/var/macports/build/_opt_local_var_macports_sources_rsync.macports.org_macports_release_tarballs_ports_net_unison/unison/work/unison-2.51.2/src/bytearray_stubs.o -c /opt/local/var/macports/build/_opt_local_var_macports_sources_rsync.macports.org_macports_release_tarballs_ports_net_unison/unison/work/unison-2.51.2/src/bytearray_stubs.c
1272:info:build Linking unison-blob.o
1273:info:build ocamlopt -dstartup -output-obj -verbose -cclib -keep_private_externs -g -unsafe-string -I lwt -I ubase -I system -thread -I fsmonitor -I fsmonitor/linux -I fsmonitor/windows -I system/generic -I lwt/generic -ccopt -mmacosx-version-min=10.14 -o u-b.o   unix.cmxa str.cmxa bigarray.cmxa threads.cmxa    ubase/rx.cmx unicode_tables.cmx unicode.cmx bytearray.cmx  system/system_generic.cmx system/generic/system_impl.cmx system.cmx ubase/projectInfo.cmx ubase/myMap.cmx ubase/safelist.cmx ubase/util.cmx ubase/uarg.cmx ubase/prefs.cmx ubase/trace.cmx ubase/proplist.cmx lwt/pqueue.cmx lwt/lwt.cmx lwt/lwt_util.cmx lwt/generic/lwt_unix_impl.cmx lwt/lwt_unix.cmx uutil.cmx case.cmx pred.cmx fileutil.cmx name.cmx path.cmx fspath.cmx fs.cmx fingerprint.cmx abort.cmx osx.cmx external.cmx fswatch.cmx props.cmx fileinfo.cmx os.cmx lock.cmx clroot.cmx common.cmx tree.cmx checksum.cmx terminal.cmx transfer.cmx xferhint.cmx remote.cmx globals.cmx fswatchold.cmx fpcache.cmx update.cmx copy.cmx stasher.cmx files.cmx sortri.cmx recon.cmx transport.cmx strings.cmx uicommon.cmx uitext.cmx test.cmx main.cmx uimacbridgenew.cmx
1274:info:build + /usr/bin/clang -c -o '/opt/local/var/macports/build/_opt_local_var_macports_sources_rsync.macports.org_macports_release_tarballs_ports_net_unison/unison/work/.tmp/camlstartup5a9069.o' 'u-b.o.startup.s'
1275:info:build + ld -r -o 'u-b.o' '-Llwt' '-Lubase' '-Lsystem' '-Lfsmonitor' '-Lfsmonitor/linux' '-Lfsmonitor/windows' '-Lsystem/generic' '-Llwt/generic' '-L/opt/local/lib/ocaml/threads' '-L/opt/local/lib/ocaml' '/opt/local/var/macports/build/_opt_local_var_macports_sources_rsync.macports.org_macports_release_tarballs_ports_net_unison/unison/work/.tmp/camlstartup5a9069.o' 'uimacbridgenew.o' 'main.o' 'test.o' 'uitext.o' 'uicommon.o' 'strings.o' 'transport.o' 'recon.o' 'sortri.o' 'files.o' 'stasher.o' 'copy.o' 'update.o' 'fpcache.o' 'fswatchold.o' 'globals.o' 'remote.o' 'xferhint.o' 'transfer.o' 'terminal.o' 'checksum.o' 'tree.o' 'common.o' 'clroot.o' 'lock.o' 'os.o' 'fileinfo.o' 'props.o' 'fswatch.o' 'external.o' 'osx.o' 'abort.o' 'fingerprint.o' 'fs.o' 'fspath.o' 'path.o' 'name.o' 'fileutil.o' 'pred.o' 'case.o' 'uutil.o' 'lwt/lwt_unix.o' 'lwt/generic/lwt_unix_impl.o' 'lwt/lwt_util.o' 'lwt/lwt.o' 'lwt/pqueue.o' 'ubase/proplist.o' 'ubase/trace.o' 'ubase/prefs.o' 'ubase/uarg.o' 'ubase/util.o' 'ubase/safelist.o' 'ubase/myMap.o' 'ubase/projectInfo.o' 'system.o' 'system/generic/system_impl.o' 'system/system_generic.o' 'bytearray.o' 'unicode.o' 'unicode_tables.o' 'ubase/rx.o' '/opt/local/lib/ocaml/threads/threads.a' '/opt/local/lib/ocaml/bigarray.a' '/opt/local/lib/ocaml/str.a' '/opt/local/lib/ocaml/unix.a' '/opt/local/lib/ocaml/stdlib.a'
1276:info:build ld -r -keep_private_externs -o unison-blob.o u-b.o osxsupport.o pty.o bytearray_stubs.o
1277:info:build rm -f u-b.o
1278:info:build make[2]: Leaving directory `/opt/local/var/macports/build/_opt_local_var_macports_sources_rsync.macports.org_macports_release_tarballs_ports_net_unison/unison/work/unison-2.51.2/src'
1279:info:build done
1280:info:build CpResource Unison.icns build/Default/Unison.app/Contents/Resources/Unison.icns
1281:info:build     cd /opt/local/var/macports/build/_opt_local_var_macports_sources_rsync.macports.org_macports_release_tarballs_ports_net_unison/unison/work/unison-2.51.2/src/uimac14
1282:info:build     builtin-copy -exclude .DS_Store -exclude CVS -exclude .svn -exclude .git -exclude .hg -strip-debug-symbols -strip-tool /Applications/Xcode.app/Contents/Developer/Toolchains/XcodeDefault.xctoolchain/usr/bin/strip -resolve-src-symlinks /opt/local/var/macports/build/_opt_local_var_macports_sources_rsync.macports.org_macports_release_tarballs_ports_net_unison/unison/work/unison-2.51.2/src/uimac14/Unison.icns /opt/local/var/macports/build/_opt_local_var_macports_sources_rsync.macports.org_macports_release_tarballs_ports_net_unison/unison/work/unison-2.51.2/src/uimac14/build/Default/Unison.app/Contents/Resources
1283:info:build CopyTiffFile build/Default/Unison.app/Contents/Resources/diff.tif toolbar/diff.tif
1284:info:build     cd /opt/local/var/macports/build/_opt_local_var_macports_sources_rsync.macports.org_macports_release_tarballs_ports_net_unison/unison/work/unison-2.51.2/src/uimac14
1285:info:build     builtin-copyTiff --outdir /opt/local/var/macports/build/_opt_local_var_macports_sources_rsync.macports.org_macports_release_tarballs_ports_net_unison/unison/work/unison-2.51.2/src/uimac14/build/Default/Unison.app/Contents/Resources -- toolbar/diff.tif
1286:info:build CopyTiffFile build/Default/Unison.app/Contents/Resources/left.tif toolbar/left.tif
1287:info:build     cd /opt/local/var/macports/build/_opt_local_var_macports_sources_rsync.macports.org_macports_release_tarballs_ports_net_unison/unison/work/unison-2.51.2/src/uimac14
1288:info:build     builtin-copyTiff --outdir /opt/local/var/macports/build/_opt_local_var_macports_sources_rsync.macports.org_macports_release_tarballs_ports_net_unison/unison/work/unison-2.51.2/src/uimac14/build/Default/Unison.app/Contents/Resources -- toolbar/left.tif
1289:info:build CopyTiffFile build/Default/Unison.app/Contents/Resources/go.tif toolbar/go.tif
1290:info:build     cd /opt/local/var/macports/build/_opt_local_var_macports_sources_rsync.macports.org_macports_release_tarballs_ports_net_unison/unison/work/unison-2.51.2/src/uimac14
1291:info:build     builtin-copyTiff --outdir /opt/local/var/macports/build/_opt_local_var_macports_sources_rsync.macports.org_macports_release_tarballs_ports_net_unison/unison/work/unison-2.51.2/src/uimac14/build/Default/Unison.app/Contents/Resources -- toolbar/go.tif
1292:info:build CopyStringsFile build/Default/Unison.app/Contents/Resources/English.lproj/InfoPlist.strings English.lproj/InfoPlist.strings
1293:info:build     cd /opt/local/var/macports/build/_opt_local_var_macports_sources_rsync.macports.org_macports_release_tarballs_ports_net_unison/unison/work/unison-2.51.2/src/uimac14
1294:info:build     builtin-copyStrings --validate --inputencoding utf-16 --outputencoding UTF-16 --outdir /opt/local/var/macports/build/_opt_local_var_macports_sources_rsync.macports.org_macports_release_tarballs_ports_net_unison/unison/work/unison-2.51.2/src/uimac14/build/Default/Unison.app/Contents/Resources/English.lproj -- English.lproj/InfoPlist.strings
1295:info:build CopyTiffFile build/Default/Unison.app/Contents/Resources/merge.tif toolbar/merge.tif
1296:info:build     cd /opt/local/var/macports/build/_opt_local_var_macports_sources_rsync.macports.org_macports_release_tarballs_ports_net_unison/unison/work/unison-2.51.2/src/uimac14
1297:info:build     builtin-copyTiff --outdir /opt/local/var/macports/build/_opt_local_var_macports_sources_rsync.macports.org_macports_release_tarballs_ports_net_unison/unison/work/unison-2.51.2/src/uimac14/build/Default/Unison.app/Contents/Resources -- toolbar/merge.tif
1298:info:build CopyTiffFile build/Default/Unison.app/Contents/Resources/right.tif toolbar/right.tif
1299:info:build     cd /opt/local/var/macports/build/_opt_local_var_macports_sources_rsync.macports.org_macports_release_tarballs_ports_net_unison/unison/work/unison-2.51.2/src/uimac14
1300:info:build     builtin-copyTiff --outdir /opt/local/var/macports/build/_opt_local_var_macports_sources_rsync.macports.org_macports_release_tarballs_ports_net_unison/unison/work/unison-2.51.2/src/uimac14/build/Default/Unison.app/Contents/Resources -- toolbar/right.tif
1301:info:build CopyTiffFile build/Default/Unison.app/Contents/Resources/quit.tif toolbar/quit.tif
1302:info:build     cd /opt/local/var/macports/build/_opt_local_var_macports_sources_rsync.macports.org_macports_release_tarballs_ports_net_unison/unison/work/unison-2.51.2/src/uimac14
1303:info:build     builtin-copyTiff --outdir /opt/local/var/macports/build/_opt_local_var_macports_sources_rsync.macports.org_macports_release_tarballs_ports_net_unison/unison/work/unison-2.51.2/src/uimac14/build/Default/Unison.app/Contents/Resources -- toolbar/quit.tif
1304:info:build CopyTiffFile build/Default/Unison.app/Contents/Resources/restart.tif toolbar/restart.tif
1305:info:build     cd /opt/local/var/macports/build/_opt_local_var_macports_sources_rsync.macports.org_macports_release_tarballs_ports_net_unison/unison/work/unison-2.51.2/src/uimac14
1306:info:build     builtin-copyTiff --outdir /opt/local/var/macports/build/_opt_local_var_macports_sources_rsync.macports.org_macports_release_tarballs_ports_net_unison/unison/work/unison-2.51.2/src/uimac14/build/Default/Unison.app/Contents/Resources -- toolbar/restart.tif
1307:info:build CopyTiffFile build/Default/Unison.app/Contents/Resources/save.tif toolbar/save.tif
1308:info:build     cd /opt/local/var/macports/build/_opt_local_var_macports_sources_rsync.macports.org_macports_release_tarballs_ports_net_unison/unison/work/unison-2.51.2/src/uimac14
1309:info:build     builtin-copyTiff --outdir /opt/local/var/macports/build/_opt_local_var_macports_sources_rsync.macports.org_macports_release_tarballs_ports_net_unison/unison/work/unison-2.51.2/src/uimac14/build/Default/Unison.app/Contents/Resources -- toolbar/save.tif
1310:info:build CopyTiffFile build/Default/Unison.app/Contents/Resources/add.tif toolbar/add.tif
1311:info:build     cd /opt/local/var/macports/build/_opt_local_var_macports_sources_rsync.macports.org_macports_release_tarballs_ports_net_unison/unison/work/unison-2.51.2/src/uimac14
1312:info:build     builtin-copyTiff --outdir /opt/local/var/macports/build/_opt_local_var_macports_sources_rsync.macports.org_macports_release_tarballs_ports_net_unison/unison/work/unison-2.51.2/src/uimac14/build/Default/Unison.app/Contents/Resources -- toolbar/add.tif
1313:info:build CopyTiffFile build/Default/Unison.app/Contents/Resources/table-error.tif tableicons/table-error.tif
1314:info:build     cd /opt/local/var/macports/build/_opt_local_var_macports_sources_rsync.macports.org_macports_release_tarballs_ports_net_unison/unison/work/unison-2.51.2/src/uimac14
1315:info:build     builtin-copyTiff --outdir /opt/local/var/macports/build/_opt_local_var_macports_sources_rsync.macports.org_macports_release_tarballs_ports_net_unison/unison/work/unison-2.51.2/src/uimac14/build/Default/Unison.app/Contents/Resources -- tableicons/table-error.tif
1316:info:build CopyTiffFile build/Default/Unison.app/Contents/Resources/skip.tif toolbar/skip.tif
1317:info:build     cd /opt/local/var/macports/build/_opt_local_var_macports_sources_rsync.macports.org_macports_release_tarballs_ports_net_unison/unison/work/unison-2.51.2/src/uimac14
1318:info:build     builtin-copyTiff --outdir /opt/local/var/macports/build/_opt_local_var_macports_sources_rsync.macports.org_macports_release_tarballs_ports_net_unison/unison/work/unison-2.51.2/src/uimac14/build/Default/Unison.app/Contents/Resources -- toolbar/skip.tif
1319:info:build CopyTiffFile build/Default/Unison.app/Contents/Resources/table-conflict.tif tableicons/table-conflict.tif
1320:info:build     cd /opt/local/var/macports/build/_opt_local_var_macports_sources_rsync.macports.org_macports_release_tarballs_ports_net_unison/unison/work/unison-2.51.2/src/uimac14
1321:info:build     builtin-copyTiff --outdir /opt/local/var/macports/build/_opt_local_var_macports_sources_rsync.macports.org_macports_release_tarballs_ports_net_unison/unison/work/unison-2.51.2/src/uimac14/build/Default/Unison.app/Contents/Resources -- tableicons/table-conflict.tif
1322:info:build CopyTiffFile build/Default/Unison.app/Contents/Resources/table-left-blue.tif tableicons/table-left-blue.tif
1323:info:build     cd /opt/local/var/macports/build/_opt_local_var_macports_sources_rsync.macports.org_macports_release_tarballs_ports_net_unison/unison/work/unison-2.51.2/src/uimac14
1324:info:build     builtin-copyTiff --outdir /opt/local/var/macports/build/_opt_local_var_macports_sources_rsync.macports.org_macports_release_tarballs_ports_net_unison/unison/work/unison-2.51.2/src/uimac14/build/Default/Unison.app/Contents/Resources -- tableicons/table-left-blue.tif
1325:info:build CopyTiffFile build/Default/Unison.app/Contents/Resources/table-left-green.tif tableicons/table-left-green.tif
1326:info:build     cd /opt/local/var/macports/build/_opt_local_var_macports_sources_rsync.macports.org_macports_release_tarballs_ports_net_unison/unison/work/unison-2.51.2/src/uimac14
1327:info:build     builtin-copyTiff --outdir /opt/local/var/macports/build/_opt_local_var_macports_sources_rsync.macports.org_macports_release_tarballs_ports_net_unison/unison/work/unison-2.51.2/src/uimac14/build/Default/Unison.app/Contents/Resources -- tableicons/table-left-green.tif
1328:info:build CopyTiffFile build/Default/Unison.app/Contents/Resources/table-right-green.tif tableicons/table-right-green.tif
1329:info:build     cd /opt/local/var/macports/build/_opt_local_var_macports_sources_rsync.macports.org_macports_release_tarballs_ports_net_unison/unison/work/unison-2.51.2/src/uimac14
1330:info:build     builtin-copyTiff --outdir /opt/local/var/macports/build/_opt_local_var_macports_sources_rsync.macports.org_macports_release_tarballs_ports_net_unison/unison/work/unison-2.51.2/src/uimac14/build/Default/Unison.app/Contents/Resources -- tableicons/table-right-green.tif
1331:info:build CopyTiffFile build/Default/Unison.app/Contents/Resources/rescan.tif toolbar/rescan.tif
1332:info:build     cd /opt/local/var/macports/build/_opt_local_var_macports_sources_rsync.macports.org_macports_release_tarballs_ports_net_unison/unison/work/unison-2.51.2/src/uimac14
1333:info:build     builtin-copyTiff --outdir /opt/local/var/macports/build/_opt_local_var_macports_sources_rsync.macports.org_macports_release_tarballs_ports_net_unison/unison/work/unison-2.51.2/src/uimac14/build/Default/Unison.app/Contents/Resources -- toolbar/rescan.tif
1334:info:build CopyTiffFile build/Default/Unison.app/Contents/Resources/table-skip.tif tableicons/table-skip.tif
1335:info:build     cd /opt/local/var/macports/build/_opt_local_var_macports_sources_rsync.macports.org_macports_release_tarballs_ports_net_unison/unison/work/unison-2.51.2/src/uimac14
1336:info:build     builtin-copyTiff --outdir /opt/local/var/macports/build/_opt_local_var_macports_sources_rsync.macports.org_macports_release_tarballs_ports_net_unison/unison/work/unison-2.51.2/src/uimac14/build/Default/Unison.app/Contents/Resources -- tableicons/table-skip.tif
1337:info:build CopyTiffFile build/Default/Unison.app/Contents/Resources/table-mixed.tif tableicons/table-mixed.tif
1338:info:build     cd /opt/local/var/macports/build/_opt_local_var_macports_sources_rsync.macports.org_macports_release_tarballs_ports_net_unison/unison/work/unison-2.51.2/src/uimac14
1339:info:build     builtin-copyTiff --outdir /opt/local/var/macports/build/_opt_local_var_macports_sources_rsync.macports.org_macports_release_tarballs_ports_net_unison/unison/work/unison-2.51.2/src/uimac14/build/Default/Unison.app/Contents/Resources -- tableicons/table-mixed.tif
1340:info:build CopyTiffFile build/Default/Unison.app/Contents/Resources/table-merge.tif tableicons/table-merge.tif
1341:info:build     cd /opt/local/var/macports/build/_opt_local_var_macports_sources_rsync.macports.org_macports_release_tarballs_ports_net_unison/unison/work/unison-2.51.2/src/uimac14
1342:info:build     builtin-copyTiff --outdir /opt/local/var/macports/build/_opt_local_var_macports_sources_rsync.macports.org_macports_release_tarballs_ports_net_unison/unison/work/unison-2.51.2/src/uimac14/build/Default/Unison.app/Contents/Resources -- tableicons/table-merge.tif
1343:info:build CopyTiffFile build/Default/Unison.app/Contents/Resources/table-right-blue.tif tableicons/table-right-blue.tif
1344:info:build     cd /opt/local/var/macports/build/_opt_local_var_macports_sources_rsync.macports.org_macports_release_tarballs_ports_net_unison/unison/work/unison-2.51.2/src/uimac14
1345:info:build     builtin-copyTiff --outdir /opt/local/var/macports/build/_opt_local_var_macports_sources_rsync.macports.org_macports_release_tarballs_ports_net_unison/unison/work/unison-2.51.2/src/uimac14/build/Default/Unison.app/Contents/Resources -- tableicons/table-right-blue.tif
1346:info:build CopyPNGFile build/Default/Unison.app/Contents/Resources/ProgressBarAdvanced.png progressicons/ProgressBarAdvanced.png
1347:info:build     cd /opt/local/var/macports/build/_opt_local_var_macports_sources_rsync.macports.org_macports_release_tarballs_ports_net_unison/unison/work/unison-2.51.2/src/uimac14
1348:info:build     export DEVELOPER_DIR=/Applications/Xcode.app/Contents/Developer
1349:info:build     export SDKROOT=/Applications/Xcode.app/Contents/Developer/Platforms/MacOSX.platform/Developer/SDKs/MacOSX10.14.sdk
1350:info:build     export TOOLCHAINS=
1351:info:build     /Applications/Xcode.app/Contents/Developer/usr/bin/copypng /opt/local/var/macports/build/_opt_local_var_macports_sources_rsync.macports.org_macports_release_tarballs_ports_net_unison/unison/work/unison-2.51.2/src/uimac14/progressicons/ProgressBarAdvanced.png /opt/local/var/macports/build/_opt_local_var_macports_sources_rsync.macports.org_macports_release_tarballs_ports_net_unison/unison/work/unison-2.51.2/src/uimac14/build/Default/Unison.app/Contents/Resources/ProgressBarAdvanced.png
1352:info:build CopyPNGFile build/Default/Unison.app/Contents/Resources/ProgressBarBlue.png progressicons/ProgressBarBlue.png
1353:info:build     cd /opt/local/var/macports/build/_opt_local_var_macports_sources_rsync.macports.org_macports_release_tarballs_ports_net_unison/unison/work/unison-2.51.2/src/uimac14
1354:info:build     export DEVELOPER_DIR=/Applications/Xcode.app/Contents/Developer
1355:info:build     export SDKROOT=/Applications/Xcode.app/Contents/Developer/Platforms/MacOSX.platform/Developer/SDKs/MacOSX10.14.sdk
1356:info:build     export TOOLCHAINS=
1357:info:build     /Applications/Xcode.app/Contents/Developer/usr/bin/copypng /opt/local/var/macports/build/_opt_local_var_macports_sources_rsync.macports.org_macports_release_tarballs_ports_net_unison/unison/work/unison-2.51.2/src/uimac14/progressicons/ProgressBarBlue.png /opt/local/var/macports/build/_opt_local_var_macports_sources_rsync.macports.org_macports_release_tarballs_ports_net_unison/unison/work/unison-2.51.2/src/uimac14/build/Default/Unison.app/Contents/Resources/ProgressBarBlue.png
1358:info:build CopyPNGFile build/Default/Unison.app/Contents/Resources/ProgressBarEndAdvanced.png progressicons/ProgressBarEndAdvanced.png
1359:info:build     cd /opt/local/var/macports/build/_opt_local_var_macports_sources_rsync.macports.org_macports_release_tarballs_ports_net_unison/unison/work/unison-2.51.2/src/uimac14
1360:info:build     export DEVELOPER_DIR=/Applications/Xcode.app/Contents/Developer
1361:info:build     export SDKROOT=/Applications/Xcode.app/Contents/Developer/Platforms/MacOSX.platform/Developer/SDKs/MacOSX10.14.sdk
1362:info:build     export TOOLCHAINS=
1363:info:build     /Applications/Xcode.app/Contents/Developer/usr/bin/copypng /opt/local/var/macports/build/_opt_local_var_macports_sources_rsync.macports.org_macports_release_tarballs_ports_net_unison/unison/work/unison-2.51.2/src/uimac14/progressicons/ProgressBarEndAdvanced.png /opt/local/var/macports/build/_opt_local_var_macports_sources_rsync.macports.org_macports_release_tarballs_ports_net_unison/unison/work/unison-2.51.2/src/uimac14/build/Default/Unison.app/Contents/Resources/ProgressBarEndAdvanced.png
1364:info:build CopyPNGFile build/Default/Unison.app/Contents/Resources/ProgressBarEndGray.png progressicons/ProgressBarEndGray.png
1365:info:build     cd /opt/local/var/macports/build/_opt_local_var_macports_sources_rsync.macports.org_macports_release_tarballs_ports_net_unison/unison/work/unison-2.51.2/src/uimac14
1366:info:build     export DEVELOPER_DIR=/Applications/Xcode.app/Contents/Developer
1367:info:build     export SDKROOT=/Applications/Xcode.app/Contents/Developer/Platforms/MacOSX.platform/Developer/SDKs/MacOSX10.14.sdk
1368:info:build     export TOOLCHAINS=
1369:info:build     /Applications/Xcode.app/Contents/Developer/usr/bin/copypng /opt/local/var/macports/build/_opt_local_var_macports_sources_rsync.macports.org_macports_release_tarballs_ports_net_unison/unison/work/unison-2.51.2/src/uimac14/progressicons/ProgressBarEndGray.png /opt/local/var/macports/build/_opt_local_var_macports_sources_rsync.macports.org_macports_release_tarballs_ports_net_unison/unison/work/unison-2.51.2/src/uimac14/build/Default/Unison.app/Contents/Resources/ProgressBarEndGray.png
1370:info:build CopyPNGFile build/Default/Unison.app/Contents/Resources/ProgressBarEndBlue.png progressicons/ProgressBarEndBlue.png
1371:info:build     cd /opt/local/var/macports/build/_opt_local_var_macports_sources_rsync.macports.org_macports_release_tarballs_ports_net_unison/unison/work/unison-2.51.2/src/uimac14
1372:info:build     export DEVELOPER_DIR=/Applications/Xcode.app/Contents/Developer
1373:info:build     export SDKROOT=/Applications/Xcode.app/Contents/Developer/Platforms/MacOSX.platform/Developer/SDKs/MacOSX10.14.sdk
1374:info:build     export TOOLCHAINS=
1375:info:build     /Applications/Xcode.app/Contents/Developer/usr/bin/copypng /opt/local/var/macports/build/_opt_local_var_macports_sources_rsync.macports.org_macports_release_tarballs_ports_net_unison/unison/work/unison-2.51.2/src/uimac14/progressicons/ProgressBarEndBlue.png /opt/local/var/macports/build/_opt_local_var_macports_sources_rsync.macports.org_macports_release_tarballs_ports_net_unison/unison/work/unison-2.51.2/src/uimac14/build/Default/Unison.app/Contents/Resources/ProgressBarEndBlue.png
1376:info:build CopyPNGFile build/Default/Unison.app/Contents/Resources/ProgressBarEndWhite.png progressicons/ProgressBarEndWhite.png
1377:info:build     cd /opt/local/var/macports/build/_opt_local_var_macports_sources_rsync.macports.org_macports_release_tarballs_ports_net_unison/unison/work/unison-2.51.2/src/uimac14
1378:info:build     export DEVELOPER_DIR=/Applications/Xcode.app/Contents/Developer
1379:info:build     export SDKROOT=/Applications/Xcode.app/Contents/Developer/Platforms/MacOSX.platform/Developer/SDKs/MacOSX10.14.sdk
1380:info:build     export TOOLCHAINS=
1381:info:build     /Applications/Xcode.app/Contents/Developer/usr/bin/copypng /opt/local/var/macports/build/_opt_local_var_macports_sources_rsync.macports.org_macports_release_tarballs_ports_net_unison/unison/work/unison-2.51.2/src/uimac14/progressicons/ProgressBarEndWhite.png /opt/local/var/macports/build/_opt_local_var_macports_sources_rsync.macports.org_macports_release_tarballs_ports_net_unison/unison/work/unison-2.51.2/src/uimac14/build/Default/Unison.app/Contents/Resources/ProgressBarEndWhite.png
1382:info:build CopyPNGFile build/Default/Unison.app/Contents/Resources/ProgressBarEndGreen.png progressicons/ProgressBarEndGreen.png
1383:info:build     cd /opt/local/var/macports/build/_opt_local_var_macports_sources_rsync.macports.org_macports_release_tarballs_ports_net_unison/unison/work/unison-2.51.2/src/uimac14
1384:info:build     export DEVELOPER_DIR=/Applications/Xcode.app/Contents/Developer
1385:info:build     export SDKROOT=/Applications/Xcode.app/Contents/Developer/Platforms/MacOSX.platform/Developer/SDKs/MacOSX10.14.sdk
1386:info:build     export TOOLCHAINS=
1387:info:build     /Applications/Xcode.app/Contents/Developer/usr/bin/copypng /opt/local/var/macports/build/_opt_local_var_macports_sources_rsync.macports.org_macports_release_tarballs_ports_net_unison/unison/work/unison-2.51.2/src/uimac14/progressicons/ProgressBarEndGreen.png /opt/local/var/macports/build/_opt_local_var_macports_sources_rsync.macports.org_macports_release_tarballs_ports_net_unison/unison/work/unison-2.51.2/src/uimac14/build/Default/Unison.app/Contents/Resources/ProgressBarEndGreen.png
1388:info:build CopyPNGFile build/Default/Unison.app/Contents/Resources/ProgressBarGray.png progressicons/ProgressBarGray.png
1389:info:build     cd /opt/local/var/macports/build/_opt_local_var_macports_sources_rsync.macports.org_macports_release_tarballs_ports_net_unison/unison/work/unison-2.51.2/src/uimac14
1390:info:build     export DEVELOPER_DIR=/Applications/Xcode.app/Contents/Developer
1391:info:build     export SDKROOT=/Applications/Xcode.app/Contents/Developer/Platforms/MacOSX.platform/Developer/SDKs/MacOSX10.14.sdk
1392:info:build     export TOOLCHAINS=
1393:info:build     /Applications/Xcode.app/Contents/Developer/usr/bin/copypng /opt/local/var/macports/build/_opt_local_var_macports_sources_rsync.macports.org_macports_release_tarballs_ports_net_unison/unison/work/unison-2.51.2/src/uimac14/progressicons/ProgressBarGray.png /opt/local/var/macports/build/_opt_local_var_macports_sources_rsync.macports.org_macports_release_tarballs_ports_net_unison/unison/work/unison-2.51.2/src/uimac14/build/Default/Unison.app/Contents/Resources/ProgressBarGray.png
1394:info:build CopyPNGFile build/Default/Unison.app/Contents/Resources/ProgressBarGreen.png progressicons/ProgressBarGreen.png
1395:info:build     cd /opt/local/var/macports/build/_opt_local_var_macports_sources_rsync.macports.org_macports_release_tarballs_ports_net_unison/unison/work/unison-2.51.2/src/uimac14
1396:info:build     export DEVELOPER_DIR=/Applications/Xcode.app/Contents/Developer
1397:info:build     export SDKROOT=/Applications/Xcode.app/Contents/Developer/Platforms/MacOSX.platform/Developer/SDKs/MacOSX10.14.sdk
1398:info:build     export TOOLCHAINS=
1399:info:build     /Applications/Xcode.app/Contents/Developer/usr/bin/copypng /opt/local/var/macports/build/_opt_local_var_macports_sources_rsync.macports.org_macports_release_tarballs_ports_net_unison/unison/work/unison-2.51.2/src/uimac14/progressicons/ProgressBarGreen.png /opt/local/var/macports/build/_opt_local_var_macports_sources_rsync.macports.org_macports_release_tarballs_ports_net_unison/unison/work/unison-2.51.2/src/uimac14/build/Default/Unison.app/Contents/Resources/ProgressBarGreen.png
1400:info:build CopyPNGFile build/Default/Unison.app/Contents/Resources/ProgressBarLightGreen.png progressicons/ProgressBarLightGreen.png
1401:info:build     cd /opt/local/var/macports/build/_opt_local_var_macports_sources_rsync.macports.org_macports_release_tarballs_ports_net_unison/unison/work/unison-2.51.2/src/uimac14
1402:info:build     export DEVELOPER_DIR=/Applications/Xcode.app/Contents/Developer
1403:info:build     export SDKROOT=/Applications/Xcode.app/Contents/Developer/Platforms/MacOSX.platform/Developer/SDKs/MacOSX10.14.sdk
1404:info:build     export TOOLCHAINS=
1405:info:build     /Applications/Xcode.app/Contents/Developer/usr/bin/copypng /opt/local/var/macports/build/_opt_local_var_macports_sources_rsync.macports.org_macports_release_tarballs_ports_net_unison/unison/work/unison-2.51.2/src/uimac14/progressicons/ProgressBarLightGreen.png /opt/local/var/macports/build/_opt_local_var_macports_sources_rsync.macports.org_macports_release_tarballs_ports_net_unison/unison/work/unison-2.51.2/src/uimac14/build/Default/Unison.app/Contents/Resources/ProgressBarLightGreen.png
1406:info:build CopyPNGFile build/Default/Unison.app/Contents/Resources/ProgressBarWhite.png progressicons/ProgressBarWhite.png
1407:info:build     cd /opt/local/var/macports/build/_opt_local_var_macports_sources_rsync.macports.org_macports_release_tarballs_ports_net_unison/unison/work/unison-2.51.2/src/uimac14
1408:info:build     export DEVELOPER_DIR=/Applications/Xcode.app/Contents/Developer
1409:info:build     export SDKROOT=/Applications/Xcode.app/Contents/Developer/Platforms/MacOSX.platform/Developer/SDKs/MacOSX10.14.sdk
1410:info:build     export TOOLCHAINS=
1411:info:build     /Applications/Xcode.app/Contents/Developer/usr/bin/copypng /opt/local/var/macports/build/_opt_local_var_macports_sources_rsync.macports.org_macports_release_tarballs_ports_net_unison/unison/work/unison-2.51.2/src/uimac14/progressicons/ProgressBarWhite.png /opt/local/var/macports/build/_opt_local_var_macports_sources_rsync.macports.org_macports_release_tarballs_ports_net_unison/unison/work/unison-2.51.2/src/uimac14/build/Default/Unison.app/Contents/Resources/ProgressBarWhite.png
1412:info:build CopyPNGFile build/Default/Unison.app/Contents/Resources/Outline-Deep.png tableicons/Outline-Deep.png
1413:info:build     cd /opt/local/var/macports/build/_opt_local_var_macports_sources_rsync.macports.org_macports_release_tarballs_ports_net_unison/unison/work/unison-2.51.2/src/uimac14
1414:info:build     export DEVELOPER_DIR=/Applications/Xcode.app/Contents/Developer
1415:info:build     export SDKROOT=/Applications/Xcode.app/Contents/Developer/Platforms/MacOSX.platform/Developer/SDKs/MacOSX10.14.sdk
1416:info:build     export TOOLCHAINS=
1417:info:build     /Applications/Xcode.app/Contents/Developer/usr/bin/copypng /opt/local/var/macports/build/_opt_local_var_macports_sources_rsync.macports.org_macports_release_tarballs_ports_net_unison/unison/work/unison-2.51.2/src/uimac14/tableicons/Outline-Deep.png /opt/local/var/macports/build/_opt_local_var_macports_sources_rsync.macports.org_macports_release_tarballs_ports_net_unison/unison/work/unison-2.51.2/src/uimac14/build/Default/Unison.app/Contents/Resources/Outline-Deep.png
1418:info:build CopyPNGFile build/Default/Unison.app/Contents/Resources/Outline-Flattened.png tableicons/Outline-Flattened.png
1419:info:build     cd /opt/local/var/macports/build/_opt_local_var_macports_sources_rsync.macports.org_macports_release_tarballs_ports_net_unison/unison/work/unison-2.51.2/src/uimac14
1420:info:build     export DEVELOPER_DIR=/Applications/Xcode.app/Contents/Developer
1421:info:build     export SDKROOT=/Applications/Xcode.app/Contents/Developer/Platforms/MacOSX.platform/Developer/SDKs/MacOSX10.14.sdk
1422:info:build     export TOOLCHAINS=
1423:info:build     /Applications/Xcode.app/Contents/Developer/usr/bin/copypng /opt/local/var/macports/build/_opt_local_var_macports_sources_rsync.macports.org_macports_release_tarballs_ports_net_unison/unison/work/unison-2.51.2/src/uimac14/tableicons/Outline-Flattened.png /opt/local/var/macports/build/_opt_local_var_macports_sources_rsync.macports.org_macports_release_tarballs_ports_net_unison/unison/work/unison-2.51.2/src/uimac14/build/Default/Unison.app/Contents/Resources/Outline-Flattened.png
1424:info:build CopyPNGFile build/Default/Unison.app/Contents/Resources/Change_Created.png tableicons/Change_Created.png
1425:info:build     cd /opt/local/var/macports/build/_opt_local_var_macports_sources_rsync.macports.org_macports_release_tarballs_ports_net_unison/unison/work/unison-2.51.2/src/uimac14
1426:info:build     export DEVELOPER_DIR=/Applications/Xcode.app/Contents/Developer
1427:info:build     export SDKROOT=/Applications/Xcode.app/Contents/Developer/Platforms/MacOSX.platform/Developer/SDKs/MacOSX10.14.sdk
1428:info:build     export TOOLCHAINS=
1429:info:build     /Applications/Xcode.app/Contents/Developer/usr/bin/copypng /opt/local/var/macports/build/_opt_local_var_macports_sources_rsync.macports.org_macports_release_tarballs_ports_net_unison/unison/work/unison-2.51.2/src/uimac14/tableicons/Change_Created.png /opt/local/var/macports/build/_opt_local_var_macports_sources_rsync.macports.org_macports_release_tarballs_ports_net_unison/unison/work/unison-2.51.2/src/uimac14/build/Default/Unison.app/Contents/Resources/Change_Created.png
1430:info:build CopyPNGFile build/Default/Unison.app/Contents/Resources/Outline-Flat.png tableicons/Outline-Flat.png
1431:info:build     cd /opt/local/var/macports/build/_opt_local_var_macports_sources_rsync.macports.org_macports_release_tarballs_ports_net_unison/unison/work/unison-2.51.2/src/uimac14
1432:info:build     export DEVELOPER_DIR=/Applications/Xcode.app/Contents/Developer
1433:info:build     export SDKROOT=/Applications/Xcode.app/Contents/Developer/Platforms/MacOSX.platform/Developer/SDKs/MacOSX10.14.sdk
1434:info:build     export TOOLCHAINS=
1435:info:build     /Applications/Xcode.app/Contents/Developer/usr/bin/copypng /opt/local/var/macports/build/_opt_local_var_macports_sources_rsync.macports.org_macports_release_tarballs_ports_net_unison/unison/work/unison-2.51.2/src/uimac14/tableicons/Outline-Flat.png /opt/local/var/macports/build/_opt_local_var_macports_sources_rsync.macports.org_macports_release_tarballs_ports_net_unison/unison/work/unison-2.51.2/src/uimac14/build/Default/Unison.app/Contents/Resources/Outline-Flat.png
1436:info:build CopyPNGFile build/Default/Unison.app/Contents/Resources/Change_Deleted.png tableicons/Change_Deleted.png
1437:info:build     cd /opt/local/var/macports/build/_opt_local_var_macports_sources_rsync.macports.org_macports_release_tarballs_ports_net_unison/unison/work/unison-2.51.2/src/uimac14
1438:info:build     export DEVELOPER_DIR=/Applications/Xcode.app/Contents/Developer
1439:info:build     export SDKROOT=/Applications/Xcode.app/Contents/Developer/Platforms/MacOSX.platform/Developer/SDKs/MacOSX10.14.sdk
1440:info:build     export TOOLCHAINS=
1441:info:build     /Applications/Xcode.app/Contents/Developer/usr/bin/copypng /opt/local/var/macports/build/_opt_local_var_macports_sources_rsync.macports.org_macports_release_tarballs_ports_net_unison/unison/work/unison-2.51.2/src/uimac14/tableicons/Change_Deleted.png /opt/local/var/macports/build/_opt_local_var_macports_sources_rsync.macports.org_macports_release_tarballs_ports_net_unison/unison/work/unison-2.51.2/src/uimac14/build/Default/Unison.app/Contents/Resources/Change_Deleted.png
1442:info:build CpResource ssselectabletoolbar/README build/Default/Unison.app/Contents/Resources/README
1443:info:build     cd /opt/local/var/macports/build/_opt_local_var_macports_sources_rsync.macports.org_macports_release_tarballs_ports_net_unison/unison/work/unison-2.51.2/src/uimac14
1444:info:build     builtin-copy -exclude .DS_Store -exclude CVS -exclude .svn -exclude .git -exclude .hg -strip-debug-symbols -strip-tool /Applications/Xcode.app/Contents/Developer/Toolchains/XcodeDefault.xctoolchain/usr/bin/strip -resolve-src-symlinks /opt/local/var/macports/build/_opt_local_var_macports_sources_rsync.macports.org_macports_release_tarballs_ports_net_unison/unison/work/unison-2.51.2/src/uimac14/ssselectabletoolbar/README /opt/local/var/macports/build/_opt_local_var_macports_sources_rsync.macports.org_macports_release_tarballs_ports_net_unison/unison/work/unison-2.51.2/src/uimac14/build/Default/Unison.app/Contents/Resources
1445:info:build CopyPNGFile build/Default/Unison.app/Contents/Resources/Change_Unmodified.png tableicons/Change_Unmodified.png
1446:info:build     cd /opt/local/var/macports/build/_opt_local_var_macports_sources_rsync.macports.org_macports_release_tarballs_ports_net_unison/unison/work/unison-2.51.2/src/uimac14
1447:info:build     export DEVELOPER_DIR=/Applications/Xcode.app/Contents/Developer
1448:info:build     export SDKROOT=/Applications/Xcode.app/Contents/Developer/Platforms/MacOSX.platform/Developer/SDKs/MacOSX10.14.sdk
1449:info:build     export TOOLCHAINS=
1450:info:build     /Applications/Xcode.app/Contents/Developer/usr/bin/copypng /opt/local/var/macports/build/_opt_local_var_macports_sources_rsync.macports.org_macports_release_tarballs_ports_net_unison/unison/work/unison-2.51.2/src/uimac14/tableicons/Change_Unmodified.png /opt/local/var/macports/build/_opt_local_var_macports_sources_rsync.macports.org_macports_release_tarballs_ports_net_unison/unison/work/unison-2.51.2/src/uimac14/build/Default/Unison.app/Contents/Resources/Change_Unmodified.png
1451:info:build CopyPNGFile build/Default/Unison.app/Contents/Resources/Change_Absent.png tableicons/Change_Absent.png
1452:info:build     cd /opt/local/var/macports/build/_opt_local_var_macports_sources_rsync.macports.org_macports_release_tarballs_ports_net_unison/unison/work/unison-2.51.2/src/uimac14
1453:info:build     export DEVELOPER_DIR=/Applications/Xcode.app/Contents/Developer
1454:info:build     export SDKROOT=/Applications/Xcode.app/Contents/Developer/Platforms/MacOSX.platform/Developer/SDKs/MacOSX10.14.sdk
1455:info:build     export TOOLCHAINS=
1456:info:build     /Applications/Xcode.app/Contents/Developer/usr/bin/copypng /opt/local/var/macports/build/_opt_local_var_macports_sources_rsync.macports.org_macports_release_tarballs_ports_net_unison/unison/work/unison-2.51.2/src/uimac14/tableicons/Change_Absent.png /opt/local/var/macports/build/_opt_local_var_macports_sources_rsync.macports.org_macports_release_tarballs_ports_net_unison/unison/work/unison-2.51.2/src/uimac14/build/Default/Unison.app/Contents/Resources/Change_Absent.png
1457:info:build CopyPNGFile build/Default/Unison.app/Contents/Resources/Change_Modified.png tableicons/Change_Modified.png
1458:info:build     cd /opt/local/var/macports/build/_opt_local_var_macports_sources_rsync.macports.org_macports_release_tarballs_ports_net_unison/unison/work/unison-2.51.2/src/uimac14
1459:info:build     export DEVELOPER_DIR=/Applications/Xcode.app/Contents/Developer
1460:info:build     export SDKROOT=/Applications/Xcode.app/Contents/Developer/Platforms/MacOSX.platform/Developer/SDKs/MacOSX10.14.sdk
1461:info:build     export TOOLCHAINS=
1462:info:build     /Applications/Xcode.app/Contents/Developer/usr/bin/copypng /opt/local/var/macports/build/_opt_local_var_macports_sources_rsync.macports.org_macports_release_tarballs_ports_net_unison/unison/work/unison-2.51.2/src/uimac14/tableicons/Change_Modified.png /opt/local/var/macports/build/_opt_local_var_macports_sources_rsync.macports.org_macports_release_tarballs_ports_net_unison/unison/work/unison-2.51.2/src/uimac14/build/Default/Unison.app/Contents/Resources/Change_Modified.png
1463:info:build CompileXIB English.lproj/MainMenu.xib
1464:info:build     cd /opt/local/var/macports/build/_opt_local_var_macports_sources_rsync.macports.org_macports_release_tarballs_ports_net_unison/unison/work/unison-2.51.2/src/uimac14
1465:info:build     export XCODE_DEVELOPER_USR_PATH=/Applications/Xcode.app/Contents/Developer/usr/bin/..
1466:info:build     /Applications/Xcode.app/Contents/Developer/usr/bin/ibtool --errors --warnings --notices --module Unison --output-partial-info-plist /opt/local/var/macports/build/_opt_local_var_macports_sources_rsync.macports.org_macports_release_tarballs_ports_net_unison/unison/work/unison-2.51.2/src/uimac14/build/uimacnew.build/Default/uimac.build/English.lproj/MainMenu-PartialInfo.plist --auto-activate-custom-fonts --target-device mac --minimum-deployment-target 10.14 --output-format human-readable-text --compile /opt/local/var/macports/build/_opt_local_var_macports_sources_rsync.macports.org_macports_release_tarballs_ports_net_unison/unison/work/unison-2.51.2/src/uimac14/build/Default/Unison.app/Contents/Resources/English.lproj/MainMenu.nib /opt/local/var/macports/build/_opt_local_var_macports_sources_rsync.macports.org_macports_release_tarballs_ports_net_unison/unison/work/unison-2.51.2/src/uimac14/English.lproj/MainMenu.xib
1467:info:build 2018-11-15 11:12:29.388 ibtoold[90042:4781377] [MT] DVTPlugInLoading: Failed to load code for plug-in com.apple.dt.IDE.IDEInterfaceBuilderAppleTVIntegration (/Applications/Xcode.app/Contents/Developer/Platforms/AppleTVSimulator.platform/Developer/Library/Xcode/PrivatePlugIns/IDEInterfaceBuilderAppleTVIntegration.ideplugin), error = Error Domain=NSCocoaErrorDomain Code=3587 "dlopen_preflight(/Applications/Xcode.app/Contents/Developer/Platforms/AppleTVSimulator.platform/Developer/Library/Xcode/PrivatePlugIns/IDEInterfaceBuilderAppleTVIntegration.ideplugin/Contents/MacOS/IDEInterfaceBuilderAppleTVIntegration): Library not loaded: /Library/Developer/PrivateFrameworks/CoreSimulator.framework/Versions/A/CoreSimulator
1468:info:build   Referenced from: /Applications/Xcode.app/Contents/Developer/Platforms/AppleTVSimulator.platform/Developer/Library/Xcode/PrivatePlugIns/IDEInterfaceBuilderAppleTVIntegration.ideplugin/Contents/MacOS/IDEInterfaceBuilderAppleTVIntegration
1469:info:build   Reason: image not found" UserInfo={NSLocalizedFailureReason=The bundle is damaged or missing necessary resources., NSLocalizedRecoverySuggestion=Try reinstalling the bundle., NSFilePath=/Applications/Xcode.app/Contents/Developer/Platforms/AppleTVSimulator.platform/Developer/Library/Xcode/PrivatePlugIns/IDEInterfaceBuilderAppleTVIntegration.ideplugin/Contents/MacOS/IDEInterfaceBuilderAppleTVIntegration, NSDebugDescription=dlopen_preflight(/Applications/Xcode.app/Contents/Developer/Platforms/AppleTVSimulator.platform/Developer/Library/Xcode/PrivatePlugIns/IDEInterfaceBuilderAppleTVIntegration.ideplugin/Contents/MacOS/IDEInterfaceBuilderAppleTVIntegration): Library not loaded: /Library/Developer/PrivateFrameworks/CoreSimulator.framework/Versions/A/CoreSimulator
1470:info:build   Referenced from: /Applications/Xcode.app/Contents/Developer/Platforms/AppleTVSimulator.platform/Developer/Library/Xcode/PrivatePlugIns/IDEInterfaceBuilderAppleTVIntegration.ideplugin/Contents/MacOS/IDEInterfaceBuilderAppleTVIntegration
1471:info:build   Reason: image not found, NSBundlePath=/Applications/Xcode.app/Contents/Developer/Platforms/AppleTVSimulator.platform/Developer/Library/Xcode/PrivatePlugIns/IDEInterfaceBuilderAppleTVIntegration.ideplugin, NSLocalizedDescription=The bundle “IDEInterfaceBuilderAppleTVIntegration” couldn’t be loaded because it is damaged or missing necessary resources.}, dyldError = dlopen(/Applications/Xcode.app/Contents/Developer/Platforms/AppleTVSimulator.platform/Developer/Library/Xcode/PrivatePlugIns/IDEInterfaceBuilderAppleTVIntegration.ideplugin/Contents/MacOS/IDEInterfaceBuilderAppleTVIntegration, 0): Library not loaded: /Library/Developer/PrivateFrameworks/CoreSimulator.framework/Versions/A/CoreSimulator
1472:info:build   Referenced from: /Applications/Xcode.app/Contents/Developer/Platforms/AppleTVSimulator.platform/Developer/Library/Xcode/PrivatePlugIns/IDEInterfaceBuilderAppleTVIntegration.ideplugin/Contents/MacOS/IDEInterfaceBuilderAppleTVIntegration
1473:info:build   Reason: image not found
1474:info:build 2018-11-15 11:12:29.388 ibtoold[90042:4781377] [MT] DVTPlugInExtensionFaulting: Failed to fire fault for extension Xcode.InterfaceBuilderKit.AppleTVIntegration.ConfigurationList: Error Domain=DVTPlugInErrorDomain Code=2 "Loading a plug-in failed." UserInfo={DVTPlugInIdentifierErrorKey=com.apple.dt.IDE.IDEInterfaceBuilderAppleTVIntegration, DVTPlugInExecutablePathErrorKey=/Applications/Xcode.app/Contents/Developer/Platforms/AppleTVSimulator.platform/Developer/Library/Xcode/PrivatePlugIns/IDEInterfaceBuilderAppleTVIntegration.ideplugin/Contents/MacOS/IDEInterfaceBuilderAppleTVIntegration, NSLocalizedRecoverySuggestion=The plug-in or one of its prerequisite plug-ins may be missing or damaged and may need to be reinstalled., DVTPlugInDYLDErrorMessageErrorKey=dlopen(/Applications/Xcode.app/Contents/Developer/Platforms/AppleTVSimulator.platform/Developer/Library/Xcode/PrivatePlugIns/IDEInterfaceBuilderAppleTVIntegration.ideplugin/Contents/MacOS/IDEInterfaceBuilderAppleTVIntegration, 0): Library not loaded: /Library/Developer/PrivateFrameworks/CoreSimulator.framework/Versions/A/CoreSimulator
1475:info:build   Referenced from: /Applications/Xcode.app/Contents/Developer/Platforms/AppleTVSimulator.platform/Developer/Library/Xcode/PrivatePlugIns/IDEInterfaceBuilderAppleTVIntegration.ideplugin/Contents/MacOS/IDEInterfaceBuilderAppleTVIntegration
1476:info:build   Reason: image not found, NSLocalizedDescription=Loading a plug-in failed., NSFilePath=/Applications/Xcode.app/Contents/Developer/Platforms/AppleTVSimulator.platform/Developer/Library/Xcode/PrivatePlugIns/IDEInterfaceBuilderAppleTVIntegration.ideplugin, NSLocalizedFailureReason=The plug-in “com.apple.dt.IDE.IDEInterfaceBuilderAppleTVIntegration” at path “/Applications/Xcode.app/Contents/Developer/Platforms/AppleTVSimulator.platform/Developer/Library/Xcode/PrivatePlugIns/IDEInterfaceBuilderAppleTVIntegration.ideplugin” could not be loaded.  The plug-in or one of its prerequisite plug-ins may be missing or damaged., NSUnderlyingError=0x7fe00e276360 {Error Domain=NSCocoaErrorDomain Code=3587 "dlopen_preflight(/Applications/Xcode.app/Contents/Developer/Platforms/AppleTVSimulator.platform/Developer/Library/Xcode/PrivatePlugIns/IDEInterfaceBuilderAppleTVIntegration.ideplugin/Contents/MacOS/IDEInterfaceBuilderAppleTVIntegration): Library not loaded: /Library/Developer/PrivateFrameworks/CoreSimulator.framework/Versions/A/CoreSimulator
1477:info:build   Referenced from: /Applications/Xcode.app/Contents/Developer/Platforms/AppleTVSimulator.platform/Developer/Library/Xcode/PrivatePlugIns/IDEInterfaceBuilderAppleTVIntegration.ideplugin/Contents/MacOS/IDEInterfaceBuilderAppleTVIntegration
1478:info:build   Reason: image not found" UserInfo={NSLocalizedFailureReason=The bundle is damaged or missing necessary resources., NSLocalizedRecoverySuggestion=Try reinstalling the bundle., NSFilePath=/Applications/Xcode.app/Contents/Developer/Platforms/AppleTVSimulator.platform/Developer/Library/Xcode/PrivatePlugIns/IDEInterfaceBuilderAppleTVIntegration.ideplugin/Contents/MacOS/IDEInterfaceBuilderAppleTVIntegration, NSDebugDescription=dlopen_preflight(/Applications/Xcode.app/Contents/Developer/Platforms/AppleTVSimulator.platform/Developer/Library/Xcode/PrivatePlugIns/IDEInterfaceBuilderAppleTVIntegration.ideplugin/Contents/MacOS/IDEInterfaceBuilderAppleTVIntegration): Library not loaded: /Library/Developer/PrivateFrameworks/CoreSimulator.framework/Versions/A/CoreSimulator
1479:info:build   Referenced from: /Applications/Xcode.app/Contents/Developer/Platforms/AppleTVSimulator.platform/Developer/Library/Xcode/PrivatePlugIns/IDEInterfaceBuilderAppleTVIntegration.ideplugin/Contents/MacOS/IDEInterfaceBuilderAppleTVIntegration
1480:info:build   Reason: image not found, NSBundlePath=/Applications/Xcode.app/Contents/Developer/Platforms/AppleTVSimulator.platform/Developer/Library/Xcode/PrivatePlugIns/IDEInterfaceBuilderAppleTVIntegration.ideplugin, NSLocalizedDescription=The bundle “IDEInterfaceBuilderAppleTVIntegration” couldn’t be loaded because it is damaged or missing necessary resources.}}}
1481:info:build 2018-11-15 11:12:29.390 ibtoold[90042:4781377] *** Terminating app due to uncaught exception 'NSInternalInconsistencyException', reason: 'Error getting value for parameter key 'class' of extension 'Xcode.InterfaceBuilderKit.AppleTVIntegration.ConfigurationList' in plug-in 'com.apple.dt.IDE.IDEInterfaceBuilderAppleTVIntegration''
1482:info:build *** First throw call stack:
1483:info:build (
1484:info:build     0   CoreFoundation                      0x00007fff42d3ce65 __exceptionPreprocess + 256
1485:info:build     1   libobjc.A.dylib                     0x00007fff6ed93720 objc_exception_throw + 48
1486:info:build     2   DVTFoundation                       0x00000001069a9ccc -[DVTExtensionParameter valueForKey:error:] + 0
1487:info:build     3   Foundation                          0x00007fff4502d644 -[NSArray(NSKeyValueCoding) valueForKey:] + 430
1488:info:build     4   Foundation                          0x00007fff450775f6 -[NSArray(NSKeyValueCoding) valueForKeyPath:] + 436
1489:info:build     5   Foundation                          0x00007fff44ff3cc3 -[NSObject(NSKeyValueCoding) valueForKeyPath:] + 260
1490:info:build     6   IDEInterfaceBuilderKit              0x0000000105fc6d3b -[IBPlatform matchesExtension:] + 50
1491:info:build     7   IDEInterfaceBuilderKit              0x0000000105fc6ed7 __42-[IBPlatform extensionsForExtensionPoint:]_block_invoke + 27
1492:info:build     8   IBFoundation                        0x000000010705716e -[NSSet(IBSetAdditions) ib_setByFilteringUsingBlock:] + 258
1493:info:build     9   IDEInterfaceBuilderKit              0x0000000105fc6e95 -[IBPlatform extensionsForExtensionPoint:] + 201
1494:info:build     10  IDEInterfaceBuilderKit              0x0000000105fc5f93 -[IBPlatform registerMemberConfigurationVariables] + 166
1495:info:build     11  IDEInterfaceBuilderKit              0x0000000106102534 -[IBScopedSingletonRegistry init] + 1350
1496:info:build     12  IDEInterfaceBuilderKit              0x0000000106101fd4 __43+[IBScopedSingletonRegistry sharedInstance]_block_invoke + 41
1497:info:build     13  libdispatch.dylib                   0x00007fff6fe13dcf _dispatch_client_callout + 8
1498:info:build     14  libdispatch.dylib                   0x00007fff6fe15515 _dispatch_once_callout + 20
1499:info:build     15  IDEInterfaceBuilderKit              0x0000000106101fa8 +[IBScopedSingletonRegistry sharedInstance] + 45
1500:info:build     16  IDEInterfaceBuilderKit              0x0000000105f161f0 -[IBInterfaceBuilderPlugin init] + 146
1501:info:build     17  IDEInterfaceBuilderKit              0x0000000105f16144 +[IBInterfaceBuilderPlugin ide_initializeWithOptions:error:] + 34
1502:info:build     18  IDEFoundation                       0x0000000107375aee _IDEInitializeOnePlugInAndPrerequisites + 2324
1503:info:build     19  IDEFoundation                       0x00000001073753f5 _IDEInitializeOnePlugInAndPrerequisites + 539
1504:info:build     20  IDEFoundation                       0x00000001073753f5 _IDEInitializeOnePlugInAndPrerequisites + 539
1505:info:build     21  IDEFoundation                       0x000000010737434b _IDEInitializePlugIns + 1598
1506:info:build     22  IDEFoundation                       0x0000000107373758 IDEInitialize + 8444
1507:info:build     23  ibtoold                             0x0000000105bf65b0 IBIDEInitialize + 52
1508:info:build     24  ibtoold                             0x0000000105bf56dc main + 1744
1509:info:build     25  libdyld.dylib                       0x00007fff6fe6208d start + 1
1510:info:build     26  ???                                 0x0000000000000015 0x0 + 21
1511:info:build )
1512:info:build libc++abi.dylib: terminating with uncaught exception of type NSException
1513:info:build Command /Applications/Xcode.app/Contents/Developer/usr/bin/ibtool failed with exit code 6. The tool may have crashed. Please file a bug report at http://bugreport.apple.com with the above output and attach any crash logs for ibtool, ibtoold, Xcode, and Interface Builder Cocoa Touch Tool created around the time of this failure. These logs can be found in ~/Library/Logs/DiagnosticReports or /Library/Logs/DiagnosticReports.
1514:info:build CopyPNGFile build/Default/Unison.app/Contents/Resources/Change_PropsChanged.png tableicons/Change_PropsChanged.png
1515:info:build     cd /opt/local/var/macports/build/_opt_local_var_macports_sources_rsync.macports.org_macports_release_tarballs_ports_net_unison/unison/work/unison-2.51.2/src/uimac14
1516:info:build     export DEVELOPER_DIR=/Applications/Xcode.app/Contents/Developer
1517:info:build     export SDKROOT=/Applications/Xcode.app/Contents/Developer/Platforms/MacOSX.platform/Developer/SDKs/MacOSX10.14.sdk
1518:info:build     export TOOLCHAINS=
1519:info:build     /Applications/Xcode.app/Contents/Developer/usr/bin/copypng /opt/local/var/macports/build/_opt_local_var_macports_sources_rsync.macports.org_macports_release_tarballs_ports_net_unison/unison/work/unison-2.51.2/src/uimac14/tableicons/Change_PropsChanged.png /opt/local/var/macports/build/_opt_local_var_macports_sources_rsync.macports.org_macports_release_tarballs_ports_net_unison/unison/work/unison-2.51.2/src/uimac14/build/Default/Unison.app/Contents/Resources/Change_PropsChanged.png
1520:info:build ** BUILD FAILED **
1521:info:build The following build commands failed:
1522:info:build     CompileXIB English.lproj/MainMenu.xib
1523:info:build (1 failure)
1524:info:build make[1]: *** [macexecutable] Error 65
1525:info:build make[1]: Leaving directory `/opt/local/var/macports/build/_opt_local_var_macports_sources_rsync.macports.org_macports_release_tarballs_ports_net_unison/unison/work/unison-2.51.2/src'
1526:info:build make: *** [src] Error 2
1527:info:build make: Leaving directory `/opt/local/var/macports/build/_opt_local_var_macports_sources_rsync.macports.org_macports_release_tarballs_ports_net_unison/unison/work/unison-2.51.2'
1528:info:build Command failed:  cd "/opt/local/var/macports/build/_opt_local_var_macports_sources_rsync.macports.org_macports_release_tarballs_ports_net_unison/unison/work/unison-2.51.2" && /usr/bin/make -w all UISTYLE=mac14 THREADS=true
1529:info:build Exit code: 2
1530:error:build Failed to build unison: command execution failed
1531:debug:build Error code: CHILDSTATUS 86376 2
1532:debug:build Backtrace: command execution failed
1533:debug:build     while executing
1534:debug:build "system {*}$notty {*}$nice $fullcmdstring"
1535:debug:build     invoked from within
1536:debug:build "command_exec build"
1537:debug:build     (procedure "portbuild::build_main" line 8)
1538:debug:build     invoked from within
1539:debug:build "$procedure $targetname"
1540:error:build See /opt/local/var/macports/logs/_opt_local_var_macports_sources_rsync.macports.org_macports_release_tarballs_ports_net_unison/unison/main.log for details.