Ticket #57723: main.log

File main.log, 18.0 KB (added by mriyah, 4 months ago)
Line 
1version:1
2:debug:sysinfo macOS 10.14 (darwin/18.2.0) arch i386
3:debug:sysinfo MacPorts 2.5.4
4:debug:sysinfo Xcode 10.1
5:debug:sysinfo SDK 10.14
6:debug:sysinfo MACOSX_DEPLOYMENT_TARGET: 10.14
7:debug:main Attempting ln -sf /opt/local/var/macports/build/_opt_local_var_macports_sources_rsync.macports.org_release_tarballs_ports_net_tuntaposx/tuntaposx/work /opt/local/var/macports/sources/rsync.macports.org/release/tarballs/ports/net/tuntaposx/work
8:debug:main dropping privileges: euid changed to 502, egid changed to 501.
9:debug:main Executing org.macports.main (tuntaposx)
10:debug:main Privilege de-escalation not attempted as not running as root.
11:debug:archivefetch archivefetch phase started at Tue Dec  4 21:19:20 CET 2018
12:msg:archivefetch --->  Fetching archive for tuntaposx
13:debug:archivefetch Executing org.macports.archivefetch (tuntaposx)
14:debug:archivefetch euid/egid changed to: 0/0
15:debug:archivefetch chowned /opt/local/var/macports/incoming to macports
16:debug:archivefetch euid/egid changed to: 502/501
17:info:archivefetch --->  tuntaposx-20150118_0.darwin_18.x86_64.tbz2 doesn't seem to exist in /opt/local/var/macports/incoming/verified
18:msg:archivefetch --->  Attempting to fetch tuntaposx-20150118_0.darwin_18.x86_64.tbz2 from https://packages.macports.org/tuntaposx
19:debug:archivefetch Fetching archive failed: The requested URL returned error: 404 Not Found
20:msg:archivefetch --->  Attempting to fetch tuntaposx-20150118_0.darwin_18.x86_64.tbz2 from http://lil.fr.packages.macports.org/tuntaposx
21:debug:archivefetch Fetching archive failed: The requested URL returned error: 404 Not Found
22:msg:archivefetch --->  Attempting to fetch tuntaposx-20150118_0.darwin_18.x86_64.tbz2 from http://nue.de.packages.macports.org/tuntaposx
23:debug:archivefetch Fetching archive failed: The requested URL returned error: 404 Not Found
24:debug:archivefetch Privilege de-escalation not attempted as not running as root.
25:debug:fetch fetch phase started at Tue Dec  4 21:19:22 CET 2018
26:notice:fetch --->  Fetching distfiles for tuntaposx
27:debug:fetch Executing org.macports.fetch (tuntaposx)
28:debug:fetch Privilege de-escalation not attempted as not running as root.
29:debug:checksum checksum phase started at Tue Dec  4 21:19:22 CET 2018
30:notice:checksum --->  Verifying checksums for tuntaposx
31:debug:checksum Executing org.macports.checksum (tuntaposx)
32:info:checksum --->  Checksumming tuntap_20150118_src.tar.gz
33:debug:checksum Calculated (rmd160) is bfdd394e10a982728c4867b2536b337ab78831e1
34:debug:checksum Correct (rmd160) checksum for tuntap_20150118_src.tar.gz
35:debug:checksum Calculated (sha256) is f01fe7a3dd0f2f64c13606ff0230696d3995f2eeae19f0cdeb778650db9f37ba
36:debug:checksum Correct (sha256) checksum for tuntap_20150118_src.tar.gz
37:debug:checksum Privilege de-escalation not attempted as not running as root.
38:debug:extract extract phase started at Tue Dec  4 21:19:22 CET 2018
39:notice:extract --->  Extracting tuntaposx
40:debug:extract Executing org.macports.extract (tuntaposx)
41:info:extract --->  Extracting tuntap_20150118_src.tar.gz
42:debug:extract setting option extract.args to '/opt/local/var/macports/distfiles/tuntaposx/tuntap_20150118_src.tar.gz'
43:debug:extract Environment:
44:debug:extract CC_PRINT_OPTIONS='YES'
45:debug:extract CC_PRINT_OPTIONS_FILE='/opt/local/var/macports/build/_opt_local_var_macports_sources_rsync.macports.org_release_tarballs_ports_net_tuntaposx/tuntaposx/work/.CC_PRINT_OPTIONS'
46:debug:extract CPATH='/opt/local/include'
47:debug:extract LIBRARY_PATH='/opt/local/lib'
48:debug:extract MACOSX_DEPLOYMENT_TARGET='10.14'
49:info:extract Executing:  cd "/opt/local/var/macports/build/_opt_local_var_macports_sources_rsync.macports.org_release_tarballs_ports_net_tuntaposx/tuntaposx/work" && /usr/bin/gzip -dc '/opt/local/var/macports/distfiles/tuntaposx/tuntap_20150118_src.tar.gz' | /usr/bin/tar -xf -
50:debug:extract system:  cd "/opt/local/var/macports/build/_opt_local_var_macports_sources_rsync.macports.org_release_tarballs_ports_net_tuntaposx/tuntaposx/work" && /usr/bin/gzip -dc '/opt/local/var/macports/distfiles/tuntaposx/tuntap_20150118_src.tar.gz' | /usr/bin/tar -xf -
51:debug:extract euid/egid changed to: 0/0
52:debug:extract chowned /opt/local/var/macports/build/_opt_local_var_macports_sources_rsync.macports.org_release_tarballs_ports_net_tuntaposx/tuntaposx/work to macports
53:debug:extract euid/egid changed to: 502/501
54:debug:extract Privilege de-escalation not attempted as not running as root.
55:debug:patch patch phase started at Tue Dec  4 21:19:22 CET 2018
56:debug:patch Executing org.macports.patch (tuntaposx)
57:notice:patch --->  Applying patches to tuntaposx
58:info:patch --->  Applying patch-src-tap-Makefile.diff
59:debug:patch Environment:
60:debug:patch CC_PRINT_OPTIONS='YES'
61:debug:patch CC_PRINT_OPTIONS_FILE='/opt/local/var/macports/build/_opt_local_var_macports_sources_rsync.macports.org_release_tarballs_ports_net_tuntaposx/tuntaposx/work/.CC_PRINT_OPTIONS'
62:debug:patch CPATH='/opt/local/include'
63:debug:patch LIBRARY_PATH='/opt/local/lib'
64:debug:patch MACOSX_DEPLOYMENT_TARGET='10.14'
65:info:patch Executing:  cd "/opt/local/var/macports/build/_opt_local_var_macports_sources_rsync.macports.org_release_tarballs_ports_net_tuntaposx/tuntaposx/work/tuntap" && /usr/bin/patch -p0 < '/opt/local/var/macports/sources/rsync.macports.org/release/tarballs/ports/net/tuntaposx/files/patch-src-tap-Makefile.diff'
66:debug:patch system:  cd "/opt/local/var/macports/build/_opt_local_var_macports_sources_rsync.macports.org_release_tarballs_ports_net_tuntaposx/tuntaposx/work/tuntap" && /usr/bin/patch -p0 < '/opt/local/var/macports/sources/rsync.macports.org/release/tarballs/ports/net/tuntaposx/files/patch-src-tap-Makefile.diff'
67:info:patch patching file src/tap/Makefile
68:info:patch --->  Applying patch-src-tun-Makefile.diff
69:debug:patch Environment:
70:debug:patch CC_PRINT_OPTIONS='YES'
71:debug:patch CC_PRINT_OPTIONS_FILE='/opt/local/var/macports/build/_opt_local_var_macports_sources_rsync.macports.org_release_tarballs_ports_net_tuntaposx/tuntaposx/work/.CC_PRINT_OPTIONS'
72:debug:patch CPATH='/opt/local/include'
73:debug:patch LIBRARY_PATH='/opt/local/lib'
74:debug:patch MACOSX_DEPLOYMENT_TARGET='10.14'
75:info:patch Executing:  cd "/opt/local/var/macports/build/_opt_local_var_macports_sources_rsync.macports.org_release_tarballs_ports_net_tuntaposx/tuntaposx/work/tuntap" && /usr/bin/patch -p0 < '/opt/local/var/macports/sources/rsync.macports.org/release/tarballs/ports/net/tuntaposx/files/patch-src-tun-Makefile.diff'
76:debug:patch system:  cd "/opt/local/var/macports/build/_opt_local_var_macports_sources_rsync.macports.org_release_tarballs_ports_net_tuntaposx/tuntaposx/work/tuntap" && /usr/bin/patch -p0 < '/opt/local/var/macports/sources/rsync.macports.org/release/tarballs/ports/net/tuntaposx/files/patch-src-tun-Makefile.diff'
77:info:patch patching file src/tun/Makefile
78:debug:patch Executing proc-post-org.macports.patch-patch-0
79:info:patch --->  Patching Makefile: s|@CC@|/usr/bin/clang|g
80:debug:patch Executing reinplace: /usr/bin/sed s|@CC@|/usr/bin/clang|g </opt/local/var/macports/build/_opt_local_var_macports_sources_rsync.macports.org_release_tarballs_ports_net_tuntaposx/tuntaposx/work/tuntap/src/tun/Makefile >@file12
81:debug:patch euid/egid changed to: 0/0
82:debug:patch chowned /opt/local/var/macports/build/_opt_local_var_macports_sources_rsync.macports.org_release_tarballs_ports_net_tuntaposx/tuntaposx/work/tuntap/src/tun/Makefile to macports
83:debug:patch euid/egid changed to: 502/501
84:debug:patch euid/egid changed to: 0/0
85:debug:patch setting attributes on /opt/local/var/macports/build/_opt_local_var_macports_sources_rsync.macports.org_release_tarballs_ports_net_tuntaposx/tuntaposx/work/tuntap/src/tun/Makefile
86:debug:patch euid/egid changed to: 502/501
87:info:patch --->  Patching Makefile: s|@CXX@|/usr/bin/clang++|g
88:debug:patch Executing reinplace: /usr/bin/sed s|@CXX@|/usr/bin/clang++|g </opt/local/var/macports/build/_opt_local_var_macports_sources_rsync.macports.org_release_tarballs_ports_net_tuntaposx/tuntaposx/work/tuntap/src/tun/Makefile >@file12
89:debug:patch euid/egid changed to: 0/0
90:debug:patch chowned /opt/local/var/macports/build/_opt_local_var_macports_sources_rsync.macports.org_release_tarballs_ports_net_tuntaposx/tuntaposx/work/tuntap/src/tun/Makefile to macports
91:debug:patch euid/egid changed to: 502/501
92:debug:patch euid/egid changed to: 0/0
93:debug:patch setting attributes on /opt/local/var/macports/build/_opt_local_var_macports_sources_rsync.macports.org_release_tarballs_ports_net_tuntaposx/tuntaposx/work/tuntap/src/tun/Makefile
94:debug:patch euid/egid changed to: 502/501
95:info:patch --->  Patching Makefile: s|@ARCHFLAGS@|-arch x86_64|
96:debug:patch Executing reinplace: /usr/bin/sed {s|@ARCHFLAGS@|-arch x86_64|} </opt/local/var/macports/build/_opt_local_var_macports_sources_rsync.macports.org_release_tarballs_ports_net_tuntaposx/tuntaposx/work/tuntap/src/tun/Makefile >@file12
97:debug:patch euid/egid changed to: 0/0
98:debug:patch chowned /opt/local/var/macports/build/_opt_local_var_macports_sources_rsync.macports.org_release_tarballs_ports_net_tuntaposx/tuntaposx/work/tuntap/src/tun/Makefile to macports
99:debug:patch euid/egid changed to: 502/501
100:debug:patch euid/egid changed to: 0/0
101:debug:patch setting attributes on /opt/local/var/macports/build/_opt_local_var_macports_sources_rsync.macports.org_release_tarballs_ports_net_tuntaposx/tuntaposx/work/tuntap/src/tun/Makefile
102:debug:patch euid/egid changed to: 502/501
103:info:patch --->  Patching Makefile: s|@CC@|/usr/bin/clang|g
104:debug:patch Executing reinplace: /usr/bin/sed s|@CC@|/usr/bin/clang|g </opt/local/var/macports/build/_opt_local_var_macports_sources_rsync.macports.org_release_tarballs_ports_net_tuntaposx/tuntaposx/work/tuntap/src/tap/Makefile >@file12
105:debug:patch euid/egid changed to: 0/0
106:debug:patch chowned /opt/local/var/macports/build/_opt_local_var_macports_sources_rsync.macports.org_release_tarballs_ports_net_tuntaposx/tuntaposx/work/tuntap/src/tap/Makefile to macports
107:debug:patch euid/egid changed to: 502/501
108:debug:patch euid/egid changed to: 0/0
109:debug:patch setting attributes on /opt/local/var/macports/build/_opt_local_var_macports_sources_rsync.macports.org_release_tarballs_ports_net_tuntaposx/tuntaposx/work/tuntap/src/tap/Makefile
110:debug:patch euid/egid changed to: 502/501
111:info:patch --->  Patching Makefile: s|@CXX@|/usr/bin/clang++|g
112:debug:patch Executing reinplace: /usr/bin/sed s|@CXX@|/usr/bin/clang++|g </opt/local/var/macports/build/_opt_local_var_macports_sources_rsync.macports.org_release_tarballs_ports_net_tuntaposx/tuntaposx/work/tuntap/src/tap/Makefile >@file12
113:debug:patch euid/egid changed to: 0/0
114:debug:patch chowned /opt/local/var/macports/build/_opt_local_var_macports_sources_rsync.macports.org_release_tarballs_ports_net_tuntaposx/tuntaposx/work/tuntap/src/tap/Makefile to macports
115:debug:patch euid/egid changed to: 502/501
116:debug:patch euid/egid changed to: 0/0
117:debug:patch setting attributes on /opt/local/var/macports/build/_opt_local_var_macports_sources_rsync.macports.org_release_tarballs_ports_net_tuntaposx/tuntaposx/work/tuntap/src/tap/Makefile
118:debug:patch euid/egid changed to: 502/501
119:info:patch --->  Patching Makefile: s|@ARCHFLAGS@|-arch x86_64|
120:debug:patch Executing reinplace: /usr/bin/sed {s|@ARCHFLAGS@|-arch x86_64|} </opt/local/var/macports/build/_opt_local_var_macports_sources_rsync.macports.org_release_tarballs_ports_net_tuntaposx/tuntaposx/work/tuntap/src/tap/Makefile >@file12
121:debug:patch euid/egid changed to: 0/0
122:debug:patch chowned /opt/local/var/macports/build/_opt_local_var_macports_sources_rsync.macports.org_release_tarballs_ports_net_tuntaposx/tuntaposx/work/tuntap/src/tap/Makefile to macports
123:debug:patch euid/egid changed to: 502/501
124:debug:patch euid/egid changed to: 0/0
125:debug:patch setting attributes on /opt/local/var/macports/build/_opt_local_var_macports_sources_rsync.macports.org_release_tarballs_ports_net_tuntaposx/tuntaposx/work/tuntap/src/tap/Makefile
126:debug:patch euid/egid changed to: 502/501
127:debug:patch Privilege de-escalation not attempted as not running as root.
128:debug:configure configure phase started at Tue Dec  4 21:19:23 CET 2018
129:notice:configure --->  Configuring tuntaposx
130:debug:configure Preferred compilers: clang macports-clang-5.0 macports-clang-4.0
131:debug:configure Using compiler 'Xcode Clang'
132:debug:configure Executing org.macports.configure (tuntaposx)
133:debug:configure Privilege de-escalation not attempted as not running as root.
134:debug:build build phase started at Tue Dec  4 21:19:23 CET 2018
135:notice:build --->  Building tuntaposx
136:debug:build Executing org.macports.build (tuntaposx)
137:debug:build Environment:
138:debug:build CC_PRINT_OPTIONS='YES'
139:debug:build CC_PRINT_OPTIONS_FILE='/opt/local/var/macports/build/_opt_local_var_macports_sources_rsync.macports.org_release_tarballs_ports_net_tuntaposx/tuntaposx/work/.CC_PRINT_OPTIONS'
140:debug:build CPATH='/opt/local/include'
141:debug:build LIBRARY_PATH='/opt/local/lib'
142:debug:build MACOSX_DEPLOYMENT_TARGET='10.14'
143:info:build Executing:  cd "/opt/local/var/macports/build/_opt_local_var_macports_sources_rsync.macports.org_release_tarballs_ports_net_tuntaposx/tuntaposx/work/tuntap" && /usr/bin/make -j4 -w all
144:debug:build system:  cd "/opt/local/var/macports/build/_opt_local_var_macports_sources_rsync.macports.org_release_tarballs_ports_net_tuntaposx/tuntaposx/work/tuntap" && /usr/bin/make -j4 -w all
145:info:build make: Entering directory `/opt/local/var/macports/build/_opt_local_var_macports_sources_rsync.macports.org_release_tarballs_ports_net_tuntaposx/tuntaposx/work/tuntap'
146:info:build cd src/tap && make TUNTAP_VERSION=20150118 -f Makefile all
147:info:build cd src/tun && make TUNTAP_VERSION=20150118 -f Makefile all
148:info:build make[1]: Entering directory `/opt/local/var/macports/build/_opt_local_var_macports_sources_rsync.macports.org_release_tarballs_ports_net_tuntaposx/tuntaposx/work/tuntap/src/tun'
149:info:build make[1]: Entering directory `/opt/local/var/macports/build/_opt_local_var_macports_sources_rsync.macports.org_release_tarballs_ports_net_tuntaposx/tuntaposx/work/tuntap/src/tap'
150:info:build /usr/bin/clang++ -Wall -Werror -mkernel -force_cpusubtype_ALL -nostdinc -fno-builtin -fno-stack-protector -msoft-float -fno-common -arch x86_64 -DKERNEL -DAPPLE -DKERNEL_PRIVATE -DTUNTAP_VERSION=\"20150118\" -DTUN_KEXT_VERSION=\"20150118\" -I.. -I/System/Library/Frameworks/Kernel.framework/Headers -c ../tuntap.cc -o ../tuntap.o
151:info:build /usr/bin/clang++ -Wall -Werror -mkernel -force_cpusubtype_ALL -nostdinc -fno-builtin -fno-stack-protector -msoft-float -fno-common -arch x86_64 -DKERNEL -DAPPLE -DKERNEL_PRIVATE -DTUNTAP_VERSION=\"20150118\" -DTAP_KEXT_VERSION=\"20150118\" -I.. -I/System/Library/Frameworks/Kernel.framework/Headers -c ../tuntap.cc -o ../tuntap.o
152:info:build /usr/bin/clang++ -Wall -Werror -mkernel -force_cpusubtype_ALL -nostdinc -fno-builtin -fno-stack-protector -msoft-float -fno-common -arch x86_64 -DKERNEL -DAPPLE -DKERNEL_PRIVATE -DTUNTAP_VERSION=\"20150118\" -DTAP_KEXT_VERSION=\"20150118\" -I.. -I/System/Library/Frameworks/Kernel.framework/Headers -c ../tuntap_mgr.cc -o ../tuntap_mgr.o
153:info:build /usr/bin/clang++ -Wall -Werror -mkernel -force_cpusubtype_ALL -nostdinc -fno-builtin -fno-stack-protector -msoft-float -fno-common -arch x86_64 -DKERNEL -DAPPLE -DKERNEL_PRIVATE -DTUNTAP_VERSION=\"20150118\" -DTUN_KEXT_VERSION=\"20150118\" -I.. -I/System/Library/Frameworks/Kernel.framework/Headers -c ../tuntap_mgr.cc -o ../tuntap_mgr.o
154:info:build In file included from ../tuntap_mgr.cc:In file included from 30In file included from :
155:info:build ../tuntap_mgr.ccIn file included from :30:
156:info:build ../tuntap.cc../tuntap.hIn file included from :35../tuntap.h:
157:info:build ::35In file included from :
158:info:build ../lock.h../lock.h../tuntap.cc::3030:
159:info:build :
160:info:build In file included from In file included from ../tuntap.h../tuntap.h:::35:
161:info:build 3535:3510:
162:info:build ../lock.h:::35 :fatal error10: :../lock.h 'kern/locks.h' file not foundfatal error: 'kern/locks.h' file not found
163:info:build :
164:info:build 35:10: fatal error: 'kern/locks.h' file not found
165:info:build #include <kern/locks.h>
166:info:build          ^~~~~~~~~~~~~~
167:info:build #include <kern/locks.h>
168:info:build          ^~~~~~~~~~~~~~
169:info:build 10: fatal error: 'kern/locks.h' file not found
170:info:build #include <kern/locks.h>
171:info:build          ^~~~~~~~~~~~~~
172:info:build #include <kern/locks.h>
173:info:build          ^~~~~~~~~~~~~~
174:info:build 1 error generated.
175:info:build 1 error generated.
176:info:build 1 error generated.
177:info:build 1 error generated.
178:info:build make[1]: *** [../tuntap_mgr.o] Error 1
179:info:build make[1]: *** Waiting for unfinished jobs....
180:info:build make[1]: *** [../tuntap_mgr.o] Error 1
181:info:build make[1]: *** Waiting for unfinished jobs....
182:info:build make[1]: *** [../tuntap.o] Error 1
183:info:build make[1]: Leaving directory `/opt/local/var/macports/build/_opt_local_var_macports_sources_rsync.macports.org_release_tarballs_ports_net_tuntaposx/tuntaposx/work/tuntap/src/tap'
184:info:build make: *** [tap.kext] Error 2
185:info:build make: *** Waiting for unfinished jobs....
186:info:build make[1]: *** [../tuntap.o] Error 1
187:info:build make[1]: Leaving directory `/opt/local/var/macports/build/_opt_local_var_macports_sources_rsync.macports.org_release_tarballs_ports_net_tuntaposx/tuntaposx/work/tuntap/src/tun'
188:info:build make: *** [tun.kext] Error 2
189:info:build make: Leaving directory `/opt/local/var/macports/build/_opt_local_var_macports_sources_rsync.macports.org_release_tarballs_ports_net_tuntaposx/tuntaposx/work/tuntap'
190:info:build Command failed:  cd "/opt/local/var/macports/build/_opt_local_var_macports_sources_rsync.macports.org_release_tarballs_ports_net_tuntaposx/tuntaposx/work/tuntap" && /usr/bin/make -j4 -w all
191:info:build Exit code: 2
192:error:build Failed to build tuntaposx: command execution failed
193:debug:build Error code: CHILDSTATUS 13698 2
194:debug:build Backtrace: command execution failed
195:debug:build     while executing
196:debug:build "system {*}$notty {*}$nice $fullcmdstring"
197:debug:build     invoked from within
198:debug:build "command_exec build"
199:debug:build     (procedure "portbuild::build_main" line 8)
200:debug:build     invoked from within
201:debug:build "$procedure $targetname"
202:error:build See /opt/local/var/macports/logs/_opt_local_var_macports_sources_rsync.macports.org_release_tarballs_ports_net_tuntaposx/tuntaposx/main.log for details.