Ticket #59559: main.log

File main.log, 92.3 KB (added by dlamija (Muhammed Ramiza), 18 months ago)

main.log

Line 
1version:1
2:debug:sysinfo macOS 10.15 (darwin/19.0.0) arch i386
3:debug:sysinfo MacPorts 2.6.2
4:debug:sysinfo Xcode 11.1
5:debug:sysinfo SDK 10.15
6:debug:sysinfo MACOSX_DEPLOYMENT_TARGET: 10.15
7:debug:main epoch: in tree: 0 installed: 0
8:debug:main libpcap 1.9.1_0 exists in the ports tree
9:debug:main libpcap 1.9.1_0  is the latest installed
10:debug:main libpcap 1.9.1_0  is active
11:debug:main Merging existing variants '' into variants
12:debug:main new fully merged portvariants:
13:debug:main Using normalized porturl file:///opt/local/var/macports/sources/github.com/macports/macports-ports/net/libpcap
14:debug:main Changing to port directory: /opt/local/var/macports/sources/github.com/macports/macports-ports/net/libpcap
15:debug:main OS darwin/19.0.0 (macOS 10.15) arch i386
16:debug:main adding the default universal variant
17:debug:main Reading variant descriptions from /opt/local/var/macports/sources/github.com/macports/macports-ports/_resources/port1.0/variant_descriptions.conf
18:debug:main Running callback portconfigure::add_automatic_compiler_dependencies
19:debug:main Finished running callback portconfigure::add_automatic_compiler_dependencies
20:debug:main Running callback portbuild::add_automatic_buildsystem_dependencies
21:debug:main Finished running callback portbuild::add_automatic_buildsystem_dependencies
22:debug:main Running callback portstartupitem::add_notes
23:debug:main Finished running callback portstartupitem::add_notes
24:debug:main No need to upgrade! libpcap 1.9.1_0 >= libpcap 1.9.1_0
25:debug:main epoch: in tree: 1 installed: 1
26:debug:main openssl 1.1.1d_0 exists in the ports tree
27:debug:main openssl 1.1.1d_0  is the latest installed
28:debug:main openssl 1.1.1d_0  is active
29:debug:main Merging existing variants '' into variants
30:debug:main new fully merged portvariants:
31:debug:main Using normalized porturl file:///opt/local/var/macports/sources/github.com/macports/macports-ports/devel/openssl
32:debug:main Changing to port directory: /opt/local/var/macports/sources/github.com/macports/macports-ports/devel/openssl
33:debug:main OS darwin/19.0.0 (macOS 10.15) arch i386
34:debug:main Reading variant descriptions from /opt/local/var/macports/sources/github.com/macports/macports-ports/_resources/port1.0/variant_descriptions.conf
35:debug:main Sourcing PortGroup muniversal 1.0 from /opt/local/var/macports/sources/github.com/macports/macports-ports/_resources/port1.0/group/muniversal-1.0.tcl
36:debug:main universal variant already exists, so not adding the default one
37:debug:main Running callback portconfigure::add_automatic_compiler_dependencies
38:debug:main Finished running callback portconfigure::add_automatic_compiler_dependencies
39:debug:main Running callback portbuild::add_automatic_buildsystem_dependencies
40:debug:main Finished running callback portbuild::add_automatic_buildsystem_dependencies
41:debug:main Running callback portstartupitem::add_notes
42:debug:main Finished running callback portstartupitem::add_notes
43:debug:main No need to upgrade! openssl 1.1.1d_0 >= openssl 1.1.1d_0
44:debug:main epoch: in tree: 0 installed: 0
45:debug:main zlib 1.2.11_0 exists in the ports tree
46:debug:main zlib 1.2.11_0  is the latest installed
47:debug:main zlib 1.2.11_0  is active
48:debug:main Merging existing variants '' into variants
49:debug:main new fully merged portvariants:
50:debug:main Using normalized porturl file:///opt/local/var/macports/sources/github.com/macports/macports-ports/archivers/zlib
51:debug:main Changing to port directory: /opt/local/var/macports/sources/github.com/macports/macports-ports/archivers/zlib
52:debug:main OS darwin/19.0.0 (macOS 10.15) arch i386
53:debug:main Sourcing PortGroup xcodeversion 1.0 from /opt/local/var/macports/sources/github.com/macports/macports-ports/_resources/port1.0/group/xcodeversion-1.0.tcl
54:debug:main adding the default universal variant
55:debug:main Reading variant descriptions from /opt/local/var/macports/sources/github.com/macports/macports-ports/_resources/port1.0/variant_descriptions.conf
56:debug:main Running callback portconfigure::add_automatic_compiler_dependencies
57:debug:main Finished running callback portconfigure::add_automatic_compiler_dependencies
58:debug:main Running callback portbuild::add_automatic_buildsystem_dependencies
59:debug:main Finished running callback portbuild::add_automatic_buildsystem_dependencies
60:debug:main Running callback portstartupitem::add_notes
61:debug:main Finished running callback portstartupitem::add_notes
62:debug:main No need to upgrade! zlib 1.2.11_0 >= zlib 1.2.11_0
63:debug:main epoch: in tree: 0 installed: 0
64:debug:main libnids 1.24_0 exists in the ports tree
65:debug:main libnids 1.24_0 +libnet11 is the latest installed
66:debug:main libnids 1.24_0 +libnet11 is active
67:debug:main Merging existing variants '+libnet11' into variants
68:debug:main new fully merged portvariants: libnet11 +
69:debug:main Using normalized porturl file:///opt/local/var/macports/sources/github.com/macports/macports-ports/net/libnids
70:debug:main Changing to port directory: /opt/local/var/macports/sources/github.com/macports/macports-ports/net/libnids
71:debug:main OS darwin/19.0.0 (macOS 10.15) arch i386
72:debug:main adding the default universal variant
73:debug:main Reading variant descriptions from /opt/local/var/macports/sources/github.com/macports/macports-ports/_resources/port1.0/variant_descriptions.conf
74:debug:main Executing variant libnet11 provides libnet11
75:debug:main Running callback portconfigure::add_automatic_compiler_dependencies
76:debug:main Finished running callback portconfigure::add_automatic_compiler_dependencies
77:debug:main Running callback portbuild::add_automatic_buildsystem_dependencies
78:debug:main Finished running callback portbuild::add_automatic_buildsystem_dependencies
79:debug:main Running callback portstartupitem::add_notes
80:debug:main Finished running callback portstartupitem::add_notes
81:debug:main No need to upgrade! libnids 1.24_0 >= libnids 1.24_0
82:debug:main epoch: in tree: 0 installed: 0
83:debug:main libnet11 1.1.6_2 exists in the ports tree
84:debug:main libnet11 1.1.6_2  is the latest installed
85:debug:main libnet11 1.1.6_2  is active
86:debug:main Merging existing variants '' into variants
87:debug:main new fully merged portvariants:
88:debug:main Using normalized porturl file:///opt/local/var/macports/sources/github.com/macports/macports-ports/net/libnet11
89:debug:main Changing to port directory: /opt/local/var/macports/sources/github.com/macports/macports-ports/net/libnet11
90:debug:main OS darwin/19.0.0 (macOS 10.15) arch i386
91:debug:main adding the default universal variant
92:debug:main Reading variant descriptions from /opt/local/var/macports/sources/github.com/macports/macports-ports/_resources/port1.0/variant_descriptions.conf
93:debug:main Running callback portconfigure::add_automatic_compiler_dependencies
94:debug:main Finished running callback portconfigure::add_automatic_compiler_dependencies
95:debug:main Running callback portbuild::add_automatic_buildsystem_dependencies
96:debug:main Finished running callback portbuild::add_automatic_buildsystem_dependencies
97:debug:main Running callback portstartupitem::add_notes
98:debug:main Finished running callback portstartupitem::add_notes
99:debug:main No need to upgrade! libnet11 1.1.6_2 >= libnet11 1.1.6_2
100:debug:main epoch: in tree: 0 installed: 0
101:debug:main xorg-libXmu 1.1.3_0 exists in the ports tree
102:debug:main xorg-libXmu 1.1.3_0  is the latest installed
103:debug:main xorg-libXmu 1.1.3_0  is active
104:debug:main Merging existing variants '' into variants
105:debug:main new fully merged portvariants:
106:debug:main Using normalized porturl file:///opt/local/var/macports/sources/github.com/macports/macports-ports/x11/xorg-libXmu
107:debug:main Changing to port directory: /opt/local/var/macports/sources/github.com/macports/macports-ports/x11/xorg-libXmu
108:debug:main OS darwin/19.0.0 (macOS 10.15) arch i386
109:debug:main adding the default universal variant
110:debug:main Reading variant descriptions from /opt/local/var/macports/sources/github.com/macports/macports-ports/_resources/port1.0/variant_descriptions.conf
111:debug:main Running callback portconfigure::add_automatic_compiler_dependencies
112:debug:main Finished running callback portconfigure::add_automatic_compiler_dependencies
113:debug:main Running callback portbuild::add_automatic_buildsystem_dependencies
114:debug:main Finished running callback portbuild::add_automatic_buildsystem_dependencies
115:debug:main Running callback portstartupitem::add_notes
116:debug:main Finished running callback portstartupitem::add_notes
117:debug:main No need to upgrade! xorg-libXmu 1.1.3_0 >= xorg-libXmu 1.1.3_0
118:debug:main epoch: in tree: 0 installed: 0
119:debug:main xorg-libXext 1.3.4_0 exists in the ports tree
120:debug:main xorg-libXext 1.3.4_0  is the latest installed
121:debug:main xorg-libXext 1.3.4_0  is active
122:debug:main Merging existing variants '' into variants
123:debug:main new fully merged portvariants:
124:debug:main Using normalized porturl file:///opt/local/var/macports/sources/github.com/macports/macports-ports/x11/xorg-libXext
125:debug:main Changing to port directory: /opt/local/var/macports/sources/github.com/macports/macports-ports/x11/xorg-libXext
126:debug:main OS darwin/19.0.0 (macOS 10.15) arch i386
127:debug:main adding the default universal variant
128:debug:main Reading variant descriptions from /opt/local/var/macports/sources/github.com/macports/macports-ports/_resources/port1.0/variant_descriptions.conf
129:debug:main Running callback portconfigure::add_automatic_compiler_dependencies
130:debug:main Finished running callback portconfigure::add_automatic_compiler_dependencies
131:debug:main Running callback portbuild::add_automatic_buildsystem_dependencies
132:debug:main Finished running callback portbuild::add_automatic_buildsystem_dependencies
133:debug:main Running callback portstartupitem::add_notes
134:debug:main Finished running callback portstartupitem::add_notes
135:debug:main No need to upgrade! xorg-libXext 1.3.4_0 >= xorg-libXext 1.3.4_0
136:debug:main epoch: in tree: 0 installed: 0
137:debug:main xorg-libX11 1.6.9_0 exists in the ports tree
138:debug:main xorg-libX11 1.6.9_0  is the latest installed
139:debug:main xorg-libX11 1.6.9_0  is active
140:debug:main Merging existing variants '' into variants
141:debug:main new fully merged portvariants:
142:debug:main Using normalized porturl file:///opt/local/var/macports/sources/github.com/macports/macports-ports/x11/xorg-libX11
143:debug:main Changing to port directory: /opt/local/var/macports/sources/github.com/macports/macports-ports/x11/xorg-libX11
144:debug:main OS darwin/19.0.0 (macOS 10.15) arch i386
145:debug:main Sourcing PortGroup compiler_blacklist_versions 1.0 from /opt/local/var/macports/sources/github.com/macports/macports-ports/_resources/port1.0/group/compiler_blacklist_versions-1.0.tcl
146:debug:main adding the default universal variant
147:debug:main Reading variant descriptions from /opt/local/var/macports/sources/github.com/macports/macports-ports/_resources/port1.0/variant_descriptions.conf
148:debug:main Running callback portconfigure::add_automatic_compiler_dependencies
149:debug:main Finished running callback portconfigure::add_automatic_compiler_dependencies
150:debug:main Running callback portbuild::add_automatic_buildsystem_dependencies
151:debug:main Finished running callback portbuild::add_automatic_buildsystem_dependencies
152:debug:main Running callback portstartupitem::add_notes
153:debug:main Finished running callback portstartupitem::add_notes
154:debug:main No need to upgrade! xorg-libX11 1.6.9_0 >= xorg-libX11 1.6.9_0
155:debug:main epoch: in tree: 0 installed: 0
156:debug:main xorg-libXdmcp 1.1.3_0 exists in the ports tree
157:debug:main xorg-libXdmcp 1.1.3_0  is the latest installed
158:debug:main xorg-libXdmcp 1.1.3_0  is active
159:debug:main Merging existing variants '' into variants
160:debug:main new fully merged portvariants:
161:debug:main Using normalized porturl file:///opt/local/var/macports/sources/github.com/macports/macports-ports/x11/xorg-libXdmcp
162:debug:main Changing to port directory: /opt/local/var/macports/sources/github.com/macports/macports-ports/x11/xorg-libXdmcp
163:debug:main OS darwin/19.0.0 (macOS 10.15) arch i386
164:debug:main adding the default universal variant
165:debug:main Reading variant descriptions from /opt/local/var/macports/sources/github.com/macports/macports-ports/_resources/port1.0/variant_descriptions.conf
166:debug:main Running callback portconfigure::add_automatic_compiler_dependencies
167:debug:main Finished running callback portconfigure::add_automatic_compiler_dependencies
168:debug:main Running callback portbuild::add_automatic_buildsystem_dependencies
169:debug:main Finished running callback portbuild::add_automatic_buildsystem_dependencies
170:debug:main Running callback portstartupitem::add_notes
171:debug:main Finished running callback portstartupitem::add_notes
172:debug:main No need to upgrade! xorg-libXdmcp 1.1.3_0 >= xorg-libXdmcp 1.1.3_0
173:debug:main epoch: in tree: 0 installed: 0
174:debug:main xorg-libXau 1.0.9_0 exists in the ports tree
175:debug:main xorg-libXau 1.0.9_0  is the latest installed
176:debug:main xorg-libXau 1.0.9_0  is active
177:debug:main Merging existing variants '' into variants
178:debug:main new fully merged portvariants:
179:debug:main Using normalized porturl file:///opt/local/var/macports/sources/github.com/macports/macports-ports/x11/xorg-libXau
180:debug:main Changing to port directory: /opt/local/var/macports/sources/github.com/macports/macports-ports/x11/xorg-libXau
181:debug:main OS darwin/19.0.0 (macOS 10.15) arch i386
182:debug:main adding the default universal variant
183:debug:main Reading variant descriptions from /opt/local/var/macports/sources/github.com/macports/macports-ports/_resources/port1.0/variant_descriptions.conf
184:debug:main Running callback portconfigure::add_automatic_compiler_dependencies
185:debug:main Finished running callback portconfigure::add_automatic_compiler_dependencies
186:debug:main Running callback portbuild::add_automatic_buildsystem_dependencies
187:debug:main Finished running callback portbuild::add_automatic_buildsystem_dependencies
188:debug:main Running callback portstartupitem::add_notes
189:debug:main Finished running callback portstartupitem::add_notes
190:debug:main No need to upgrade! xorg-libXau 1.0.9_0 >= xorg-libXau 1.0.9_0
191:debug:main epoch: in tree: 1 installed: 1
192:debug:main xorg-xorgproto 2019.2_0 exists in the ports tree
193:debug:main xorg-xorgproto 2019.2_0  is the latest installed
194:debug:main xorg-xorgproto 2019.2_0  is active
195:debug:main Merging existing variants '' into variants
196:debug:main new fully merged portvariants:
197:debug:main Using normalized porturl file:///opt/local/var/macports/sources/github.com/macports/macports-ports/x11/xorg-xorgproto
198:debug:main Changing to port directory: /opt/local/var/macports/sources/github.com/macports/macports-ports/x11/xorg-xorgproto
199:debug:main OS darwin/19.0.0 (macOS 10.15) arch i386
200:debug:main only one arch supported, so not adding the default universal variant
201:debug:main Running callback portconfigure::add_automatic_compiler_dependencies
202:debug:main Finished running callback portconfigure::add_automatic_compiler_dependencies
203:debug:main Running callback portbuild::add_automatic_buildsystem_dependencies
204:debug:main Finished running callback portbuild::add_automatic_buildsystem_dependencies
205:debug:main Running callback portstartupitem::add_notes
206:debug:main Finished running callback portstartupitem::add_notes
207:debug:main No need to upgrade! xorg-xorgproto 2019.2_0 >= xorg-xorgproto 2019.2_0
208:debug:main epoch: in tree: 0 installed: 0
209:debug:main xorg-libxcb 1.13.1_0 exists in the ports tree
210:debug:main xorg-libxcb 1.13.1_0 +python37 is the latest installed
211:debug:main xorg-libxcb 1.13.1_0 +python37 is active
212:debug:main Merging existing variants '+python37' into variants
213:debug:main new fully merged portvariants: python37 +
214:debug:main Using normalized porturl file:///opt/local/var/macports/sources/github.com/macports/macports-ports/x11/xorg-libxcb
215:debug:main Changing to port directory: /opt/local/var/macports/sources/github.com/macports/macports-ports/x11/xorg-libxcb
216:debug:main OS darwin/19.0.0 (macOS 10.15) arch i386
217:debug:main adding the default universal variant
218:debug:main Reading variant descriptions from /opt/local/var/macports/sources/github.com/macports/macports-ports/_resources/port1.0/variant_descriptions.conf
219:debug:main Executing variant python37 provides python37
220:debug:main Running callback portconfigure::add_automatic_compiler_dependencies
221:debug:main Finished running callback portconfigure::add_automatic_compiler_dependencies
222:debug:main Running callback portbuild::add_automatic_buildsystem_dependencies
223:debug:main Finished running callback portbuild::add_automatic_buildsystem_dependencies
224:debug:main Running callback portstartupitem::add_notes
225:debug:main Finished running callback portstartupitem::add_notes
226:debug:main No need to upgrade! xorg-libxcb 1.13.1_0 >= xorg-libxcb 1.13.1_0
227:debug:main epoch: in tree: 0 installed: 0
228:debug:main xorg-xcb-proto 1.13_2 exists in the ports tree
229:debug:main xorg-xcb-proto 1.13_2 +python37 is the latest installed
230:debug:main xorg-xcb-proto 1.13_2 +python37 is active
231:debug:main Merging existing variants '+python37' into variants
232:debug:main new fully merged portvariants: python37 +
233:debug:main Using normalized porturl file:///opt/local/var/macports/sources/github.com/macports/macports-ports/x11/xorg-xcb-proto
234:debug:main Changing to port directory: /opt/local/var/macports/sources/github.com/macports/macports-ports/x11/xorg-xcb-proto
235:debug:main OS darwin/19.0.0 (macOS 10.15) arch i386
236:debug:main only one arch supported, so not adding the default universal variant
237:debug:main Executing variant python37 provides python37
238:debug:main Running callback portconfigure::add_automatic_compiler_dependencies
239:debug:main Finished running callback portconfigure::add_automatic_compiler_dependencies
240:debug:main Running callback portbuild::add_automatic_buildsystem_dependencies
241:debug:main Finished running callback portbuild::add_automatic_buildsystem_dependencies
242:debug:main Running callback portstartupitem::add_notes
243:debug:main Finished running callback portstartupitem::add_notes
244:debug:main No need to upgrade! xorg-xcb-proto 1.13_2 >= xorg-xcb-proto 1.13_2
245:debug:main epoch: in tree: 0 installed: 0
246:debug:main libxml2 2.9.9_3 exists in the ports tree
247:debug:main libxml2 2.9.9_3  is the latest installed
248:debug:main libxml2 2.9.9_3  is active
249:debug:main Merging existing variants '' into variants
250:debug:main new fully merged portvariants:
251:debug:main Using normalized porturl file:///opt/local/var/macports/sources/github.com/macports/macports-ports/textproc/libxml2
252:debug:main Changing to port directory: /opt/local/var/macports/sources/github.com/macports/macports-ports/textproc/libxml2
253:debug:main OS darwin/19.0.0 (macOS 10.15) arch i386
254:debug:main Sourcing PortGroup clang_dependency 1.0 from /opt/local/var/macports/sources/github.com/macports/macports-ports/_resources/port1.0/group/clang_dependency-1.0.tcl
255:debug:main adding the default universal variant
256:debug:main Reading variant descriptions from /opt/local/var/macports/sources/github.com/macports/macports-ports/_resources/port1.0/variant_descriptions.conf
257:debug:main Running callback portconfigure::add_automatic_compiler_dependencies
258:debug:main Finished running callback portconfigure::add_automatic_compiler_dependencies
259:debug:main Running callback portbuild::add_automatic_buildsystem_dependencies
260:debug:main Finished running callback portbuild::add_automatic_buildsystem_dependencies
261:debug:main Running callback portstartupitem::add_notes
262:debug:main Finished running callback portstartupitem::add_notes
263:debug:main No need to upgrade! libxml2 2.9.9_3 >= libxml2 2.9.9_3
264:debug:main epoch: in tree: 0 installed: 0
265:debug:main libiconv 1.16_0 exists in the ports tree
266:debug:main libiconv 1.16_0  is the latest installed
267:debug:main libiconv 1.16_0  is active
268:debug:main Merging existing variants '' into variants
269:debug:main new fully merged portvariants:
270:debug:main Using normalized porturl file:///opt/local/var/macports/sources/github.com/macports/macports-ports/textproc/libiconv
271:debug:main Changing to port directory: /opt/local/var/macports/sources/github.com/macports/macports-ports/textproc/libiconv
272:debug:main OS darwin/19.0.0 (macOS 10.15) arch i386
273:debug:main Reading variant descriptions from /opt/local/var/macports/sources/github.com/macports/macports-ports/_resources/port1.0/variant_descriptions.conf
274:debug:main Sourcing PortGroup muniversal 1.0 from /opt/local/var/macports/sources/github.com/macports/macports-ports/_resources/port1.0/group/muniversal-1.0.tcl
275:debug:main Sourcing PortGroup clang_dependency 1.0 from /opt/local/var/macports/sources/github.com/macports/macports-ports/_resources/port1.0/group/clang_dependency-1.0.tcl
276:debug:main universal variant already exists, so not adding the default one
277:debug:main Running callback portconfigure::add_automatic_compiler_dependencies
278:debug:main Finished running callback portconfigure::add_automatic_compiler_dependencies
279:debug:main Running callback portbuild::add_automatic_buildsystem_dependencies
280:debug:main Finished running callback portbuild::add_automatic_buildsystem_dependencies
281:debug:main Running callback portstartupitem::add_notes
282:debug:main Finished running callback portstartupitem::add_notes
283:debug:main No need to upgrade! libiconv 1.16_0 >= libiconv 1.16_0
284:debug:main epoch: in tree: 0 installed: 0
285:debug:main icu 65.1_0 exists in the ports tree
286:debug:main icu 65.1_0  is the latest installed
287:debug:main icu 65.1_0  is active
288:debug:main Merging existing variants '' into variants
289:debug:main new fully merged portvariants:
290:debug:main Using normalized porturl file:///opt/local/var/macports/sources/github.com/macports/macports-ports/devel/icu
291:debug:main Changing to port directory: /opt/local/var/macports/sources/github.com/macports/macports-ports/devel/icu
292:debug:main OS darwin/19.0.0 (macOS 10.15) arch i386
293:debug:main Sourcing PortGroup clang_dependency 1.0 from /opt/local/var/macports/sources/github.com/macports/macports-ports/_resources/port1.0/group/clang_dependency-1.0.tcl
294:debug:main Reading variant descriptions from /opt/local/var/macports/sources/github.com/macports/macports-ports/_resources/port1.0/variant_descriptions.conf
295:debug:main Sourcing PortGroup muniversal 1.0 from /opt/local/var/macports/sources/github.com/macports/macports-ports/_resources/port1.0/group/muniversal-1.0.tcl
296:debug:main universal variant already exists, so not adding the default one
297:debug:main Running callback portconfigure::add_automatic_compiler_dependencies
298:debug:main Finished running callback portconfigure::add_automatic_compiler_dependencies
299:debug:main Running callback portbuild::add_automatic_buildsystem_dependencies
300:debug:main Finished running callback portbuild::add_automatic_buildsystem_dependencies
301:debug:main Running callback portstartupitem::add_notes
302:debug:main Finished running callback portstartupitem::add_notes
303:debug:main No need to upgrade! icu 65.1_0 >= icu 65.1_0
304:debug:main epoch: in tree: 0 installed: 0
305:debug:main xz 5.2.4_0 exists in the ports tree
306:debug:main xz 5.2.4_0  is the latest installed
307:debug:main xz 5.2.4_0  is active
308:debug:main Merging existing variants '' into variants
309:debug:main new fully merged portvariants:
310:debug:main Using normalized porturl file:///opt/local/var/macports/sources/github.com/macports/macports-ports/archivers/xz
311:debug:main Changing to port directory: /opt/local/var/macports/sources/github.com/macports/macports-ports/archivers/xz
312:debug:main OS darwin/19.0.0 (macOS 10.15) arch i386
313:debug:main Sourcing PortGroup clang_dependency 1.0 from /opt/local/var/macports/sources/github.com/macports/macports-ports/_resources/port1.0/group/clang_dependency-1.0.tcl
314:debug:main adding the default universal variant
315:debug:main Reading variant descriptions from /opt/local/var/macports/sources/github.com/macports/macports-ports/_resources/port1.0/variant_descriptions.conf
316:debug:main Running callback portconfigure::add_automatic_compiler_dependencies
317:debug:main Finished running callback portconfigure::add_automatic_compiler_dependencies
318:debug:main Running callback portbuild::add_automatic_buildsystem_dependencies
319:debug:main Finished running callback portbuild::add_automatic_buildsystem_dependencies
320:debug:main Running callback portstartupitem::add_notes
321:debug:main Finished running callback portstartupitem::add_notes
322:debug:main No need to upgrade! xz 5.2.4_0 >= xz 5.2.4_0
323:debug:main epoch: in tree: 2 installed: 2
324:debug:main gettext 0.19.8.1_2 exists in the ports tree
325:debug:main gettext 0.19.8.1_2  is the latest installed
326:debug:main gettext 0.19.8.1_2  is active
327:debug:main Merging existing variants '' into variants
328:debug:main new fully merged portvariants:
329:debug:main Using normalized porturl file:///opt/local/var/macports/sources/github.com/macports/macports-ports/devel/gettext
330:debug:main Changing to port directory: /opt/local/var/macports/sources/github.com/macports/macports-ports/devel/gettext
331:debug:main OS darwin/19.0.0 (macOS 10.15) arch i386
332:debug:main Sourcing PortGroup compiler_blacklist_versions 1.0 from /opt/local/var/macports/sources/github.com/macports/macports-ports/_resources/port1.0/group/compiler_blacklist_versions-1.0.tcl
333:debug:main Reading variant descriptions from /opt/local/var/macports/sources/github.com/macports/macports-ports/_resources/port1.0/variant_descriptions.conf
334:debug:main Sourcing PortGroup muniversal 1.0 from /opt/local/var/macports/sources/github.com/macports/macports-ports/_resources/port1.0/group/muniversal-1.0.tcl
335:debug:main Sourcing PortGroup clang_dependency 1.0 from /opt/local/var/macports/sources/github.com/macports/macports-ports/_resources/port1.0/group/clang_dependency-1.0.tcl
336:debug:main compiler clang 1100.0.33.8 not blacklisted because it doesn't match {clang < 211.10.1}
337:debug:main universal variant already exists, so not adding the default one
338:debug:main Running callback portconfigure::add_automatic_compiler_dependencies
339:debug:main Finished running callback portconfigure::add_automatic_compiler_dependencies
340:debug:main Running callback portbuild::add_automatic_buildsystem_dependencies
341:debug:main Finished running callback portbuild::add_automatic_buildsystem_dependencies
342:debug:main Running callback portstartupitem::add_notes
343:debug:main Finished running callback portstartupitem::add_notes
344:debug:main No need to upgrade! gettext 0.19.8.1_2 >= gettext 0.19.8.1_2
345:debug:main epoch: in tree: 0 installed: 0
346:debug:main ncurses 6.1_0 exists in the ports tree
347:debug:main ncurses 6.1_0  is the latest installed
348:debug:main ncurses 6.1_0  is active
349:debug:main Merging existing variants '' into variants
350:debug:main new fully merged portvariants:
351:debug:main Using normalized porturl file:///opt/local/var/macports/sources/github.com/macports/macports-ports/devel/ncurses
352:debug:main Changing to port directory: /opt/local/var/macports/sources/github.com/macports/macports-ports/devel/ncurses
353:debug:main OS darwin/19.0.0 (macOS 10.15) arch i386
354:debug:main Sourcing PortGroup clang_dependency 1.0 from /opt/local/var/macports/sources/github.com/macports/macports-ports/_resources/port1.0/group/clang_dependency-1.0.tcl
355:debug:main adding the default universal variant
356:debug:main Reading variant descriptions from /opt/local/var/macports/sources/github.com/macports/macports-ports/_resources/port1.0/variant_descriptions.conf
357:debug:main Running callback portconfigure::add_automatic_compiler_dependencies
358:debug:main Finished running callback portconfigure::add_automatic_compiler_dependencies
359:debug:main Running callback portbuild::add_automatic_buildsystem_dependencies
360:debug:main Finished running callback portbuild::add_automatic_buildsystem_dependencies
361:debug:main Running callback portstartupitem::add_notes
362:debug:main Finished running callback portstartupitem::add_notes
363:debug:main No need to upgrade! ncurses 6.1_0 >= ncurses 6.1_0
364:debug:main epoch: in tree: 0 installed: 0
365:debug:main xorg-libpthread-stubs 0.4_0 exists in the ports tree
366:debug:main xorg-libpthread-stubs 0.4_0  is the latest installed
367:debug:main xorg-libpthread-stubs 0.4_0  is active
368:debug:main Merging existing variants '' into variants
369:debug:main new fully merged portvariants:
370:debug:main Using normalized porturl file:///opt/local/var/macports/sources/github.com/macports/macports-ports/x11/xorg-libpthread-stubs
371:debug:main Changing to port directory: /opt/local/var/macports/sources/github.com/macports/macports-ports/x11/xorg-libpthread-stubs
372:debug:main OS darwin/19.0.0 (macOS 10.15) arch i386
373:debug:main only one arch supported, so not adding the default universal variant
374:debug:main Running callback portconfigure::add_automatic_compiler_dependencies
375:debug:main Finished running callback portconfigure::add_automatic_compiler_dependencies
376:debug:main Running callback portbuild::add_automatic_buildsystem_dependencies
377:debug:main Finished running callback portbuild::add_automatic_buildsystem_dependencies
378:debug:main Running callback portstartupitem::add_notes
379:debug:main Finished running callback portstartupitem::add_notes
380:debug:main No need to upgrade! xorg-libpthread-stubs 0.4_0 >= xorg-libpthread-stubs 0.4_0
381:debug:main epoch: in tree: 0 installed: 0
382:debug:main xorg-libXt 1.2.0_0 exists in the ports tree
383:debug:main xorg-libXt 1.2.0_0  is the latest installed
384:debug:main xorg-libXt 1.2.0_0  is active
385:debug:main Merging existing variants '' into variants
386:debug:main new fully merged portvariants:
387:debug:main Using normalized porturl file:///opt/local/var/macports/sources/github.com/macports/macports-ports/x11/xorg-libXt
388:debug:main Changing to port directory: /opt/local/var/macports/sources/github.com/macports/macports-ports/x11/xorg-libXt
389:debug:main OS darwin/19.0.0 (macOS 10.15) arch i386
390:debug:main adding the default universal variant
391:debug:main Reading variant descriptions from /opt/local/var/macports/sources/github.com/macports/macports-ports/_resources/port1.0/variant_descriptions.conf
392:debug:main Running callback portconfigure::add_automatic_compiler_dependencies
393:debug:main Finished running callback portconfigure::add_automatic_compiler_dependencies
394:debug:main Running callback portbuild::add_automatic_buildsystem_dependencies
395:debug:main Finished running callback portbuild::add_automatic_buildsystem_dependencies
396:debug:main Running callback portstartupitem::add_notes
397:debug:main Finished running callback portstartupitem::add_notes
398:debug:main No need to upgrade! xorg-libXt 1.2.0_0 >= xorg-libXt 1.2.0_0
399:debug:main epoch: in tree: 0 installed: 0
400:debug:main xorg-libsm 1.2.3_0 exists in the ports tree
401:debug:main xorg-libsm 1.2.3_0  is the latest installed
402:debug:main xorg-libsm 1.2.3_0  is active
403:debug:main Merging existing variants '' into variants
404:debug:main new fully merged portvariants:
405:debug:main Using normalized porturl file:///opt/local/var/macports/sources/github.com/macports/macports-ports/x11/xorg-libsm
406:debug:main Changing to port directory: /opt/local/var/macports/sources/github.com/macports/macports-ports/x11/xorg-libsm
407:debug:main OS darwin/19.0.0 (macOS 10.15) arch i386
408:debug:main adding the default universal variant
409:debug:main Reading variant descriptions from /opt/local/var/macports/sources/github.com/macports/macports-ports/_resources/port1.0/variant_descriptions.conf
410:debug:main Running callback portconfigure::add_automatic_compiler_dependencies
411:debug:main Finished running callback portconfigure::add_automatic_compiler_dependencies
412:debug:main Running callback portbuild::add_automatic_buildsystem_dependencies
413:debug:main Finished running callback portbuild::add_automatic_buildsystem_dependencies
414:debug:main Running callback portstartupitem::add_notes
415:debug:main Finished running callback portstartupitem::add_notes
416:debug:main No need to upgrade! xorg-libsm 1.2.3_0 >= xorg-libsm 1.2.3_0
417:debug:main epoch: in tree: 0 installed: 0
418:debug:main xorg-libice 1.0.10_0 exists in the ports tree
419:debug:main xorg-libice 1.0.10_0  is the latest installed
420:debug:main xorg-libice 1.0.10_0  is active
421:debug:main Merging existing variants '' into variants
422:debug:main new fully merged portvariants:
423:debug:main Using normalized porturl file:///opt/local/var/macports/sources/github.com/macports/macports-ports/x11/xorg-libice
424:debug:main Changing to port directory: /opt/local/var/macports/sources/github.com/macports/macports-ports/x11/xorg-libice
425:debug:main OS darwin/19.0.0 (macOS 10.15) arch i386
426:debug:main adding the default universal variant
427:debug:main Reading variant descriptions from /opt/local/var/macports/sources/github.com/macports/macports-ports/_resources/port1.0/variant_descriptions.conf
428:debug:main Running callback portconfigure::add_automatic_compiler_dependencies
429:debug:main Finished running callback portconfigure::add_automatic_compiler_dependencies
430:debug:main Running callback portbuild::add_automatic_buildsystem_dependencies
431:debug:main Finished running callback portbuild::add_automatic_buildsystem_dependencies
432:debug:main Running callback portstartupitem::add_notes
433:debug:main Finished running callback portstartupitem::add_notes
434:debug:main No need to upgrade! xorg-libice 1.0.10_0 >= xorg-libice 1.0.10_0
435:msg:main --->  Computing dependencies for dsniff:info:main .:debug:main dsniff has no conflicts
436:debug:main Searching for dependency: libpcap
437:debug:main Found Dependency: receipt exists for libpcap
438:debug:main Searching for dependency: openssl
439:debug:main Found Dependency: receipt exists for openssl
440:debug:main Searching for dependency: libnids
441:debug:main Found Dependency: receipt exists for libnids
442:debug:main Searching for dependency: xorg-libXmu
443:debug:main Found Dependency: receipt exists for xorg-libXmu
444:debug:main Executing org.macports.main (dsniff)
445:debug:main dropping privileges: euid changed to 502, egid changed to 501.
446:debug:archivefetch archivefetch phase started at Sat Nov  2 07:27:40 +08 2019
447:msg:archivefetch --->  Fetching archive for dsniff
448:debug:archivefetch Executing org.macports.archivefetch (dsniff)
449:debug:archivefetch euid/egid changed to: 0/0
450:debug:archivefetch chowned /opt/local/var/macports/incoming to macports
451:debug:archivefetch euid/egid changed to: 502/501
452:info:archivefetch --->  dsniff-2.4b1_2.darwin_19.x86_64.tbz2 doesn't seem to exist in /opt/local/var/macports/incoming/verified
453:msg:archivefetch --->  Attempting to fetch dsniff-2.4b1_2.darwin_19.x86_64.tbz2 from http://jog.id.packages.macports.org/macports/packages/dsniff
454:debug:archivefetch Fetching archive failed: The requested URL returned error: 404 Not Found
455:msg:archivefetch --->  Attempting to fetch dsniff-2.4b1_2.darwin_19.x86_64.tbz2 from https://pek.cn.packages.macports.org/macports/packages/dsniff
456:debug:archivefetch Fetching archive failed: The requested URL returned error: 404
457:msg:archivefetch --->  Attempting to fetch dsniff-2.4b1_2.darwin_19.x86_64.tbz2 from http://kmq.jp.packages.macports.org/dsniff
458:debug:archivefetch Fetching archive failed: The requested URL returned error: 404 Not Found
459:debug:archivefetch Privilege de-escalation not attempted as not running as root.
460:debug:fetch fetch phase started at Sat Nov  2 07:27:42 +08 2019
461:notice:fetch --->  Fetching distfiles for dsniff
462:debug:fetch Executing org.macports.fetch (dsniff)
463:debug:fetch Privilege de-escalation not attempted as not running as root.
464:debug:checksum checksum phase started at Sat Nov  2 07:27:42 +08 2019
465:notice:checksum --->  Verifying checksums for dsniff
466:debug:checksum Executing org.macports.checksum (dsniff)
467:info:checksum --->  Checksumming dsniff-2.4b1.tar.gz
468:debug:checksum Calculated (rmd160) is 4d5dee193f0d252d22cfe2417f067460db9638b1
469:debug:checksum Correct (rmd160) checksum for dsniff-2.4b1.tar.gz
470:debug:checksum Calculated (sha256) is a9803a7a02ddfe5fb9704ce86f0ffc48453c321e88db85810db411ba0841152a
471:debug:checksum Correct (sha256) checksum for dsniff-2.4b1.tar.gz
472:debug:checksum Privilege de-escalation not attempted as not running as root.
473:debug:extract extract phase started at Sat Nov  2 07:27:42 +08 2019
474:notice:extract --->  Extracting dsniff
475:debug:extract Executing org.macports.extract (dsniff)
476:info:extract --->  Extracting dsniff-2.4b1.tar.gz
477:debug:extract setting option extract.args to '/opt/local/var/macports/distfiles/dsniff/dsniff-2.4b1.tar.gz'
478:debug:extract Environment:
479:debug:extract CC_PRINT_OPTIONS='YES'
480:debug:extract CC_PRINT_OPTIONS_FILE='/opt/local/var/macports/build/_opt_local_var_macports_sources_github.com_macports_macports-ports_net_dsniff/dsniff/work/.CC_PRINT_OPTIONS'
481:debug:extract CPATH='/opt/local/include'
482:debug:extract DEVELOPER_DIR='/Library/Developer/CommandLineTools'
483:debug:extract LIBRARY_PATH='/opt/local/lib'
484:debug:extract MACOSX_DEPLOYMENT_TARGET='10.15'
485:debug:extract SDKROOT='/Library/Developer/CommandLineTools/SDKs/MacOSX10.15.sdk'
486:info:extract Executing:  cd "/opt/local/var/macports/build/_opt_local_var_macports_sources_github.com_macports_macports-ports_net_dsniff/dsniff/work" && /usr/bin/gzip -dc '/opt/local/var/macports/distfiles/dsniff/dsniff-2.4b1.tar.gz' | /usr/bin/tar -xf -
487:debug:extract system:  cd "/opt/local/var/macports/build/_opt_local_var_macports_sources_github.com_macports_macports-ports_net_dsniff/dsniff/work" && /usr/bin/gzip -dc '/opt/local/var/macports/distfiles/dsniff/dsniff-2.4b1.tar.gz' | /usr/bin/tar -xf -
488:debug:extract euid/egid changed to: 0/0
489:debug:extract chowned /opt/local/var/macports/build/_opt_local_var_macports_sources_github.com_macports_macports-ports_net_dsniff/dsniff/work to macports
490:debug:extract euid/egid changed to: 502/501
491:debug:extract Privilege de-escalation not attempted as not running as root.
492:debug:patch patch phase started at Sat Nov  2 07:27:42 +08 2019
493:debug:patch Executing org.macports.patch (dsniff)
494:notice:patch --->  Applying patches to dsniff
495:info:patch --->  Applying patch-pcaputil.c
496:debug:patch Environment:
497:debug:patch CC_PRINT_OPTIONS='YES'
498:debug:patch CC_PRINT_OPTIONS_FILE='/opt/local/var/macports/build/_opt_local_var_macports_sources_github.com_macports_macports-ports_net_dsniff/dsniff/work/.CC_PRINT_OPTIONS'
499:debug:patch CPATH='/opt/local/include'
500:debug:patch DEVELOPER_DIR='/Library/Developer/CommandLineTools'
501:debug:patch LIBRARY_PATH='/opt/local/lib'
502:debug:patch MACOSX_DEPLOYMENT_TARGET='10.15'
503:debug:patch SDKROOT='/Library/Developer/CommandLineTools/SDKs/MacOSX10.15.sdk'
504:info:patch Executing:  cd "/opt/local/var/macports/build/_opt_local_var_macports_sources_github.com_macports_macports-ports_net_dsniff/dsniff/work/dsniff-2.4" && /usr/bin/patch -p0 < '/opt/local/var/macports/sources/github.com/macports/macports-ports/net/dsniff/files/patch-pcaputil.c'
505:debug:patch system:  cd "/opt/local/var/macports/build/_opt_local_var_macports_sources_github.com_macports_macports-ports_net_dsniff/dsniff/work/dsniff-2.4" && /usr/bin/patch -p0 < '/opt/local/var/macports/sources/github.com/macports/macports-ports/net/dsniff/files/patch-pcaputil.c'
506:info:patch patching file pcaputil.c
507:info:patch --->  Applying patch-sshcrypto.c
508:debug:patch Environment:
509:debug:patch CC_PRINT_OPTIONS='YES'
510:debug:patch CC_PRINT_OPTIONS_FILE='/opt/local/var/macports/build/_opt_local_var_macports_sources_github.com_macports_macports-ports_net_dsniff/dsniff/work/.CC_PRINT_OPTIONS'
511:debug:patch CPATH='/opt/local/include'
512:debug:patch DEVELOPER_DIR='/Library/Developer/CommandLineTools'
513:debug:patch LIBRARY_PATH='/opt/local/lib'
514:debug:patch MACOSX_DEPLOYMENT_TARGET='10.15'
515:debug:patch SDKROOT='/Library/Developer/CommandLineTools/SDKs/MacOSX10.15.sdk'
516:info:patch Executing:  cd "/opt/local/var/macports/build/_opt_local_var_macports_sources_github.com_macports_macports-ports_net_dsniff/dsniff/work/dsniff-2.4" && /usr/bin/patch -p0 < '/opt/local/var/macports/sources/github.com/macports/macports-ports/net/dsniff/files/patch-sshcrypto.c'
517:debug:patch system:  cd "/opt/local/var/macports/build/_opt_local_var_macports_sources_github.com_macports_macports-ports_net_dsniff/dsniff/work/dsniff-2.4" && /usr/bin/patch -p0 < '/opt/local/var/macports/sources/github.com/macports/macports-ports/net/dsniff/files/patch-sshcrypto.c'
518:info:patch patching file sshcrypto.c
519:info:patch --->  Applying patch-sshow.c.diff
520:debug:patch Environment:
521:debug:patch CC_PRINT_OPTIONS='YES'
522:debug:patch CC_PRINT_OPTIONS_FILE='/opt/local/var/macports/build/_opt_local_var_macports_sources_github.com_macports_macports-ports_net_dsniff/dsniff/work/.CC_PRINT_OPTIONS'
523:debug:patch CPATH='/opt/local/include'
524:debug:patch DEVELOPER_DIR='/Library/Developer/CommandLineTools'
525:debug:patch LIBRARY_PATH='/opt/local/lib'
526:debug:patch MACOSX_DEPLOYMENT_TARGET='10.15'
527:debug:patch SDKROOT='/Library/Developer/CommandLineTools/SDKs/MacOSX10.15.sdk'
528:info:patch Executing:  cd "/opt/local/var/macports/build/_opt_local_var_macports_sources_github.com_macports_macports-ports_net_dsniff/dsniff/work/dsniff-2.4" && /usr/bin/patch -p0 < '/opt/local/var/macports/sources/github.com/macports/macports-ports/net/dsniff/files/patch-sshow.c.diff'
529:debug:patch system:  cd "/opt/local/var/macports/build/_opt_local_var_macports_sources_github.com_macports_macports-ports_net_dsniff/dsniff/work/dsniff-2.4" && /usr/bin/patch -p0 < '/opt/local/var/macports/sources/github.com/macports/macports-ports/net/dsniff/files/patch-sshow.c.diff'
530:info:patch patching file sshow.c
531:info:patch --->  Applying patch-arpspoof.c.diff
532:debug:patch Environment:
533:debug:patch CC_PRINT_OPTIONS='YES'
534:debug:patch CC_PRINT_OPTIONS_FILE='/opt/local/var/macports/build/_opt_local_var_macports_sources_github.com_macports_macports-ports_net_dsniff/dsniff/work/.CC_PRINT_OPTIONS'
535:debug:patch CPATH='/opt/local/include'
536:debug:patch DEVELOPER_DIR='/Library/Developer/CommandLineTools'
537:debug:patch LIBRARY_PATH='/opt/local/lib'
538:debug:patch MACOSX_DEPLOYMENT_TARGET='10.15'
539:debug:patch SDKROOT='/Library/Developer/CommandLineTools/SDKs/MacOSX10.15.sdk'
540:info:patch Executing:  cd "/opt/local/var/macports/build/_opt_local_var_macports_sources_github.com_macports_macports-ports_net_dsniff/dsniff/work/dsniff-2.4" && /usr/bin/patch -p0 < '/opt/local/var/macports/sources/github.com/macports/macports-ports/net/dsniff/files/patch-arpspoof.c.diff'
541:debug:patch system:  cd "/opt/local/var/macports/build/_opt_local_var_macports_sources_github.com_macports_macports-ports_net_dsniff/dsniff/work/dsniff-2.4" && /usr/bin/patch -p0 < '/opt/local/var/macports/sources/github.com/macports/macports-ports/net/dsniff/files/patch-arpspoof.c.diff'
542:info:patch patching file arpspoof.c
543:info:patch --->  Applying patch-dnsspoof.c.diff
544:debug:patch Environment:
545:debug:patch CC_PRINT_OPTIONS='YES'
546:debug:patch CC_PRINT_OPTIONS_FILE='/opt/local/var/macports/build/_opt_local_var_macports_sources_github.com_macports_macports-ports_net_dsniff/dsniff/work/.CC_PRINT_OPTIONS'
547:debug:patch CPATH='/opt/local/include'
548:debug:patch DEVELOPER_DIR='/Library/Developer/CommandLineTools'
549:debug:patch LIBRARY_PATH='/opt/local/lib'
550:debug:patch MACOSX_DEPLOYMENT_TARGET='10.15'
551:debug:patch SDKROOT='/Library/Developer/CommandLineTools/SDKs/MacOSX10.15.sdk'
552:info:patch Executing:  cd "/opt/local/var/macports/build/_opt_local_var_macports_sources_github.com_macports_macports-ports_net_dsniff/dsniff/work/dsniff-2.4" && /usr/bin/patch -p0 < '/opt/local/var/macports/sources/github.com/macports/macports-ports/net/dsniff/files/patch-dnsspoof.c.diff'
553:debug:patch system:  cd "/opt/local/var/macports/build/_opt_local_var_macports_sources_github.com_macports_macports-ports_net_dsniff/dsniff/work/dsniff-2.4" && /usr/bin/patch -p0 < '/opt/local/var/macports/sources/github.com/macports/macports-ports/net/dsniff/files/patch-dnsspoof.c.diff'
554:info:patch patching file dnsspoof.c
555:info:patch --->  Applying patch-filesnarf.c.diff
556:debug:patch Environment:
557:debug:patch CC_PRINT_OPTIONS='YES'
558:debug:patch CC_PRINT_OPTIONS_FILE='/opt/local/var/macports/build/_opt_local_var_macports_sources_github.com_macports_macports-ports_net_dsniff/dsniff/work/.CC_PRINT_OPTIONS'
559:debug:patch CPATH='/opt/local/include'
560:debug:patch DEVELOPER_DIR='/Library/Developer/CommandLineTools'
561:debug:patch LIBRARY_PATH='/opt/local/lib'
562:debug:patch MACOSX_DEPLOYMENT_TARGET='10.15'
563:debug:patch SDKROOT='/Library/Developer/CommandLineTools/SDKs/MacOSX10.15.sdk'
564:info:patch Executing:  cd "/opt/local/var/macports/build/_opt_local_var_macports_sources_github.com_macports_macports-ports_net_dsniff/dsniff/work/dsniff-2.4" && /usr/bin/patch -p0 < '/opt/local/var/macports/sources/github.com/macports/macports-ports/net/dsniff/files/patch-filesnarf.c.diff'
565:debug:patch system:  cd "/opt/local/var/macports/build/_opt_local_var_macports_sources_github.com_macports_macports-ports_net_dsniff/dsniff/work/dsniff-2.4" && /usr/bin/patch -p0 < '/opt/local/var/macports/sources/github.com/macports/macports-ports/net/dsniff/files/patch-filesnarf.c.diff'
566:info:patch patching file filesnarf.c
567:info:patch --->  Applying patch-macof.c.diff
568:debug:patch Environment:
569:debug:patch CC_PRINT_OPTIONS='YES'
570:debug:patch CC_PRINT_OPTIONS_FILE='/opt/local/var/macports/build/_opt_local_var_macports_sources_github.com_macports_macports-ports_net_dsniff/dsniff/work/.CC_PRINT_OPTIONS'
571:debug:patch CPATH='/opt/local/include'
572:debug:patch DEVELOPER_DIR='/Library/Developer/CommandLineTools'
573:debug:patch LIBRARY_PATH='/opt/local/lib'
574:debug:patch MACOSX_DEPLOYMENT_TARGET='10.15'
575:debug:patch SDKROOT='/Library/Developer/CommandLineTools/SDKs/MacOSX10.15.sdk'
576:info:patch Executing:  cd "/opt/local/var/macports/build/_opt_local_var_macports_sources_github.com_macports_macports-ports_net_dsniff/dsniff/work/dsniff-2.4" && /usr/bin/patch -p0 < '/opt/local/var/macports/sources/github.com/macports/macports-ports/net/dsniff/files/patch-macof.c.diff'
577:debug:patch system:  cd "/opt/local/var/macports/build/_opt_local_var_macports_sources_github.com_macports_macports-ports_net_dsniff/dsniff/work/dsniff-2.4" && /usr/bin/patch -p0 < '/opt/local/var/macports/sources/github.com/macports/macports-ports/net/dsniff/files/patch-macof.c.diff'
578:info:patch patching file macof.c
579:info:patch --->  Applying patch-record.c.diff
580:debug:patch Environment:
581:debug:patch CC_PRINT_OPTIONS='YES'
582:debug:patch CC_PRINT_OPTIONS_FILE='/opt/local/var/macports/build/_opt_local_var_macports_sources_github.com_macports_macports-ports_net_dsniff/dsniff/work/.CC_PRINT_OPTIONS'
583:debug:patch CPATH='/opt/local/include'
584:debug:patch DEVELOPER_DIR='/Library/Developer/CommandLineTools'
585:debug:patch LIBRARY_PATH='/opt/local/lib'
586:debug:patch MACOSX_DEPLOYMENT_TARGET='10.15'
587:debug:patch SDKROOT='/Library/Developer/CommandLineTools/SDKs/MacOSX10.15.sdk'
588:info:patch Executing:  cd "/opt/local/var/macports/build/_opt_local_var_macports_sources_github.com_macports_macports-ports_net_dsniff/dsniff/work/dsniff-2.4" && /usr/bin/patch -p0 < '/opt/local/var/macports/sources/github.com/macports/macports-ports/net/dsniff/files/patch-record.c.diff'
589:debug:patch system:  cd "/opt/local/var/macports/build/_opt_local_var_macports_sources_github.com_macports_macports-ports_net_dsniff/dsniff/work/dsniff-2.4" && /usr/bin/patch -p0 < '/opt/local/var/macports/sources/github.com/macports/macports-ports/net/dsniff/files/patch-record.c.diff'
590:info:patch patching file record.c
591:info:patch --->  Applying patch-sshmitm.c.diff
592:debug:patch Environment:
593:debug:patch CC_PRINT_OPTIONS='YES'
594:debug:patch CC_PRINT_OPTIONS_FILE='/opt/local/var/macports/build/_opt_local_var_macports_sources_github.com_macports_macports-ports_net_dsniff/dsniff/work/.CC_PRINT_OPTIONS'
595:debug:patch CPATH='/opt/local/include'
596:debug:patch DEVELOPER_DIR='/Library/Developer/CommandLineTools'
597:debug:patch LIBRARY_PATH='/opt/local/lib'
598:debug:patch MACOSX_DEPLOYMENT_TARGET='10.15'
599:debug:patch SDKROOT='/Library/Developer/CommandLineTools/SDKs/MacOSX10.15.sdk'
600:info:patch Executing:  cd "/opt/local/var/macports/build/_opt_local_var_macports_sources_github.com_macports_macports-ports_net_dsniff/dsniff/work/dsniff-2.4" && /usr/bin/patch -p0 < '/opt/local/var/macports/sources/github.com/macports/macports-ports/net/dsniff/files/patch-sshmitm.c.diff'
601:debug:patch system:  cd "/opt/local/var/macports/build/_opt_local_var_macports_sources_github.com_macports_macports-ports_net_dsniff/dsniff/work/dsniff-2.4" && /usr/bin/patch -p0 < '/opt/local/var/macports/sources/github.com/macports/macports-ports/net/dsniff/files/patch-sshmitm.c.diff'
602:info:patch patching file sshmitm.c
603:info:patch --->  Applying patch-tcp_raw.c.diff
604:debug:patch Environment:
605:debug:patch CC_PRINT_OPTIONS='YES'
606:debug:patch CC_PRINT_OPTIONS_FILE='/opt/local/var/macports/build/_opt_local_var_macports_sources_github.com_macports_macports-ports_net_dsniff/dsniff/work/.CC_PRINT_OPTIONS'
607:debug:patch CPATH='/opt/local/include'
608:debug:patch DEVELOPER_DIR='/Library/Developer/CommandLineTools'
609:debug:patch LIBRARY_PATH='/opt/local/lib'
610:debug:patch MACOSX_DEPLOYMENT_TARGET='10.15'
611:debug:patch SDKROOT='/Library/Developer/CommandLineTools/SDKs/MacOSX10.15.sdk'
612:info:patch Executing:  cd "/opt/local/var/macports/build/_opt_local_var_macports_sources_github.com_macports_macports-ports_net_dsniff/dsniff/work/dsniff-2.4" && /usr/bin/patch -p0 < '/opt/local/var/macports/sources/github.com/macports/macports-ports/net/dsniff/files/patch-tcp_raw.c.diff'
613:debug:patch system:  cd "/opt/local/var/macports/build/_opt_local_var_macports_sources_github.com_macports_macports-ports_net_dsniff/dsniff/work/dsniff-2.4" && /usr/bin/patch -p0 < '/opt/local/var/macports/sources/github.com/macports/macports-ports/net/dsniff/files/patch-tcp_raw.c.diff'
614:info:patch patching file tcp_raw.c
615:info:patch --->  Applying patch-tcp_raw.h.diff
616:debug:patch Environment:
617:debug:patch CC_PRINT_OPTIONS='YES'
618:debug:patch CC_PRINT_OPTIONS_FILE='/opt/local/var/macports/build/_opt_local_var_macports_sources_github.com_macports_macports-ports_net_dsniff/dsniff/work/.CC_PRINT_OPTIONS'
619:debug:patch CPATH='/opt/local/include'
620:debug:patch DEVELOPER_DIR='/Library/Developer/CommandLineTools'
621:debug:patch LIBRARY_PATH='/opt/local/lib'
622:debug:patch MACOSX_DEPLOYMENT_TARGET='10.15'
623:debug:patch SDKROOT='/Library/Developer/CommandLineTools/SDKs/MacOSX10.15.sdk'
624:info:patch Executing:  cd "/opt/local/var/macports/build/_opt_local_var_macports_sources_github.com_macports_macports-ports_net_dsniff/dsniff/work/dsniff-2.4" && /usr/bin/patch -p0 < '/opt/local/var/macports/sources/github.com/macports/macports-ports/net/dsniff/files/patch-tcp_raw.h.diff'
625:debug:patch system:  cd "/opt/local/var/macports/build/_opt_local_var_macports_sources_github.com_macports_macports-ports_net_dsniff/dsniff/work/dsniff-2.4" && /usr/bin/patch -p0 < '/opt/local/var/macports/sources/github.com/macports/macports-ports/net/dsniff/files/patch-tcp_raw.h.diff'
626:info:patch patching file tcp_raw.h
627:info:patch --->  Applying patch-tcpkill.c.diff
628:debug:patch Environment:
629:debug:patch CC_PRINT_OPTIONS='YES'
630:debug:patch CC_PRINT_OPTIONS_FILE='/opt/local/var/macports/build/_opt_local_var_macports_sources_github.com_macports_macports-ports_net_dsniff/dsniff/work/.CC_PRINT_OPTIONS'
631:debug:patch CPATH='/opt/local/include'
632:debug:patch DEVELOPER_DIR='/Library/Developer/CommandLineTools'
633:debug:patch LIBRARY_PATH='/opt/local/lib'
634:debug:patch MACOSX_DEPLOYMENT_TARGET='10.15'
635:debug:patch SDKROOT='/Library/Developer/CommandLineTools/SDKs/MacOSX10.15.sdk'
636:info:patch Executing:  cd "/opt/local/var/macports/build/_opt_local_var_macports_sources_github.com_macports_macports-ports_net_dsniff/dsniff/work/dsniff-2.4" && /usr/bin/patch -p0 < '/opt/local/var/macports/sources/github.com/macports/macports-ports/net/dsniff/files/patch-tcpkill.c.diff'
637:debug:patch system:  cd "/opt/local/var/macports/build/_opt_local_var_macports_sources_github.com_macports_macports-ports_net_dsniff/dsniff/work/dsniff-2.4" && /usr/bin/patch -p0 < '/opt/local/var/macports/sources/github.com/macports/macports-ports/net/dsniff/files/patch-tcpkill.c.diff'
638:info:patch patching file tcpkill.c
639:info:patch --->  Applying patch-tcpnice.c.diff
640:debug:patch Environment:
641:debug:patch CC_PRINT_OPTIONS='YES'
642:debug:patch CC_PRINT_OPTIONS_FILE='/opt/local/var/macports/build/_opt_local_var_macports_sources_github.com_macports_macports-ports_net_dsniff/dsniff/work/.CC_PRINT_OPTIONS'
643:debug:patch CPATH='/opt/local/include'
644:debug:patch DEVELOPER_DIR='/Library/Developer/CommandLineTools'
645:debug:patch LIBRARY_PATH='/opt/local/lib'
646:debug:patch MACOSX_DEPLOYMENT_TARGET='10.15'
647:debug:patch SDKROOT='/Library/Developer/CommandLineTools/SDKs/MacOSX10.15.sdk'
648:info:patch Executing:  cd "/opt/local/var/macports/build/_opt_local_var_macports_sources_github.com_macports_macports-ports_net_dsniff/dsniff/work/dsniff-2.4" && /usr/bin/patch -p0 < '/opt/local/var/macports/sources/github.com/macports/macports-ports/net/dsniff/files/patch-tcpnice.c.diff'
649:debug:patch system:  cd "/opt/local/var/macports/build/_opt_local_var_macports_sources_github.com_macports_macports-ports_net_dsniff/dsniff/work/dsniff-2.4" && /usr/bin/patch -p0 < '/opt/local/var/macports/sources/github.com/macports/macports-ports/net/dsniff/files/patch-tcpnice.c.diff'
650:info:patch patching file tcpnice.c
651:info:patch --->  Applying patch-trigger.c.diff
652:debug:patch Environment:
653:debug:patch CC_PRINT_OPTIONS='YES'
654:debug:patch CC_PRINT_OPTIONS_FILE='/opt/local/var/macports/build/_opt_local_var_macports_sources_github.com_macports_macports-ports_net_dsniff/dsniff/work/.CC_PRINT_OPTIONS'
655:debug:patch CPATH='/opt/local/include'
656:debug:patch DEVELOPER_DIR='/Library/Developer/CommandLineTools'
657:debug:patch LIBRARY_PATH='/opt/local/lib'
658:debug:patch MACOSX_DEPLOYMENT_TARGET='10.15'
659:debug:patch SDKROOT='/Library/Developer/CommandLineTools/SDKs/MacOSX10.15.sdk'
660:info:patch Executing:  cd "/opt/local/var/macports/build/_opt_local_var_macports_sources_github.com_macports_macports-ports_net_dsniff/dsniff/work/dsniff-2.4" && /usr/bin/patch -p0 < '/opt/local/var/macports/sources/github.com/macports/macports-ports/net/dsniff/files/patch-trigger.c.diff'
661:debug:patch system:  cd "/opt/local/var/macports/build/_opt_local_var_macports_sources_github.com_macports_macports-ports_net_dsniff/dsniff/work/dsniff-2.4" && /usr/bin/patch -p0 < '/opt/local/var/macports/sources/github.com/macports/macports-ports/net/dsniff/files/patch-trigger.c.diff'
662:info:patch patching file trigger.c
663:info:patch --->  Applying patch-trigger.h.diff
664:debug:patch Environment:
665:debug:patch CC_PRINT_OPTIONS='YES'
666:debug:patch CC_PRINT_OPTIONS_FILE='/opt/local/var/macports/build/_opt_local_var_macports_sources_github.com_macports_macports-ports_net_dsniff/dsniff/work/.CC_PRINT_OPTIONS'
667:debug:patch CPATH='/opt/local/include'
668:debug:patch DEVELOPER_DIR='/Library/Developer/CommandLineTools'
669:debug:patch LIBRARY_PATH='/opt/local/lib'
670:debug:patch MACOSX_DEPLOYMENT_TARGET='10.15'
671:debug:patch SDKROOT='/Library/Developer/CommandLineTools/SDKs/MacOSX10.15.sdk'
672:info:patch Executing:  cd "/opt/local/var/macports/build/_opt_local_var_macports_sources_github.com_macports_macports-ports_net_dsniff/dsniff/work/dsniff-2.4" && /usr/bin/patch -p0 < '/opt/local/var/macports/sources/github.com/macports/macports-ports/net/dsniff/files/patch-trigger.h.diff'
673:debug:patch system:  cd "/opt/local/var/macports/build/_opt_local_var_macports_sources_github.com_macports_macports-ports_net_dsniff/dsniff/work/dsniff-2.4" && /usr/bin/patch -p0 < '/opt/local/var/macports/sources/github.com/macports/macports-ports/net/dsniff/files/patch-trigger.h.diff'
674:info:patch patching file trigger.h
675:info:patch --->  Applying patch-urlsnarf.c.diff
676:debug:patch Environment:
677:debug:patch CC_PRINT_OPTIONS='YES'
678:debug:patch CC_PRINT_OPTIONS_FILE='/opt/local/var/macports/build/_opt_local_var_macports_sources_github.com_macports_macports-ports_net_dsniff/dsniff/work/.CC_PRINT_OPTIONS'
679:debug:patch CPATH='/opt/local/include'
680:debug:patch DEVELOPER_DIR='/Library/Developer/CommandLineTools'
681:debug:patch LIBRARY_PATH='/opt/local/lib'
682:debug:patch MACOSX_DEPLOYMENT_TARGET='10.15'
683:debug:patch SDKROOT='/Library/Developer/CommandLineTools/SDKs/MacOSX10.15.sdk'
684:info:patch Executing:  cd "/opt/local/var/macports/build/_opt_local_var_macports_sources_github.com_macports_macports-ports_net_dsniff/dsniff/work/dsniff-2.4" && /usr/bin/patch -p0 < '/opt/local/var/macports/sources/github.com/macports/macports-ports/net/dsniff/files/patch-urlsnarf.c.diff'
685:debug:patch system:  cd "/opt/local/var/macports/build/_opt_local_var_macports_sources_github.com_macports_macports-ports_net_dsniff/dsniff/work/dsniff-2.4" && /usr/bin/patch -p0 < '/opt/local/var/macports/sources/github.com/macports/macports-ports/net/dsniff/files/patch-urlsnarf.c.diff'
686:info:patch patching file urlsnarf.c
687:info:patch --->  Applying patch-webmitm.c.diff
688:debug:patch Environment:
689:debug:patch CC_PRINT_OPTIONS='YES'
690:debug:patch CC_PRINT_OPTIONS_FILE='/opt/local/var/macports/build/_opt_local_var_macports_sources_github.com_macports_macports-ports_net_dsniff/dsniff/work/.CC_PRINT_OPTIONS'
691:debug:patch CPATH='/opt/local/include'
692:debug:patch DEVELOPER_DIR='/Library/Developer/CommandLineTools'
693:debug:patch LIBRARY_PATH='/opt/local/lib'
694:debug:patch MACOSX_DEPLOYMENT_TARGET='10.15'
695:debug:patch SDKROOT='/Library/Developer/CommandLineTools/SDKs/MacOSX10.15.sdk'
696:info:patch Executing:  cd "/opt/local/var/macports/build/_opt_local_var_macports_sources_github.com_macports_macports-ports_net_dsniff/dsniff/work/dsniff-2.4" && /usr/bin/patch -p0 < '/opt/local/var/macports/sources/github.com/macports/macports-ports/net/dsniff/files/patch-webmitm.c.diff'
697:debug:patch system:  cd "/opt/local/var/macports/build/_opt_local_var_macports_sources_github.com_macports_macports-ports_net_dsniff/dsniff/work/dsniff-2.4" && /usr/bin/patch -p0 < '/opt/local/var/macports/sources/github.com/macports/macports-ports/net/dsniff/files/patch-webmitm.c.diff'
698:info:patch patching file webmitm.c
699:info:patch --->  Applying patch-webspy.c.diff
700:debug:patch Environment:
701:debug:patch CC_PRINT_OPTIONS='YES'
702:debug:patch CC_PRINT_OPTIONS_FILE='/opt/local/var/macports/build/_opt_local_var_macports_sources_github.com_macports_macports-ports_net_dsniff/dsniff/work/.CC_PRINT_OPTIONS'
703:debug:patch CPATH='/opt/local/include'
704:debug:patch DEVELOPER_DIR='/Library/Developer/CommandLineTools'
705:debug:patch LIBRARY_PATH='/opt/local/lib'
706:debug:patch MACOSX_DEPLOYMENT_TARGET='10.15'
707:debug:patch SDKROOT='/Library/Developer/CommandLineTools/SDKs/MacOSX10.15.sdk'
708:info:patch Executing:  cd "/opt/local/var/macports/build/_opt_local_var_macports_sources_github.com_macports_macports-ports_net_dsniff/dsniff/work/dsniff-2.4" && /usr/bin/patch -p0 < '/opt/local/var/macports/sources/github.com/macports/macports-ports/net/dsniff/files/patch-webspy.c.diff'
709:debug:patch system:  cd "/opt/local/var/macports/build/_opt_local_var_macports_sources_github.com_macports_macports-ports_net_dsniff/dsniff/work/dsniff-2.4" && /usr/bin/patch -p0 < '/opt/local/var/macports/sources/github.com/macports/macports-ports/net/dsniff/files/patch-webspy.c.diff'
710:info:patch patching file webspy.c
711:info:patch --->  Applying patch-sshmitm.c-redef-of-csin.diff
712:debug:patch Environment:
713:debug:patch CC_PRINT_OPTIONS='YES'
714:debug:patch CC_PRINT_OPTIONS_FILE='/opt/local/var/macports/build/_opt_local_var_macports_sources_github.com_macports_macports-ports_net_dsniff/dsniff/work/.CC_PRINT_OPTIONS'
715:debug:patch CPATH='/opt/local/include'
716:debug:patch DEVELOPER_DIR='/Library/Developer/CommandLineTools'
717:debug:patch LIBRARY_PATH='/opt/local/lib'
718:debug:patch MACOSX_DEPLOYMENT_TARGET='10.15'
719:debug:patch SDKROOT='/Library/Developer/CommandLineTools/SDKs/MacOSX10.15.sdk'
720:info:patch Executing:  cd "/opt/local/var/macports/build/_opt_local_var_macports_sources_github.com_macports_macports-ports_net_dsniff/dsniff/work/dsniff-2.4" && /usr/bin/patch -p0 < '/opt/local/var/macports/sources/github.com/macports/macports-ports/net/dsniff/files/patch-sshmitm.c-redef-of-csin.diff'
721:debug:patch system:  cd "/opt/local/var/macports/build/_opt_local_var_macports_sources_github.com_macports_macports-ports_net_dsniff/dsniff/work/dsniff-2.4" && /usr/bin/patch -p0 < '/opt/local/var/macports/sources/github.com/macports/macports-ports/net/dsniff/files/patch-sshmitm.c-redef-of-csin.diff'
722:info:patch patching file sshmitm.c
723:info:patch --->  Applying patch-webmitm.c-redef-of-csin.diff
724:debug:patch Environment:
725:debug:patch CC_PRINT_OPTIONS='YES'
726:debug:patch CC_PRINT_OPTIONS_FILE='/opt/local/var/macports/build/_opt_local_var_macports_sources_github.com_macports_macports-ports_net_dsniff/dsniff/work/.CC_PRINT_OPTIONS'
727:debug:patch CPATH='/opt/local/include'
728:debug:patch DEVELOPER_DIR='/Library/Developer/CommandLineTools'
729:debug:patch LIBRARY_PATH='/opt/local/lib'
730:debug:patch MACOSX_DEPLOYMENT_TARGET='10.15'
731:debug:patch SDKROOT='/Library/Developer/CommandLineTools/SDKs/MacOSX10.15.sdk'
732:info:patch Executing:  cd "/opt/local/var/macports/build/_opt_local_var_macports_sources_github.com_macports_macports-ports_net_dsniff/dsniff/work/dsniff-2.4" && /usr/bin/patch -p0 < '/opt/local/var/macports/sources/github.com/macports/macports-ports/net/dsniff/files/patch-webmitm.c-redef-of-csin.diff'
733:debug:patch system:  cd "/opt/local/var/macports/build/_opt_local_var_macports_sources_github.com_macports_macports-ports_net_dsniff/dsniff/work/dsniff-2.4" && /usr/bin/patch -p0 < '/opt/local/var/macports/sources/github.com/macports/macports-ports/net/dsniff/files/patch-webmitm.c-redef-of-csin.diff'
734:info:patch patching file webmitm.c
735:debug:patch Privilege de-escalation not attempted as not running as root.
736:debug:configure configure phase started at Sat Nov  2 07:27:43 +08 2019
737:notice:configure --->  Configuring dsniff
738:debug:configure Preferred compilers: clang macports-clang-9.0 macports-clang-8.0 macports-clang-7.0 macports-clang-6.0 macports-clang-5.0
739:debug:configure Using compiler 'Xcode Clang'
740:debug:configure Executing proc-pre-org.macports.configure-configure-0
741:debug:configure Active variants check for source-type install considers depends_fetch depends_extract depends_lib depends_build depends_run: libpcap openssl libnids xorg-libXmu
742:debug:configure libnids is installed with the following variants: +libnet11
743:debug:configure   required: libnet11, forbidden: libnet
744:debug:configure   accepted
745:debug:configure Executing org.macports.configure (dsniff)
746:debug:configure Environment:
747:debug:configure CC='/usr/bin/clang'
748:debug:configure CC_PRINT_OPTIONS='YES'
749:debug:configure CC_PRINT_OPTIONS_FILE='/opt/local/var/macports/build/_opt_local_var_macports_sources_github.com_macports_macports-ports_net_dsniff/dsniff/work/.CC_PRINT_OPTIONS'
750:debug:configure CFLAGS='-pipe -Os -DBIND_8_COMPAT -isysroot/Library/Developer/CommandLineTools/SDKs/MacOSX10.15.sdk -arch x86_64'
751:debug:configure CPATH='/opt/local/include'
752:debug:configure CPPFLAGS='-I/opt/local/include -isysroot/Library/Developer/CommandLineTools/SDKs/MacOSX10.15.sdk'
753:debug:configure CXX='/usr/bin/clang++'
754:debug:configure CXXFLAGS='-pipe -Os -stdlib=libc++ -isysroot/Library/Developer/CommandLineTools/SDKs/MacOSX10.15.sdk -arch x86_64'
755:debug:configure DEVELOPER_DIR='/Library/Developer/CommandLineTools'
756:debug:configure F90FLAGS='-pipe -Os -m64'
757:debug:configure FCFLAGS='-pipe -Os -m64'
758:debug:configure FFLAGS='-pipe -Os -m64'
759:debug:configure INSTALL='/usr/bin/install -c'
760:debug:configure LDFLAGS='-L/opt/local/lib -Wl,-headerpad_max_install_names -Wl,-syslibroot,/Library/Developer/CommandLineTools/SDKs/MacOSX10.15.sdk -arch x86_64'
761:debug:configure LIBRARY_PATH='/opt/local/lib'
762:debug:configure MACOSX_DEPLOYMENT_TARGET='10.15'
763:debug:configure OBJC='/usr/bin/clang'
764:debug:configure OBJCFLAGS='-pipe -Os -isysroot/Library/Developer/CommandLineTools/SDKs/MacOSX10.15.sdk -arch x86_64'
765:debug:configure OBJCXX='/usr/bin/clang++'
766:debug:configure OBJCXXFLAGS='-pipe -Os -stdlib=libc++ -isysroot/Library/Developer/CommandLineTools/SDKs/MacOSX10.15.sdk -arch x86_64'
767:debug:configure SDKROOT='/Library/Developer/CommandLineTools/SDKs/MacOSX10.15.sdk'
768:info:configure Executing:  cd "/opt/local/var/macports/build/_opt_local_var_macports_sources_github.com_macports_macports-ports_net_dsniff/dsniff/work/dsniff-2.4" && ./configure --prefix=/opt/local --mandir=/opt/local/share/man
769:debug:configure system:  cd "/opt/local/var/macports/build/_opt_local_var_macports_sources_github.com_macports_macports-ports_net_dsniff/dsniff/work/dsniff-2.4" && ./configure --prefix=/opt/local --mandir=/opt/local/share/man
770:info:configure creating cache ./config.cache
771:info:configure checking for gcc... /usr/bin/clang
772:info:configure checking whether the C compiler (/usr/bin/clang -pipe -Os -DBIND_8_COMPAT -isysroot/Library/Developer/CommandLineTools/SDKs/MacOSX10.15.sdk -arch x86_64 -L/opt/local/lib -Wl,-headerpad_max_install_names -Wl,-syslibroot,/Library/Developer/CommandLineTools/SDKs/MacOSX10.15.sdk -arch x86_64) works... yes
773:info:configure checking whether the C compiler (/usr/bin/clang -pipe -Os -DBIND_8_COMPAT -isysroot/Library/Developer/CommandLineTools/SDKs/MacOSX10.15.sdk -arch x86_64 -L/opt/local/lib -Wl,-headerpad_max_install_names -Wl,-syslibroot,/Library/Developer/CommandLineTools/SDKs/MacOSX10.15.sdk -arch x86_64) is a cross-compiler... no
774:info:configure checking whether we are using GNU C... yes
775:info:configure checking whether /usr/bin/clang accepts -g... yes
776:info:configure checking for a BSD compatible install... /usr/bin/install -c
777:info:configure checking for ranlib... ranlib
778:info:configure checking how to run the C preprocessor... /usr/bin/clang -E
779:info:configure checking for X... libraries , headers
780:info:configure checking for dnet_ntoa in -ldnet... no
781:info:configure checking for dnet_ntoa in -ldnet_stub... no
782:info:configure checking for gethostbyname... yes
783:info:configure checking for connect... yes
784:info:configure checking for remove... yes
785:info:configure checking for shmat... yes
786:info:configure checking for IceConnectionNumber in -lICE... yes
787:info:configure checking for ANSI C header files... yes
788:info:configure checking for err.h... yes
789:info:configure checking for fcntl.h... yes
790:info:configure checking for sys/ioctl.h... yes
791:info:configure checking for sys/queue.h... yes
792:info:configure checking for unistd.h... yes
793:info:configure checking for libgen.h... yes
794:info:configure checking for net/if_tun.h... no
795:info:configure checking for MIN and MAX in sys/param.h... yes
796:info:configure checking for working const... yes
797:info:configure checking for size_t... yes
798:info:configure checking whether struct tm is in sys/time.h or time.h... time.h
799:info:configure checking for u_int32_t... yes
800:info:configure checking for u_int64_t... yes
801:info:configure checking for in_addr_t... yes
802:info:configure checking whether /usr/bin/clang needs -traditional... no
803:info:configure checking for 8-bit clean memcmp... yes
804:info:configure checking return type of signal handlers... void
805:info:configure checking for strftime... yes
806:info:configure checking for gethostname... yes
807:info:configure checking for socket... yes
808:info:configure checking for strdup... yes
809:info:configure checking for strstr... yes
810:info:configure checking for xdr_fhstatus in -lrpcsvc... no
811:info:configure checking for socket in -lsocket... no
812:info:configure checking for gethostbyname in -lnsl... no
813:info:configure checking for dn_expand in -lresolv... yes
814:info:configure checking for dirname... yes
815:info:configure checking for strlcpy... yes
816:info:configure checking for strlcat... yes
817:info:configure checking for strsep... yes
818:info:configure checking for MD5Update... no
819:info:configure checking for warnx... yes
820:info:configure checking for ether_ntoa... yes
821:info:configure checking for Berkeley DB with 1.85 compatibility... yes
822:info:configure checking for libpcap... yes
823:info:configure checking for libnet... yes
824:info:configure checking for libnids... yes
825:info:configure checking whether libnids version is good... yes
826:info:configure checking for OpenSSL... yes
827:info:configure updating cache ./config.cache
828:info:configure creating ./config.status
829:info:configure creating Makefile
830:info:configure creating config.h
831:debug:configure Privilege de-escalation not attempted as not running as root.
832:debug:build build phase started at Sat Nov  2 07:27:47 +08 2019
833:notice:build --->  Building dsniff
834:debug:build Executing org.macports.build (dsniff)
835:debug:build port disallows a parallel build
836:debug:build Environment:
837:debug:build CC_PRINT_OPTIONS='YES'
838:debug:build CC_PRINT_OPTIONS_FILE='/opt/local/var/macports/build/_opt_local_var_macports_sources_github.com_macports_macports-ports_net_dsniff/dsniff/work/.CC_PRINT_OPTIONS'
839:debug:build CPATH='/opt/local/include'
840:debug:build DEVELOPER_DIR='/Library/Developer/CommandLineTools'
841:debug:build LIBRARY_PATH='/opt/local/lib'
842:debug:build MACOSX_DEPLOYMENT_TARGET='10.15'
843:debug:build SDKROOT='/Library/Developer/CommandLineTools/SDKs/MacOSX10.15.sdk'
844:info:build Executing:  cd "/opt/local/var/macports/build/_opt_local_var_macports_sources_github.com_macports_macports-ports_net_dsniff/dsniff/work/dsniff-2.4" && /usr/bin/make -w all
845:debug:build system:  cd "/opt/local/var/macports/build/_opt_local_var_macports_sources_github.com_macports_macports-ports_net_dsniff/dsniff/work/dsniff-2.4" && /usr/bin/make -w all
846:info:build make: Entering directory `/opt/local/var/macports/build/_opt_local_var_macports_sources_github.com_macports_macports-ports_net_dsniff/dsniff/work/dsniff-2.4'
847:info:build /usr/bin/clang -pipe -Os -DBIND_8_COMPAT -isysroot/Library/Developer/CommandLineTools/SDKs/MacOSX10.15.sdk -arch x86_64 -D_BSD_SOURCE -DHAVE_SOCKADDR_SA_LEN -DLIBNET_BSDISH_OS -DLIBNET_BSD_BYTE_SWAP -DDSNIFF_LIBDIR=\"/opt/local/lib/\" -I. -I/opt/local/include -I/opt/local/include -I/opt/local/include -I/opt/local/include -I/opt/local/include  -I./missing -c ./missing/dummy.c
848:info:build /usr/bin/clang -pipe -Os -DBIND_8_COMPAT -isysroot/Library/Developer/CommandLineTools/SDKs/MacOSX10.15.sdk -arch x86_64 -D_BSD_SOURCE -DHAVE_SOCKADDR_SA_LEN -DLIBNET_BSDISH_OS -DLIBNET_BSD_BYTE_SWAP -DDSNIFF_LIBDIR=\"/opt/local/lib/\" -I. -I/opt/local/include -I/opt/local/include -I/opt/local/include -I/opt/local/include -I/opt/local/include  -I./missing -c ./missing/md5.c
849:info:build ./missing/md5.c:151:27: warning: 'memset' call operates on objects of type 'struct MD5Context' while the size is based on a different type 'struct MD5Context *' [-Wsizeof-pointer-memaccess]
850:info:build     memset(ctx, 0, sizeof(ctx));        /* In case it's sensitive */
851:info:build            ~~~            ^~~
852:info:build ./missing/md5.c:151:27: note: did you mean to dereference the argument to 'sizeof' (and multiply it by the number of elements)?
853:info:build     memset(ctx, 0, sizeof(ctx));        /* In case it's sensitive */
854:info:build                           ^~~
855:info:build 1 warning generated.
856:info:build ar -cr libmissing.a dummy.o  md5.o
857:info:build /opt/local/bin/ranlib: file: libmissing.a(dummy.o) has no symbols
858:info:build ranlib libmissing.a
859:info:build ranlib: file: libmissing.a(dummy.o) has no symbols
860:info:build /usr/bin/clang -pipe -Os -DBIND_8_COMPAT -isysroot/Library/Developer/CommandLineTools/SDKs/MacOSX10.15.sdk -arch x86_64 -D_BSD_SOURCE -DHAVE_SOCKADDR_SA_LEN -DLIBNET_BSDISH_OS -DLIBNET_BSD_BYTE_SWAP -DDSNIFF_LIBDIR=\"/opt/local/lib/\" -I. -I/opt/local/include -I/opt/local/include -I/opt/local/include -I/opt/local/include -I/opt/local/include  -I./missing -c ./arpspoof.c
861:info:build ./arpspoof.c:59:7: warning: assigning to 'u_int8_t *' (aka 'unsigned char *') from 'char [7]' converts between pointers to integer types with different sign [-Wpointer-sign]
862:info:build                 tha = "\xff\xff\xff\xff\xff\xff";
863:info:build                     ^ ~~~~~~~~~~~~~~~~~~~~~~~~~~
864:info:build ./arpspoof.c:186:30: warning: 'pcap_lookupdev' is deprecated: use 'pcap_findalldevs' and use the first device [-Wdeprecated-declarations]
865:info:build         if (intf == NULL && (intf = pcap_lookupdev(pcap_ebuf)) == NULL)
866:info:build                                     ^
867:info:build /opt/local/include/pcap/pcap.h:329:1: note: 'pcap_lookupdev' has been explicitly marked deprecated here
868:info:build PCAP_DEPRECATED(pcap_lookupdev, "use 'pcap_findalldevs' and use the first device");
869:info:build ^
870:info:build /opt/local/include/pcap/funcattrs.h:227:53: note: expanded from macro 'PCAP_DEPRECATED'
871:info:build   #define PCAP_DEPRECATED(func, msg)    __attribute__((deprecated(msg)))
872:info:build                                                        ^
873:info:build 2 warnings generated.
874:info:build /usr/bin/clang -pipe -Os -DBIND_8_COMPAT -isysroot/Library/Developer/CommandLineTools/SDKs/MacOSX10.15.sdk -arch x86_64 -D_BSD_SOURCE -DHAVE_SOCKADDR_SA_LEN -DLIBNET_BSDISH_OS -DLIBNET_BSD_BYTE_SWAP -DDSNIFF_LIBDIR=\"/opt/local/lib/\" -I. -I/opt/local/include -I/opt/local/include -I/opt/local/include -I/opt/local/include -I/opt/local/include  -I./missing -c ./arp.c
875:info:build ./arp.c:76:4: warning: implicitly declaring library function 'memcpy' with type 'void *(void *, const void *, unsigned long)' [-Wimplicit-function-declaration]
876:info:build                         memcpy(ether->ether_addr_octet, LLADDR(sdl),
877:info:build                         ^
878:info:build ./arp.c:76:4: note: include the header <string.h> or explicitly provide a declaration for 'memcpy'
879:info:build 1 warning generated.
880:info:build /usr/bin/clang -L/opt/local/lib -Wl,-headerpad_max_install_names -Wl,-syslibroot,/Library/Developer/CommandLineTools/SDKs/MacOSX10.15.sdk -arch x86_64 -o arpspoof arpspoof.o arp.o -lresolv  -L. -lmissing -L/opt/local/lib -lpcap -L/opt/local/lib -lnet
881:info:build /usr/bin/clang -pipe -Os -DBIND_8_COMPAT -isysroot/Library/Developer/CommandLineTools/SDKs/MacOSX10.15.sdk -arch x86_64 -D_BSD_SOURCE -DHAVE_SOCKADDR_SA_LEN -DLIBNET_BSDISH_OS -DLIBNET_BSD_BYTE_SWAP -DDSNIFF_LIBDIR=\"/opt/local/lib/\" -I. -I/opt/local/include -I/opt/local/include -I/opt/local/include -I/opt/local/include -I/opt/local/include  -I./missing -c ./dnsspoof.c
882:info:build ./dnsspoof.c:226:10: warning: assigning to 'u_char *' (aka 'unsigned char *') from 'char *' converts between pointers to integer types with different sign [-Wpointer-sign]
883:info:build                 if ((q = dns_lookup_ptr(name)) == NULL)
884:info:build                        ^ ~~~~~~~~~~~~~~~~~~~~
885:info:build ./dnsspoof.c:230:20: warning: passing 'u_char *' (aka 'unsigned char *') to parameter of type 'const char *' converts between pointers to integer types with different sign [-Wpointer-sign]
886:info:build                 anslen = dn_comp(q, p + 12, 256, NULL, NULL);
887:info:build                                  ^
888:info:build /Library/Developer/CommandLineTools/SDKs/MacOSX10.15.sdk/usr/include/resolv.h:443:31: note: passing argument to parameter here
889:info:build int             dn_comp __P((const char *, u_char *, int, u_char **, u_char **));
890:info:build                                          ^
891:info:build ./dnsspoof.c:299:28: warning: 'pcap_lookupdev' is deprecated: use 'pcap_findalldevs' and use the first device [-Wdeprecated-declarations]
892:info:build         if (dev == NULL && (dev = pcap_lookupdev(buf)) == NULL)
893:info:build                                   ^
894:info:build /opt/local/include/pcap/pcap.h:329:1: note: 'pcap_lookupdev' has been explicitly marked deprecated here
895:info:build PCAP_DEPRECATED(pcap_lookupdev, "use 'pcap_findalldevs' and use the first device");
896:info:build ^
897:info:build /opt/local/include/pcap/funcattrs.h:227:53: note: expanded from macro 'PCAP_DEPRECATED'
898:info:build   #define PCAP_DEPRECATED(func, msg)    __attribute__((deprecated(msg)))
899:info:build                                                        ^
900:info:build 3 warnings generated.
901:info:build /usr/bin/clang -pipe -Os -DBIND_8_COMPAT -isysroot/Library/Developer/CommandLineTools/SDKs/MacOSX10.15.sdk -arch x86_64 -D_BSD_SOURCE -DHAVE_SOCKADDR_SA_LEN -DLIBNET_BSDISH_OS -DLIBNET_BSD_BYTE_SWAP -DDSNIFF_LIBDIR=\"/opt/local/lib/\" -I. -I/opt/local/include -I/opt/local/include -I/opt/local/include -I/opt/local/include -I/opt/local/include  -I./missing -c ./pcaputil.c
902:info:build ./pcaputil.c:71:30: warning: 'pcap_lookupdev' is deprecated: use 'pcap_findalldevs' and use the first device [-Wdeprecated-declarations]
903:info:build         if (intf == NULL && (intf = pcap_lookupdev(ebuf)) == NULL) {
904:info:build                                     ^
905:info:build /opt/local/include/pcap/pcap.h:329:1: note: 'pcap_lookupdev' has been explicitly marked deprecated here
906:info:build PCAP_DEPRECATED(pcap_lookupdev, "use 'pcap_findalldevs' and use the first device");
907:info:build ^
908:info:build /opt/local/include/pcap/funcattrs.h:227:53: note: expanded from macro 'PCAP_DEPRECATED'
909:info:build   #define PCAP_DEPRECATED(func, msg)    __attribute__((deprecated(msg)))
910:info:build                                                        ^
911:info:build 1 warning generated.
912:info:build /usr/bin/clang -L/opt/local/lib -Wl,-headerpad_max_install_names -Wl,-syslibroot,/Library/Developer/CommandLineTools/SDKs/MacOSX10.15.sdk -arch x86_64 -o dnsspoof dnsspoof.o pcaputil.o -lresolv  -L. -lmissing -L/opt/local/lib -lpcap -L/opt/local/lib -lnet
913:info:build rpcgen -h mount.x -o mount.h
914:info:build rpcgen -c mount.x -o mount.c
915:info:build /usr/bin/clang -pipe -Os -DBIND_8_COMPAT -isysroot/Library/Developer/CommandLineTools/SDKs/MacOSX10.15.sdk -arch x86_64 -D_BSD_SOURCE -DHAVE_SOCKADDR_SA_LEN -DLIBNET_BSDISH_OS -DLIBNET_BSD_BYTE_SWAP -DDSNIFF_LIBDIR=\"/opt/local/lib/\" -I. -I/opt/local/include -I/opt/local/include -I/opt/local/include -I/opt/local/include -I/opt/local/include  -I./missing -c ./asn1.c
916:info:build /usr/bin/clang -pipe -Os -DBIND_8_COMPAT -isysroot/Library/Developer/CommandLineTools/SDKs/MacOSX10.15.sdk -arch x86_64 -D_BSD_SOURCE -DHAVE_SOCKADDR_SA_LEN -DLIBNET_BSDISH_OS -DLIBNET_BSD_BYTE_SWAP -DDSNIFF_LIBDIR=\"/opt/local/lib/\" -I. -I/opt/local/include -I/opt/local/include -I/opt/local/include -I/opt/local/include -I/opt/local/include  -I./missing -c ./base64.c
917:info:build /usr/bin/clang -pipe -Os -DBIND_8_COMPAT -isysroot/Library/Developer/CommandLineTools/SDKs/MacOSX10.15.sdk -arch x86_64 -D_BSD_SOURCE -DHAVE_SOCKADDR_SA_LEN -DLIBNET_BSDISH_OS -DLIBNET_BSD_BYTE_SWAP -DDSNIFF_LIBDIR=\"/opt/local/lib/\" -I. -I/opt/local/include -I/opt/local/include -I/opt/local/include -I/opt/local/include -I/opt/local/include  -I./missing -c ./buf.c
918:info:build ./buf.c:98:2: warning: implicitly declaring library function 'memcpy' with type 'void *(void *, const void *, unsigned long)' [-Wimplicit-function-declaration]
919:info:build         memcpy(buf_ptr(buf), src, len);
920:info:build         ^
921:info:build ./buf.c:98:2: note: include the header <string.h> or explicitly provide a declaration for 'memcpy'
922:info:build ./buf.c:112:16: warning: passing 'u_char *' (aka 'unsigned char *') to parameter of type 'char *' converts between pointers to integer types with different sign [-Wpointer-sign]
923:info:build         i = vsnprintf(buf_ptr(buf), buf_len(buf), fmt, ap);
924:info:build             ~~~~~~~~~~^~~~~~~~~~~~~~~~~~~~~~~~~~~~~~~~~~~~
925:info:build ./buf.h:31:20: note: expanded from macro 'buf_ptr'
926:info:build #define buf_ptr(b)      ((b)->base + (b)->offset)
927:info:build                         ^
928:info:build /Library/Developer/CommandLineTools/SDKs/MacOSX10.15.sdk/usr/include/secure/_stdio.h:75:30: note: expanded from macro 'vsnprintf'
929:info:build   __builtin___vsnprintf_chk (str, len, 0, __darwin_obsz(str), format, ap)
930:info:build                              ^~~
931:info:build ./buf.c:136:7: warning: implicitly declaring library function 'memcmp' with type 'int (const void *, const void *, unsigned long)' [-Wimplicit-function-declaration]
932:info:build                 if (memcmp(p, ptr, len) == 0)
933:info:build                     ^
934:info:build ./buf.c:136:7: note: include the header <string.h> or explicitly provide a declaration for 'memcmp'
935:info:build 3 warnings generated.
936:info:build /usr/bin/clang -pipe -Os -DBIND_8_COMPAT -isysroot/Library/Developer/CommandLineTools/SDKs/MacOSX10.15.sdk -arch x86_64 -D_BSD_SOURCE -DHAVE_SOCKADDR_SA_LEN -DLIBNET_BSDISH_OS -DLIBNET_BSD_BYTE_SWAP -DDSNIFF_LIBDIR=\"/opt/local/lib/\" -I. -I/opt/local/include -I/opt/local/include -I/opt/local/include -I/opt/local/include -I/opt/local/include  -I./missing -c ./hex.c
937:info:build /usr/bin/clang -pipe -Os -DBIND_8_COMPAT -isysroot/Library/Developer/CommandLineTools/SDKs/MacOSX10.15.sdk -arch x86_64 -D_BSD_SOURCE -DHAVE_SOCKADDR_SA_LEN -DLIBNET_BSDISH_OS -DLIBNET_BSD_BYTE_SWAP -DDSNIFF_LIBDIR=\"/opt/local/lib/\" -I. -I/opt/local/include -I/opt/local/include -I/opt/local/include -I/opt/local/include -I/opt/local/include  -I./missing -c ./magic.c
938:info:build /usr/bin/clang -pipe -Os -DBIND_8_COMPAT -isysroot/Library/Developer/CommandLineTools/SDKs/MacOSX10.15.sdk -arch x86_64 -D_BSD_SOURCE -DHAVE_SOCKADDR_SA_LEN -DLIBNET_BSDISH_OS -DLIBNET_BSD_BYTE_SWAP -DDSNIFF_LIBDIR=\"/opt/local/lib/\" -I. -I/opt/local/include -I/opt/local/include -I/opt/local/include -I/opt/local/include -I/opt/local/include  -I./missing -c ./mount.c
939:info:build /usr/bin/clang -pipe -Os -DBIND_8_COMPAT -isysroot/Library/Developer/CommandLineTools/SDKs/MacOSX10.15.sdk -arch x86_64 -D_BSD_SOURCE -DHAVE_SOCKADDR_SA_LEN -DLIBNET_BSDISH_OS -DLIBNET_BSD_BYTE_SWAP -DDSNIFF_LIBDIR=\"/opt/local/lib/\" -I. -I/opt/local/include -I/opt/local/include -I/opt/local/include -I/opt/local/include -I/opt/local/include  -I./missing -c ./rpc.c
940:info:build ./rpc.c:112:24: warning: passing 'u_char *' (aka 'unsigned char *') to parameter of type 'char *' converts between pointers to integer types with different sign [-Wpointer-sign]
941:info:build                 xdrmem_create(&xdrs, buf, len, XDR_DECODE);
942:info:build                                      ^~~
943:info:build /Library/Developer/CommandLineTools/SDKs/MacOSX10.15.sdk/usr/include/rpc/xdr.h:430:42: note: passing argument to parameter here
944:info:build extern void   xdrmem_create(XDR *, char *, unsigned int, enum xdr_op);
945:info:build                                          ^
946:info:build ./rpc.c:121:24: warning: passing 'u_char *' (aka 'unsigned char *') to parameter of type 'char *' converts between pointers to integer types with different sign [-Wpointer-sign]
947:info:build                 xdrmem_create(&xdrs, buf, len, XDR_DECODE);
948:info:build                                      ^~~
949:info:build /Library/Developer/CommandLineTools/SDKs/MacOSX10.15.sdk/usr/include/rpc/xdr.h:430:42: note: passing argument to parameter here
950:info:build extern void   xdrmem_create(XDR *, char *, unsigned int, enum xdr_op);
951:info:build                                          ^
952:info:build 2 warnings generated.
953:info:build /usr/bin/clang -pipe -Os -DBIND_8_COMPAT -isysroot/Library/Developer/CommandLineTools/SDKs/MacOSX10.15.sdk -arch x86_64 -D_BSD_SOURCE -DHAVE_SOCKADDR_SA_LEN -DLIBNET_BSDISH_OS -DLIBNET_BSD_BYTE_SWAP -DDSNIFF_LIBDIR=\"/opt/local/lib/\" -I. -I/opt/local/include -I/opt/local/include -I/opt/local/include -I/opt/local/include -I/opt/local/include  -I./missing -c ./tcp_raw.c
954:info:build /usr/bin/clang -pipe -Os -DBIND_8_COMPAT -isysroot/Library/Developer/CommandLineTools/SDKs/MacOSX10.15.sdk -arch x86_64 -D_BSD_SOURCE -DHAVE_SOCKADDR_SA_LEN -DLIBNET_BSDISH_OS -DLIBNET_BSD_BYTE_SWAP -DDSNIFF_LIBDIR=\"/opt/local/lib/\" -I. -I/opt/local/include -I/opt/local/include -I/opt/local/include -I/opt/local/include -I/opt/local/include  -I./missing -c ./trigger.c
955:info:build ./trigger.c:300:42: warning: passing 'char [4096]' to parameter of type 'u_char *' (aka 'unsigned char *') converts between pointers to integer types with different sign [-Wpointer-sign]
956:info:build         if ((len = t->decode->dc_func(buf, len, obuf, sizeof(obuf))) > 0) {
957:info:build                                                 ^~~~
958:info:build ./trigger.c:302:36: warning: passing 'char [4096]' to parameter of type 'u_char *' (aka 'unsigned char *') converts between pointers to integer types with different sign [-Wpointer-sign]
959:info:build                        0, 0, t->decode->dc_name, obuf, len);
960:info:build                                                  ^~~~
961:info:build ./record.h:17:44: note: passing argument to parameter 'buf' here
962:info:build                u_short dport, char *name, u_char *buf, int len);
963:info:build                                                   ^
964:info:build ./trigger.c:346:42: warning: passing 'char [4096]' to parameter of type 'u_char *' (aka 'unsigned char *') converts between pointers to integer types with different sign [-Wpointer-sign]
965:info:build         if ((len = t->decode->dc_func(buf, len, obuf, sizeof(obuf))) > 0) {
966:info:build                                                 ^~~~
967:info:build ./trigger.c:349:30: warning: passing 'char [4096]' to parameter of type 'u_char *' (aka 'unsigned char *') converts between pointers to integer types with different sign [-Wpointer-sign]
968:info:build                        t->decode->dc_name, obuf, len);
969:info:build                                            ^~~~
970:info:build ./record.h:17:44: note: passing argument to parameter 'buf' here
971:info:build                u_short dport, char *name, u_char *buf, int len);
972:info:build                                                   ^
973:info:build ./trigger.c:360:6: warning: assigning to 'u_char *' (aka 'unsigned char *') from 'char *' converts between pointers to integer types with different sign [-Wpointer-sign]
974:info:build         buf = hs->data;
975:info:build             ^ ~~~~~~~~
976:info:build ./trigger.c:378:12: warning: passing 'char [4096]' to parameter of type 'u_char *' (aka 'unsigned char *') converts between pointers to integer types with different sign [-Wpointer-sign]
977:info:build                                               obuf, sizeof(obuf))) > 0) {
978:info:build                                               ^~~~
979:info:build ./trigger.c:381:11: warning: passing 'char [4096]' to parameter of type 'u_char *' (aka 'unsigned char *') converts between pointers to integer types with different sign [-Wpointer-sign]
980:info:build                                obuf, len);
981:info:build                                ^~~~
982:info:build ./record.h:17:44: note: passing argument to parameter 'buf' here
983:info:build                u_short dport, char *name, u_char *buf, int len);
984:info:build                                                   ^
985:info:build ./trigger.c:478:7: warning: passing 'char [4096]' to parameter of type 'u_char *' (aka 'unsigned char *') converts between pointers to integer types with different sign [-Wpointer-sign]
986:info:build                                          obuf, sizeof(obuf));
987:info:build                                          ^~~~
988:info:build ./trigger.c:484:11: warning: passing 'char [4096]' to parameter of type 'u_char *' (aka 'unsigned char *') converts between pointers to integer types with different sign [-Wpointer-sign]
989:info:build                                obuf, len);
990:info:build                                ^~~~
991:info:build ./record.h:17:44: note: passing argument to parameter 'buf' here
992:info:build                u_short dport, char *name, u_char *buf, int len);
993:info:build                                                   ^
994:info:build ./trigger.c:512:12: warning: passing 'char [4096]' to parameter of type 'u_char *' (aka 'unsigned char *') converts between pointers to integer types with different sign [-Wpointer-sign]
995:info:build                                               obuf, sizeof(obuf))) > 0) {
996:info:build                                               ^~~~
997:info:build ./trigger.c:514:31: warning: passing 'char [4096]' to parameter of type 'u_char *' (aka 'unsigned char *') converts between pointers to integer types with different sign [-Wpointer-sign]
998:info:build                                t->decode->dc_name, obuf, len);
999:info:build                                                    ^~~~
1000:info:build ./record.h:17:44: note: passing argument to parameter 'buf' here
1001:info:build                u_short dport, char *name, u_char *buf, int len);
1002:info:build                                                   ^
1003:info:build 11 warnings generated.
1004:info:build /usr/bin/clang -pipe -Os -DBIND_8_COMPAT -isysroot/Library/Developer/CommandLineTools/SDKs/MacOSX10.15.sdk -arch x86_64 -D_BSD_SOURCE -DHAVE_SOCKADDR_SA_LEN -DLIBNET_BSDISH_OS -DLIBNET_BSD_BYTE_SWAP -DDSNIFF_LIBDIR=\"/opt/local/lib/\" -I. -I/opt/local/include -I/opt/local/include -I/opt/local/include -I/opt/local/include -I/opt/local/include  -I./missing -c ./record.c
1005:info:build ./record.c:45:23: warning: incompatible pointer types passing 'u_long *' (aka 'unsigned long *') to parameter of type 'unsigned int *' [-Wincompatible-pointer-types]
1006:info:build         if (xdr_u_long(xdrs, (u_long *)&rec->time) &&
1007:info:build                              ^~~~~~~~~~~~~~~~~~~~
1008:info:build /Library/Developer/CommandLineTools/SDKs/MacOSX10.15.sdk/usr/include/rpc/xdr.h:374:47: note: passing argument to parameter here
1009:info:build extern bool_t   xdr_u_long(XDR *, unsigned int *);
1010:info:build                                                 ^
1011:info:build ./record.c:46:23: warning: incompatible pointer types passing 'u_long *' (aka 'unsigned long *') to parameter of type 'unsigned int *' [-Wincompatible-pointer-types]
1012:info:build             xdr_u_long(xdrs, (u_long *)&rec->src) &&
1013:info:build                              ^~~~~~~~~~~~~~~~~~~
1014:info:build /Library/Developer/CommandLineTools/SDKs/MacOSX10.15.sdk/usr/include/rpc/xdr.h:374:47: note: passing argument to parameter here
1015:info:build extern bool_t   xdr_u_long(XDR *, unsigned int *);
1016:info:build                                                 ^
1017:info:build ./record.c:47:23: warning: incompatible pointer types passing 'u_long *' (aka 'unsigned long *') to parameter of type 'unsigned int *' [-Wincompatible-pointer-types]
1018:info:build             xdr_u_long(xdrs, (u_long *)&rec->dst) &&
1019:info:build                              ^~~~~~~~~~~~~~~~~~~
1020:info:build /Library/Developer/CommandLineTools/SDKs/MacOSX10.15.sdk/usr/include/rpc/xdr.h:374:47: note: passing argument to parameter here
1021:info:build extern bool_t   xdr_u_long(XDR *, unsigned int *);
1022:info:build                                                 ^
1023:info:build ./record.c:104:18: warning: passing 'char *' to parameter of type 'const unsigned char *' converts between pointers to integer types with different sign [-Wpointer-sign]
1024:info:build         MD5Update(&ctx, rec->name.n_bytes, rec->name.n_len);
1025:info:build                         ^~~~~~~~~~~~~~~~~
1026:info:build ./missing/md5.h:11:65: note: passing argument to parameter 'buf' here
1027:info:build void MD5Update(struct MD5Context *context, unsigned char const *buf,
1028:info:build                                                                 ^
1029:info:build ./record.c:105:18: warning: passing 'char *' to parameter of type 'const unsigned char *' converts between pointers to integer types with different sign [-Wpointer-sign]
1030:info:build         MD5Update(&ctx, rec->data.n_bytes, rec->data.n_len);
1031:info:build                         ^~~~~~~~~~~~~~~~~
1032:info:build ./missing/md5.h:11:65: note: passing argument to parameter 'buf' here
1033:info:build void MD5Update(struct MD5Context *context, unsigned char const *buf,
1034:info:build                                                                 ^
1035:info:build ./record.c:121:23: warning: passing 'u_char [2048]' to parameter of type 'char *' converts between pointers to integer types with different sign [-Wpointer-sign]
1036:info:build         xdrmem_create(&xdrs, buf, sizeof(buf), XDR_ENCODE);
1037:info:build                              ^~~
1038:info:build /Library/Developer/CommandLineTools/SDKs/MacOSX10.15.sdk/usr/include/rpc/xdr.h:430:42: note: passing argument to parameter here
1039:info:build extern void   xdrmem_create(XDR *, char *, unsigned int, enum xdr_op);
1040:info:build                                          ^
1041:info:build ./record.c:133:30: error: use of undeclared identifier 'R_NOOVERWRITE'
1042:info:build         if (db->put(db, key, &data, R_NOOVERWRITE) == 0)
1043:info:build                                     ^
1044:info:build ./record.c:146:13: error: no member named 'seq' in 'struct __db'
1045:info:build         while (db->seq(db, &key, &data, R_NEXT) == 0) {
1046:info:build                ~~  ^
1047:info:build ./record.c:146:34: error: use of undeclared identifier 'R_NEXT'
1048:info:build         while (db->seq(db, &key, &data, R_NEXT) == 0) {
1049:info:build                                         ^
1050:info:build ./record.c:170:12: warning: implicit declaration of function 'dbopen' is invalid in C99 [-Wimplicit-function-declaration]
1051:info:build         if ((db = dbopen(file, flags, mode, DB_BTREE, NULL)) == NULL)
1052:info:build                   ^
1053:info:build ./record.c:170:10: warning: incompatible integer to pointer conversion assigning to 'DB *' (aka 'struct __db *') from 'int' [-Wint-conversion]
1054:info:build         if ((db = dbopen(file, flags, mode, DB_BTREE, NULL)) == NULL)
1055:info:build                 ^ ~~~~~~~~~~~~~~~~~~~~~~~~~~~~~~~~~~~~~~~~~
1056:info:build ./record.c:195:19: warning: assigning to 'char *' from 'u_char *' (aka 'unsigned char *') converts between pointers to integer types with different sign [-Wpointer-sign]
1057:info:build         rec.data.n_bytes = buf;
1058:info:build                          ^ ~~~
1059:info:build ./record.c:209:14: error: too few arguments to function call, expected 2, have 1
1060:info:build         db->close(db);
1061:info:build         ~~~~~~~~~   ^
1062:info:build 9 warnings and 4 errors generated.
1063:info:build make: *** [record.o] Error 1
1064:info:build make: Leaving directory `/opt/local/var/macports/build/_opt_local_var_macports_sources_github.com_macports_macports-ports_net_dsniff/dsniff/work/dsniff-2.4'
1065:info:build Command failed:  cd "/opt/local/var/macports/build/_opt_local_var_macports_sources_github.com_macports_macports-ports_net_dsniff/dsniff/work/dsniff-2.4" && /usr/bin/make -w all
1066:info:build Exit code: 2
1067:error:build Failed to build dsniff: command execution failed
1068:debug:build Error code: CHILDSTATUS 3568 2
1069:debug:build Backtrace: command execution failed
1070:debug:build     while executing
1071:debug:build "system {*}$notty {*}$nice $fullcmdstring"
1072:debug:build     invoked from within
1073:debug:build "command_exec build"
1074:debug:build     (procedure "portbuild::build_main" line 8)
1075:debug:build     invoked from within
1076:debug:build "$procedure $targetname"
1077:error:build See /opt/local/var/macports/logs/_opt_local_var_macports_sources_github.com_macports_macports-ports_net_dsniff/dsniff/main.log for details.