Ticket #59783: groff-SL-fail.log

File groff-SL-fail.log, 155.4 KB (added by kencu (Ken), 3 years ago)
Line 
1version:1
2:debug:sysinfo Mac OS X 10.6 (darwin/10.8.0) arch i386
3:debug:sysinfo MacPorts 2.6.99
4:debug:sysinfo Xcode 3.2.6
5:debug:sysinfo SDK 10.6
6:debug:sysinfo MACOSX_DEPLOYMENT_TARGET: 10.6
7:debug:main epoch: in tree: 0 installed: 0
8:debug:main texinfo 6.7_0 exists in the ports tree
9:debug:main texinfo 6.7_0  is the latest installed
10:debug:main texinfo 6.7_0  is active
11:debug:main Merging existing variants '' into variants
12:debug:main new fully merged portvariants:
13:debug:main Changing to port directory: /opt/local/var/macports/sources/rsync.macports.org/macports/release/tarballs/ports/textproc/texinfo
14:debug:main OS darwin/10.8.0 (macOS 10.6) arch i386
15:debug:main Sourcing PortGroup clang_dependency 1.0 from /opt/local/var/macports/sources/rsync.macports.org/macports/release/tarballs/ports/_resources/port1.0/group/clang_dependency-1.0.tcl
16:debug:main adding the default universal variant
17:debug:main Reading variant descriptions from /opt/local/var/macports/sources/rsync.macports.org/macports/release/tarballs/ports/_resources/port1.0/variant_descriptions.conf
18:debug:main Running callback portconfigure::add_automatic_compiler_dependencies
19:debug:main Chosen compiler macports-clang-3.7 is provided by a port, adding dependency
20:debug:main Adding depends_build port:clang-3.7
21:debug:main Adding depends_lib libcxx
22:debug:main Adding depends_skip_archcheck clang-3.7
23:debug:main Finished running callback portconfigure::add_automatic_compiler_dependencies
24:debug:main Running callback portbuild::add_automatic_buildsystem_dependencies
25:debug:main Finished running callback portbuild::add_automatic_buildsystem_dependencies
26:debug:main Running callback portstartupitem::add_notes
27:debug:main Finished running callback portstartupitem::add_notes
28:debug:main No need to upgrade! texinfo 6.7_0 >= texinfo 6.7_0
29:debug:main epoch: in tree: 2 installed: 2
30:debug:main gettext 0.19.8.1_2 exists in the ports tree
31:debug:main gettext 0.19.8.1_2  is the latest installed
32:debug:main gettext 0.19.8.1_2  is active
33:debug:main Merging existing variants '' into variants
34:debug:main new fully merged portvariants:
35:debug:main Changing to port directory: /opt/local/var/macports/sources/rsync.macports.org/macports/release/tarballs/ports/devel/gettext
36:debug:main OS darwin/10.8.0 (macOS 10.6) arch i386
37:debug:main Sourcing PortGroup compiler_blacklist_versions 1.0 from /opt/local/var/macports/sources/rsync.macports.org/macports/release/tarballs/ports/_resources/port1.0/group/compiler_blacklist_versions-1.0.tcl
38:debug:main Reading variant descriptions from /opt/local/var/macports/sources/rsync.macports.org/macports/release/tarballs/ports/_resources/port1.0/variant_descriptions.conf
39:debug:main Sourcing PortGroup muniversal 1.0 from /opt/local/var/macports/sources/rsync.macports.org/macports/release/tarballs/ports/_resources/port1.0/group/muniversal-1.0.tcl
40:debug:main Sourcing PortGroup clang_dependency 1.0 from /opt/local/var/macports/sources/rsync.macports.org/macports/release/tarballs/ports/_resources/port1.0/group/clang_dependency-1.0.tcl
41:debug:main compiler clang 77 blacklisted because it matches {clang < 211.10.1}
42:debug:main universal variant already exists, so not adding the default one
43:debug:main Running callback portconfigure::add_automatic_compiler_dependencies
44:debug:main Chosen compiler macports-clang-3.4 is provided by a port, adding dependency
45:debug:main Adding depends_build port:clang-3.4
46:debug:main Adding depends_lib libcxx
47:debug:main Adding depends_skip_archcheck clang-3.4
48:debug:main Finished running callback portconfigure::add_automatic_compiler_dependencies
49:debug:main Running callback portbuild::add_automatic_buildsystem_dependencies
50:debug:main Finished running callback portbuild::add_automatic_buildsystem_dependencies
51:debug:main Running callback portstartupitem::add_notes
52:debug:main Finished running callback portstartupitem::add_notes
53:debug:main No need to upgrade! gettext 0.19.8.1_2 >= gettext 0.19.8.1_2
54:debug:main epoch: in tree: 0 installed: 0
55:debug:main libiconv 1.16_0 exists in the ports tree
56:debug:main libiconv 1.16_0 +universal is the latest installed
57:debug:main libiconv 1.16_0 +universal is active
58:debug:main Merging existing variants '+universal' into variants
59:debug:main new fully merged portvariants: universal +
60:debug:main Changing to port directory: /opt/local/var/macports/sources/rsync.macports.org/macports/release/tarballs/ports/textproc/libiconv
61:debug:main OS darwin/10.8.0 (macOS 10.6) arch i386
62:debug:main Reading variant descriptions from /opt/local/var/macports/sources/rsync.macports.org/macports/release/tarballs/ports/_resources/port1.0/variant_descriptions.conf
63:debug:main Sourcing PortGroup muniversal 1.0 from /opt/local/var/macports/sources/rsync.macports.org/macports/release/tarballs/ports/_resources/port1.0/group/muniversal-1.0.tcl
64:debug:main Sourcing PortGroup clang_dependency 1.0 from /opt/local/var/macports/sources/rsync.macports.org/macports/release/tarballs/ports/_resources/port1.0/group/clang_dependency-1.0.tcl
65:debug:main universal variant already exists, so not adding the default one
66:debug:main Executing variant universal provides universal
67:debug:main Running callback portconfigure::add_automatic_compiler_dependencies
68:debug:main Chosen compiler macports-clang-3.4 is provided by a port, adding dependency
69:debug:main Adding depends_build port:clang-3.4
70:debug:main Adding depends_lib libcxx
71:debug:main Adding depends_skip_archcheck clang-3.4
72:debug:main Finished running callback portconfigure::add_automatic_compiler_dependencies
73:debug:main Running callback portbuild::add_automatic_buildsystem_dependencies
74:debug:main Finished running callback portbuild::add_automatic_buildsystem_dependencies
75:debug:main Running callback portstartupitem::add_notes
76:debug:main Finished running callback portstartupitem::add_notes
77:debug:main No need to upgrade! libiconv 1.16_0 >= libiconv 1.16_0
78:debug:main epoch: in tree: 1 installed: 1
79:debug:main libcxx 5.0.1_4 exists in the ports tree
80:debug:main libcxx 5.0.1_4 +emulated_tls+universal is the latest installed
81:debug:main libcxx 5.0.1_4 +emulated_tls+universal is active
82:debug:main Merging existing variants '+emulated_tls+universal' into variants
83:debug:main new fully merged portvariants: universal + emulated_tls +
84:debug:main Changing to port directory: /opt/local/var/macports/sources/rsync.macports.org/macports/release/tarballs/ports/lang/libcxx
85:debug:main OS darwin/10.8.0 (macOS 10.6) arch i386
86:debug:main Sourcing PortGroup compiler_blacklist_versions 1.0 from /opt/local/var/macports/sources/rsync.macports.org/macports/release/tarballs/ports/_resources/port1.0/group/compiler_blacklist_versions-1.0.tcl
87:debug:main Sourcing PortGroup active_variants 1.1 from /opt/local/var/macports/sources/rsync.macports.org/macports/release/tarballs/ports/_resources/port1.0/group/active_variants-1.1.tcl
88:debug:main Reading variant descriptions from /opt/local/var/macports/sources/rsync.macports.org/macports/release/tarballs/ports/_resources/port1.0/variant_descriptions.conf
89:debug:main clang-9.0 is installed with the following variants: +analyzer+defaultlibcxx+emulated_tls+libstdcxx
90:debug:main   required: emulated_tls, forbidden:
91:debug:main   accepted
92:debug:main Adding macports-clang-9.0 to compiler whitelist
93:debug:main clang-8.0 is installed with the following variants: +analyzer+defaultlibcxx+emulated_tls+libstdcxx
94:debug:main   required: emulated_tls, forbidden:
95:debug:main   accepted
96:debug:main Adding macports-clang-8.0 to compiler whitelist
97:debug:main clang-7.0 is installed with the following variants: +analyzer+defaultlibcxx+emulated_tls+libstdcxx
98:debug:main   required: emulated_tls, forbidden:
99:debug:main   accepted
100:debug:main Adding macports-clang-7.0 to compiler whitelist
101:debug:main clang-6.0 is installed with the following variants: +analyzer+defaultlibcxx+emulated_tls+libstdcxx
102:debug:main   required: emulated_tls, forbidden:
103:debug:main   accepted
104:debug:main Adding macports-clang-6.0 to compiler whitelist
105:debug:main clang-5.0 is installed with the following variants: +analyzer+defaultlibcxx+emulated_tls+libstdcxx
106:debug:main   required: emulated_tls, forbidden:
107:debug:main   accepted
108:debug:main Adding macports-clang-5.0 to compiler whitelist
109:debug:main compiler clang 77 blacklisted because it matches {clang < 500}
110:debug:main universal variant already exists, so not adding the default one
111:debug:main Executing variant universal provides universal
112:debug:main Executing variant emulated_tls provides emulated_tls
113:debug:main Running callback portconfigure::add_automatic_compiler_dependencies
114:debug:main Chosen compiler macports-clang-5.0 is provided by a port, adding dependency
115:debug:main Adding depends_build port:clang-5.0
116:debug:main Adding depends_skip_archcheck clang-5.0
117:debug:main Finished running callback portconfigure::add_automatic_compiler_dependencies
118:debug:main Running callback portbuild::add_automatic_buildsystem_dependencies
119:debug:main Finished running callback portbuild::add_automatic_buildsystem_dependencies
120:debug:main Running callback portstartupitem::add_notes
121:debug:main Finished running callback portstartupitem::add_notes
122:debug:main No need to upgrade! libcxx 5.0.1_4 >= libcxx 5.0.1_4
123:debug:main epoch: in tree: 0 installed: 0
124:debug:main ncurses 6.1_0 exists in the ports tree
125:debug:main ncurses 6.1_0  is the latest installed
126:debug:main ncurses 6.1_0  is active
127:debug:main Merging existing variants '' into variants
128:debug:main new fully merged portvariants:
129:debug:main Changing to port directory: /opt/local/var/macports/sources/rsync.macports.org/macports/release/tarballs/ports/devel/ncurses
130:debug:main OS darwin/10.8.0 (macOS 10.6) arch i386
131:debug:main Sourcing PortGroup clang_dependency 1.0 from /opt/local/var/macports/sources/rsync.macports.org/macports/release/tarballs/ports/_resources/port1.0/group/clang_dependency-1.0.tcl
132:debug:main adding the default universal variant
133:debug:main Reading variant descriptions from /opt/local/var/macports/sources/rsync.macports.org/macports/release/tarballs/ports/_resources/port1.0/variant_descriptions.conf
134:debug:main Running callback portconfigure::add_automatic_compiler_dependencies
135:debug:main Chosen compiler macports-clang-3.4 is provided by a port, adding dependency
136:debug:main Adding depends_build port:clang-3.4
137:debug:main Adding depends_lib libcxx
138:debug:main Adding depends_skip_archcheck clang-3.4
139:debug:main Finished running callback portconfigure::add_automatic_compiler_dependencies
140:debug:main Running callback portbuild::add_automatic_buildsystem_dependencies
141:debug:main Finished running callback portbuild::add_automatic_buildsystem_dependencies
142:debug:main Running callback portstartupitem::add_notes
143:debug:main Finished running callback portstartupitem::add_notes
144:debug:main No need to upgrade! ncurses 6.1_0 >= ncurses 6.1_0
145:debug:main epoch: in tree: 0 installed: 0
146:debug:main perl5.28 5.28.2_0 exists in the ports tree
147:debug:main perl5.28 5.28.2_0  is the latest installed
148:debug:main perl5.28 5.28.2_0  is active
149:debug:main Merging existing variants '' into variants
150:debug:main new fully merged portvariants:
151:debug:main Changing to port directory: /opt/local/var/macports/sources/rsync.macports.org/macports/release/tarballs/ports/lang/perl5
152:debug:main OS darwin/10.8.0 (macOS 10.6) arch i386
153:debug:main Re-registering default for configure.universal_args
154:debug:main Sourcing PortGroup perl5 1.0 from /opt/local/var/macports/sources/rsync.macports.org/macports/release/tarballs/ports/_resources/port1.0/group/perl5-1.0.tcl
155:debug:main Sourcing PortGroup clang_dependency 1.0 from /opt/local/var/macports/sources/rsync.macports.org/macports/release/tarballs/ports/_resources/port1.0/group/clang_dependency-1.0.tcl
156:debug:main adding the default universal variant
157:debug:main Reading variant descriptions from /opt/local/var/macports/sources/rsync.macports.org/macports/release/tarballs/ports/_resources/port1.0/variant_descriptions.conf
158:debug:main Running callback portconfigure::add_automatic_compiler_dependencies
159:debug:main Chosen compiler macports-clang-3.4 is provided by a port, adding dependency
160:debug:main Adding depends_build port:clang-3.4
161:debug:main Adding depends_lib libcxx
162:debug:main Adding depends_skip_archcheck clang-3.4
163:debug:main Finished running callback portconfigure::add_automatic_compiler_dependencies
164:debug:main Running callback portbuild::add_automatic_buildsystem_dependencies
165:debug:main Finished running callback portbuild::add_automatic_buildsystem_dependencies
166:debug:main Running callback portstartupitem::add_notes
167:debug:main Finished running callback portstartupitem::add_notes
168:debug:main No need to upgrade! perl5.28 5.28.2_0 >= perl5.28 5.28.2_0
169:debug:main epoch: in tree: 0 installed: 0
170:debug:main db48 4.8.30_4 exists in the ports tree
171:debug:main db48 4.8.30_4 +java is the latest installed
172:debug:main db48 4.8.30_4 +java is active
173:debug:main Merging existing variants '+java' into variants
174:debug:main new fully merged portvariants: java +
175:debug:main Changing to port directory: /opt/local/var/macports/sources/rsync.macports.org/macports/release/tarballs/ports/databases/db48
176:debug:main OS darwin/10.8.0 (macOS 10.6) arch i386
177:debug:main Reading variant descriptions from /opt/local/var/macports/sources/rsync.macports.org/macports/release/tarballs/ports/_resources/port1.0/variant_descriptions.conf
178:debug:main Sourcing PortGroup muniversal 1.0 from /opt/local/var/macports/sources/rsync.macports.org/macports/release/tarballs/ports/_resources/port1.0/group/muniversal-1.0.tcl
179:debug:main Sourcing PortGroup clang_dependency 1.0 from /opt/local/var/macports/sources/rsync.macports.org/macports/release/tarballs/ports/_resources/port1.0/group/clang_dependency-1.0.tcl
180:debug:main universal variant already exists, so not adding the default one
181:debug:main Executing variant java provides java
182:debug:main Running callback portconfigure::add_automatic_compiler_dependencies
183:debug:main Chosen compiler macports-clang-3.4 is provided by a port, adding dependency
184:debug:main Adding depends_build port:clang-3.4
185:debug:main Adding depends_lib libcxx
186:debug:main Adding depends_skip_archcheck clang-3.4
187:debug:main Finished running callback portconfigure::add_automatic_compiler_dependencies
188:debug:main Running callback portbuild::add_automatic_buildsystem_dependencies
189:debug:main Finished running callback portbuild::add_automatic_buildsystem_dependencies
190:debug:main Running callback portstartupitem::add_notes
191:debug:main Finished running callback portstartupitem::add_notes
192:debug:main No need to upgrade! db48 4.8.30_4 >= db48 4.8.30_4
193:debug:main epoch: in tree: 0 installed: 0
194:debug:main gdbm 1.18.1_1 exists in the ports tree
195:debug:main gdbm 1.18.1_1  is the latest installed
196:debug:main gdbm 1.18.1_1  is active
197:debug:main Merging existing variants '' into variants
198:debug:main new fully merged portvariants:
199:debug:main Changing to port directory: /opt/local/var/macports/sources/rsync.macports.org/macports/release/tarballs/ports/databases/gdbm
200:debug:main OS darwin/10.8.0 (macOS 10.6) arch i386
201:debug:main Sourcing PortGroup clang_dependency 1.0 from /opt/local/var/macports/sources/rsync.macports.org/macports/release/tarballs/ports/_resources/port1.0/group/clang_dependency-1.0.tcl
202:debug:main adding the default universal variant
203:debug:main Reading variant descriptions from /opt/local/var/macports/sources/rsync.macports.org/macports/release/tarballs/ports/_resources/port1.0/variant_descriptions.conf
204:debug:main Running callback portconfigure::add_automatic_compiler_dependencies
205:debug:main Chosen compiler macports-clang-3.4 is provided by a port, adding dependency
206:debug:main Adding depends_build port:clang-3.4
207:debug:main Adding depends_lib libcxx
208:debug:main Adding depends_skip_archcheck clang-3.4
209:debug:main Finished running callback portconfigure::add_automatic_compiler_dependencies
210:debug:main Running callback portbuild::add_automatic_buildsystem_dependencies
211:debug:main Finished running callback portbuild::add_automatic_buildsystem_dependencies
212:debug:main Running callback portstartupitem::add_notes
213:debug:main Finished running callback portstartupitem::add_notes
214:debug:main No need to upgrade! gdbm 1.18.1_1 >= gdbm 1.18.1_1
215:debug:main epoch: in tree: 0 installed: 0
216:debug:main readline 8.0.000_0 exists in the ports tree
217:debug:main readline 8.0.000_0  is the latest installed
218:debug:main readline 8.0.000_0  is active
219:debug:main Merging existing variants '' into variants
220:debug:main new fully merged portvariants:
221:debug:main Changing to port directory: /opt/local/var/macports/sources/rsync.macports.org/macports/release/tarballs/ports/devel/readline
222:debug:main OS darwin/10.8.0 (macOS 10.6) arch i386
223:debug:main Reading variant descriptions from /opt/local/var/macports/sources/rsync.macports.org/macports/release/tarballs/ports/_resources/port1.0/variant_descriptions.conf
224:debug:main Sourcing PortGroup muniversal 1.0 from /opt/local/var/macports/sources/rsync.macports.org/macports/release/tarballs/ports/_resources/port1.0/group/muniversal-1.0.tcl
225:debug:main Sourcing PortGroup clang_dependency 1.0 from /opt/local/var/macports/sources/rsync.macports.org/macports/release/tarballs/ports/_resources/port1.0/group/clang_dependency-1.0.tcl
226:debug:main universal variant already exists, so not adding the default one
227:debug:main Running callback portconfigure::add_automatic_compiler_dependencies
228:debug:main Chosen compiler macports-clang-3.4 is provided by a port, adding dependency
229:debug:main Adding depends_build port:clang-3.4
230:debug:main Adding depends_lib libcxx
231:debug:main Adding depends_skip_archcheck clang-3.4
232:debug:main Finished running callback portconfigure::add_automatic_compiler_dependencies
233:debug:main Running callback portbuild::add_automatic_buildsystem_dependencies
234:debug:main Finished running callback portbuild::add_automatic_buildsystem_dependencies
235:debug:main Running callback portstartupitem::add_notes
236:debug:main Finished running callback portstartupitem::add_notes
237:debug:main No need to upgrade! readline 8.0.000_0 >= readline 8.0.000_0
238:debug:main epoch: in tree: 1 installed: 1
239:debug:main clang-9.0 9.0.0_0 exists in the ports tree
240:debug:main clang-9.0 9.0.0_0 +analyzer+defaultlibcxx+emulated_tls+libstdcxx is the latest installed
241:debug:main clang-9.0 9.0.0_0 +analyzer+defaultlibcxx+emulated_tls+libstdcxx is active
242:debug:main Merging existing variants '+analyzer+defaultlibcxx+emulated_tls+libstdcxx' into variants
243:debug:main new fully merged portvariants: libstdcxx + analyzer + emulated_tls + defaultlibcxx +
244:debug:main Changing to port directory: /opt/local/var/macports/sources/rsync.macports.org/macports/release/tarballs/ports/lang/llvm-9.0
245:debug:main OS darwin/10.8.0 (macOS 10.6) arch i386
246:debug:main Sourcing PortGroup select 1.0 from /opt/local/var/macports/sources/rsync.macports.org/macports/release/tarballs/ports/_resources/port1.0/group/select-1.0.tcl
247:debug:main Sourcing PortGroup compiler_blacklist_versions 1.0 from /opt/local/var/macports/sources/rsync.macports.org/macports/release/tarballs/ports/_resources/port1.0/group/compiler_blacklist_versions-1.0.tcl
248:debug:main Sourcing PortGroup active_variants 1.1 from /opt/local/var/macports/sources/rsync.macports.org/macports/release/tarballs/ports/_resources/port1.0/group/active_variants-1.1.tcl
249:debug:main Re-registering default for configure.dir
250:debug:main Re-registering default for configure.pre_args
251:debug:main Re-registering default for build.dir
252:debug:main Re-registering default for destroot.target
253:debug:main Sourcing PortGroup cmake 1.0 from /opt/local/var/macports/sources/rsync.macports.org/macports/release/tarballs/ports/_resources/port1.0/group/cmake-1.0.tcl
254:debug:main Re-registering default for configure.dir
255:debug:main Re-registering default for build.dir
256:debug:main compiler clang 77 blacklisted because it matches {clang < 602}
257:debug:main Reading variant descriptions from /opt/local/var/macports/sources/rsync.macports.org/macports/release/tarballs/ports/_resources/port1.0/variant_descriptions.conf
258:debug:main universal variant already exists, so not adding the default one
259:debug:main Executing variant emulated_tls provides emulated_tls
260:debug:main Executing variant analyzer provides analyzer
261:debug:main Executing variant defaultlibcxx provides defaultlibcxx
262:debug:main Executing variant libstdcxx provides libstdcxx
263:debug:main Running callback portconfigure::add_automatic_compiler_dependencies
264:debug:main Chosen compiler macports-clang-3.7 is provided by a port, adding dependency
265:debug:main Adding depends_build port:clang-3.7
266:debug:main Adding depends_lib libcxx
267:debug:main Adding depends_skip_archcheck clang-3.7
268:debug:main Finished running callback portconfigure::add_automatic_compiler_dependencies
269:debug:main Running callback portbuild::add_automatic_buildsystem_dependencies
270:debug:main Finished running callback portbuild::add_automatic_buildsystem_dependencies
271:debug:main Running callback portstartupitem::add_notes
272:debug:main Finished running callback portstartupitem::add_notes
273:debug:main No need to upgrade! clang-9.0 9.0.0_0 >= clang-9.0 9.0.0_0
274:debug:main epoch: in tree: 0 installed: 0
275:debug:main libxml2 2.9.10_0 exists in the ports tree
276:debug:main libxml2 2.9.10_0  is the latest installed
277:debug:main libxml2 2.9.10_0  is active
278:debug:main Merging existing variants '' into variants
279:debug:main new fully merged portvariants:
280:debug:main Changing to port directory: /opt/local/var/macports/sources/rsync.macports.org/macports/release/tarballs/ports/textproc/libxml2
281:debug:main OS darwin/10.8.0 (macOS 10.6) arch i386
282:debug:main Sourcing PortGroup clang_dependency 1.0 from /opt/local/var/macports/sources/rsync.macports.org/macports/release/tarballs/ports/_resources/port1.0/group/clang_dependency-1.0.tcl
283:debug:main adding the default universal variant
284:debug:main Reading variant descriptions from /opt/local/var/macports/sources/rsync.macports.org/macports/release/tarballs/ports/_resources/port1.0/variant_descriptions.conf
285:debug:main Running callback portconfigure::add_automatic_compiler_dependencies
286:debug:main Chosen compiler macports-clang-3.4 is provided by a port, adding dependency
287:debug:main Adding depends_build port:clang-3.4
288:debug:main Adding depends_lib libcxx
289:debug:main Adding depends_skip_archcheck clang-3.4
290:debug:main Finished running callback portconfigure::add_automatic_compiler_dependencies
291:debug:main Running callback portbuild::add_automatic_buildsystem_dependencies
292:debug:main Finished running callback portbuild::add_automatic_buildsystem_dependencies
293:debug:main Running callback portstartupitem::add_notes
294:debug:main Finished running callback portstartupitem::add_notes
295:debug:main No need to upgrade! libxml2 2.9.10_0 >= libxml2 2.9.10_0
296:debug:main epoch: in tree: 0 installed: 0
297:debug:main icu 65.1_1 exists in the ports tree
298:debug:main icu 65.1_1  is the latest installed
299:debug:main icu 65.1_1  is active
300:debug:main Merging existing variants '' into variants
301:debug:main new fully merged portvariants:
302:debug:main Changing to port directory: /opt/local/var/macports/sources/rsync.macports.org/macports/release/tarballs/ports/devel/icu
303:debug:main OS darwin/10.8.0 (macOS 10.6) arch i386
304:debug:main Sourcing PortGroup clang_dependency 1.0 from /opt/local/var/macports/sources/rsync.macports.org/macports/release/tarballs/ports/_resources/port1.0/group/clang_dependency-1.0.tcl
305:debug:main Reading variant descriptions from /opt/local/var/macports/sources/rsync.macports.org/macports/release/tarballs/ports/_resources/port1.0/variant_descriptions.conf
306:debug:main Sourcing PortGroup muniversal 1.0 from /opt/local/var/macports/sources/rsync.macports.org/macports/release/tarballs/ports/_resources/port1.0/group/muniversal-1.0.tcl
307:debug:main universal variant already exists, so not adding the default one
308:debug:main Running callback portconfigure::add_automatic_compiler_dependencies
309:debug:main Chosen compiler macports-clang-3.4 is provided by a port, adding dependency
310:debug:main Adding depends_build port:clang-3.4
311:debug:main Adding depends_lib libcxx
312:debug:main Adding depends_skip_archcheck clang-3.4
313:debug:main Finished running callback portconfigure::add_automatic_compiler_dependencies
314:debug:main Running callback portbuild::add_automatic_buildsystem_dependencies
315:debug:main Finished running callback portbuild::add_automatic_buildsystem_dependencies
316:debug:main Running callback portstartupitem::add_notes
317:debug:main Finished running callback portstartupitem::add_notes
318:debug:main No need to upgrade! icu 65.1_1 >= icu 65.1_1
319:debug:main epoch: in tree: 0 installed: 0
320:debug:main xz 5.2.4_0 exists in the ports tree
321:debug:main xz 5.2.4_0  is the latest installed
322:debug:main xz 5.2.4_0  is active
323:debug:main Merging existing variants '' into variants
324:debug:main new fully merged portvariants:
325:debug:main Changing to port directory: /opt/local/var/macports/sources/rsync.macports.org/macports/release/tarballs/ports/archivers/xz
326:debug:main OS darwin/10.8.0 (macOS 10.6) arch i386
327:debug:main Sourcing PortGroup clang_dependency 1.0 from /opt/local/var/macports/sources/rsync.macports.org/macports/release/tarballs/ports/_resources/port1.0/group/clang_dependency-1.0.tcl
328:debug:main adding the default universal variant
329:debug:main Reading variant descriptions from /opt/local/var/macports/sources/rsync.macports.org/macports/release/tarballs/ports/_resources/port1.0/variant_descriptions.conf
330:debug:main Running callback portconfigure::add_automatic_compiler_dependencies
331:debug:main Chosen compiler macports-clang-3.4 is provided by a port, adding dependency
332:debug:main Adding depends_build port:clang-3.4
333:debug:main Adding depends_lib libcxx
334:debug:main Adding depends_skip_archcheck clang-3.4
335:debug:main Finished running callback portconfigure::add_automatic_compiler_dependencies
336:debug:main Running callback portbuild::add_automatic_buildsystem_dependencies
337:debug:main Finished running callback portbuild::add_automatic_buildsystem_dependencies
338:debug:main Running callback portstartupitem::add_notes
339:debug:main Finished running callback portstartupitem::add_notes
340:debug:main No need to upgrade! xz 5.2.4_0 >= xz 5.2.4_0
341:debug:main epoch: in tree: 0 installed: 0
342:debug:main zlib 1.2.11_0 exists in the ports tree
343:debug:main zlib 1.2.11_0 +universal is the latest installed
344:debug:main zlib 1.2.11_0 +universal is active
345:debug:main Merging existing variants '+universal' into variants
346:debug:main new fully merged portvariants: universal +
347:debug:main Changing to port directory: /opt/local/var/macports/sources/rsync.macports.org/macports/release/tarballs/ports/archivers/zlib
348:debug:main OS darwin/10.8.0 (macOS 10.6) arch i386
349:debug:main Sourcing PortGroup xcodeversion 1.0 from /opt/local/var/macports/sources/rsync.macports.org/macports/release/tarballs/ports/_resources/port1.0/group/xcodeversion-1.0.tcl
350:debug:main adding the default universal variant
351:debug:main Reading variant descriptions from /opt/local/var/macports/sources/rsync.macports.org/macports/release/tarballs/ports/_resources/port1.0/variant_descriptions.conf
352:debug:main Executing variant universal provides universal
353:debug:main Running callback portconfigure::add_automatic_compiler_dependencies
354:debug:main Finished running callback portconfigure::add_automatic_compiler_dependencies
355:debug:main Running callback portbuild::add_automatic_buildsystem_dependencies
356:debug:main Finished running callback portbuild::add_automatic_buildsystem_dependencies
357:debug:main Running callback portstartupitem::add_notes
358:debug:main Finished running callback portstartupitem::add_notes
359:debug:main No need to upgrade! zlib 1.2.11_0 >= zlib 1.2.11_0
360:debug:main epoch: in tree: 1 installed: 1
361:debug:main libomp 9.0.0_0 exists in the ports tree
362:debug:main libomp 9.0.0_0 +universal is the latest installed
363:debug:main libomp 9.0.0_0 +universal is active
364:debug:main Merging existing variants '+universal' into variants
365:debug:main new fully merged portvariants: universal +
366:debug:main Changing to port directory: /opt/local/var/macports/sources/rsync.macports.org/macports/release/tarballs/ports/lang/libomp
367:debug:main OS darwin/10.8.0 (macOS 10.6) arch i386
368:debug:main Re-registering default for configure.dir
369:debug:main Re-registering default for configure.pre_args
370:debug:main Re-registering default for build.dir
371:debug:main Re-registering default for destroot.target
372:debug:main Sourcing PortGroup cmake 1.0 from /opt/local/var/macports/sources/rsync.macports.org/macports/release/tarballs/ports/_resources/port1.0/group/cmake-1.0.tcl
373:debug:main Reading variant descriptions from /opt/local/var/macports/sources/rsync.macports.org/macports/release/tarballs/ports/_resources/port1.0/variant_descriptions.conf
374:debug:main Sourcing PortGroup muniversal 1.0 from /opt/local/var/macports/sources/rsync.macports.org/macports/release/tarballs/ports/_resources/port1.0/group/muniversal-1.0.tcl
375:debug:main Sourcing PortGroup compiler_blacklist_versions 1.0 from /opt/local/var/macports/sources/rsync.macports.org/macports/release/tarballs/ports/_resources/port1.0/group/compiler_blacklist_versions-1.0.tcl
376:debug:main Sourcing PortGroup github 1.0 from /opt/local/var/macports/sources/rsync.macports.org/macports/release/tarballs/ports/_resources/port1.0/group/github-1.0.tcl
377:debug:main compiler clang 77 blacklisted because it matches {clang < 500}
378:debug:main universal variant already exists, so not adding the default one
379:debug:main Executing variant universal provides universal
380:debug:main Running callback portconfigure::add_automatic_compiler_dependencies
381:debug:main Chosen compiler macports-clang-9.0 is provided by a port, adding dependency
382:debug:main Adding depends_build port:clang-9.0
383:debug:main Adding depends_lib libcxx
384:debug:main Adding depends_skip_archcheck clang-9.0
385:debug:main Finished running callback portconfigure::add_automatic_compiler_dependencies
386:debug:main Running callback portbuild::add_automatic_buildsystem_dependencies
387:debug:main Finished running callback portbuild::add_automatic_buildsystem_dependencies
388:debug:main Running callback portstartupitem::add_notes
389:debug:main Finished running callback portstartupitem::add_notes
390:debug:main No need to upgrade! libomp 9.0.0_0 >= libomp 9.0.0_0
391:debug:main epoch: in tree: 1 installed: 1
392:debug:main llvm-9.0 9.0.0_0 exists in the ports tree
393:debug:main llvm-9.0 9.0.0_0 +emulated_tls is the latest installed
394:debug:main llvm-9.0 9.0.0_0 +emulated_tls is active
395:debug:main Merging existing variants '+emulated_tls' into variants
396:debug:main new fully merged portvariants: emulated_tls +
397:debug:main Changing to port directory: /opt/local/var/macports/sources/rsync.macports.org/macports/release/tarballs/ports/lang/llvm-9.0
398:debug:main OS darwin/10.8.0 (macOS 10.6) arch i386
399:debug:main Sourcing PortGroup select 1.0 from /opt/local/var/macports/sources/rsync.macports.org/macports/release/tarballs/ports/_resources/port1.0/group/select-1.0.tcl
400:debug:main Sourcing PortGroup compiler_blacklist_versions 1.0 from /opt/local/var/macports/sources/rsync.macports.org/macports/release/tarballs/ports/_resources/port1.0/group/compiler_blacklist_versions-1.0.tcl
401:debug:main Sourcing PortGroup active_variants 1.1 from /opt/local/var/macports/sources/rsync.macports.org/macports/release/tarballs/ports/_resources/port1.0/group/active_variants-1.1.tcl
402:debug:main Re-registering default for configure.dir
403:debug:main Re-registering default for configure.pre_args
404:debug:main Re-registering default for build.dir
405:debug:main Re-registering default for destroot.target
406:debug:main Sourcing PortGroup cmake 1.0 from /opt/local/var/macports/sources/rsync.macports.org/macports/release/tarballs/ports/_resources/port1.0/group/cmake-1.0.tcl
407:debug:main Re-registering default for configure.dir
408:debug:main Re-registering default for build.dir
409:debug:main compiler clang 77 blacklisted because it matches {clang < 602}
410:debug:main Reading variant descriptions from /opt/local/var/macports/sources/rsync.macports.org/macports/release/tarballs/ports/_resources/port1.0/variant_descriptions.conf
411:debug:main universal variant already exists, so not adding the default one
412:debug:main Executing variant emulated_tls provides emulated_tls
413:debug:main Running callback portconfigure::add_automatic_compiler_dependencies
414:debug:main Chosen compiler macports-clang-3.7 is provided by a port, adding dependency
415:debug:main Adding depends_build port:clang-3.7
416:debug:main Adding depends_lib libcxx
417:debug:main Adding depends_skip_archcheck clang-3.7
418:debug:main Finished running callback portconfigure::add_automatic_compiler_dependencies
419:debug:main Running callback portbuild::add_automatic_buildsystem_dependencies
420:debug:main Finished running callback portbuild::add_automatic_buildsystem_dependencies
421:debug:main Running callback portstartupitem::add_notes
422:debug:main Finished running callback portstartupitem::add_notes
423:debug:main No need to upgrade! llvm-9.0 9.0.0_0 >= llvm-9.0 9.0.0_0
424:debug:main epoch: in tree: 20090923 installed: 20090923
425:debug:main libedit 20191025-3.1_0 exists in the ports tree
426:debug:main libedit 20191025-3.1_0  is the latest installed
427:debug:main libedit 20191025-3.1_0  is active
428:debug:main Merging existing variants '' into variants
429:debug:main new fully merged portvariants:
430:debug:main Changing to port directory: /opt/local/var/macports/sources/rsync.macports.org/macports/release/tarballs/ports/devel/libedit
431:debug:main OS darwin/10.8.0 (macOS 10.6) arch i386
432:debug:main Reading variant descriptions from /opt/local/var/macports/sources/rsync.macports.org/macports/release/tarballs/ports/_resources/port1.0/variant_descriptions.conf
433:debug:main Sourcing PortGroup muniversal 1.0 from /opt/local/var/macports/sources/rsync.macports.org/macports/release/tarballs/ports/_resources/port1.0/group/muniversal-1.0.tcl
434:debug:main Sourcing PortGroup clang_dependency 1.0 from /opt/local/var/macports/sources/rsync.macports.org/macports/release/tarballs/ports/_resources/port1.0/group/clang_dependency-1.0.tcl
435:debug:main universal variant already exists, so not adding the default one
436:debug:main Running callback portconfigure::add_automatic_compiler_dependencies
437:debug:main Chosen compiler macports-clang-3.4 is provided by a port, adding dependency
438:debug:main Adding depends_build port:clang-3.4
439:debug:main Adding depends_lib libcxx
440:debug:main Adding depends_skip_archcheck clang-3.4
441:debug:main Finished running callback portconfigure::add_automatic_compiler_dependencies
442:debug:main Running callback portbuild::add_automatic_buildsystem_dependencies
443:debug:main Finished running callback portbuild::add_automatic_buildsystem_dependencies
444:debug:main Running callback portstartupitem::add_notes
445:debug:main Finished running callback portstartupitem::add_notes
446:debug:main No need to upgrade! libedit 20191025-3.1_0 >= libedit 20191025-3.1_0
447:debug:main epoch: in tree: 0 installed: 0
448:debug:main libffi 3.2.1_0 exists in the ports tree
449:debug:main libffi 3.2.1_0  is the latest installed
450:debug:main libffi 3.2.1_0  is active
451:debug:main Merging existing variants '' into variants
452:debug:main new fully merged portvariants:
453:debug:main Changing to port directory: /opt/local/var/macports/sources/rsync.macports.org/macports/release/tarballs/ports/devel/libffi
454:debug:main OS darwin/10.8.0 (macOS 10.6) arch i386
455:debug:main Reading variant descriptions from /opt/local/var/macports/sources/rsync.macports.org/macports/release/tarballs/ports/_resources/port1.0/variant_descriptions.conf
456:debug:main Sourcing PortGroup muniversal 1.0 from /opt/local/var/macports/sources/rsync.macports.org/macports/release/tarballs/ports/_resources/port1.0/group/muniversal-1.0.tcl
457:debug:main universal variant already exists, so not adding the default one
458:debug:main Running callback portconfigure::add_automatic_compiler_dependencies
459:debug:main Finished running callback portconfigure::add_automatic_compiler_dependencies
460:debug:main Running callback portbuild::add_automatic_buildsystem_dependencies
461:debug:main Finished running callback portbuild::add_automatic_buildsystem_dependencies
462:debug:main Running callback portstartupitem::add_notes
463:debug:main Finished running callback portstartupitem::add_notes
464:debug:main No need to upgrade! libffi 3.2.1_0 >= libffi 3.2.1_0
465:debug:main epoch: in tree: 0 installed: 0
466:debug:main xar 1.6.1_4 exists in the ports tree
467:debug:main xar 1.6.1_4  is the latest installed
468:debug:main xar 1.6.1_4  is active
469:debug:main Merging existing variants '' into variants
470:debug:main new fully merged portvariants:
471:debug:main Changing to port directory: /opt/local/var/macports/sources/rsync.macports.org/macports/release/tarballs/ports/archivers/xar
472:debug:main OS darwin/10.8.0 (macOS 10.6) arch i386
473:debug:main Sourcing PortGroup github 1.0 from /opt/local/var/macports/sources/rsync.macports.org/macports/release/tarballs/ports/_resources/port1.0/group/github-1.0.tcl
474:debug:main Sourcing PortGroup clang_dependency 1.0 from /opt/local/var/macports/sources/rsync.macports.org/macports/release/tarballs/ports/_resources/port1.0/group/clang_dependency-1.0.tcl
475:debug:main Re-registering default for livecheck.regex
476:debug:main adding the default universal variant
477:debug:main Reading variant descriptions from /opt/local/var/macports/sources/rsync.macports.org/macports/release/tarballs/ports/_resources/port1.0/variant_descriptions.conf
478:debug:main Running callback portconfigure::add_automatic_compiler_dependencies
479:debug:main Chosen compiler macports-clang-3.7 is provided by a port, adding dependency
480:debug:main Adding depends_build port:clang-3.7
481:debug:main Adding depends_lib libcxx
482:debug:main Adding depends_skip_archcheck clang-3.7
483:debug:main Finished running callback portconfigure::add_automatic_compiler_dependencies
484:debug:main Running callback portbuild::add_automatic_buildsystem_dependencies
485:debug:main Finished running callback portbuild::add_automatic_buildsystem_dependencies
486:debug:main Running callback portstartupitem::add_notes
487:debug:main Finished running callback portstartupitem::add_notes
488:debug:main No need to upgrade! xar 1.6.1_4 >= xar 1.6.1_4
489:debug:main epoch: in tree: 0 installed: 0
490:debug:main bzip2 1.0.8_0 exists in the ports tree
491:debug:main bzip2 1.0.8_0  is the latest installed
492:debug:main bzip2 1.0.8_0  is active
493:debug:main Merging existing variants '' into variants
494:debug:main new fully merged portvariants:
495:debug:main Changing to port directory: /opt/local/var/macports/sources/rsync.macports.org/macports/release/tarballs/ports/archivers/bzip2
496:debug:main OS darwin/10.8.0 (macOS 10.6) arch i386
497:debug:main Reading variant descriptions from /opt/local/var/macports/sources/rsync.macports.org/macports/release/tarballs/ports/_resources/port1.0/variant_descriptions.conf
498:debug:main universal variant already exists, so not adding the default one
499:debug:main Running callback portconfigure::add_automatic_compiler_dependencies
500:debug:main Finished running callback portconfigure::add_automatic_compiler_dependencies
501:debug:main Running callback portbuild::add_automatic_buildsystem_dependencies
502:debug:main Finished running callback portbuild::add_automatic_buildsystem_dependencies
503:debug:main Running callback portstartupitem::add_notes
504:debug:main Finished running callback portstartupitem::add_notes
505:debug:main No need to upgrade! bzip2 1.0.8_0 >= bzip2 1.0.8_0
506:debug:main epoch: in tree: 1 installed: 1
507:debug:main openssl 1.1.1d_0 exists in the ports tree
508:debug:main openssl 1.1.1d_0  is the latest installed
509:debug:main openssl 1.1.1d_0  is active
510:debug:main Merging existing variants '' into variants
511:debug:main new fully merged portvariants:
512:debug:main Changing to port directory: /opt/local/var/macports/sources/rsync.macports.org/macports/release/tarballs/ports/devel/openssl
513:debug:main OS darwin/10.8.0 (macOS 10.6) arch i386
514:debug:main Reading variant descriptions from /opt/local/var/macports/sources/rsync.macports.org/macports/release/tarballs/ports/_resources/port1.0/variant_descriptions.conf
515:debug:main Sourcing PortGroup muniversal 1.0 from /opt/local/var/macports/sources/rsync.macports.org/macports/release/tarballs/ports/_resources/port1.0/group/muniversal-1.0.tcl
516:debug:main universal variant already exists, so not adding the default one
517:debug:main Running callback portconfigure::add_automatic_compiler_dependencies
518:debug:main Finished running callback portconfigure::add_automatic_compiler_dependencies
519:debug:main Running callback portbuild::add_automatic_buildsystem_dependencies
520:debug:main Finished running callback portbuild::add_automatic_buildsystem_dependencies
521:debug:main Running callback portstartupitem::add_notes
522:debug:main Finished running callback portstartupitem::add_notes
523:debug:main No need to upgrade! openssl 1.1.1d_0 >= openssl 1.1.1d_0
524:debug:main epoch: in tree: 0 installed: 0
525:debug:main perl5 5.26.1_0 exists in the ports tree
526:debug:main perl5 5.26.1_0 +perl5_26 is the latest installed
527:debug:main perl5 5.26.1_0 +perl5_26 is active
528:debug:main Merging existing variants '+perl5_26' into variants
529:debug:main new fully merged portvariants: perl5_26 +
530:debug:main Changing to port directory: /opt/local/var/macports/sources/rsync.macports.org/macports/release/tarballs/ports/lang/perl5
531:debug:main OS darwin/10.8.0 (macOS 10.6) arch i386
532:debug:main Re-registering default for configure.universal_args
533:debug:main Sourcing PortGroup perl5 1.0 from /opt/local/var/macports/sources/rsync.macports.org/macports/release/tarballs/ports/_resources/port1.0/group/perl5-1.0.tcl
534:debug:main Sourcing PortGroup clang_dependency 1.0 from /opt/local/var/macports/sources/rsync.macports.org/macports/release/tarballs/ports/_resources/port1.0/group/clang_dependency-1.0.tcl
535:debug:main universal_variant is false, so not adding the default universal variant
536:debug:main Executing variant perl5_26 provides perl5_26
537:debug:main Running callback portconfigure::add_automatic_compiler_dependencies
538:debug:main Finished running callback portconfigure::add_automatic_compiler_dependencies
539:debug:main Running callback portbuild::add_automatic_buildsystem_dependencies
540:debug:main Finished running callback portbuild::add_automatic_buildsystem_dependencies
541:debug:main Running callback portstartupitem::add_notes
542:debug:main Finished running callback portstartupitem::add_notes
543:debug:main No need to upgrade! perl5 5.26.1_0 >= perl5 5.26.1_0
544:debug:main epoch: in tree: 0 installed: 0
545:debug:main perl5.26 5.26.3_2 exists in the ports tree
546:debug:main perl5.26 5.26.3_2  is the latest installed
547:debug:main perl5.26 5.26.3_2  is active
548:debug:main Merging existing variants '' into variants
549:debug:main new fully merged portvariants:
550:debug:main Changing to port directory: /opt/local/var/macports/sources/rsync.macports.org/macports/release/tarballs/ports/lang/perl5
551:debug:main OS darwin/10.8.0 (macOS 10.6) arch i386
552:debug:main Re-registering default for configure.universal_args
553:debug:main Sourcing PortGroup perl5 1.0 from /opt/local/var/macports/sources/rsync.macports.org/macports/release/tarballs/ports/_resources/port1.0/group/perl5-1.0.tcl
554:debug:main Sourcing PortGroup clang_dependency 1.0 from /opt/local/var/macports/sources/rsync.macports.org/macports/release/tarballs/ports/_resources/port1.0/group/clang_dependency-1.0.tcl
555:debug:main adding the default universal variant
556:debug:main Reading variant descriptions from /opt/local/var/macports/sources/rsync.macports.org/macports/release/tarballs/ports/_resources/port1.0/variant_descriptions.conf
557:debug:main Running callback portconfigure::add_automatic_compiler_dependencies
558:debug:main Chosen compiler macports-clang-3.4 is provided by a port, adding dependency
559:debug:main Adding depends_build port:clang-3.4
560:debug:main Adding depends_lib libcxx
561:debug:main Adding depends_skip_archcheck clang-3.4
562:debug:main Finished running callback portconfigure::add_automatic_compiler_dependencies
563:debug:main Running callback portbuild::add_automatic_buildsystem_dependencies
564:debug:main Finished running callback portbuild::add_automatic_buildsystem_dependencies
565:debug:main Running callback portstartupitem::add_notes
566:debug:main Finished running callback portstartupitem::add_notes
567:debug:main No need to upgrade! perl5.26 5.26.3_2 >= perl5.26 5.26.3_2
568:debug:main epoch: in tree: 0 installed: 0
569:debug:main llvm_select 2_0 exists in the ports tree
570:debug:main llvm_select 2_0  is the latest installed
571:debug:main llvm_select 2_0  is active
572:debug:main Merging existing variants '' into variants
573:debug:main new fully merged portvariants:
574:debug:main Changing to port directory: /opt/local/var/macports/sources/rsync.macports.org/macports/release/tarballs/ports/sysutils/llvm_select
575:debug:main OS darwin/10.8.0 (macOS 10.6) arch i386
576:debug:main Sourcing PortGroup select 1.0 from /opt/local/var/macports/sources/rsync.macports.org/macports/release/tarballs/ports/_resources/port1.0/group/select-1.0.tcl
577:debug:main universal_variant is false, so not adding the default universal variant
578:debug:main Running callback portconfigure::add_automatic_compiler_dependencies
579:debug:main Finished running callback portconfigure::add_automatic_compiler_dependencies
580:debug:main Running callback portbuild::add_automatic_buildsystem_dependencies
581:debug:main Finished running callback portbuild::add_automatic_buildsystem_dependencies
582:debug:main Running callback portstartupitem::add_notes
583:debug:main Finished running callback portstartupitem::add_notes
584:debug:main No need to upgrade! llvm_select 2_0 >= llvm_select 2_0
585:debug:main epoch: in tree: 2 installed: 2
586:debug:main python27 2.7.17_0 exists in the ports tree
587:debug:main python27 2.7.17_0  is the latest installed
588:debug:main python27 2.7.17_0  is active
589:debug:main Merging existing variants '' into variants
590:debug:main new fully merged portvariants:
591:debug:main Changing to port directory: /opt/local/var/macports/sources/rsync.macports.org/macports/release/tarballs/ports/lang/python27
592:debug:main OS darwin/10.8.0 (macOS 10.6) arch i386
593:debug:main Sourcing PortGroup select 1.0 from /opt/local/var/macports/sources/rsync.macports.org/macports/release/tarballs/ports/_resources/port1.0/group/select-1.0.tcl
594:debug:main Sourcing PortGroup clang_dependency 1.0 from /opt/local/var/macports/sources/rsync.macports.org/macports/release/tarballs/ports/_resources/port1.0/group/clang_dependency-1.0.tcl
595:debug:main Reading variant descriptions from /opt/local/var/macports/sources/rsync.macports.org/macports/release/tarballs/ports/_resources/port1.0/variant_descriptions.conf
596:debug:main universal variant already exists, so not adding the default one
597:debug:main Running callback portconfigure::add_automatic_compiler_dependencies
598:debug:main Chosen compiler macports-clang-3.4 is provided by a port, adding dependency
599:debug:main Adding depends_build port:clang-3.4
600:debug:main Adding depends_lib libcxx
601:debug:main Adding depends_skip_archcheck clang-3.4
602:debug:main Finished running callback portconfigure::add_automatic_compiler_dependencies
603:debug:main Running callback portbuild::add_automatic_buildsystem_dependencies
604:debug:main Finished running callback portbuild::add_automatic_buildsystem_dependencies
605:debug:main Running callback portstartupitem::add_notes
606:debug:main Finished running callback portstartupitem::add_notes
607:debug:main No need to upgrade! python27 2.7.17_0 >= python27 2.7.17_0
608:debug:main epoch: in tree: 0 installed: 0
609:debug:main expat 2.2.9_0 exists in the ports tree
610:debug:main expat 2.2.9_0  is the latest installed
611:debug:main expat 2.2.9_0  is active
612:debug:main Merging existing variants '' into variants
613:debug:main new fully merged portvariants:
614:debug:main Changing to port directory: /opt/local/var/macports/sources/rsync.macports.org/macports/release/tarballs/ports/textproc/expat
615:debug:main OS darwin/10.8.0 (macOS 10.6) arch i386
616:debug:main Reading variant descriptions from /opt/local/var/macports/sources/rsync.macports.org/macports/release/tarballs/ports/_resources/port1.0/variant_descriptions.conf
617:debug:main Sourcing PortGroup muniversal 1.0 from /opt/local/var/macports/sources/rsync.macports.org/macports/release/tarballs/ports/_resources/port1.0/group/muniversal-1.0.tcl
618:debug:main universal variant already exists, so not adding the default one
619:debug:main Running callback portconfigure::add_automatic_compiler_dependencies
620:debug:main Finished running callback portconfigure::add_automatic_compiler_dependencies
621:debug:main Running callback portbuild::add_automatic_buildsystem_dependencies
622:debug:main Finished running callback portbuild::add_automatic_buildsystem_dependencies
623:debug:main Running callback portstartupitem::add_notes
624:debug:main Finished running callback portstartupitem::add_notes
625:debug:main No need to upgrade! expat 2.2.9_0 >= expat 2.2.9_0
626:debug:main epoch: in tree: 0 installed: 0
627:debug:main sqlite3 3.30.1_0 exists in the ports tree
628:debug:main sqlite3 3.30.1_0  is the latest installed
629:debug:main sqlite3 3.30.1_0  is active
630:debug:main Merging existing variants '' into variants
631:debug:main new fully merged portvariants:
632:debug:main Changing to port directory: /opt/local/var/macports/sources/rsync.macports.org/macports/release/tarballs/ports/databases/sqlite3
633:debug:main OS darwin/10.8.0 (macOS 10.6) arch i386
634:debug:main Sourcing PortGroup clang_dependency 1.0 from /opt/local/var/macports/sources/rsync.macports.org/macports/release/tarballs/ports/_resources/port1.0/group/clang_dependency-1.0.tcl
635:debug:main adding the default universal variant
636:debug:main Reading variant descriptions from /opt/local/var/macports/sources/rsync.macports.org/macports/release/tarballs/ports/_resources/port1.0/variant_descriptions.conf
637:debug:main Running callback portconfigure::add_automatic_compiler_dependencies
638:debug:main Chosen compiler macports-clang-3.4 is provided by a port, adding dependency
639:debug:main Adding depends_build port:clang-3.4
640:debug:main Adding depends_lib libcxx
641:debug:main Adding depends_skip_archcheck clang-3.4
642:debug:main Finished running callback portconfigure::add_automatic_compiler_dependencies
643:debug:main Running callback portbuild::add_automatic_buildsystem_dependencies
644:debug:main Finished running callback portbuild::add_automatic_buildsystem_dependencies
645:debug:main Running callback portstartupitem::add_notes
646:debug:main Finished running callback portstartupitem::add_notes
647:debug:main No need to upgrade! sqlite3 3.30.1_0 >= sqlite3 3.30.1_0
648:debug:main epoch: in tree: 0 installed: 0
649:debug:main python_select 0.3_8 exists in the ports tree
650:debug:main python_select 0.3_8  is the latest installed
651:debug:main python_select 0.3_8  is active
652:debug:main Merging existing variants '' into variants
653:debug:main new fully merged portvariants:
654:debug:main Changing to port directory: /opt/local/var/macports/sources/rsync.macports.org/macports/release/tarballs/ports/sysutils/python_select
655:debug:main OS darwin/10.8.0 (macOS 10.6) arch i386
656:debug:main Sourcing PortGroup select 1.0 from /opt/local/var/macports/sources/rsync.macports.org/macports/release/tarballs/ports/_resources/port1.0/group/select-1.0.tcl
657:debug:main universal_variant is false, so not adding the default universal variant
658:debug:main Running callback portconfigure::add_automatic_compiler_dependencies
659:debug:main Finished running callback portconfigure::add_automatic_compiler_dependencies
660:debug:main Running callback portbuild::add_automatic_buildsystem_dependencies
661:debug:main Finished running callback portbuild::add_automatic_buildsystem_dependencies
662:debug:main Running callback portstartupitem::add_notes
663:debug:main Finished running callback portstartupitem::add_notes
664:debug:main No need to upgrade! python_select 0.3_8 >= python_select 0.3_8
665:debug:main epoch: in tree: 0 installed: 0
666:debug:main python2_select 0.0_3 exists in the ports tree
667:debug:main python2_select 0.0_3  is the latest installed
668:debug:main python2_select 0.0_3  is active
669:debug:main Merging existing variants '' into variants
670:debug:main new fully merged portvariants:
671:debug:main Changing to port directory: /opt/local/var/macports/sources/rsync.macports.org/macports/release/tarballs/ports/sysutils/python2_select
672:debug:main OS darwin/10.8.0 (macOS 10.6) arch i386
673:debug:main Sourcing PortGroup select 1.0 from /opt/local/var/macports/sources/rsync.macports.org/macports/release/tarballs/ports/_resources/port1.0/group/select-1.0.tcl
674:debug:main universal_variant is false, so not adding the default universal variant
675:debug:main Running callback portconfigure::add_automatic_compiler_dependencies
676:debug:main Finished running callback portconfigure::add_automatic_compiler_dependencies
677:debug:main Running callback portbuild::add_automatic_buildsystem_dependencies
678:debug:main Finished running callback portbuild::add_automatic_buildsystem_dependencies
679:debug:main Running callback portstartupitem::add_notes
680:debug:main Finished running callback portstartupitem::add_notes
681:debug:main No need to upgrade! python2_select 0.0_3 >= python2_select 0.0_3
682:debug:main epoch: in tree: 0 installed: 0
683:debug:main clang_select 2.2_0 exists in the ports tree
684:debug:main clang_select 2.2_0  is the latest installed
685:debug:main clang_select 2.2_0  is active
686:debug:main Merging existing variants '' into variants
687:debug:main new fully merged portvariants:
688:debug:main Changing to port directory: /opt/local/var/macports/sources/rsync.macports.org/macports/release/tarballs/ports/sysutils/clang_select
689:debug:main OS darwin/10.8.0 (macOS 10.6) arch i386
690:debug:main Sourcing PortGroup select 1.0 from /opt/local/var/macports/sources/rsync.macports.org/macports/release/tarballs/ports/_resources/port1.0/group/select-1.0.tcl
691:debug:main universal_variant is false, so not adding the default universal variant
692:debug:main Running callback portconfigure::add_automatic_compiler_dependencies
693:debug:main Finished running callback portconfigure::add_automatic_compiler_dependencies
694:debug:main Running callback portbuild::add_automatic_buildsystem_dependencies
695:debug:main Finished running callback portbuild::add_automatic_buildsystem_dependencies
696:debug:main Running callback portstartupitem::add_notes
697:debug:main Finished running callback portstartupitem::add_notes
698:debug:main No need to upgrade! clang_select 2.2_0 >= clang_select 2.2_0
699:debug:main epoch: in tree: 2 installed: 2
700:debug:main ld64 3_1 exists in the ports tree
701:debug:main ld64 3_1  is the latest installed
702:debug:main ld64 3_1  is active
703:debug:main Merging existing variants '-ld64_127-ld64_236-ld64_97-ld64_xcode' into variants
704:debug:main new fully merged portvariants: ld64_xcode - ld64_236 - ld64_97 - ld64_127 -
705:debug:main Changing to port directory: /opt/local/var/macports/sources/rsync.macports.org/macports/release/tarballs/ports/devel/ld64
706:debug:main OS darwin/10.8.0 (macOS 10.6) arch i386
707:debug:main Sourcing PortGroup compiler_blacklist_versions 1.0 from /opt/local/var/macports/sources/rsync.macports.org/macports/release/tarballs/ports/_resources/port1.0/group/compiler_blacklist_versions-1.0.tcl
708:debug:main Reading variant descriptions from /opt/local/var/macports/sources/rsync.macports.org/macports/release/tarballs/ports/_resources/port1.0/variant_descriptions.conf
709:debug:main universal variant already exists, so not adding the default one
710:debug:main Running callback portconfigure::add_automatic_compiler_dependencies
711:debug:main Finished running callback portconfigure::add_automatic_compiler_dependencies
712:debug:main Running callback portbuild::add_automatic_buildsystem_dependencies
713:debug:main Finished running callback portbuild::add_automatic_buildsystem_dependencies
714:debug:main Running callback portstartupitem::add_notes
715:debug:main Finished running callback portstartupitem::add_notes
716:debug:main No need to upgrade! ld64 3_1 >= ld64 3_1
717:debug:main epoch: in tree: 2 installed: 2
718:debug:main ld64-latest 274.2_2 exists in the ports tree
719:debug:main ld64-latest 274.2_2 +llvm34 is the latest installed
720:debug:main ld64-latest 274.2_2 +llvm34 is active
721:debug:main Merging existing variants '+llvm34' into variants
722:debug:main new fully merged portvariants: llvm34 +
723:debug:main Changing to port directory: /opt/local/var/macports/sources/rsync.macports.org/macports/release/tarballs/ports/devel/ld64
724:debug:main OS darwin/10.8.0 (macOS 10.6) arch i386
725:debug:main Sourcing PortGroup compiler_blacklist_versions 1.0 from /opt/local/var/macports/sources/rsync.macports.org/macports/release/tarballs/ports/_resources/port1.0/group/compiler_blacklist_versions-1.0.tcl
726:debug:main compiler clang 77 blacklisted because it matches {clang < 300}
727:debug:main Reading variant descriptions from /opt/local/var/macports/sources/rsync.macports.org/macports/release/tarballs/ports/_resources/port1.0/variant_descriptions.conf
728:debug:main universal variant already exists, so not adding the default one
729:debug:main Executing variant llvm34 provides llvm34
730:debug:main Running callback portconfigure::add_automatic_compiler_dependencies
731:debug:main Chosen compiler macports-clang-9.0 is provided by a port, adding dependency
732:debug:main Adding depends_build port:clang-9.0
733:debug:main Adding depends_lib libcxx
734:debug:main Adding depends_skip_archcheck clang-9.0
735:debug:main Finished running callback portconfigure::add_automatic_compiler_dependencies
736:debug:main Running callback portbuild::add_automatic_buildsystem_dependencies
737:debug:main Finished running callback portbuild::add_automatic_buildsystem_dependencies
738:debug:main Running callback portstartupitem::add_notes
739:debug:main Finished running callback portstartupitem::add_notes
740:debug:main No need to upgrade! ld64-latest 274.2_2 >= ld64-latest 274.2_2
741:debug:main epoch: in tree: 1 installed: 1
742:debug:main llvm-3.4 3.4.2_12 exists in the ports tree
743:debug:main llvm-3.4 3.4.2_12  is the latest installed
744:debug:main llvm-3.4 3.4.2_12  is active
745:debug:main Merging existing variants '' into variants
746:debug:main new fully merged portvariants:
747:debug:main Changing to port directory: /opt/local/var/macports/sources/rsync.macports.org/macports/release/tarballs/ports/lang/llvm-3.4
748:debug:main OS darwin/10.8.0 (macOS 10.6) arch i386
749:debug:main Sourcing PortGroup select 1.0 from /opt/local/var/macports/sources/rsync.macports.org/macports/release/tarballs/ports/_resources/port1.0/group/select-1.0.tcl
750:debug:main Sourcing PortGroup compiler_blacklist_versions 1.0 from /opt/local/var/macports/sources/rsync.macports.org/macports/release/tarballs/ports/_resources/port1.0/group/compiler_blacklist_versions-1.0.tcl
751:debug:main compiler gcc-4.2 5666 not blacklisted because it doesn't match {gcc-4.2 <= 5577}
752:debug:main compiler clang 77 blacklisted because it matches {clang < 421}
753:debug:main Reading variant descriptions from /opt/local/var/macports/sources/rsync.macports.org/macports/release/tarballs/ports/_resources/port1.0/variant_descriptions.conf
754:debug:main universal variant already exists, so not adding the default one
755:debug:main Running callback portconfigure::add_automatic_compiler_dependencies
756:debug:main Finished running callback portconfigure::add_automatic_compiler_dependencies
757:debug:main Running callback portbuild::add_automatic_buildsystem_dependencies
758:debug:main Finished running callback portbuild::add_automatic_buildsystem_dependencies
759:debug:main Running callback portstartupitem::add_notes
760:debug:main Finished running callback portstartupitem::add_notes
761:debug:main No need to upgrade! llvm-3.4 3.4.2_12 >= llvm-3.4 3.4.2_12
762:debug:main epoch: in tree: 0 installed: 0
763:debug:main ncurses-bootstrap 6.1_0 exists in the ports tree
764:debug:main ncurses-bootstrap 6.1_0  is the latest installed
765:debug:main ncurses-bootstrap 6.1_0  is active
766:debug:main Merging existing variants '' into variants
767:debug:main new fully merged portvariants:
768:debug:main Changing to port directory: /opt/local/var/macports/sources/rsync.macports.org/macports/release/tarballs/ports/devel/ncurses
769:debug:main OS darwin/10.8.0 (macOS 10.6) arch i386
770:debug:main Sourcing PortGroup clang_dependency 1.0 from /opt/local/var/macports/sources/rsync.macports.org/macports/release/tarballs/ports/_resources/port1.0/group/clang_dependency-1.0.tcl
771:debug:main adding the default universal variant
772:debug:main Reading variant descriptions from /opt/local/var/macports/sources/rsync.macports.org/macports/release/tarballs/ports/_resources/port1.0/variant_descriptions.conf
773:debug:main Running callback portconfigure::add_automatic_compiler_dependencies
774:debug:main Finished running callback portconfigure::add_automatic_compiler_dependencies
775:debug:main Running callback portbuild::add_automatic_buildsystem_dependencies
776:debug:main Finished running callback portbuild::add_automatic_buildsystem_dependencies
777:debug:main Running callback portstartupitem::add_notes
778:debug:main Finished running callback portstartupitem::add_notes
779:debug:main No need to upgrade! ncurses-bootstrap 6.1_0 >= ncurses-bootstrap 6.1_0
780:debug:main epoch: in tree: 0 installed: 0
781:debug:main cctools 921_4 exists in the ports tree
782:debug:main cctools 921_4 +llvm34 is the latest installed
783:debug:main cctools 921_4 +llvm34 is active
784:debug:main Merging existing variants '+llvm34' into variants
785:debug:main new fully merged portvariants: llvm34 +
786:debug:main Changing to port directory: /opt/local/var/macports/sources/rsync.macports.org/macports/release/tarballs/ports/devel/cctools
787:debug:main OS darwin/10.8.0 (macOS 10.6) arch i386
788:debug:main Reading variant descriptions from /opt/local/var/macports/sources/rsync.macports.org/macports/release/tarballs/ports/_resources/port1.0/variant_descriptions.conf
789:debug:main universal variant already exists, so not adding the default one
790:debug:main Executing variant llvm34 provides llvm34
791:debug:main Running callback portconfigure::add_automatic_compiler_dependencies
792:debug:main Finished running callback portconfigure::add_automatic_compiler_dependencies
793:debug:main Running callback portbuild::add_automatic_buildsystem_dependencies
794:debug:main Finished running callback portbuild::add_automatic_buildsystem_dependencies
795:debug:main Running callback portstartupitem::add_notes
796:debug:main Finished running callback portstartupitem::add_notes
797:debug:main No need to upgrade! cctools 921_4 >= cctools 921_4
798:debug:main epoch: in tree: 0 installed: 0
799:debug:main ghostscript 9.50_0 exists in the ports tree
800:debug:main ghostscript 9.50_0 +x11 is the latest installed
801:debug:main ghostscript 9.50_0 +x11 is active
802:debug:main Merging existing variants '+x11' into variants
803:debug:main new fully merged portvariants: x11 +
804:debug:main Changing to port directory: /opt/local/var/macports/sources/rsync.macports.org/macports/release/tarballs/ports/print/ghostscript
805:debug:main OS darwin/10.8.0 (macOS 10.6) arch i386
806:debug:main Reading variant descriptions from /opt/local/var/macports/sources/rsync.macports.org/macports/release/tarballs/ports/_resources/port1.0/variant_descriptions.conf
807:debug:main Sourcing PortGroup muniversal 1.0 from /opt/local/var/macports/sources/rsync.macports.org/macports/release/tarballs/ports/_resources/port1.0/group/muniversal-1.0.tcl
808:debug:main universal variant already exists, so not adding the default one
809:debug:main Executing variant x11 provides x11
810:debug:main Running callback portconfigure::add_automatic_compiler_dependencies
811:debug:main Chosen compiler macports-clang-9.0 is provided by a port, adding dependency
812:debug:main Adding depends_build port:clang-9.0
813:debug:main Adding depends_lib libcxx
814:debug:main Adding depends_skip_archcheck clang-9.0
815:debug:main Finished running callback portconfigure::add_automatic_compiler_dependencies
816:debug:main Running callback portbuild::add_automatic_buildsystem_dependencies
817:debug:main Finished running callback portbuild::add_automatic_buildsystem_dependencies
818:debug:main Running callback portstartupitem::add_notes
819:debug:main Finished running callback portstartupitem::add_notes
820:debug:main No need to upgrade! ghostscript 9.50_0 >= ghostscript 9.50_0
821:debug:main epoch: in tree: 0 installed: 0
822:debug:main fontconfig 2.13.1_0 exists in the ports tree
823:debug:main fontconfig 2.13.1_0  is the latest installed
824:debug:main fontconfig 2.13.1_0  is active
825:debug:main Merging existing variants '' into variants
826:debug:main new fully merged portvariants:
827:debug:main Changing to port directory: /opt/local/var/macports/sources/rsync.macports.org/macports/release/tarballs/ports/graphics/fontconfig
828:debug:main OS darwin/10.8.0 (macOS 10.6) arch i386
829:debug:main Reading variant descriptions from /opt/local/var/macports/sources/rsync.macports.org/macports/release/tarballs/ports/_resources/port1.0/variant_descriptions.conf
830:debug:main Sourcing PortGroup muniversal 1.0 from /opt/local/var/macports/sources/rsync.macports.org/macports/release/tarballs/ports/_resources/port1.0/group/muniversal-1.0.tcl
831:debug:main universal variant already exists, so not adding the default one
832:debug:main Running callback portconfigure::add_automatic_compiler_dependencies
833:debug:main Chosen compiler macports-clang-9.0 is provided by a port, adding dependency
834:debug:main Adding depends_build port:clang-9.0
835:debug:main Adding depends_lib libcxx
836:debug:main Adding depends_skip_archcheck clang-9.0
837:debug:main Finished running callback portconfigure::add_automatic_compiler_dependencies
838:debug:main Running callback portbuild::add_automatic_buildsystem_dependencies
839:debug:main Finished running callback portbuild::add_automatic_buildsystem_dependencies
840:debug:main Running callback portstartupitem::add_notes
841:debug:main Finished running callback portstartupitem::add_notes
842:debug:main No need to upgrade! fontconfig 2.13.1_0 >= fontconfig 2.13.1_0
843:debug:main epoch: in tree: 0 installed: 0
844:debug:main freetype 2.10.1_0 exists in the ports tree
845:debug:main freetype 2.10.1_0  is the latest installed
846:debug:main freetype 2.10.1_0  is active
847:debug:main Merging existing variants '' into variants
848:debug:main new fully merged portvariants:
849:debug:main Changing to port directory: /opt/local/var/macports/sources/rsync.macports.org/macports/release/tarballs/ports/print/freetype
850:debug:main OS darwin/10.8.0 (macOS 10.6) arch i386
851:debug:main Reading variant descriptions from /opt/local/var/macports/sources/rsync.macports.org/macports/release/tarballs/ports/_resources/port1.0/variant_descriptions.conf
852:debug:main Sourcing PortGroup muniversal 1.0 from /opt/local/var/macports/sources/rsync.macports.org/macports/release/tarballs/ports/_resources/port1.0/group/muniversal-1.0.tcl
853:debug:main universal variant already exists, so not adding the default one
854:debug:main Running callback portconfigure::add_automatic_compiler_dependencies
855:debug:main Chosen compiler macports-clang-9.0 is provided by a port, adding dependency
856:debug:main Adding depends_build port:clang-9.0
857:debug:main Adding depends_lib libcxx
858:debug:main Adding depends_skip_archcheck clang-9.0
859:debug:main Finished running callback portconfigure::add_automatic_compiler_dependencies
860:debug:main Running callback portbuild::add_automatic_buildsystem_dependencies
861:debug:main Finished running callback portbuild::add_automatic_buildsystem_dependencies
862:debug:main Running callback portstartupitem::add_notes
863:debug:main Finished running callback portstartupitem::add_notes
864:debug:main No need to upgrade! freetype 2.10.1_0 >= freetype 2.10.1_0
865:debug:main epoch: in tree: 0 installed: 0
866:debug:main libpng 1.6.37_0 exists in the ports tree
867:debug:main libpng 1.6.37_0  is the latest installed
868:debug:main libpng 1.6.37_0  is active
869:debug:main Merging existing variants '' into variants
870:debug:main new fully merged portvariants:
871:debug:main Changing to port directory: /opt/local/var/macports/sources/rsync.macports.org/macports/release/tarballs/ports/graphics/libpng
872:debug:main OS darwin/10.8.0 (macOS 10.6) arch i386
873:debug:main adding the default universal variant
874:debug:main Reading variant descriptions from /opt/local/var/macports/sources/rsync.macports.org/macports/release/tarballs/ports/_resources/port1.0/variant_descriptions.conf
875:debug:main Running callback portconfigure::add_automatic_compiler_dependencies
876:debug:main Chosen compiler macports-clang-9.0 is provided by a port, adding dependency
877:debug:main Adding depends_build port:clang-9.0
878:debug:main Adding depends_lib libcxx
879:debug:main Adding depends_skip_archcheck clang-9.0
880:debug:main Finished running callback portconfigure::add_automatic_compiler_dependencies
881:debug:main Running callback portbuild::add_automatic_buildsystem_dependencies
882:debug:main Finished running callback portbuild::add_automatic_buildsystem_dependencies
883:debug:main Running callback portstartupitem::add_notes
884:debug:main Finished running callback portstartupitem::add_notes
885:debug:main No need to upgrade! libpng 1.6.37_0 >= libpng 1.6.37_0
886:debug:main epoch: in tree: 0 installed: 0
887:debug:main ossp-uuid 1.6.2_11 exists in the ports tree
888:debug:main ossp-uuid 1.6.2_11 +perl5_26 is the latest installed
889:debug:main ossp-uuid 1.6.2_11 +perl5_26 is active
890:debug:main Merging existing variants '+perl5_26' into variants
891:debug:main new fully merged portvariants: perl5_26 +
892:debug:main Changing to port directory: /opt/local/var/macports/sources/rsync.macports.org/macports/release/tarballs/ports/devel/ossp-uuid
893:debug:main OS darwin/10.8.0 (macOS 10.6) arch i386
894:debug:main Reading variant descriptions from /opt/local/var/macports/sources/rsync.macports.org/macports/release/tarballs/ports/_resources/port1.0/variant_descriptions.conf
895:debug:main Sourcing PortGroup muniversal 1.0 from /opt/local/var/macports/sources/rsync.macports.org/macports/release/tarballs/ports/_resources/port1.0/group/muniversal-1.0.tcl
896:debug:main Re-registering default for configure.universal_args
897:debug:main Sourcing PortGroup perl5 1.0 from /opt/local/var/macports/sources/rsync.macports.org/macports/release/tarballs/ports/_resources/port1.0/group/perl5-1.0.tcl
898:debug:main universal variant already exists, so not adding the default one
899:debug:main Executing variant perl5_26 provides perl5_26
900:debug:main Running callback portconfigure::add_automatic_compiler_dependencies
901:debug:main Chosen compiler macports-clang-9.0 is provided by a port, adding dependency
902:debug:main Adding depends_build port:clang-9.0
903:debug:main Adding depends_lib libcxx
904:debug:main Adding depends_skip_archcheck clang-9.0
905:debug:main Finished running callback portconfigure::add_automatic_compiler_dependencies
906:debug:main Running callback portbuild::add_automatic_buildsystem_dependencies
907:debug:main Finished running callback portbuild::add_automatic_buildsystem_dependencies
908:debug:main Running callback portstartupitem::add_notes
909:debug:main Finished running callback portstartupitem::add_notes
910:debug:main No need to upgrade! ossp-uuid 1.6.2_11 >= ossp-uuid 1.6.2_11
911:debug:main epoch: in tree: 0 installed: 0
912:debug:main jbig2dec 0.17_0 exists in the ports tree
913:debug:main jbig2dec 0.17_0  is the latest installed
914:debug:main jbig2dec 0.17_0  is active
915:debug:main Merging existing variants '' into variants
916:debug:main new fully merged portvariants:
917:debug:main Changing to port directory: /opt/local/var/macports/sources/rsync.macports.org/macports/release/tarballs/ports/graphics/jbig2dec
918:debug:main OS darwin/10.8.0 (macOS 10.6) arch i386
919:debug:main Sourcing PortGroup github 1.0 from /opt/local/var/macports/sources/rsync.macports.org/macports/release/tarballs/ports/_resources/port1.0/group/github-1.0.tcl
920:debug:main Re-registering default for livecheck.regex
921:debug:main adding the default universal variant
922:debug:main Reading variant descriptions from /opt/local/var/macports/sources/rsync.macports.org/macports/release/tarballs/ports/_resources/port1.0/variant_descriptions.conf
923:debug:main Running callback portconfigure::add_automatic_compiler_dependencies
924:debug:main Chosen compiler macports-clang-9.0 is provided by a port, adding dependency
925:debug:main Adding depends_build port:clang-9.0
926:debug:main Adding depends_lib libcxx
927:debug:main Adding depends_skip_archcheck clang-9.0
928:debug:main Finished running callback portconfigure::add_automatic_compiler_dependencies
929:debug:main Running callback portbuild::add_automatic_buildsystem_dependencies
930:debug:main Finished running callback portbuild::add_automatic_buildsystem_dependencies
931:debug:main Running callback portstartupitem::add_notes
932:debug:main Finished running callback portstartupitem::add_notes
933:debug:main No need to upgrade! jbig2dec 0.17_0 >= jbig2dec 0.17_0
934:debug:main epoch: in tree: 0 installed: 0
935:debug:main jpeg 9c_0 exists in the ports tree
936:debug:main jpeg 9c_0  is the latest installed
937:debug:main jpeg 9c_0  is active
938:debug:main Merging existing variants '' into variants
939:debug:main new fully merged portvariants:
940:debug:main Changing to port directory: /opt/local/var/macports/sources/rsync.macports.org/macports/release/tarballs/ports/graphics/jpeg
941:debug:main OS darwin/10.8.0 (macOS 10.6) arch i386
942:debug:main adding the default universal variant
943:debug:main Reading variant descriptions from /opt/local/var/macports/sources/rsync.macports.org/macports/release/tarballs/ports/_resources/port1.0/variant_descriptions.conf
944:debug:main Running callback portconfigure::add_automatic_compiler_dependencies
945:debug:main Chosen compiler macports-clang-9.0 is provided by a port, adding dependency
946:debug:main Adding depends_build port:clang-9.0
947:debug:main Adding depends_lib libcxx
948:debug:main Adding depends_skip_archcheck clang-9.0
949:debug:main Finished running callback portconfigure::add_automatic_compiler_dependencies
950:debug:main Running callback portbuild::add_automatic_buildsystem_dependencies
951:debug:main Finished running callback portbuild::add_automatic_buildsystem_dependencies
952:debug:main Running callback portstartupitem::add_notes
953:debug:main Finished running callback portstartupitem::add_notes
954:debug:main No need to upgrade! jpeg 9c_0 >= jpeg 9c_0
955:debug:main epoch: in tree: 0 installed: 0
956:debug:main libidn 1.35_0 exists in the ports tree
957:debug:main libidn 1.35_0  is the latest installed
958:debug:main libidn 1.35_0  is active
959:debug:main Merging existing variants '' into variants
960:debug:main new fully merged portvariants:
961:debug:main Changing to port directory: /opt/local/var/macports/sources/rsync.macports.org/macports/release/tarballs/ports/mail/libidn
962:debug:main OS darwin/10.8.0 (macOS 10.6) arch i386
963:debug:main adding the default universal variant
964:debug:main Reading variant descriptions from /opt/local/var/macports/sources/rsync.macports.org/macports/release/tarballs/ports/_resources/port1.0/variant_descriptions.conf
965:debug:main Running callback portconfigure::add_automatic_compiler_dependencies
966:debug:main Chosen compiler macports-clang-9.0 is provided by a port, adding dependency
967:debug:main Adding depends_build port:clang-9.0
968:debug:main Adding depends_lib libcxx
969:debug:main Adding depends_skip_archcheck clang-9.0
970:debug:main Finished running callback portconfigure::add_automatic_compiler_dependencies
971:debug:main Running callback portbuild::add_automatic_buildsystem_dependencies
972:debug:main Finished running callback portbuild::add_automatic_buildsystem_dependencies
973:debug:main Running callback portstartupitem::add_notes
974:debug:main Finished running callback portstartupitem::add_notes
975:debug:main No need to upgrade! libidn 1.35_0 >= libidn 1.35_0
976:debug:main epoch: in tree: 0 installed: 0
977:debug:main libpaper 1.1.28_0 exists in the ports tree
978:debug:main libpaper 1.1.28_0  is the latest installed
979:debug:main libpaper 1.1.28_0  is active
980:debug:main Merging existing variants '' into variants
981:debug:main new fully merged portvariants:
982:debug:main Changing to port directory: /opt/local/var/macports/sources/rsync.macports.org/macports/release/tarballs/ports/print/libpaper
983:debug:main OS darwin/10.8.0 (macOS 10.6) arch i386
984:debug:main adding the default universal variant
985:debug:main Reading variant descriptions from /opt/local/var/macports/sources/rsync.macports.org/macports/release/tarballs/ports/_resources/port1.0/variant_descriptions.conf
986:debug:main Running callback portconfigure::add_automatic_compiler_dependencies
987:debug:main Chosen compiler macports-clang-9.0 is provided by a port, adding dependency
988:debug:main Adding depends_build port:clang-9.0
989:debug:main Adding depends_lib libcxx
990:debug:main Adding depends_skip_archcheck clang-9.0
991:debug:main Finished running callback portconfigure::add_automatic_compiler_dependencies
992:debug:main Running callback portbuild::add_automatic_buildsystem_dependencies
993:debug:main Finished running callback portbuild::add_automatic_buildsystem_dependencies
994:debug:main Running callback portstartupitem::add_notes
995:debug:main Finished running callback portstartupitem::add_notes
996:debug:main No need to upgrade! libpaper 1.1.28_0 >= libpaper 1.1.28_0
997:debug:main epoch: in tree: 0 installed: 0
998:debug:main tiff 4.1.0_0 exists in the ports tree
999:debug:main tiff 4.1.0_0  is the latest installed
1000:debug:main tiff 4.1.0_0  is active
1001:debug:main Merging existing variants '' into variants
1002:debug:main new fully merged portvariants:
1003:debug:main Changing to port directory: /opt/local/var/macports/sources/rsync.macports.org/macports/release/tarballs/ports/graphics/tiff
1004:debug:main OS darwin/10.8.0 (macOS 10.6) arch i386
1005:debug:main Sourcing PortGroup xcodeversion 1.0 from /opt/local/var/macports/sources/rsync.macports.org/macports/release/tarballs/ports/_resources/port1.0/group/xcodeversion-1.0.tcl
1006:debug:main Reading variant descriptions from /opt/local/var/macports/sources/rsync.macports.org/macports/release/tarballs/ports/_resources/port1.0/variant_descriptions.conf
1007:debug:main Sourcing PortGroup muniversal 1.0 from /opt/local/var/macports/sources/rsync.macports.org/macports/release/tarballs/ports/_resources/port1.0/group/muniversal-1.0.tcl
1008:debug:main universal variant already exists, so not adding the default one
1009:debug:main Running callback portconfigure::add_automatic_compiler_dependencies
1010:debug:main Chosen compiler macports-clang-9.0 is provided by a port, adding dependency
1011:debug:main Adding depends_build port:clang-9.0
1012:debug:main Adding depends_lib libcxx
1013:debug:main Adding depends_skip_archcheck clang-9.0
1014:debug:main Finished running callback portconfigure::add_automatic_compiler_dependencies
1015:debug:main Running callback portbuild::add_automatic_buildsystem_dependencies
1016:debug:main Finished running callback portbuild::add_automatic_buildsystem_dependencies
1017:debug:main Running callback portstartupitem::add_notes
1018:debug:main Finished running callback portstartupitem::add_notes
1019:debug:main No need to upgrade! tiff 4.1.0_0 >= tiff 4.1.0_0
1020:debug:main epoch: in tree: 0 installed: 0
1021:debug:main zstd 1.4.4_0 exists in the ports tree
1022:debug:main zstd 1.4.4_0  is the latest installed
1023:debug:main zstd 1.4.4_0  is active
1024:debug:main Merging existing variants '' into variants
1025:debug:main new fully merged portvariants:
1026:debug:main Changing to port directory: /opt/local/var/macports/sources/rsync.macports.org/macports/release/tarballs/ports/archivers/zstd
1027:debug:main OS darwin/10.8.0 (macOS 10.6) arch i386
1028:debug:main Sourcing PortGroup github 1.0 from /opt/local/var/macports/sources/rsync.macports.org/macports/release/tarballs/ports/_resources/port1.0/group/github-1.0.tcl
1029:debug:main Sourcing PortGroup clang_dependency 1.0 from /opt/local/var/macports/sources/rsync.macports.org/macports/release/tarballs/ports/_resources/port1.0/group/clang_dependency-1.0.tcl
1030:debug:main Re-registering default for livecheck.regex
1031:debug:main Reading variant descriptions from /opt/local/var/macports/sources/rsync.macports.org/macports/release/tarballs/ports/_resources/port1.0/variant_descriptions.conf
1032:debug:main universal variant already exists, so not adding the default one
1033:debug:main Running callback portconfigure::add_automatic_compiler_dependencies
1034:debug:main Chosen compiler macports-clang-3.7 is provided by a port, adding dependency
1035:debug:main Adding depends_build port:clang-3.7
1036:debug:main Adding depends_lib libcxx
1037:debug:main Adding depends_skip_archcheck clang-3.7
1038:debug:main Finished running callback portconfigure::add_automatic_compiler_dependencies
1039:debug:main Running callback portbuild::add_automatic_buildsystem_dependencies
1040:debug:main Finished running callback portbuild::add_automatic_buildsystem_dependencies
1041:debug:main Running callback portstartupitem::add_notes
1042:debug:main Finished running callback portstartupitem::add_notes
1043:debug:main No need to upgrade! zstd 1.4.4_0 >= zstd 1.4.4_0
1044:debug:main epoch: in tree: 0 installed: 0
1045:debug:main lz4 1.9.2_0 exists in the ports tree
1046:debug:main lz4 1.9.2_0  is the latest installed
1047:debug:main lz4 1.9.2_0  is active
1048:debug:main Merging existing variants '' into variants
1049:debug:main new fully merged portvariants:
1050:debug:main Changing to port directory: /opt/local/var/macports/sources/rsync.macports.org/macports/release/tarballs/ports/archivers/lz4
1051:debug:main OS darwin/10.8.0 (macOS 10.6) arch i386
1052:debug:main Sourcing PortGroup github 1.0 from /opt/local/var/macports/sources/rsync.macports.org/macports/release/tarballs/ports/_resources/port1.0/group/github-1.0.tcl
1053:debug:main Reading variant descriptions from /opt/local/var/macports/sources/rsync.macports.org/macports/release/tarballs/ports/_resources/port1.0/variant_descriptions.conf
1054:debug:main Sourcing PortGroup muniversal 1.0 from /opt/local/var/macports/sources/rsync.macports.org/macports/release/tarballs/ports/_resources/port1.0/group/muniversal-1.0.tcl
1055:debug:main Sourcing PortGroup clang_dependency 1.0 from /opt/local/var/macports/sources/rsync.macports.org/macports/release/tarballs/ports/_resources/port1.0/group/clang_dependency-1.0.tcl
1056:debug:main Re-registering default for livecheck.regex
1057:debug:main universal variant already exists, so not adding the default one
1058:debug:main Running callback portconfigure::add_automatic_compiler_dependencies
1059:debug:main Chosen compiler macports-clang-3.7 is provided by a port, adding dependency
1060:debug:main Adding depends_build port:clang-3.7
1061:debug:main Adding depends_lib libcxx
1062:debug:main Adding depends_skip_archcheck clang-3.7
1063:debug:main Finished running callback portconfigure::add_automatic_compiler_dependencies
1064:debug:main Running callback portbuild::add_automatic_buildsystem_dependencies
1065:debug:main Finished running callback portbuild::add_automatic_buildsystem_dependencies
1066:debug:main Running callback portstartupitem::add_notes
1067:debug:main Finished running callback portstartupitem::add_notes
1068:debug:main No need to upgrade! lz4 1.9.2_0 >= lz4 1.9.2_0
1069:debug:main epoch: in tree: 0 installed: 0
1070:debug:main lcms2 2.9_1 exists in the ports tree
1071:debug:main lcms2 2.9_1  is the latest installed
1072:debug:main lcms2 2.9_1  is active
1073:debug:main Merging existing variants '' into variants
1074:debug:main new fully merged portvariants:
1075:debug:main Changing to port directory: /opt/local/var/macports/sources/rsync.macports.org/macports/release/tarballs/ports/graphics/lcms2
1076:debug:main OS darwin/10.8.0 (macOS 10.6) arch i386
1077:debug:main Reading variant descriptions from /opt/local/var/macports/sources/rsync.macports.org/macports/release/tarballs/ports/_resources/port1.0/variant_descriptions.conf
1078:debug:main Sourcing PortGroup muniversal 1.0 from /opt/local/var/macports/sources/rsync.macports.org/macports/release/tarballs/ports/_resources/port1.0/group/muniversal-1.0.tcl
1079:debug:main universal variant already exists, so not adding the default one
1080:debug:main Running callback portconfigure::add_automatic_compiler_dependencies
1081:debug:main Chosen compiler macports-clang-9.0 is provided by a port, adding dependency
1082:debug:main Adding depends_build port:clang-9.0
1083:debug:main Adding depends_lib libcxx
1084:debug:main Adding depends_skip_archcheck clang-9.0
1085:debug:main Finished running callback portconfigure::add_automatic_compiler_dependencies
1086:debug:main Running callback portbuild::add_automatic_buildsystem_dependencies
1087:debug:main Finished running callback portbuild::add_automatic_buildsystem_dependencies
1088:debug:main Running callback portstartupitem::add_notes
1089:debug:main Finished running callback portstartupitem::add_notes
1090:debug:main No need to upgrade! lcms2 2.9_1 >= lcms2 2.9_1
1091:debug:main epoch: in tree: 0 installed: 0
1092:debug:main xorg-libXext 1.3.4_0 exists in the ports tree
1093:debug:main xorg-libXext 1.3.4_0  is the latest installed
1094:debug:main xorg-libXext 1.3.4_0  is active
1095:debug:main Merging existing variants '' into variants
1096:debug:main new fully merged portvariants:
1097:debug:main Changing to port directory: /opt/local/var/macports/sources/rsync.macports.org/macports/release/tarballs/ports/x11/xorg-libXext
1098:debug:main OS darwin/10.8.0 (macOS 10.6) arch i386
1099:debug:main adding the default universal variant
1100:debug:main Reading variant descriptions from /opt/local/var/macports/sources/rsync.macports.org/macports/release/tarballs/ports/_resources/port1.0/variant_descriptions.conf
1101:debug:main Running callback portconfigure::add_automatic_compiler_dependencies
1102:debug:main Chosen compiler macports-clang-9.0 is provided by a port, adding dependency
1103:debug:main Adding depends_build port:clang-9.0
1104:debug:main Adding depends_lib libcxx
1105:debug:main Adding depends_skip_archcheck clang-9.0
1106:debug:main Finished running callback portconfigure::add_automatic_compiler_dependencies
1107:debug:main Running callback portbuild::add_automatic_buildsystem_dependencies
1108:debug:main Finished running callback portbuild::add_automatic_buildsystem_dependencies
1109:debug:main Running callback portstartupitem::add_notes
1110:debug:main Finished running callback portstartupitem::add_notes
1111:debug:main No need to upgrade! xorg-libXext 1.3.4_0 >= xorg-libXext 1.3.4_0
1112:debug:main epoch: in tree: 0 installed: 0
1113:debug:main xorg-libX11 1.6.9_0 exists in the ports tree
1114:debug:main xorg-libX11 1.6.9_0  is the latest installed
1115:debug:main xorg-libX11 1.6.9_0  is active
1116:debug:main Merging existing variants '' into variants
1117:debug:main new fully merged portvariants:
1118:debug:main Changing to port directory: /opt/local/var/macports/sources/rsync.macports.org/macports/release/tarballs/ports/x11/xorg-libX11
1119:debug:main OS darwin/10.8.0 (macOS 10.6) arch i386
1120:debug:main Sourcing PortGroup compiler_blacklist_versions 1.0 from /opt/local/var/macports/sources/rsync.macports.org/macports/release/tarballs/ports/_resources/port1.0/group/compiler_blacklist_versions-1.0.tcl
1121:debug:main adding the default universal variant
1122:debug:main Reading variant descriptions from /opt/local/var/macports/sources/rsync.macports.org/macports/release/tarballs/ports/_resources/port1.0/variant_descriptions.conf
1123:debug:main Running callback portconfigure::add_automatic_compiler_dependencies
1124:debug:main Chosen compiler macports-clang-9.0 is provided by a port, adding dependency
1125:debug:main Adding depends_build port:clang-9.0
1126:debug:main Adding depends_lib libcxx
1127:debug:main Adding depends_skip_archcheck clang-9.0
1128:debug:main Finished running callback portconfigure::add_automatic_compiler_dependencies
1129:debug:main Running callback portbuild::add_automatic_buildsystem_dependencies
1130:debug:main Finished running callback portbuild::add_automatic_buildsystem_dependencies
1131:debug:main Running callback portstartupitem::add_notes
1132:debug:main Finished running callback portstartupitem::add_notes
1133:debug:main No need to upgrade! xorg-libX11 1.6.9_0 >= xorg-libX11 1.6.9_0
1134:debug:main epoch: in tree: 0 installed: 0
1135:debug:main xorg-libXdmcp 1.1.3_0 exists in the ports tree
1136:debug:main xorg-libXdmcp 1.1.3_0  is the latest installed
1137:debug:main xorg-libXdmcp 1.1.3_0  is active
1138:debug:main Merging existing variants '' into variants
1139:debug:main new fully merged portvariants:
1140:debug:main Changing to port directory: /opt/local/var/macports/sources/rsync.macports.org/macports/release/tarballs/ports/x11/xorg-libXdmcp
1141:debug:main OS darwin/10.8.0 (macOS 10.6) arch i386
1142:debug:main adding the default universal variant
1143:debug:main Reading variant descriptions from /opt/local/var/macports/sources/rsync.macports.org/macports/release/tarballs/ports/_resources/port1.0/variant_descriptions.conf
1144:debug:main Running callback portconfigure::add_automatic_compiler_dependencies
1145:debug:main Chosen compiler macports-clang-9.0 is provided by a port, adding dependency
1146:debug:main Adding depends_build port:clang-9.0
1147:debug:main Adding depends_lib libcxx
1148:debug:main Adding depends_skip_archcheck clang-9.0
1149:debug:main Finished running callback portconfigure::add_automatic_compiler_dependencies
1150:debug:main Running callback portbuild::add_automatic_buildsystem_dependencies
1151:debug:main Finished running callback portbuild::add_automatic_buildsystem_dependencies
1152:debug:main Running callback portstartupitem::add_notes
1153:debug:main Finished running callback portstartupitem::add_notes
1154:debug:main No need to upgrade! xorg-libXdmcp 1.1.3_0 >= xorg-libXdmcp 1.1.3_0
1155:debug:main epoch: in tree: 0 installed: 0
1156:debug:main xorg-libXau 1.0.9_0 exists in the ports tree
1157:debug:main xorg-libXau 1.0.9_0  is the latest installed
1158:debug:main xorg-libXau 1.0.9_0  is active
1159:debug:main Merging existing variants '' into variants
1160:debug:main new fully merged portvariants:
1161:debug:main Changing to port directory: /opt/local/var/macports/sources/rsync.macports.org/macports/release/tarballs/ports/x11/xorg-libXau
1162:debug:main OS darwin/10.8.0 (macOS 10.6) arch i386
1163:debug:main adding the default universal variant
1164:debug:main Reading variant descriptions from /opt/local/var/macports/sources/rsync.macports.org/macports/release/tarballs/ports/_resources/port1.0/variant_descriptions.conf
1165:debug:main Running callback portconfigure::add_automatic_compiler_dependencies
1166:debug:main Chosen compiler macports-clang-9.0 is provided by a port, adding dependency
1167:debug:main Adding depends_build port:clang-9.0
1168:debug:main Adding depends_lib libcxx
1169:debug:main Adding depends_skip_archcheck clang-9.0
1170:debug:main Finished running callback portconfigure::add_automatic_compiler_dependencies
1171:debug:main Running callback portbuild::add_automatic_buildsystem_dependencies
1172:debug:main Finished running callback portbuild::add_automatic_buildsystem_dependencies
1173:debug:main Running callback portstartupitem::add_notes
1174:debug:main Finished running callback portstartupitem::add_notes
1175:debug:main No need to upgrade! xorg-libXau 1.0.9_0 >= xorg-libXau 1.0.9_0
1176:debug:main epoch: in tree: 1 installed: 1
1177:debug:main xorg-xorgproto 2019.2_0 exists in the ports tree
1178:debug:main xorg-xorgproto 2019.2_0  is the latest installed
1179:debug:main xorg-xorgproto 2019.2_0  is active
1180:debug:main Merging existing variants '' into variants
1181:debug:main new fully merged portvariants:
1182:debug:main Changing to port directory: /opt/local/var/macports/sources/rsync.macports.org/macports/release/tarballs/ports/x11/xorg-xorgproto
1183:debug:main OS darwin/10.8.0 (macOS 10.6) arch i386
1184:debug:main only one arch supported, so not adding the default universal variant
1185:debug:main Running callback portconfigure::add_automatic_compiler_dependencies
1186:debug:main Finished running callback portconfigure::add_automatic_compiler_dependencies
1187:debug:main Running callback portbuild::add_automatic_buildsystem_dependencies
1188:debug:main Finished running callback portbuild::add_automatic_buildsystem_dependencies
1189:debug:main Running callback portstartupitem::add_notes
1190:debug:main Finished running callback portstartupitem::add_notes
1191:debug:main No need to upgrade! xorg-xorgproto 2019.2_0 >= xorg-xorgproto 2019.2_0
1192:debug:main epoch: in tree: 0 installed: 0
1193:debug:main xorg-libxcb 1.13.1_0 exists in the ports tree
1194:debug:main xorg-libxcb 1.13.1_0 +python27 is the latest installed
1195:debug:main xorg-libxcb 1.13.1_0 +python27 is active
1196:debug:main Merging existing variants '+python27' into variants
1197:debug:main new fully merged portvariants: python27 +
1198:debug:main Changing to port directory: /opt/local/var/macports/sources/rsync.macports.org/macports/release/tarballs/ports/x11/xorg-libxcb
1199:debug:main OS darwin/10.8.0 (macOS 10.6) arch i386
1200:debug:main adding the default universal variant
1201:debug:main Reading variant descriptions from /opt/local/var/macports/sources/rsync.macports.org/macports/release/tarballs/ports/_resources/port1.0/variant_descriptions.conf
1202:debug:main Requested variant +python27 is not provided by port xorg-libxcb.
1203:debug:main Executing variant python37 provides python37
1204:debug:main Running callback portconfigure::add_automatic_compiler_dependencies
1205:debug:main Chosen compiler macports-clang-9.0 is provided by a port, adding dependency
1206:debug:main Adding depends_build port:clang-9.0
1207:debug:main Adding depends_lib libcxx
1208:debug:main Adding depends_skip_archcheck clang-9.0
1209:debug:main Finished running callback portconfigure::add_automatic_compiler_dependencies
1210:debug:main Running callback portbuild::add_automatic_buildsystem_dependencies
1211:debug:main Finished running callback portbuild::add_automatic_buildsystem_dependencies
1212:debug:main Running callback portstartupitem::add_notes
1213:debug:main Finished running callback portstartupitem::add_notes
1214:debug:main Skipping upgrade since xorg-libxcb 1.13.1_0 >= xorg-libxcb 1.13.1_0, even though installed variants "+python27" do not match "+python37".
1215:debug:main epoch: in tree: 0 installed: 0
1216:debug:main xorg-xcb-proto 1.13_2 exists in the ports tree
1217:debug:main xorg-xcb-proto 1.13_2 +python37 is the latest installed
1218:debug:main xorg-xcb-proto 1.13_2 +python37 is active
1219:debug:main Merging existing variants '+python37' into variants
1220:debug:main new fully merged portvariants: python37 +
1221:debug:main Changing to port directory: /opt/local/var/macports/sources/rsync.macports.org/macports/release/tarballs/ports/x11/xorg-xcb-proto
1222:debug:main OS darwin/10.8.0 (macOS 10.6) arch i386
1223:debug:main only one arch supported, so not adding the default universal variant
1224:debug:main Executing variant python37 provides python37
1225:debug:main Running callback portconfigure::add_automatic_compiler_dependencies
1226:debug:main Finished running callback portconfigure::add_automatic_compiler_dependencies
1227:debug:main Running callback portbuild::add_automatic_buildsystem_dependencies
1228:debug:main Finished running callback portbuild::add_automatic_buildsystem_dependencies
1229:debug:main Running callback portstartupitem::add_notes
1230:debug:main Finished running callback portstartupitem::add_notes
1231:debug:main No need to upgrade! xorg-xcb-proto 1.13_2 >= xorg-xcb-proto 1.13_2
1232:debug:main epoch: in tree: 0 installed: 0
1233:debug:main xorg-libpthread-stubs 0.4_0 exists in the ports tree
1234:debug:main xorg-libpthread-stubs 0.4_0  is the latest installed
1235:debug:main xorg-libpthread-stubs 0.4_0  is active
1236:debug:main Merging existing variants '' into variants
1237:debug:main new fully merged portvariants:
1238:debug:main Changing to port directory: /opt/local/var/macports/sources/rsync.macports.org/macports/release/tarballs/ports/x11/xorg-libpthread-stubs
1239:debug:main OS darwin/10.8.0 (macOS 10.6) arch i386
1240:debug:main only one arch supported, so not adding the default universal variant
1241:debug:main Running callback portconfigure::add_automatic_compiler_dependencies
1242:debug:main Finished running callback portconfigure::add_automatic_compiler_dependencies
1243:debug:main Running callback portbuild::add_automatic_buildsystem_dependencies
1244:debug:main Finished running callback portbuild::add_automatic_buildsystem_dependencies
1245:debug:main Running callback portstartupitem::add_notes
1246:debug:main Finished running callback portstartupitem::add_notes
1247:debug:main No need to upgrade! xorg-libpthread-stubs 0.4_0 >= xorg-libpthread-stubs 0.4_0
1248:debug:main epoch: in tree: 0 installed: 0
1249:debug:main xorg-libXt 1.2.0_0 exists in the ports tree
1250:debug:main xorg-libXt 1.2.0_0  is the latest installed
1251:debug:main xorg-libXt 1.2.0_0  is active
1252:debug:main Merging existing variants '' into variants
1253:debug:main new fully merged portvariants:
1254:debug:main Changing to port directory: /opt/local/var/macports/sources/rsync.macports.org/macports/release/tarballs/ports/x11/xorg-libXt
1255:debug:main OS darwin/10.8.0 (macOS 10.6) arch i386
1256:debug:main adding the default universal variant
1257:debug:main Reading variant descriptions from /opt/local/var/macports/sources/rsync.macports.org/macports/release/tarballs/ports/_resources/port1.0/variant_descriptions.conf
1258:debug:main Running callback portconfigure::add_automatic_compiler_dependencies
1259:debug:main Chosen compiler macports-clang-9.0 is provided by a port, adding dependency
1260:debug:main Adding depends_build port:clang-9.0
1261:debug:main Adding depends_lib libcxx
1262:debug:main Adding depends_skip_archcheck clang-9.0
1263:debug:main Finished running callback portconfigure::add_automatic_compiler_dependencies
1264:debug:main Running callback portbuild::add_automatic_buildsystem_dependencies
1265:debug:main Finished running callback portbuild::add_automatic_buildsystem_dependencies
1266:debug:main Running callback portstartupitem::add_notes
1267:debug:main Finished running callback portstartupitem::add_notes
1268:debug:main No need to upgrade! xorg-libXt 1.2.0_0 >= xorg-libXt 1.2.0_0
1269:debug:main epoch: in tree: 0 installed: 0
1270:debug:main xorg-libsm 1.2.3_0 exists in the ports tree
1271:debug:main xorg-libsm 1.2.3_0  is the latest installed
1272:debug:main xorg-libsm 1.2.3_0  is active
1273:debug:main Merging existing variants '' into variants
1274:debug:main new fully merged portvariants:
1275:debug:main Changing to port directory: /opt/local/var/macports/sources/rsync.macports.org/macports/release/tarballs/ports/x11/xorg-libsm
1276:debug:main OS darwin/10.8.0 (macOS 10.6) arch i386
1277:debug:main adding the default universal variant
1278:debug:main Reading variant descriptions from /opt/local/var/macports/sources/rsync.macports.org/macports/release/tarballs/ports/_resources/port1.0/variant_descriptions.conf
1279:debug:main Running callback portconfigure::add_automatic_compiler_dependencies
1280:debug:main Chosen compiler macports-clang-9.0 is provided by a port, adding dependency
1281:debug:main Adding depends_build port:clang-9.0
1282:debug:main Adding depends_lib libcxx
1283:debug:main Adding depends_skip_archcheck clang-9.0
1284:debug:main Finished running callback portconfigure::add_automatic_compiler_dependencies
1285:debug:main Running callback portbuild::add_automatic_buildsystem_dependencies
1286:debug:main Finished running callback portbuild::add_automatic_buildsystem_dependencies
1287:debug:main Running callback portstartupitem::add_notes
1288:debug:main Finished running callback portstartupitem::add_notes
1289:debug:main No need to upgrade! xorg-libsm 1.2.3_0 >= xorg-libsm 1.2.3_0
1290:debug:main epoch: in tree: 0 installed: 0
1291:debug:main xorg-libice 1.0.10_0 exists in the ports tree
1292:debug:main xorg-libice 1.0.10_0  is the latest installed
1293:debug:main xorg-libice 1.0.10_0  is active
1294:debug:main Merging existing variants '' into variants
1295:debug:main new fully merged portvariants:
1296:debug:main Changing to port directory: /opt/local/var/macports/sources/rsync.macports.org/macports/release/tarballs/ports/x11/xorg-libice
1297:debug:main OS darwin/10.8.0 (macOS 10.6) arch i386
1298:debug:main adding the default universal variant
1299:debug:main Reading variant descriptions from /opt/local/var/macports/sources/rsync.macports.org/macports/release/tarballs/ports/_resources/port1.0/variant_descriptions.conf
1300:debug:main Running callback portconfigure::add_automatic_compiler_dependencies
1301:debug:main Chosen compiler macports-clang-9.0 is provided by a port, adding dependency
1302:debug:main Adding depends_build port:clang-9.0
1303:debug:main Adding depends_lib libcxx
1304:debug:main Adding depends_skip_archcheck clang-9.0
1305:debug:main Finished running callback portconfigure::add_automatic_compiler_dependencies
1306:debug:main Running callback portbuild::add_automatic_buildsystem_dependencies
1307:debug:main Finished running callback portbuild::add_automatic_buildsystem_dependencies
1308:debug:main Running callback portstartupitem::add_notes
1309:debug:main Finished running callback portstartupitem::add_notes
1310:debug:main No need to upgrade! xorg-libice 1.0.10_0 >= xorg-libice 1.0.10_0
1311:debug:main epoch: in tree: 0 installed: 0
1312:debug:main psutils p17_1 exists in the ports tree
1313:debug:main psutils p17_1  is the latest installed
1314:debug:main psutils p17_1  is active
1315:debug:main Merging existing variants '' into variants
1316:debug:main new fully merged portvariants:
1317:debug:main Changing to port directory: /opt/local/var/macports/sources/rsync.macports.org/macports/release/tarballs/ports/print/psutils
1318:debug:main OS darwin/10.8.0 (macOS 10.6) arch i386
1319:debug:main Reading variant descriptions from /opt/local/var/macports/sources/rsync.macports.org/macports/release/tarballs/ports/_resources/port1.0/variant_descriptions.conf
1320:debug:main universal variant already exists, so not adding the default one
1321:debug:main Running callback portconfigure::add_automatic_compiler_dependencies
1322:debug:main Chosen compiler macports-clang-9.0 is provided by a port, adding dependency
1323:debug:main Adding depends_build port:clang-9.0
1324:debug:main Adding depends_lib libcxx
1325:debug:main Adding depends_skip_archcheck clang-9.0
1326:debug:main Finished running callback portconfigure::add_automatic_compiler_dependencies
1327:debug:main Running callback portbuild::add_automatic_buildsystem_dependencies
1328:debug:main Finished running callback portbuild::add_automatic_buildsystem_dependencies
1329:debug:main Running callback portstartupitem::add_notes
1330:debug:main Finished running callback portstartupitem::add_notes
1331:debug:main No need to upgrade! psutils p17_1 >= psutils p17_1
1332:debug:main epoch: in tree: 0 installed: 0
1333:debug:main netpbm 10.88.00_0 exists in the ports tree
1334:debug:main netpbm 10.88.00_0 +x11 is the latest installed
1335:debug:main netpbm 10.88.00_0 +x11 is active
1336:debug:main Merging existing variants '+x11' into variants
1337:debug:main new fully merged portvariants: x11 +
1338:debug:main Changing to port directory: /opt/local/var/macports/sources/rsync.macports.org/macports/release/tarballs/ports/graphics/netpbm
1339:debug:main OS darwin/10.8.0 (macOS 10.6) arch i386
1340:debug:main Sourcing PortGroup github 1.0 from /opt/local/var/macports/sources/rsync.macports.org/macports/release/tarballs/ports/_resources/port1.0/group/github-1.0.tcl
1341:debug:main Re-registering default for livecheck.url
1342:debug:main Reading variant descriptions from /opt/local/var/macports/sources/rsync.macports.org/macports/release/tarballs/ports/_resources/port1.0/variant_descriptions.conf
1343:debug:main universal variant already exists, so not adding the default one
1344:debug:main Executing variant x11 provides x11
1345:debug:main Running callback portconfigure::add_automatic_compiler_dependencies
1346:debug:main Chosen compiler macports-clang-9.0 is provided by a port, adding dependency
1347:debug:main Adding depends_build port:clang-9.0
1348:debug:main Adding depends_lib libcxx
1349:debug:main Adding depends_skip_archcheck clang-9.0
1350:debug:main Finished running callback portconfigure::add_automatic_compiler_dependencies
1351:debug:main Running callback portbuild::add_automatic_buildsystem_dependencies
1352:debug:main Finished running callback portbuild::add_automatic_buildsystem_dependencies
1353:debug:main Running callback portstartupitem::add_notes
1354:debug:main Finished running callback portstartupitem::add_notes
1355:debug:main No need to upgrade! netpbm 10.88.00_0 >= netpbm 10.88.00_0
1356:debug:main epoch: in tree: 0 installed: 0
1357:debug:main jasper 2.0.14_0 exists in the ports tree
1358:debug:main jasper 2.0.14_0  is the latest installed
1359:debug:main jasper 2.0.14_0  is active
1360:debug:main Merging existing variants '' into variants
1361:debug:main new fully merged portvariants:
1362:debug:main Changing to port directory: /opt/local/var/macports/sources/rsync.macports.org/macports/release/tarballs/ports/graphics/jasper
1363:debug:main OS darwin/10.8.0 (macOS 10.6) arch i386
1364:debug:main Re-registering default for configure.dir
1365:debug:main Re-registering default for configure.pre_args
1366:debug:main Re-registering default for build.dir
1367:debug:main Re-registering default for destroot.target
1368:debug:main Sourcing PortGroup cmake 1.0 from /opt/local/var/macports/sources/rsync.macports.org/macports/release/tarballs/ports/_resources/port1.0/group/cmake-1.0.tcl
1369:debug:main adding the default universal variant
1370:debug:main Reading variant descriptions from /opt/local/var/macports/sources/rsync.macports.org/macports/release/tarballs/ports/_resources/port1.0/variant_descriptions.conf
1371:debug:main Running callback portconfigure::add_automatic_compiler_dependencies
1372:debug:main Chosen compiler macports-clang-9.0 is provided by a port, adding dependency
1373:debug:main Adding depends_build port:clang-9.0
1374:debug:main Adding depends_lib libcxx
1375:debug:main Adding depends_skip_archcheck clang-9.0
1376:debug:main Finished running callback portconfigure::add_automatic_compiler_dependencies
1377:debug:main Running callback portbuild::add_automatic_buildsystem_dependencies
1378:debug:main Finished running callback portbuild::add_automatic_buildsystem_dependencies
1379:debug:main Running callback portstartupitem::add_notes
1380:debug:main Finished running callback portstartupitem::add_notes
1381:debug:main No need to upgrade! jasper 2.0.14_0 >= jasper 2.0.14_0
1382:debug:main epoch: in tree: 0 installed: 0
1383:debug:main jbigkit 2.1_0 exists in the ports tree
1384:debug:main jbigkit 2.1_0  is the latest installed
1385:debug:main jbigkit 2.1_0  is active
1386:debug:main Merging existing variants '' into variants
1387:debug:main new fully merged portvariants:
1388:debug:main Changing to port directory: /opt/local/var/macports/sources/rsync.macports.org/macports/release/tarballs/ports/graphics/jbigkit
1389:debug:main OS darwin/10.8.0 (macOS 10.6) arch i386
1390:debug:main Reading variant descriptions from /opt/local/var/macports/sources/rsync.macports.org/macports/release/tarballs/ports/_resources/port1.0/variant_descriptions.conf
1391:debug:main universal variant already exists, so not adding the default one
1392:debug:main Running callback portconfigure::add_automatic_compiler_dependencies
1393:debug:main Chosen compiler macports-clang-9.0 is provided by a port, adding dependency
1394:debug:main Adding depends_build port:clang-9.0
1395:debug:main Adding depends_lib libcxx
1396:debug:main Adding depends_skip_archcheck clang-9.0
1397:debug:main Finished running callback portconfigure::add_automatic_compiler_dependencies
1398:debug:main Running callback portbuild::add_automatic_buildsystem_dependencies
1399:debug:main Finished running callback portbuild::add_automatic_buildsystem_dependencies
1400:debug:main Running callback portstartupitem::add_notes
1401:debug:main Finished running callback portstartupitem::add_notes
1402:debug:main No need to upgrade! jbigkit 2.1_0 >= jbigkit 2.1_0
1403:debug:main epoch: in tree: 0 installed: 0
1404:debug:main libnetpbm 10.88.00_0 exists in the ports tree
1405:debug:main libnetpbm 10.88.00_0  is the latest installed
1406:debug:main libnetpbm 10.88.00_0  is active
1407:debug:main Merging existing variants '' into variants
1408:debug:main new fully merged portvariants:
1409:debug:main Changing to port directory: /opt/local/var/macports/sources/rsync.macports.org/macports/release/tarballs/ports/graphics/netpbm
1410:debug:main OS darwin/10.8.0 (macOS 10.6) arch i386
1411:debug:main Sourcing PortGroup github 1.0 from /opt/local/var/macports/sources/rsync.macports.org/macports/release/tarballs/ports/_resources/port1.0/group/github-1.0.tcl
1412:debug:main Re-registering default for livecheck.url
1413:debug:main Reading variant descriptions from /opt/local/var/macports/sources/rsync.macports.org/macports/release/tarballs/ports/_resources/port1.0/variant_descriptions.conf
1414:debug:main universal variant already exists, so not adding the default one
1415:debug:main Running callback portconfigure::add_automatic_compiler_dependencies
1416:debug:main Chosen compiler macports-clang-9.0 is provided by a port, adding dependency
1417:debug:main Adding depends_build port:clang-9.0
1418:debug:main Adding depends_lib libcxx
1419:debug:main Adding depends_skip_archcheck clang-9.0
1420:debug:main Finished running callback portconfigure::add_automatic_compiler_dependencies
1421:debug:main Running callback portbuild::add_automatic_buildsystem_dependencies
1422:debug:main Finished running callback portbuild::add_automatic_buildsystem_dependencies
1423:debug:main Running callback portstartupitem::add_notes
1424:debug:main Finished running callback portstartupitem::add_notes
1425:debug:main No need to upgrade! libnetpbm 10.88.00_0 >= libnetpbm 10.88.00_0
1426:msg:main --->  Computing dependencies for groff:info:main .:debug:main Searching for dependency: texinfo
1427:debug:main Found Dependency: receipt exists for texinfo
1428:debug:main Searching for dependency: clang-9.0
1429:debug:main Found Dependency: receipt exists for clang-9.0
1430:debug:main Searching for dependency: ghostscript
1431:debug:main Found Dependency: receipt exists for ghostscript
1432:debug:main Searching for dependency: psutils
1433:debug:main Found Dependency: receipt exists for psutils
1434:debug:main Searching for dependency: netpbm
1435:debug:main Found Dependency: receipt exists for netpbm
1436:debug:main Searching for dependency: libcxx
1437:debug:main Found Dependency: receipt exists for libcxx
1438:debug:main Executing org.macports.main (groff)
1439:debug:main dropping privileges: euid changed to 502, egid changed to 505.
1440:debug:fetch fetch phase started at Sat Nov 30 13:26:22 PST 2019
1441:notice:fetch --->  Fetching distfiles for groff
1442:debug:fetch Executing org.macports.fetch (groff)
1443:debug:fetch Privilege de-escalation not attempted as not running as root.
1444:debug:checksum checksum phase started at Sat Nov 30 13:26:22 PST 2019
1445:notice:checksum --->  Verifying checksums for groff
1446:debug:checksum Executing org.macports.checksum (groff)
1447:info:checksum --->  Checksumming groff-1.22.4.tar.gz
1448:debug:checksum Calculated (rmd160) is 6f0555695ac882a8e1f925cce22f7e3d267188cb
1449:debug:checksum Correct (rmd160) checksum for groff-1.22.4.tar.gz
1450:debug:checksum Calculated (sha256) is e78e7b4cb7dec310849004fa88847c44701e8d133b5d4c13057d876c1bad0293
1451:debug:checksum Correct (sha256) checksum for groff-1.22.4.tar.gz
1452:debug:checksum Calculated (size) is 4137480
1453:debug:checksum Correct (size) checksum for groff-1.22.4.tar.gz
1454:debug:checksum Privilege de-escalation not attempted as not running as root.
1455:debug:extract extract phase started at Sat Nov 30 13:26:22 PST 2019
1456:notice:extract --->  Extracting groff
1457:debug:extract Executing org.macports.extract (groff)
1458:info:extract --->  Extracting groff-1.22.4.tar.gz
1459:debug:extract setting option extract.args to '/opt/local/var/macports/distfiles/groff/groff-1.22.4.tar.gz'
1460:debug:extract Environment:
1461:debug:extract CC_PRINT_OPTIONS='YES'
1462:debug:extract CC_PRINT_OPTIONS_FILE='/opt/local/var/macports/build/_opt_local_var_macports_sources_rsync.macports.org_macports_release_tarballs_ports_sysutils_groff/groff/work/.CC_PRINT_OPTIONS'
1463:debug:extract CPATH='/opt/local/include'
1464:debug:extract DEVELOPER_DIR='/Developer'
1465:debug:extract LIBRARY_PATH='/opt/local/lib'
1466:debug:extract MACOSX_DEPLOYMENT_TARGET='10.6'
1467:info:extract Executing:  cd "/opt/local/var/macports/build/_opt_local_var_macports_sources_rsync.macports.org_macports_release_tarballs_ports_sysutils_groff/groff/work" && /usr/bin/gzip -dc '/opt/local/var/macports/distfiles/groff/groff-1.22.4.tar.gz' | /usr/bin/gnutar --no-same-owner -xf -
1468:debug:extract system:  cd "/opt/local/var/macports/build/_opt_local_var_macports_sources_rsync.macports.org_macports_release_tarballs_ports_sysutils_groff/groff/work" && /usr/bin/gzip -dc '/opt/local/var/macports/distfiles/groff/groff-1.22.4.tar.gz' | /usr/bin/gnutar --no-same-owner -xf -
1469:debug:extract euid/egid changed to: 0/0
1470:debug:extract chowned /opt/local/var/macports/build/_opt_local_var_macports_sources_rsync.macports.org_macports_release_tarballs_ports_sysutils_groff/groff/work to macports
1471:debug:extract euid/egid changed to: 502/505
1472:debug:extract Privilege de-escalation not attempted as not running as root.
1473:debug:patch patch phase started at Sat Nov 30 13:26:23 PST 2019
1474:debug:patch Executing org.macports.patch (groff)
1475:debug:patch Privilege de-escalation not attempted as not running as root.
1476:debug:configure configure phase started at Sat Nov 30 13:26:23 PST 2019
1477:notice:configure --->  Configuring groff
1478:debug:configure Preferred compilers: macports-clang-9.0 macports-clang-8.0 macports-clang-7.0 macports-clang-6.0 macports-clang-5.0 macports-clang-3.7 macports-clang-3.4
1479:debug:configure Using compiler 'MacPorts Clang 9.0'
1480:debug:configure Executing org.macports.configure (groff)
1481:debug:configure Environment:
1482:debug:configure CC='/opt/local/bin/clang-mp-9.0'
1483:debug:configure CC_PRINT_OPTIONS='YES'
1484:debug:configure CC_PRINT_OPTIONS_FILE='/opt/local/var/macports/build/_opt_local_var_macports_sources_rsync.macports.org_macports_release_tarballs_ports_sysutils_groff/groff/work/.CC_PRINT_OPTIONS'
1485:debug:configure CFLAGS='-pipe -Os -arch x86_64'
1486:debug:configure CPATH='/opt/local/include'
1487:debug:configure CPPFLAGS='-I/opt/local/include'
1488:debug:configure CXX='/opt/local/bin/clang++-mp-9.0'
1489:debug:configure CXXFLAGS='-pipe -Os -stdlib=libc++ -arch x86_64'
1490:debug:configure DEVELOPER_DIR='/Developer'
1491:debug:configure F90FLAGS='-pipe -Os -m64'
1492:debug:configure FCFLAGS='-pipe -Os -m64'
1493:debug:configure FFLAGS='-pipe -Os -m64'
1494:debug:configure INSTALL='/usr/bin/install -c'
1495:debug:configure LDFLAGS='-L/opt/local/lib -Wl,-headerpad_max_install_names -arch x86_64'
1496:debug:configure LIBRARY_PATH='/opt/local/lib'
1497:debug:configure MACOSX_DEPLOYMENT_TARGET='10.6'
1498:debug:configure OBJC='/opt/local/bin/clang-mp-9.0'
1499:debug:configure OBJCFLAGS='-pipe -Os -arch x86_64'
1500:debug:configure OBJCXX='/opt/local/bin/clang++-mp-9.0'
1501:debug:configure OBJCXXFLAGS='-pipe -Os -stdlib=libc++ -arch x86_64'
1502:info:configure Executing:  cd "/opt/local/var/macports/build/_opt_local_var_macports_sources_rsync.macports.org_macports_release_tarballs_ports_sysutils_groff/groff/work/groff-1.22.4" && ./configure --prefix=/opt/local --infodir=/opt/local/share/info --mandir=/opt/local/share/man --without-x ac_cv_prog_AWK=/usr/bin/awk
1503:debug:configure system:  cd "/opt/local/var/macports/build/_opt_local_var_macports_sources_rsync.macports.org_macports_release_tarballs_ports_sysutils_groff/groff/work/groff-1.22.4" && ./configure --prefix=/opt/local --infodir=/opt/local/share/info --mandir=/opt/local/share/man --without-x ac_cv_prog_AWK=/usr/bin/awk
1504:info:configure checking for gcc... /opt/local/bin/clang-mp-9.0
1505:info:configure checking whether the C compiler works... yes
1506:info:configure checking for C compiler default output file name... a.out
1507:info:configure checking for suffix of executables...
1508:info:configure checking whether we are cross compiling... no
1509:info:configure checking for suffix of object files... o
1510:info:configure checking whether we are using the GNU C compiler... yes
1511:info:configure checking whether /opt/local/bin/clang-mp-9.0 accepts -g... yes
1512:info:configure checking for /opt/local/bin/clang-mp-9.0 option to accept ISO C89... none needed
1513:info:configure checking whether /opt/local/bin/clang-mp-9.0 understands -c and -o together... yes
1514:info:configure checking how to run the C preprocessor... /opt/local/bin/clang-mp-9.0 -E
1515:info:configure checking for grep that handles long lines and -e... /usr/bin/grep
1516:info:configure checking for egrep... /usr/bin/grep -E
1517:info:configure checking for ANSI C header files... yes
1518:info:configure checking for sys/types.h... yes
1519:info:configure checking for sys/stat.h... yes
1520:info:configure checking for stdlib.h... yes
1521:info:configure checking for string.h... yes
1522:info:configure checking for memory.h... yes
1523:info:configure checking for strings.h... yes
1524:info:configure checking for inttypes.h... yes
1525:info:configure checking for stdint.h... yes
1526:info:configure checking for unistd.h... yes
1527:info:configure checking minix/config.h usability... no
1528:info:configure checking minix/config.h presence... no
1529:info:configure checking for minix/config.h... no
1530:info:configure checking whether it is safe to define __EXTENSIONS__... yes
1531:info:configure checking whether _XOPEN_SOURCE should be defined... no
1532:info:configure checking for a BSD-compatible install... /usr/bin/install -c
1533:info:configure checking whether build environment is sane... yes
1534:info:configure checking for a thread-safe mkdir -p... /opt/local/bin/gmkdir -p
1535:info:configure checking for gawk... (cached) /usr/bin/awk
1536:info:configure checking whether make sets $(MAKE)... yes
1537:info:configure checking whether make supports the include directive... yes (GNU style)
1538:info:configure checking whether make supports nested variables... yes
1539:info:configure checking dependency style of /opt/local/bin/clang-mp-9.0... gcc3
1540:info:configure checking whether make supports nested variables... (cached) yes
1541:info:configure checking for gcc... (cached) /opt/local/bin/clang-mp-9.0
1542:info:configure checking whether we are using the GNU C compiler... (cached) yes
1543:info:configure checking whether /opt/local/bin/clang-mp-9.0 accepts -g... (cached) yes
1544:info:configure checking for /opt/local/bin/clang-mp-9.0 option to accept ISO C89... (cached) none needed
1545:info:configure checking whether /opt/local/bin/clang-mp-9.0 understands -c and -o together... (cached) yes
1546:info:configure checking whether we are using the GNU C++ compiler... yes
1547:info:configure checking whether /opt/local/bin/clang++-mp-9.0 accepts -g... yes
1548:info:configure checking dependency style of /opt/local/bin/clang++-mp-9.0... gcc3
1549:info:configure checking for Minix Amsterdam compiler... no
1550:info:configure checking for ar... ar
1551:info:configure checking for ranlib... ranlib
1552:info:configure checking build system type... x86_64-apple-darwin10.8.0
1553:info:configure checking host system type... x86_64-apple-darwin10.8.0
1554:info:configure checking for size_t... yes
1555:info:configure checking for working alloca.h... yes
1556:info:configure checking for alloca... yes
1557:info:configure checking whether the preprocessor supports include_next... yes
1558:info:configure checking whether system header files limit the line length... no
1559:info:configure checking for complete errno.h... no
1560:info:configure checking for EMULTIHOP value... yes
1561:info:configure checking for ENOLINK value... yes
1562:info:configure checking for EOVERFLOW value... yes
1563:info:configure checking for stdint.h... yes
1564:info:configure checking for inttypes.h... yes
1565:info:configure checking whether printf supports size specifiers as in C99... yes
1566:info:configure checking whether printf supports 'long double' arguments... yes
1567:info:configure checking whether printf supports infinite 'double' arguments... yes
1568:info:configure checking whether byte ordering is bigendian... no
1569:info:configure checking whether long double and double are the same... no
1570:info:configure checking whether printf supports infinite 'long double' arguments... yes
1571:info:configure checking whether printf supports the 'a' and 'A' directives... no
1572:info:configure checking whether printf supports the 'F' directive... yes
1573:info:configure checking whether printf supports the 'n' directive... yes
1574:info:configure checking whether printf supports the 'ls' directive... yes
1575:info:configure checking whether printf supports POSIX/XSI format strings with positions... yes
1576:info:configure checking whether printf supports the grouping flag... yes
1577:info:configure checking whether printf supports the left-adjust flag correctly... yes
1578:info:configure checking whether printf supports the zero flag correctly... no
1579:info:configure checking whether printf supports large precisions... yes
1580:info:configure checking whether printf survives out-of-memory conditions... yes
1581:info:configure checking for vasnprintf... no
1582:info:configure checking for snprintf... yes
1583:info:configure checking for __fseterr... no
1584:info:configure checking for symlink... yes
1585:info:configure checking for mprotect... yes
1586:info:configure checking for iswcntrl... yes
1587:info:configure checking for wcwidth... yes
1588:info:configure checking for unsigned long long int... yes
1589:info:configure checking for long long int... yes
1590:info:configure checking for wchar_t... yes
1591:info:configure checking for wint_t... yes
1592:info:configure checking whether wint_t is too small... no
1593:info:configure checking for features.h... no
1594:info:configure checking for limits.h... yes
1595:info:configure checking for unistd.h... (cached) yes
1596:info:configure checking for math.h... yes
1597:info:configure checking for sys/mman.h... yes
1598:info:configure checking for wchar.h... yes
1599:info:configure checking for stdint.h... (cached) yes
1600:info:configure checking for crtdefs.h... no
1601:info:configure checking for wctype.h... yes
1602:info:configure checking for stdlib.h... (cached) yes
1603:info:configure checking for sys/param.h... yes
1604:info:configure checking for intmax_t... yes
1605:info:configure checking where to find the exponent in a 'double'... word 1 bit 20
1606:info:configure checking whether snprintf returns a byte count as in C99... yes
1607:info:configure checking for snprintf... (cached) yes
1608:info:configure checking for strnlen... no
1609:info:configure checking for wcslen... yes
1610:info:configure checking for wcsnlen... no
1611:info:configure checking for mbrtowc... yes
1612:info:configure checking for wcrtomb... yes
1613:info:configure checking whether _snprintf is declared... no
1614:info:configure checking whether frexp() can be used without linking with libm... yes
1615:info:configure checking whether alarm is declared... yes
1616:info:configure checking host CPU and C ABI... x86_64
1617:info:configure checking where to find the exponent in a 'float'... word 0 bit 23
1618:info:configure checking whether limits.h has LLONG_MAX, WORD_BIT, ULLONG_WIDTH etc.... no
1619:info:configure checking for nl_langinfo and CODESET... yes
1620:info:configure checking for working fcntl.h... no (bad O_NOATIME)
1621:info:configure checking whether getc_unlocked is declared... yes
1622:info:configure checking whether we are using the GNU C Library >= 2.1 or uClibc... no
1623:info:configure checking for mmap... yes
1624:info:configure checking for MAP_ANONYMOUS... yes
1625:info:configure checking whether memchr works... yes
1626:info:configure checking whether snprintf is declared... yes
1627:info:configure checking whether stdint.h conforms to C99... no
1628:info:configure checking sys/inttypes.h usability... no
1629:info:configure checking sys/inttypes.h presence... no
1630:info:configure checking for sys/inttypes.h... no
1631:info:configure checking sys/bitypes.h usability... no
1632:info:configure checking sys/bitypes.h presence... no
1633:info:configure checking for sys/bitypes.h... no
1634:info:configure checking for bit size of ptrdiff_t... 64
1635:info:configure checking for bit size of size_t... 64
1636:info:configure checking for bit size of sig_atomic_t... 32
1637:info:configure checking for bit size of wchar_t... 32
1638:info:configure checking for bit size of wint_t... 32
1639:info:configure checking whether sig_atomic_t is signed... yes
1640:info:configure checking whether wchar_t is signed... yes
1641:info:configure checking whether wint_t is signed... yes
1642:info:configure checking for ptrdiff_t integer literal suffix... l
1643:info:configure checking for size_t integer literal suffix... ul
1644:info:configure checking for sig_atomic_t integer literal suffix...
1645:info:configure checking for wchar_t integer literal suffix...
1646:info:configure checking for wint_t integer literal suffix...
1647:info:configure checking for C/C++ restrict keyword... __restrict
1648:info:configure checking for pid_t... yes
1649:info:configure checking for mode_t... yes
1650:info:configure checking whether vsnprintf is declared... yes
1651:info:configure checking whether <wchar.h> uses 'inline' correctly... yes
1652:info:configure checking for inline... inline
1653:info:configure checking for alloca as a compiler built-in... yes
1654:info:configure checking whether conversion from 'int' to 'long double' works... yes
1655:info:configure checking for nl_langinfo... yes
1656:info:configure checking for ptrdiff_t... yes
1657:info:configure checking whether frexp works... yes
1658:info:configure checking whether frexpl is declared... yes
1659:info:configure checking whether frexpl() can be used without linking with libm... yes
1660:info:configure checking whether frexpl works... yes
1661:info:configure checking whether isnan(double) can be used without linking with libm... yes
1662:info:configure checking whether isnan(float) can be used without linking with libm... no
1663:info:configure checking where to find the exponent in a 'float'... (cached) word 0 bit 23
1664:info:configure checking whether isnan(long double) can be used without linking with libm... no
1665:info:configure checking where to find the exponent in a 'long double'... word 2 bit 0
1666:info:configure checking whether NAN macro works... yes
1667:info:configure checking whether HUGE_VAL works... yes
1668:info:configure checking whether frexp works... (cached) yes
1669:info:configure checking whether ldexp can be used without linking with libm... yes
1670:info:configure checking whether frexpl() can be used without linking with libm... (cached) yes
1671:info:configure checking whether frexpl works... (cached) yes
1672:info:configure checking whether frexpl is declared... (cached) yes
1673:info:configure checking whether ldexpl() can be used without linking with libm... yes
1674:info:configure checking whether ldexpl works... yes
1675:info:configure checking whether ldexpl is declared... yes
1676:info:configure checking for signbit macro... yes
1677:info:configure checking for signbit compiler built-ins... yes
1678:info:configure checking for stdint.h... (cached) yes
1679:info:configure checking for SIZE_MAX... yes
1680:info:configure checking for snprintf... (cached) yes
1681:info:configure checking whether snprintf respects a size of 1... yes
1682:info:configure checking whether printf supports POSIX/XSI format strings with positions... (cached) yes
1683:info:configure checking for ssize_t... yes
1684:info:configure checking for good max_align_t... yes
1685:info:configure checking whether NULL can be used in arbitrary expressions... yes
1686:info:configure checking which flavor of printf attribute matches inttypes macros... system
1687:info:configure checking for ptrdiff_t... (cached) yes
1688:info:configure checking for vsnprintf... yes
1689:info:configure checking whether snprintf respects a size of 1... (cached) yes
1690:info:configure checking whether printf supports POSIX/XSI format strings with positions... (cached) yes
1691:info:configure checking whether iswcntrl works... yes
1692:info:configure checking for towlower... yes
1693:info:configure checking for wctype_t... yes
1694:info:configure checking for wctrans_t... yes
1695:info:configure checking whether wcwidth is declared... yes
1696:info:configure checking whether wcwidth works reasonably in UTF-8 locales... no
1697:info:configure checking for stdint.h... (cached) yes
1698:info:configure checking that C++ compiler can compile simple program... yes
1699:info:configure checking that C++ static constructors and destructors are called... yes
1700:info:configure checking that header files support C++... yes
1701:info:configure checking whether character set is EBCDIC... no
1702:info:configure checking whether to install .cmd wrapper scripts for Windows... no
1703:info:configure checking for X... disabled
1704:info:configure configure: gxditview and xtotroff won't be built
1705:info:configure checking for a sed that does not truncate output... /opt/local/bin/gsed
1706:info:configure checking for perl... /opt/local/bin/perl
1707:info:configure checking for perl version... 5.26.3
1708:info:configure checking for lpr... lpr
1709:info:configure checking for lp... lp
1710:info:configure checking for lpq... lpq
1711:info:configure checking for command to use for printing PostScript files... lpr
1712:info:configure checking for command to use for printing dvi files... lpr -d
1713:info:configure checking for egrep... (cached) /usr/bin/grep -E
1714:info:configure checking for byacc... no
1715:info:configure checking for bison... bison -y
1716:info:configure checking for makeinfo... makeinfo
1717:info:configure checking for makeinfo version... 6.7
1718:info:configure checking for texi2dvi... found
1719:info:configure checking for ranlib... (cached) ranlib
1720:info:configure checking for install-info... install-info
1721:info:configure checking whether ln -s works... yes
1722:info:configure checking for xpmtoppm... found
1723:info:configure checking for pkg-config... /opt/local/bin/pkg-config
1724:info:configure checking pkg-config is at least version 0.9.0... yes
1725:info:configure checking for UCHARDET... no
1726:info:configure configure: WARNING: uchardet library not found, preconv might not work properly
1727:info:configure checking for pdfinfo... missing
1728:info:configure checking for pdffonts... missing
1729:info:configure checking for pdfimages... missing
1730:info:configure checking for csh hash hack... no
1731:info:configure checking stddef.h usability... yes
1732:info:configure checking stddef.h presence... yes
1733:info:configure checking for stddef.h... yes
1734:info:configure checking for stdlib.h... (cached) yes
1735:info:configure checking for unistd.h... (cached) yes
1736:info:configure checking dirent.h usability... yes
1737:info:configure checking dirent.h presence... yes
1738:info:configure checking for dirent.h... yes
1739:info:configure checking for limits.h... (cached) yes
1740:info:configure checking sys/dir.h usability... yes
1741:info:configure checking sys/dir.h presence... yes
1742:info:configure checking for sys/dir.h... yes
1743:info:configure checking for string.h... (cached) yes
1744:info:configure checking for strings.h... (cached) yes
1745:info:configure checking for math.h... (cached) yes
1746:info:configure checking sys/time.h usability... yes
1747:info:configure checking sys/time.h presence... yes
1748:info:configure checking for sys/time.h... yes
1749:info:configure checking direct.h usability... no
1750:info:configure checking direct.h presence... no
1751:info:configure checking for direct.h... no
1752:info:configure checking process.h usability... no
1753:info:configure checking process.h presence... no
1754:info:configure checking for process.h... no
1755:info:configure checking for ISC 3.x or 4.x... no
1756:info:configure checking whether -D_POSIX_SOURCE is necessary... no
1757:info:configure checking for return type of srand... void
1758:info:configure checking whether gettimeofday must be declared... no
1759:info:configure checking whether popen must be declared... no
1760:info:configure checking whether pclose must be declared... no
1761:info:configure checking whether putenv must be declared... no
1762:info:configure checking whether rand must be declared... no
1763:info:configure checking whether srand must be declared... no
1764:info:configure checking whether strcasecmp must be declared... no
1765:info:configure checking whether strncasecmp must be declared... no
1766:info:configure checking whether vfprintf must be declared... no
1767:info:configure checking for sys_nerr in <errno.h>, <stdio.h>, or <stdlib.h>... yes
1768:info:configure checking for sys_errlist in <errno.h>, <stdio.h>, or <stdlib.h>... yes
1769:info:configure checking C++ <osfcn.h>... no
1770:info:configure checking C++ <limits.h>... yes
1771:info:configure checking C++ <inttypes.h>... yes
1772:info:configure checking for unsigned long long... yes
1773:info:configure checking for declaration of time_t... yes
1774:info:configure checking for return type of signal handlers... void
1775:info:configure checking struct exception... yes
1776:info:configure checking whether byte ordering is bigendian... (cached) no
1777:info:configure checking for main in -lc... yes
1778:info:configure checking for sin in -lm... yes
1779:info:configure checking for ld used by /opt/local/bin/clang-mp-9.0... /opt/local/libexec/llvm-9.0/bin/ld
1780:info:configure checking if the linker (/opt/local/libexec/llvm-9.0/bin/ld) is GNU ld... no
1781:info:configure checking for shared library run path origin... done
1782:info:configure checking how to run the C++ preprocessor... /opt/local/bin/clang++-mp-9.0 -E
1783:info:configure checking for iconv... yes
1784:info:configure checking for working iconv... yes
1785:info:configure checking how to link with libiconv... -liconv
1786:info:configure checking for iconv declaration...
1787:info:configure          extern size_t iconv (iconv_t cd, char * *inbuf, size_t *inbytesleft, char * *outbuf, size_t *outbytesleft);
1788:info:configure checking for getpagesize... yes
1789:info:configure checking for working mmap... yes
1790:info:configure checking for fmod... yes
1791:info:configure checking for getcwd... yes
1792:info:configure checking for putenv... yes
1793:info:configure checking for strcasecmp... yes
1794:info:configure checking for strerror... yes
1795:info:configure checking for strncasecmp... yes
1796:info:configure checking for strtol... yes
1797:info:configure checking for gettimeofday... yes
1798:info:configure checking for isatty... yes
1799:info:configure checking for kill... yes
1800:info:configure checking for rename... yes
1801:info:configure checking for setlocale... yes
1802:info:configure checking for strsep... yes
1803:info:configure checking for mkstemp... yes
1804:info:configure checking whether sys_siglist is declared... no
1805:info:configure checking whether getc_unlocked is declared... (cached) yes
1806:info:configure checking for nl_langinfo and CODESET... (cached) yes
1807:info:configure checking whether ANSI array delete syntax is supported... yes
1808:info:configure checking traditional preprocessor... no
1809:info:configure checking w_coredump... no
1810:info:configure checking default value for grops -b option... 0
1811:info:configure checking default paper size... letter
1812:info:configure checking for existing troff installation... no
1813:info:configure checking for prefix of system macro packages...
1814:info:configure checking which system macro packages should be made available...
1815:info:configure checking separator character to use in groff search paths... :
1816:info:configure checking for gs... gs
1817:info:configure checking for pnmcut... found
1818:info:configure checking for pnmcrop... found
1819:info:configure checking for pnmtopng... found
1820:info:configure checking for psselect... found
1821:info:configure checking for pnmtops... found
1822:info:configure checking whether pnmtops can handle the -nosetpage option... yes
1823:info:configure checking whether make has builtin variable RM... yes
1824:info:configure checking for a diff program that supports option -D... yes
1825:info:configure checking whether test supports option -ef... yes
1826:info:configure checking for bash... /opt/local/bin/bash
1827:info:configure checking whether we are using the GNU C Library >= 2.1 or uClibc... (cached) no
1828:info:configure checking whether URW fonts in pfb format are available... found in /opt/local/share/fonts/urw-fonts/
1829:info:configure checking that generated files are newer than configure... done
1830:info:configure configure: creating ./config.status
1831:info:configure config.status: creating Makefile
1832:info:configure config.status: creating test-groff
1833:info:configure config.status: creating src/include/config.h
1834:info:configure config.status: executing depfiles commands
1835:info:configure GNU Troff version 1.22.4
1836:info:configure ----------------------------------------------------------------------
1837:info:configure  Prefix                          : /opt/local
1838:info:configure  Compiler                        : /opt/local/bin/clang-mp-9.0 -pipe -Os -arch x86_64 -I/opt/local/include
1839:info:configure  X11 support                     : no
1840:info:configure  Doc build                       : yes
1841:info:configure  URW fonts for pdf               : yes
1842:info:configure  Use uchardet library for preconv: no
1843:info:configure  pdftools for distcheck          : no
1844:info:configure ----------------------------------------------------------------------
1845:info:configure configure: WARNING:
1846:info:configure   uchardet library was not found; preprocessor 'preconv', which uses it to detect
1847:info:configure   the input file encoding, might not work properly (to check how and in which
1848:info:configure   order 'preconv' tries to determine the file encoding, see its man page).
1849:info:configure   
1850:debug:configure Privilege de-escalation not attempted as not running as root.
1851:debug:build build phase started at Sat Nov 30 13:27:05 PST 2019
1852:notice:build --->  Building groff
1853:debug:build Executing org.macports.build (groff)
1854:debug:build Environment:
1855:debug:build CC_PRINT_OPTIONS='YES'
1856:debug:build CC_PRINT_OPTIONS_FILE='/opt/local/var/macports/build/_opt_local_var_macports_sources_rsync.macports.org_macports_release_tarballs_ports_sysutils_groff/groff/work/.CC_PRINT_OPTIONS'
1857:debug:build CPATH='/opt/local/include'
1858:debug:build DEVELOPER_DIR='/Developer'
1859:debug:build LC_CTYPE='C'
1860:debug:build LIBRARY_PATH='/opt/local/lib'
1861:debug:build MACOSX_DEPLOYMENT_TARGET='10.6'
1862:info:build Executing:  cd "/opt/local/var/macports/build/_opt_local_var_macports_sources_rsync.macports.org_macports_release_tarballs_ports_sysutils_groff/groff/work/groff-1.22.4" && /usr/bin/make -j8 -w all
1863:debug:build system:  cd "/opt/local/var/macports/build/_opt_local_var_macports_sources_rsync.macports.org_macports_release_tarballs_ports_sysutils_groff/groff/work/groff-1.22.4" && /usr/bin/make -j8 -w all
1864:info:build make: Entering directory `/opt/local/var/macports/build/_opt_local_var_macports_sources_rsync.macports.org_macports_release_tarballs_ports_sysutils_groff/groff/work/groff-1.22.4'
1865:info:build   GEN      lib/alloca.h
1866:info:build   GEN      lib/limits.h
1867:info:build   GEN      lib/errno.h
1868:info:build   GEN      lib/stdint.h
1869:info:build   GEN      lib/math.h
1870:info:build   GEN      lib/stdio.h
1871:info:build   GEN      lib/string.h
1872:info:build   GEN      lib/unitypes.h
1873:info:build   GEN      lib/wchar.h
1874:info:build   GEN      lib/wctype.h
1875:info:build   GEN      lib/uniwidth.h
1876:info:build   GEN      lib/sys/types.h
1877:info:build   GEN      contrib/chem/README
1878:info:build   GEN      afmtodit
1879:info:build   GEN      font/devpdf/DESC
1880:info:build LANG=C \
1881:info:build     LC_ALL=C \
1882:info:build     makeinfo -o doc/groff.info --enable-encoding -I/opt/local/var/macports/build/_opt_local_var_macports_sources_rsync.macports.org_macports_release_tarballs_ports_sysutils_groff/groff/work/groff-1.22.4/doc /opt/local/var/macports/build/_opt_local_var_macports_sources_rsync.macports.org_macports_release_tarballs_ports_sysutils_groff/groff/work/groff-1.22.4/doc/groff.texi
1883:info:build cp -f ./font/devps/text.enc \
1884:info:build       ./font/devpdf/enc
1885:info:build /bin/sh ./arch/misc/shdeps.sh ":" ":" "/opt/local/bin" > shdeps.sed
1886:info:build /bin/sh ./src/libs/libgroff/config.charset '' > t-charset.alias
1887:info:build sed -e '/^#/d' \
1888:info:build         -e 's/@''PACKAGE''@/groff/g' ./src/libs/libgroff/ref-add.sin > t-ref-add.sed
1889:info:build   GEN      font/devpdf/Foundry
1890:info:build sed -e '/^#/d' \
1891:info:build         -e 's/@''PACKAGE''@/groff/g' ./src/libs/libgroff/ref-del.sin > t-ref-del.sed
1892:info:build mv t-ref-add.sed ref-add.sed
1893:info:build /opt/local/bin/gmkdir -p ./tmac;
1894:info:build mv t-ref-del.sed ref-del.sed
1895:info:build mv t-charset.alias charset.alias
1896:info:build   GEN      font/devpdf/util/BuildFoundries
1897:info:build if test -n ""; then \
1898:info:build       for m in ""; do \
1899:info:build         rm -f ./tmac/$m-wrap; \
1900:info:build         if test "$m" = an; then \
1901:info:build           echo .do mso andoc.tmac >>./tmac/$m-wrap; \
1902:info:build         fi; \
1903:info:build         echo .cp 1 >>./tmac/$m-wrap; \
1904:info:build         echo .so $m >>./tmac/$m-wrap; \
1905:info:build       done; \
1906:info:build     fi
1907:info:build touch tmac/stamp-wrap
1908:info:build   GEN      ./font/devpdf/download
1909:info:build BuildFoundries: notice: Copied grops font AB...
1910:info:build BuildFoundries: notice: Copied grops font ABI...
1911:info:build BuildFoundries: notice: Copied grops font AI...
1912:info:build BuildFoundries: notice: Copied grops font AR...
1913:info:build BuildFoundries: notice: Copied grops font BMB...
1914:info:build BuildFoundries: notice: Copied grops font BMBI...
1915:info:build BuildFoundries: notice: Copied grops font BMI...
1916:info:build BuildFoundries: notice: Copied grops font BMR...
1917:info:build BuildFoundries: notice: Copied grops font CB...
1918:info:build BuildFoundries: notice: Copied grops font CBI...
1919:info:build BuildFoundries: notice: Copied grops font CI...
1920:info:build BuildFoundries: notice: Copied grops font CR...
1921:info:build BuildFoundries: notice: Copied grops font EURO...
1922:info:build BuildFoundries: notice: Copied grops font HB...
1923:info:build BuildFoundries: notice: Copied grops font HBI...
1924:info:build BuildFoundries: notice: Copied grops font HI...
1925:info:build BuildFoundries: notice: Copied grops font HNB...
1926:info:build BuildFoundries: notice: Copied grops font HNBI...
1927:info:build BuildFoundries: notice: Copied grops font HNI...
1928:info:build BuildFoundries: notice: Copied grops font HNR...
1929:info:build BuildFoundries: notice: Copied grops font HR...
1930:info:build BuildFoundries: notice: Copied grops font NB...
1931:info:build BuildFoundries: notice: Copied grops font NBI...
1932:info:build BuildFoundries: notice: Copied grops font NI...
1933:info:build BuildFoundries: notice: Copied grops font NR...
1934:info:build BuildFoundries: notice: Copied grops font PB...
1935:info:build BuildFoundries: notice: Copied grops font PBI...
1936:info:build BuildFoundries: notice: Copied grops font PI...
1937:info:build BuildFoundries: notice: Copied grops font PR...
1938:info:build BuildFoundries: notice: Copied grops font S...
1939:info:build BuildFoundries: notice: Copied grops font TB...
1940:info:build BuildFoundries: notice: Copied grops font TBI...
1941:info:build BuildFoundries: notice: Copied grops font TI...
1942:info:build BuildFoundries: notice: Copied grops font TR...
1943:info:build BuildFoundries: notice: Copied grops font ZCMI...
1944:info:build BuildFoundries: notice: Copied grops font ZD...
1945:info:build BuildFoundries: notice: Generated U-AB...
1946:info:build BuildFoundries: notice: Generated U-ABI...
1947:info:build BuildFoundries: notice: Generated U-AI...
1948:info:build BuildFoundries: notice: Generated U-AR...
1949:info:build BuildFoundries: notice: Generated U-BMB...
1950:info:build BuildFoundries: notice: Generated U-BMBI...
1951:info:build BuildFoundries: notice: Generated U-BMI...
1952:info:build BuildFoundries: notice: Generated U-BMR...
1953:info:build BuildFoundries: notice: Generated U-CB...
1954:info:build BuildFoundries: notice: Generated U-CBI...
1955:info:build BuildFoundries: notice: Generated U-CI...
1956:info:build BuildFoundries: notice: Generated U-CR...
1957:info:build BuildFoundries: notice: Generated U-HB...
1958:info:build BuildFoundries: notice: Generated U-HBI...
1959:info:build BuildFoundries: notice: Generated U-HI...
1960:info:build BuildFoundries: notice: Generated U-HNB...
1961:info:build BuildFoundries: notice: Generated U-HNBI...
1962:info:build BuildFoundries: notice: Generated U-HNI...
1963:info:build BuildFoundries: notice: Generated U-HNR...
1964:info:build BuildFoundries: notice: Generated U-HR...
1965:info:build BuildFoundries: notice: Generated U-NB...
1966:info:build BuildFoundries: notice: Generated U-NBI...
1967:info:build BuildFoundries: notice: Generated U-NI...
1968:info:build BuildFoundries: notice: Generated U-NR...
1969:info:build BuildFoundries: notice: Generated U-PB...
1970:info:build BuildFoundries: notice: Generated U-PBI...
1971:info:build BuildFoundries: notice: Generated U-PI...
1972:info:build BuildFoundries: notice: Generated U-PR...
1973:info:build BuildFoundries: notice: Generated U-S...
1974:info:build BuildFoundries: notice: Generated U-TB...
1975:info:build BuildFoundries: notice: Generated U-TBI...
1976:info:build BuildFoundries: notice: Generated U-TI...
1977:info:build BuildFoundries: notice: Generated U-TR...
1978:info:build BuildFoundries: notice: Generated U-ZCMI...
1979:info:build BuildFoundries: notice: Generated U-ZD...
1980:info:build /usr/bin/make  all-am
1981:info:build make[1]: Entering directory `/opt/local/var/macports/build/_opt_local_var_macports_sources_rsync.macports.org_macports_release_tarballs_ports_sysutils_groff/groff/work/groff-1.22.4'
1982:info:build Making version.cpp
1983:info:build Making src/roff/troff/majorminor.cpp
1984:info:build   GEN      eqn2graph
1985:info:build   GEN      gdiffmk
1986:info:build   GEN      gperl
1987:info:build   GEN      glilypond
1988:info:build   GEN      grap2graph
1989:info:build   GEN      gpinyin
1990:info:build cp ./contrib/groffer/roff2.pl roff2dvi
1991:info:build cp ./contrib/groffer/roff2.pl roff2html
1992:info:build cp ./contrib/groffer/roff2.pl roff2pdf
1993:info:build   GEN      groffer
1994:info:build cp ./contrib/groffer/roff2.pl roff2ps
1995:info:build cp ./contrib/groffer/roff2.pl roff2text
1996:info:build cp ./contrib/groffer/roff2.pl roff2x
1997:info:build   GEN      mmroff
1998:info:build   GEN      pdfroff
1999:info:build   GEN      pic2graph
2000:info:build   GEN      gropdf
2001:info:build   GEN      pdfmom
2002:info:build   GEN      chem
2003:info:build   GEN      grog
2004:info:build   GEN      neqn
2005:info:build   GEN      nroff
2006:info:build   GEN      contrib/chem/chem.1
2007:info:build   GEN      contrib/eqn2graph/eqn2graph.1
2008:info:build   GEN      contrib/gdiffmk/gdiffmk.1
2009:info:build   GEN      contrib/glilypond/glilypond.1
2010:info:build   GEN      contrib/gperl/gperl.1
2011:info:build   GEN      contrib/gpinyin/gpinyin.1
2012:info:build   GEN      contrib/grap2graph/grap2graph.1
2013:info:build   GEN      contrib/groffer/groffer.1
2014:info:build   GEN      contrib/groffer/roff2dvi.1.man
2015:info:build   GEN      contrib/groffer/roff2html.1.man
2016:info:build   GEN      contrib/groffer/roff2pdf.1.man
2017:info:build   GEN      contrib/groffer/roff2ps.1.man
2018:info:build   GEN      contrib/groffer/roff2text.1.man
2019:info:build   GEN      contrib/groffer/roff2x.1.man
2020:info:build   GEN      contrib/pdfmark/pdfroff.1
2021:info:build   GEN      contrib/mm/mmroff.1
2022:info:build   GEN      contrib/pic2graph/pic2graph.1
2023:info:build   GEN      src/devices/grodvi/grodvi.1
2024:info:build   GEN      src/devices/grohtml/grohtml.1
2025:info:build   GEN      src/devices/grolbp/grolbp.1
2026:info:build   GEN      src/devices/grolj4/grolj4.1
2027:info:build   GEN      src/devices/gropdf/gropdf.1
2028:info:build   GEN      src/devices/gropdf/pdfmom.1
2029:info:build   GEN      src/devices/grops/grops.1
2030:info:build   GEN      src/devices/grotty/grotty.1
2031:info:build   GEN      src/preproc/preconv/preconv.1
2032:info:build   GEN      src/roff/groff/groff.1
2033:info:build   GEN      src/roff/grog/grog.1
2034:info:build   GEN      src/utils/afmtodit/afmtodit.1
2035:info:build   GEN      src/utils/addftinfo/addftinfo.1
2036:info:build   GEN      src/utils/hpftodit/hpftodit.1
2037:info:build   GEN      src/utils/lkbib/lkbib.1
2038:info:build   GEN      src/utils/pfbtops/pfbtops.1
2039:info:build   GEN      src/utils/tfmtodit/tfmtodit.1
2040:info:build   GEN      src/preproc/eqn/eqn.1
2041:info:build   GEN      src/preproc/eqn/neqn.1
2042:info:build   GEN      src/preproc/grn/grn.1
2043:info:build   GEN      src/preproc/pic/pic.1
2044:info:build   GEN      src/preproc/refer/refer.1
2045:info:build   GEN      src/preproc/soelim/soelim.1
2046:info:build   GEN      src/preproc/tbl/tbl.1
2047:info:build   GEN      src/roff/nroff/nroff.1
2048:info:build   GEN      src/roff/troff/troff.1
2049:info:build   GEN      src/utils/indxbib/indxbib.1
2050:info:build   GEN      src/utils/lookbib/lookbib.1
2051:info:build   GEN      contrib/groff_filenames/groff_filenames.5
2052:info:build   GEN      man/groff_font.5
2053:info:build   GEN      man/groff_out.5
2054:info:build   GEN      man/groff_tmac.5
2055:info:build   GEN      src/devices/grolj4/lj4_font.5
2056:info:build   GEN      contrib/hdtbl/groff_hdtbl.7
2057:info:build   GEN      contrib/mm/groff_mm.7
2058:info:build   GEN      contrib/mm/groff_mmse.7
2059:info:build   GEN      contrib/mom/groff_mom.7
2060:info:build   GEN      man/ditroff.7
2061:info:build   GEN      man/groff_char.7
2062:info:build   GEN      man/groff_diff.7
2063:info:build   GEN      man/groff.7
2064:info:build   GEN      man/roff.7
2065:info:build   GEN      tmac/groff_ms.7
2066:info:build   GEN      tmac/groff_man.7
2067:info:build   GEN      tmac/groff_me.7
2068:info:build   GEN      tmac/groff_mdoc.7
2069:info:build   GEN      tmac/groff_trace.7
2070:info:build   GEN      tmac/groff_www.7
2071:info:build   GEN      font/devascii/R
2072:info:build   GEN      font/devascii/I
2073:info:build   GEN      font/devascii/B
2074:info:build   GEN      font/devascii/BI
2075:info:build   GEN      font/devascii/DESC
2076:info:build   GEN      font/devcp1047/R
2077:info:build   GEN      font/devcp1047/I
2078:info:build   GEN      font/devcp1047/B
2079:info:build   GEN      font/devcp1047/BI
2080:info:build   GEN      font/devcp1047/DESC
2081:info:build   GEN      font/devdvi/DESC
2082:info:build   GEN      font/devhtml/R
2083:info:build   GEN      font/devhtml/I
2084:info:build   GEN      font/devhtml/B
2085:info:build   GEN      font/devhtml/BI
2086:info:build   GEN      font/devhtml/CR
2087:info:build   GEN      font/devhtml/CB
2088:info:build   GEN      font/devhtml/CI
2089:info:build   GEN      font/devhtml/CBI
2090:info:build   GEN      font/devhtml/S
2091:info:build   GEN      font/devhtml/DESC
2092:info:build   GEN      font/devlatin1/I
2093:info:build   GEN      font/devlatin1/R
2094:info:build   GEN      font/devlatin1/B
2095:info:build   GEN      font/devlatin1/BI
2096:info:build   GEN      font/devlatin1/DESC
2097:info:build   GEN      font/devlbp/DESC
2098:info:build   GEN      font/devutf8/R
2099:info:build   GEN      font/devutf8/I
2100:info:build   GEN      font/devutf8/B
2101:info:build   GEN      font/devutf8/BI
2102:info:build   GEN      font/devutf8/DESC
2103:info:build /opt/local/bin/gmkdir -p ./tmac
2104:info:build sed -e "s;[@]PNMTOPS_NOSETPAGE[@];pnmtops -nosetpage;g" \
2105:info:build       ./tmac/www.tmac.in > ./tmac/www.tmac
2106:info:build groff options:   GEN      font/devps/prologue
2107:info:build   GEN      font/devps/DESC
2108:info:build   GEN      font/devps/zapfdr.pfa
2109:info:build             abcCd:D:eEf:F:gGhiI:jJkK:lL:m:M:n:No:pP:r:RsST:UvVw:W:XzZ
2110:info:build test -f /opt/local/var/macports/build/_opt_local_var_macports_sources_rsync.macports.org_macports_release_tarballs_ports_sysutils_groff/groff/work/groff-1.22.4/doc/groff.css || cp /opt/local/var/macports/build/_opt_local_var_macports_sources_rsync.macports.org_macports_release_tarballs_ports_sysutils_groff/groff/work/groff-1.22.4/doc/groff.css /opt/local/var/macports/build/_opt_local_var_macports_sources_rsync.macports.org_macports_release_tarballs_ports_sysutils_groff/groff/work/groff-1.22.4/doc
2111:info:build   GEN      font/devps/symbolsl.pfa
2112:info:build echo timestamp > doc/examples.stamp
2113:info:build   GEN      contrib/chem/examples/README
2114:info:build sed -f ./tmac/strip.sed ./contrib/hdtbl/`basename contrib/hdtbl/hdtbl.tmac`-u > contrib/hdtbl/hdtbl.tmac;
2115:info:build   GEN      contrib/chem/examples/122/README
2116:info:build sed -f ./tmac/strip.sed ./contrib/hdtbl/`basename contrib/hdtbl/hdmisc.tmac`-u > contrib/hdtbl/hdmisc.tmac;
2117:info:build echo found
2118:info:build   GEN      font/devlj4/DESC
2119:info:build /opt/local/bin/gmkdir -p ./tmac
2120:info:build found
2121:info:build if test -f ./doc/gnu.eps; then \
2122:info:build       cp ./doc/gnu.eps . ; \
2123:info:build     elif test -f ./doc/gnu.eps; then \
2124:info:build       cp ./doc/gnu.eps . ; \
2125:info:build     else \
2126:info:build       if test ""found != "found"; then \
2127:info:build         echo "Program xpmtoppm is missing, can't generate gnu.eps" ; \
2128:info:build         exit 1; \
2129:info:build       fi; \
2130:info:build       if test ""found != "found"; then \
2131:info:build         echo "Program pnmtops is missing, can't generate gnu.eps" ; \
2132:info:build         exit 1; \
2133:info:build       fi; \
2134:info:build       if test "pnmtops -nosetpage" != "pnmtops -nosetpage"; then \
2135:info:build         echo "Program pnmtops can't handle -nosetpage, can't generate gnu.eps" ; \
2136:info:build         exit 1; \
2137:info:build       fi; \
2138:info:build       xpmtoppm ./doc/gnu.xpm | pnmdepth 15 \
2139:info:build         | pnmtops -nosetpage -noturn -rle >gnu.eps ; \
2140:info:build     fi
2141:info:build /opt/local/bin/gmkdir -p ./tmac
2142:info:build /opt/local/bin/gmkdir -p ./tmac
2143:info:build for f in tmac/doc-common tmac/doc-ditroff tmac/doc-nroff tmac/doc-syms tmac/e.tmac tmac/doc.tmac tmac/doc-old.tmac; do \
2144:info:build        sed -f ./tmac/strip.sed ./$f-u > ./$f; \
2145:info:build     done
2146:info:build /opt/local/bin/gmkdir -p ./tmac
2147:info:build   GEN      contrib/hdtbl/examples/fonts_n.roff
2148:info:build   GEN      contrib/hdtbl/examples/fonts_x.roff
2149:info:build for f in tmac/doc-common tmac/doc-ditroff tmac/doc-nroff tmac/doc-syms tmac/e.tmac tmac/doc.tmac tmac/doc-old.tmac; do \
2150:info:build        sed -f ./tmac/strip.sed ./$f-u > ./$f; \
2151:info:build     done
2152:info:build /opt/local/bin/gmkdir -p ./tmac
2153:info:build for f in tmac/doc-common tmac/doc-ditroff tmac/doc-nroff tmac/doc-syms tmac/e.tmac tmac/doc.tmac tmac/doc-old.tmac; do \
2154:info:build        sed -f ./tmac/strip.sed ./$f-u > ./$f; \
2155:info:build     done
2156:info:build /opt/local/bin/gmkdir -p ./tmac
2157:info:build for f in tmac/doc-common tmac/doc-ditroff tmac/doc-nroff tmac/doc-syms tmac/e.tmac tmac/doc.tmac tmac/doc-old.tmac; do \
2158:info:build        sed -f ./tmac/strip.sed ./$f-u > ./$f; \
2159:info:build     done
2160:info:build for f in tmac/doc-common tmac/doc-ditroff tmac/doc-nroff tmac/doc-syms tmac/e.tmac tmac/doc.tmac tmac/doc-old.tmac; do \
2161:info:build        sed -f ./tmac/strip.sed ./$f-u > ./$f; \
2162:info:build     done
2163:info:build for f in tmac/doc-common tmac/doc-ditroff tmac/doc-nroff tmac/doc-syms tmac/e.tmac tmac/doc.tmac tmac/doc-old.tmac; do \
2164:info:build        sed -f ./tmac/strip.sed ./$f-u > ./$f; \
2165:info:build     done
2166:info:build /opt/local/bin/gmkdir -p ./tmac
2167:info:build cp ./contrib/mom/examples/penguin.ps penguin.ps
2168:info:build cp ./contrib/mom/examples/penguin.pdf penguin.pdf
2169:info:build for f in tmac/doc-common tmac/doc-ditroff tmac/doc-nroff tmac/doc-syms tmac/e.tmac tmac/doc.tmac tmac/doc-old.tmac; do \
2170:info:build        sed -f ./tmac/strip.sed ./$f-u > ./$f; \
2171:info:build     done
2172:info:build   CXX      src/devices/grodvi/dvi.o
2173:info:build   CXX      src/libs/libdriver/input.o
2174:info:build   CXX      src/libs/libdriver/printer.o
2175:info:build   CXX      src/libs/libgroff/libgroff_a-assert.o
2176:info:build   CXX      src/libs/libgroff/libgroff_a-change_lf.o
2177:info:build   CXX      src/libs/libgroff/libgroff_a-cmap.o
2178:info:build   CXX      src/libs/libgroff/libgroff_a-color.o
2179:info:build   CXX      src/libs/libgroff/libgroff_a-cset.o
2180:info:build   CXX      src/libs/libgroff/libgroff_a-curtime.o
2181:info:build   CXX      src/libs/libgroff/libgroff_a-device.o
2182:info:build In file included from src/libs/libgroff/assert.cpp:20:
2183:info:build In file included from /opt/local/libexec/llvm-9.0/bin/../include/c++/v1/stdlib.h:100:
2184:info:build ./lib/math.h:38:3: error: "Please include config.h first."
2185:info:build  #error "Please include config.h first."
2186:info:build   ^
2187:info:build ./lib/math.h:40:1: error: unknown type name '_GL_INLINE_HEADER_BEGIN'
2188:info:build _GL_INLINE_HEADER_BEGIN
2189:info:build ^
2190:info:build ./lib/math.h:1537:1: error: expected unqualified-id
2191:info:build _GL_CXXALIAS_SYS (frexp, double, (double x, int *expptr));
2192:info:build ^
2193:info:build ./lib/stdio.h:344:5: note: expanded from macro '_GL_CXXALIAS_SYS'
2194:info:build     _GL_EXTERN_C int _gl_cxxalias_dummy
2195:info:build     ^
2196:info:build ./lib/stdio.h:234:30: note: expanded from macro '_GL_EXTERN_C'
2197:info:build # define _GL_EXTERN_C extern "C"
2198:info:build                              ^
2199:info:build In file included from src/libs/libgroff/assert.cpp:20:
2200:info:build In file included from /opt/local/libexec/llvm-9.0/bin/../include/c++/v1/stdlib.h:100:
2201:info:build ./lib/math.h:2888:1: error: unknown type name '_GL_INLINE_HEADER_END'
2202:info:build _GL_INLINE_HEADER_END
2203:info:build ^
2204:info:build 4 errors generated.
2205:info:build make[1]: *** [src/libs/libgroff/libgroff_a-assert.o] Error 1
2206:info:build make[1]: *** Waiting for unfinished jobs....
2207:info:build In file included from src/libs/libgroff/curtime.cpp:20:
2208:info:build In file included from /opt/local/libexec/llvm-9.0/bin/../include/c++/v1/stdlib.h:100:
2209:info:build ./lib/math.h:38:3: error: "Please include config.h first."
2210:info:build  #error "Please include config.h first."
2211:info:build   ^
2212:info:build ./lib/math.h:40:1: error: unknown type name '_GL_INLINE_HEADER_BEGIN'
2213:info:build _GL_INLINE_HEADER_BEGIN
2214:info:build ^
2215:info:build ./lib/math.h:1537:1: error: expected unqualified-id
2216:info:build _GL_CXXALIAS_SYS (frexp, double, (double x, int *expptr));
2217:info:build ^
2218:info:build ./lib/math.h:246:5: note: expanded from macro '_GL_CXXALIAS_SYS'
2219:info:build     _GL_EXTERN_C int _gl_cxxalias_dummy
2220:info:build     ^
2221:info:build ./lib/math.h:136:30: note: expanded from macro '_GL_EXTERN_C'
2222:info:build # define _GL_EXTERN_C extern "C"
2223:info:build                              ^
2224:info:build ./lib/math.h:2888:1: error: unknown type name '_GL_INLINE_HEADER_END'
2225:info:build _GL_INLINE_HEADER_END
2226:info:build ^
2227:info:build In file included from src/libs/libgroff/curtime.cpp:21:
2228:info:build In file included from ./lib/string.h:41:
2229:info:build In file included from /opt/local/libexec/llvm-9.0/bin/../include/c++/v1/string.h:60:
2230:info:build /usr/include/string.h:70:25: error: expected ';' after top level declarator
2231:info:build typedef __darwin_ssize_t        ssize_t;
2232:info:build                         ^
2233:info:build /usr/include/string.h:137:56: error: unknown type name 'ssize_t'; did you mean 'size_t'?
2234:info:build void     swab(const void * __restrict, void * __restrict, ssize_t);
2235:info:build                                                           ^
2236:info:build /usr/include/sys/signal.h:173:27: note: 'size_t' declared here
2237:info:build typedef __darwin_size_t                 size_t;
2238:info:build                                         ^
2239:info:build 6 errors generated.
2240:info:build make[1]: *** [src/libs/libgroff/libgroff_a-curtime.o] Error 1
2241:info:build In file included from src/libs/libgroff/device.cpp:20:
2242:info:build In file included from /opt/local/libexec/llvm-9.0/bin/../include/c++/v1/stdlib.h:100:
2243:info:build ./lib/math.h:38:3: error: "Please include config.h first."
2244:info:build  #error "Please include config.h first."
2245:info:build   ^
2246:info:build ./lib/math.h:40:1: error: unknown type name '_GL_INLINE_HEADER_BEGIN'
2247:info:build _GL_INLINE_HEADER_BEGIN
2248:info:build ^
2249:info:build ./lib/math.h:1537:1: error: expected unqualified-id
2250:info:build _GL_CXXALIAS_SYS (frexp, double, (double x, int *expptr));
2251:info:build ^
2252:info:build ./lib/math.h:246:5: note: expanded from macro '_GL_CXXALIAS_SYS'
2253:info:build     _GL_EXTERN_C int _gl_cxxalias_dummy
2254:info:build     ^
2255:info:build ./lib/math.h:136:30: note: expanded from macro '_GL_EXTERN_C'
2256:info:build # define _GL_EXTERN_C extern "C"
2257:info:build                              ^
2258:info:build ./lib/math.h:2888:1: error: unknown type name '_GL_INLINE_HEADER_END'
2259:info:build _GL_INLINE_HEADER_END
2260:info:build ^
2261:info:build 4 errors generated.
2262:info:build make[1]: *** [src/libs/libgroff/libgroff_a-device.o] Error 1
2263:info:build make[1]: Leaving directory `/opt/local/var/macports/build/_opt_local_var_macports_sources_rsync.macports.org_macports_release_tarballs_ports_sysutils_groff/groff/work/groff-1.22.4'
2264:info:build make: *** [all] Error 2
2265:info:build make: Leaving directory `/opt/local/var/macports/build/_opt_local_var_macports_sources_rsync.macports.org_macports_release_tarballs_ports_sysutils_groff/groff/work/groff-1.22.4'
2266:info:build Command failed:  cd "/opt/local/var/macports/build/_opt_local_var_macports_sources_rsync.macports.org_macports_release_tarballs_ports_sysutils_groff/groff/work/groff-1.22.4" && /usr/bin/make -j8 -w all
2267:info:build Exit code: 2
2268:error:build Failed to build groff: command execution failed
2269:debug:build Error code: CHILDSTATUS 59159 2
2270:debug:build Backtrace: command execution failed
2271:debug:build     while executing
2272:debug:build "system {*}$notty {*}$nice $fullcmdstring"
2273:debug:build     invoked from within
2274:debug:build "command_exec build"
2275:debug:build     (procedure "portbuild::build_main" line 8)
2276:debug:build     invoked from within
2277:debug:build "$procedure $targetname"
2278:error:build See /opt/local/var/macports/logs/_opt_local_var_macports_sources_rsync.macports.org_macports_release_tarballs_ports_sysutils_groff/groff/main.log for details.