Ticket #61231: main.log

File main.log, 110.0 KB (added by valerie-vallet, 19 months ago)

compilation log file

Line 
1version:1
2:debug:sysinfo macOS 11.2 (darwin/20.3.0) arch i386
3:debug:sysinfo MacPorts 2.6.4
4:debug:sysinfo Xcode 12.4
5:debug:sysinfo SDK 11.2
6:debug:sysinfo MACOSX_DEPLOYMENT_TARGET: 11.2
7:warn:main The macOS 11.2 SDK does not appear to be installed. Ports may not build correctly.
8:warn:main You can install it as part of the Xcode Command Line Tools package by running `xcode-select --install'.
9:debug:main epoch: in tree: 0 installed: 0
10:debug:main gmake 4.3_0 exists in the ports tree
11:debug:main gmake 4.3_0  is the latest installed
12:debug:main gmake 4.3_0  is active
13:debug:main Merging existing variants '' into variants
14:debug:main new fully merged portvariants:
15:debug:main Changing to port directory: /opt/local/var/macports/sources/rsync.macports.org/macports/release/tarballs/ports/devel/gmake
16:debug:main OS darwin/20.3.0 (macOS 11.2) arch i386
17:debug:main adding the default universal variant
18:debug:main Reading variant descriptions from /opt/local/var/macports/sources/rsync.macports.org/macports/release/tarballs/ports/_resources/port1.0/variant_descriptions.conf
19:debug:main Running callback portconfigure::add_automatic_compiler_dependencies
20:debug:main Finished running callback portconfigure::add_automatic_compiler_dependencies
21:debug:main Running callback portbuild::add_automatic_buildsystem_dependencies
22:debug:main Finished running callback portbuild::add_automatic_buildsystem_dependencies
23:debug:main Running callback portstartupitem::add_notes
24:debug:main Finished running callback portstartupitem::add_notes
25:debug:main No need to upgrade! gmake 4.3_0 >= gmake 4.3_0
26:debug:main epoch: in tree: 2 installed: 2
27:debug:main gettext 0.19.8.1_2 exists in the ports tree
28:debug:main gettext 0.19.8.1_2  is the latest installed
29:debug:main gettext 0.19.8.1_2  is active
30:debug:main Merging existing variants '' into variants
31:debug:main new fully merged portvariants:
32:debug:main Changing to port directory: /opt/local/var/macports/sources/rsync.macports.org/macports/release/tarballs/ports/devel/gettext
33:debug:main OS darwin/20.3.0 (macOS 11.2) arch i386
34:debug:main Sourcing PortGroup compiler_blacklist_versions 1.0 from /opt/local/var/macports/sources/rsync.macports.org/macports/release/tarballs/ports/_resources/port1.0/group/compiler_blacklist_versions-1.0.tcl
35:debug:main Sourcing PortGroup muniversal 1.0 from /opt/local/var/macports/sources/rsync.macports.org/macports/release/tarballs/ports/_resources/port1.0/group/muniversal-1.0.tcl
36:debug:main Sourcing PortGroup clang_dependency 1.0 from /opt/local/var/macports/sources/rsync.macports.org/macports/release/tarballs/ports/_resources/port1.0/group/clang_dependency-1.0.tcl
37:debug:main compiler clang 1200.0.32.29 not blacklisted because it doesn't match {clang < 211.10.1}
38:debug:main muniversal: adding universal variant
39:debug:main Reading variant descriptions from /opt/local/var/macports/sources/rsync.macports.org/macports/release/tarballs/ports/_resources/port1.0/variant_descriptions.conf
40:debug:main Running callback portconfigure::add_automatic_compiler_dependencies
41:debug:main Finished running callback portconfigure::add_automatic_compiler_dependencies
42:debug:main Running callback portbuild::add_automatic_buildsystem_dependencies
43:debug:main Finished running callback portbuild::add_automatic_buildsystem_dependencies
44:debug:main Running callback portstartupitem::add_notes
45:debug:main Finished running callback portstartupitem::add_notes
46:debug:main No need to upgrade! gettext 0.19.8.1_2 >= gettext 0.19.8.1_2
47:debug:main epoch: in tree: 0 installed: 0
48:debug:main libiconv 1.16_1 exists in the ports tree
49:debug:main libiconv 1.16_1  is the latest installed
50:debug:main libiconv 1.16_1  is active
51:debug:main Merging existing variants '' into variants
52:debug:main new fully merged portvariants:
53:debug:main Changing to port directory: /opt/local/var/macports/sources/rsync.macports.org/macports/release/tarballs/ports/textproc/libiconv
54:debug:main OS darwin/20.3.0 (macOS 11.2) arch i386
55:debug:main Sourcing PortGroup muniversal 1.0 from /opt/local/var/macports/sources/rsync.macports.org/macports/release/tarballs/ports/_resources/port1.0/group/muniversal-1.0.tcl
56:debug:main Sourcing PortGroup clang_dependency 1.0 from /opt/local/var/macports/sources/rsync.macports.org/macports/release/tarballs/ports/_resources/port1.0/group/clang_dependency-1.0.tcl
57:debug:main Sourcing PortGroup xcodeversion 1.0 from /opt/local/var/macports/sources/rsync.macports.org/macports/release/tarballs/ports/_resources/port1.0/group/xcodeversion-1.0.tcl
58:debug:main muniversal: adding universal variant
59:debug:main Reading variant descriptions from /opt/local/var/macports/sources/rsync.macports.org/macports/release/tarballs/ports/_resources/port1.0/variant_descriptions.conf
60:debug:main Running callback portconfigure::add_automatic_compiler_dependencies
61:debug:main Finished running callback portconfigure::add_automatic_compiler_dependencies
62:debug:main Running callback portbuild::add_automatic_buildsystem_dependencies
63:debug:main Finished running callback portbuild::add_automatic_buildsystem_dependencies
64:debug:main Running callback portstartupitem::add_notes
65:debug:main Finished running callback portstartupitem::add_notes
66:debug:main No need to upgrade! libiconv 1.16_1 >= libiconv 1.16_1
67:debug:main epoch: in tree: 0 installed: 0
68:debug:main ncurses 6.2_1 exists in the ports tree
69:debug:main ncurses 6.2_1  is the latest installed
70:debug:main ncurses 6.2_1  is active
71:debug:main Merging existing variants '' into variants
72:debug:main new fully merged portvariants:
73:debug:main Changing to port directory: /opt/local/var/macports/sources/rsync.macports.org/macports/release/tarballs/ports/devel/ncurses
74:debug:main OS darwin/20.3.0 (macOS 11.2) arch i386
75:debug:main Sourcing PortGroup clang_dependency 1.0 from /opt/local/var/macports/sources/rsync.macports.org/macports/release/tarballs/ports/_resources/port1.0/group/clang_dependency-1.0.tcl
76:debug:main adding the default universal variant
77:debug:main Reading variant descriptions from /opt/local/var/macports/sources/rsync.macports.org/macports/release/tarballs/ports/_resources/port1.0/variant_descriptions.conf
78:debug:main Running callback portconfigure::add_automatic_compiler_dependencies
79:debug:main Finished running callback portconfigure::add_automatic_compiler_dependencies
80:debug:main Running callback portbuild::add_automatic_buildsystem_dependencies
81:debug:main Finished running callback portbuild::add_automatic_buildsystem_dependencies
82:debug:main Running callback portstartupitem::add_notes
83:debug:main Finished running callback portstartupitem::add_notes
84:debug:main No need to upgrade! ncurses 6.2_1 >= ncurses 6.2_1
85:debug:main epoch: in tree: 0 installed: 0
86:debug:main makedepend 1.0.6_0 exists in the ports tree
87:debug:main makedepend 1.0.6_0  is the latest installed
88:debug:main makedepend 1.0.6_0  is active
89:debug:main Merging existing variants '' into variants
90:debug:main new fully merged portvariants:
91:debug:main Changing to port directory: /opt/local/var/macports/sources/rsync.macports.org/macports/release/tarballs/ports/x11/makedepend
92:debug:main OS darwin/20.3.0 (macOS 11.2) arch i386
93:debug:main adding the default universal variant
94:debug:main Reading variant descriptions from /opt/local/var/macports/sources/rsync.macports.org/macports/release/tarballs/ports/_resources/port1.0/variant_descriptions.conf
95:debug:main Running callback portconfigure::add_automatic_compiler_dependencies
96:debug:main Finished running callback portconfigure::add_automatic_compiler_dependencies
97:debug:main Running callback portbuild::add_automatic_buildsystem_dependencies
98:debug:main Finished running callback portbuild::add_automatic_buildsystem_dependencies
99:debug:main Running callback portstartupitem::add_notes
100:debug:main Finished running callback portstartupitem::add_notes
101:debug:main No need to upgrade! makedepend 1.0.6_0 >= makedepend 1.0.6_0
102:debug:main epoch: in tree: 3 installed: 3
103:debug:main gcc9 9.3.0_5 exists in the ports tree
104:debug:main gcc9 9.3.0_5  is the latest installed
105:debug:main gcc9 9.3.0_5  is active
106:debug:main Merging existing variants '' into variants
107:debug:main new fully merged portvariants:
108:debug:main Changing to port directory: /opt/local/var/macports/sources/rsync.macports.org/macports/release/tarballs/ports/lang/gcc9
109:debug:main OS darwin/20.3.0 (macOS 11.2) arch i386
110:debug:main Sourcing PortGroup select 1.0 from /opt/local/var/macports/sources/rsync.macports.org/macports/release/tarballs/ports/_resources/port1.0/group/select-1.0.tcl
111:debug:main Sourcing PortGroup compiler_blacklist_versions 1.0 from /opt/local/var/macports/sources/rsync.macports.org/macports/release/tarballs/ports/_resources/port1.0/group/compiler_blacklist_versions-1.0.tcl
112:debug:main Sourcing PortGroup active_variants 1.1 from /opt/local/var/macports/sources/rsync.macports.org/macports/release/tarballs/ports/_resources/port1.0/group/active_variants-1.1.tcl
113:debug:main Sourcing PortGroup conflicts_build 1.0 from /opt/local/var/macports/sources/rsync.macports.org/macports/release/tarballs/ports/_resources/port1.0/group/conflicts_build-1.0.tcl
114:debug:main Sourcing PortGroup cltversion 1.0 from /opt/local/var/macports/sources/rsync.macports.org/macports/release/tarballs/ports/_resources/port1.0/group/cltversion-1.0.tcl
115:debug:main Sourcing PortGroup xcode_workaround 1.0 from /opt/local/var/macports/sources/rsync.macports.org/macports/release/tarballs/ports/_resources/port1.0/group/xcode_workaround-1.0.tcl
116:debug:main compiler clang 1200.0.32.29 not blacklisted because it doesn't match {clang < 800}
117:debug:main Reading variant descriptions from /opt/local/var/macports/sources/rsync.macports.org/macports/release/tarballs/ports/_resources/port1.0/variant_descriptions.conf
118:debug:main universal variant already exists, so not adding the default one
119:debug:main Running callback portconfigure::add_automatic_compiler_dependencies
120:debug:main Finished running callback portconfigure::add_automatic_compiler_dependencies
121:debug:main Running callback portbuild::add_automatic_buildsystem_dependencies
122:debug:main Finished running callback portbuild::add_automatic_buildsystem_dependencies
123:debug:main Running callback portstartupitem::add_notes
124:debug:main Finished running callback portstartupitem::add_notes
125:debug:main Running callback xcode_workaround::xcode_workaround.appy_fix
126:debug:main Finished running callback xcode_workaround::xcode_workaround.appy_fix
127:debug:main No need to upgrade! gcc9 9.3.0_5 >= gcc9 9.3.0_5
128:debug:main epoch: in tree: 0 installed: 0
129:debug:main cctools 949.0.1_0 exists in the ports tree
130:debug:main cctools 949.0.1_0 +xcode is the latest installed
131:debug:main cctools 949.0.1_0 +xcode is active
132:debug:main Merging existing variants '+xcode' into variants
133:debug:main new fully merged portvariants: xcode +
134:debug:main Changing to port directory: /opt/local/var/macports/sources/rsync.macports.org/macports/release/tarballs/ports/devel/cctools
135:debug:main OS darwin/20.3.0 (macOS 11.2) arch i386
136:debug:main Sourcing PortGroup cltversion 1.0 from /opt/local/var/macports/sources/rsync.macports.org/macports/release/tarballs/ports/_resources/port1.0/group/cltversion-1.0.tcl
137:debug:main universal_variant is false, so not adding the default universal variant
138:debug:main Executing variant xcode provides xcode
139:debug:main Running callback portconfigure::add_automatic_compiler_dependencies
140:debug:main Finished running callback portconfigure::add_automatic_compiler_dependencies
141:debug:main Running callback portbuild::add_automatic_buildsystem_dependencies
142:debug:main Finished running callback portbuild::add_automatic_buildsystem_dependencies
143:debug:main Running callback portstartupitem::add_notes
144:debug:main Finished running callback portstartupitem::add_notes
145:debug:main No need to upgrade! cctools 949.0.1_0 >= cctools 949.0.1_0
146:debug:main epoch: in tree: 0 installed: 0
147:debug:main gmp 6.2.1_0 exists in the ports tree
148:debug:main gmp 6.2.1_0  is the latest installed
149:debug:main gmp 6.2.1_0  is active
150:debug:main Merging existing variants '' into variants
151:debug:main new fully merged portvariants:
152:debug:main Changing to port directory: /opt/local/var/macports/sources/rsync.macports.org/macports/release/tarballs/ports/devel/gmp
153:debug:main OS darwin/20.3.0 (macOS 11.2) arch i386
154:debug:main Sourcing PortGroup muniversal 1.0 from /opt/local/var/macports/sources/rsync.macports.org/macports/release/tarballs/ports/_resources/port1.0/group/muniversal-1.0.tcl
155:debug:main Sourcing PortGroup cltversion 1.0 from /opt/local/var/macports/sources/rsync.macports.org/macports/release/tarballs/ports/_resources/port1.0/group/cltversion-1.0.tcl
156:debug:main Sourcing PortGroup xcode_workaround 1.0 from /opt/local/var/macports/sources/rsync.macports.org/macports/release/tarballs/ports/_resources/port1.0/group/xcode_workaround-1.0.tcl
157:debug:main muniversal: adding universal variant
158:debug:main Reading variant descriptions from /opt/local/var/macports/sources/rsync.macports.org/macports/release/tarballs/ports/_resources/port1.0/variant_descriptions.conf
159:debug:main Running callback portconfigure::add_automatic_compiler_dependencies
160:debug:main Finished running callback portconfigure::add_automatic_compiler_dependencies
161:debug:main Running callback portbuild::add_automatic_buildsystem_dependencies
162:debug:main Finished running callback portbuild::add_automatic_buildsystem_dependencies
163:debug:main Running callback portstartupitem::add_notes
164:debug:main Finished running callback portstartupitem::add_notes
165:debug:main Running callback xcode_workaround::xcode_workaround.appy_fix
166:debug:main Finished running callback xcode_workaround::xcode_workaround.appy_fix
167:debug:main No need to upgrade! gmp 6.2.1_0 >= gmp 6.2.1_0
168:debug:main epoch: in tree: 3 installed: 3
169:debug:main isl 0.22.1_0 exists in the ports tree
170:debug:main isl 0.22.1_0  is the latest installed
171:debug:main isl 0.22.1_0  is active
172:debug:main Merging existing variants '' into variants
173:debug:main new fully merged portvariants:
174:debug:main Changing to port directory: /opt/local/var/macports/sources/rsync.macports.org/macports/release/tarballs/ports/devel/isl
175:debug:main OS darwin/20.3.0 (macOS 11.2) arch i386
176:debug:main Sourcing PortGroup muniversal 1.0 from /opt/local/var/macports/sources/rsync.macports.org/macports/release/tarballs/ports/_resources/port1.0/group/muniversal-1.0.tcl
177:debug:main muniversal: adding universal variant
178:debug:main Reading variant descriptions from /opt/local/var/macports/sources/rsync.macports.org/macports/release/tarballs/ports/_resources/port1.0/variant_descriptions.conf
179:debug:main Running callback portconfigure::add_automatic_compiler_dependencies
180:debug:main Finished running callback portconfigure::add_automatic_compiler_dependencies
181:debug:main Running callback portbuild::add_automatic_buildsystem_dependencies
182:debug:main Finished running callback portbuild::add_automatic_buildsystem_dependencies
183:debug:main Running callback portstartupitem::add_notes
184:debug:main Finished running callback portstartupitem::add_notes
185:debug:main No need to upgrade! isl 0.22.1_0 >= isl 0.22.1_0
186:debug:main epoch: in tree: 2 installed: 2
187:debug:main ld64 3_3 exists in the ports tree
188:debug:main ld64 3_3 +ld64_xcode is the latest installed
189:debug:main ld64 3_3 +ld64_xcode is active
190:debug:main Merging existing variants '+ld64_xcode' into variants
191:debug:main new fully merged portvariants: ld64_xcode +
192:debug:main Changing to port directory: /opt/local/var/macports/sources/rsync.macports.org/macports/release/tarballs/ports/devel/ld64
193:debug:main OS darwin/20.3.0 (macOS 11.2) arch i386
194:debug:main Sourcing PortGroup compiler_blacklist_versions 1.0 from /opt/local/var/macports/sources/rsync.macports.org/macports/release/tarballs/ports/_resources/port1.0/group/compiler_blacklist_versions-1.0.tcl
195:debug:main Reading variant descriptions from /opt/local/var/macports/sources/rsync.macports.org/macports/release/tarballs/ports/_resources/port1.0/variant_descriptions.conf
196:debug:main universal variant already exists, so not adding the default one
197:debug:main Executing variant ld64_xcode provides ld64_xcode
198:debug:main Running callback portconfigure::add_automatic_compiler_dependencies
199:debug:main Finished running callback portconfigure::add_automatic_compiler_dependencies
200:debug:main Running callback portbuild::add_automatic_buildsystem_dependencies
201:debug:main Finished running callback portbuild::add_automatic_buildsystem_dependencies
202:debug:main Running callback portstartupitem::add_notes
203:debug:main Finished running callback portstartupitem::add_notes
204:debug:main No need to upgrade! ld64 3_3 >= ld64 3_3
205:debug:main epoch: in tree: 2 installed: 2
206:debug:main ld64-xcode 2_3 exists in the ports tree
207:debug:main ld64-xcode 2_3  is the latest installed
208:debug:main ld64-xcode 2_3  is active
209:debug:main Merging existing variants '' into variants
210:debug:main new fully merged portvariants:
211:debug:main Changing to port directory: /opt/local/var/macports/sources/rsync.macports.org/macports/release/tarballs/ports/devel/ld64
212:debug:main OS darwin/20.3.0 (macOS 11.2) arch i386
213:debug:main Sourcing PortGroup compiler_blacklist_versions 1.0 from /opt/local/var/macports/sources/rsync.macports.org/macports/release/tarballs/ports/_resources/port1.0/group/compiler_blacklist_versions-1.0.tcl
214:debug:main Reading variant descriptions from /opt/local/var/macports/sources/rsync.macports.org/macports/release/tarballs/ports/_resources/port1.0/variant_descriptions.conf
215:debug:main universal variant already exists, so not adding the default one
216:debug:main Running callback portconfigure::add_automatic_compiler_dependencies
217:debug:main Finished running callback portconfigure::add_automatic_compiler_dependencies
218:debug:main Running callback portbuild::add_automatic_buildsystem_dependencies
219:debug:main Finished running callback portbuild::add_automatic_buildsystem_dependencies
220:debug:main Running callback portstartupitem::add_notes
221:debug:main Finished running callback portstartupitem::add_notes
222:debug:main No need to upgrade! ld64-xcode 2_3 >= ld64-xcode 2_3
223:debug:main epoch: in tree: 0 installed: 0
224:debug:main libmpc 1.2.1_0 exists in the ports tree
225:debug:main libmpc 1.2.1_0  is the latest installed
226:debug:main libmpc 1.2.1_0  is active
227:debug:main Merging existing variants '' into variants
228:debug:main new fully merged portvariants:
229:debug:main Changing to port directory: /opt/local/var/macports/sources/rsync.macports.org/macports/release/tarballs/ports/devel/libmpc
230:debug:main OS darwin/20.3.0 (macOS 11.2) arch i386
231:debug:main adding the default universal variant
232:debug:main Reading variant descriptions from /opt/local/var/macports/sources/rsync.macports.org/macports/release/tarballs/ports/_resources/port1.0/variant_descriptions.conf
233:debug:main Running callback portconfigure::add_automatic_compiler_dependencies
234:debug:main Finished running callback portconfigure::add_automatic_compiler_dependencies
235:debug:main Running callback portbuild::add_automatic_buildsystem_dependencies
236:debug:main Finished running callback portbuild::add_automatic_buildsystem_dependencies
237:debug:main Running callback portstartupitem::add_notes
238:debug:main Finished running callback portstartupitem::add_notes
239:debug:main No need to upgrade! libmpc 1.2.1_0 >= libmpc 1.2.1_0
240:debug:main epoch: in tree: 0 installed: 0
241:debug:main mpfr 4.1.0_0 exists in the ports tree
242:debug:main mpfr 4.1.0_0  is the latest installed
243:debug:main mpfr 4.1.0_0  is active
244:debug:main Merging existing variants '' into variants
245:debug:main new fully merged portvariants:
246:debug:main Changing to port directory: /opt/local/var/macports/sources/rsync.macports.org/macports/release/tarballs/ports/devel/mpfr
247:debug:main OS darwin/20.3.0 (macOS 11.2) arch i386
248:debug:main Sourcing PortGroup muniversal 1.0 from /opt/local/var/macports/sources/rsync.macports.org/macports/release/tarballs/ports/_resources/port1.0/group/muniversal-1.0.tcl
249:debug:main Sourcing PortGroup compiler_blacklist_versions 1.0 from /opt/local/var/macports/sources/rsync.macports.org/macports/release/tarballs/ports/_resources/port1.0/group/compiler_blacklist_versions-1.0.tcl
250:debug:main Sourcing PortGroup cltversion 1.0 from /opt/local/var/macports/sources/rsync.macports.org/macports/release/tarballs/ports/_resources/port1.0/group/cltversion-1.0.tcl
251:debug:main Sourcing PortGroup xcode_workaround 1.0 from /opt/local/var/macports/sources/rsync.macports.org/macports/release/tarballs/ports/_resources/port1.0/group/xcode_workaround-1.0.tcl
252:debug:main compiler clang 1200.0.32.29 not blacklisted because it doesn't match {clang == 211.10.1}
253:debug:main muniversal: adding universal variant
254:debug:main Reading variant descriptions from /opt/local/var/macports/sources/rsync.macports.org/macports/release/tarballs/ports/_resources/port1.0/variant_descriptions.conf
255:debug:main Running callback portconfigure::add_automatic_compiler_dependencies
256:debug:main Finished running callback portconfigure::add_automatic_compiler_dependencies
257:debug:main Running callback portbuild::add_automatic_buildsystem_dependencies
258:debug:main Finished running callback portbuild::add_automatic_buildsystem_dependencies
259:debug:main Running callback portstartupitem::add_notes
260:debug:main Finished running callback portstartupitem::add_notes
261:debug:main Running callback xcode_workaround::xcode_workaround.appy_fix
262:debug:main Finished running callback xcode_workaround::xcode_workaround.appy_fix
263:debug:main No need to upgrade! mpfr 4.1.0_0 >= mpfr 4.1.0_0
264:debug:main epoch: in tree: 0 installed: 0
265:debug:main zlib 1.2.11_0 exists in the ports tree
266:debug:main zlib 1.2.11_0  is the latest installed
267:debug:main zlib 1.2.11_0  is active
268:debug:main Merging existing variants '' into variants
269:debug:main new fully merged portvariants:
270:debug:main Changing to port directory: /opt/local/var/macports/sources/rsync.macports.org/macports/release/tarballs/ports/archivers/zlib
271:debug:main OS darwin/20.3.0 (macOS 11.2) arch i386
272:debug:main Sourcing PortGroup xcodeversion 1.0 from /opt/local/var/macports/sources/rsync.macports.org/macports/release/tarballs/ports/_resources/port1.0/group/xcodeversion-1.0.tcl
273:debug:main adding the default universal variant
274:debug:main Reading variant descriptions from /opt/local/var/macports/sources/rsync.macports.org/macports/release/tarballs/ports/_resources/port1.0/variant_descriptions.conf
275:debug:main Running callback portconfigure::add_automatic_compiler_dependencies
276:debug:main Finished running callback portconfigure::add_automatic_compiler_dependencies
277:debug:main Running callback portbuild::add_automatic_buildsystem_dependencies
278:debug:main Finished running callback portbuild::add_automatic_buildsystem_dependencies
279:debug:main Running callback portstartupitem::add_notes
280:debug:main Finished running callback portstartupitem::add_notes
281:debug:main No need to upgrade! zlib 1.2.11_0 >= zlib 1.2.11_0
282:debug:main epoch: in tree: 0 installed: 0
283:debug:main gcc_select 0.1_9 exists in the ports tree
284:debug:main gcc_select 0.1_9  is the latest installed
285:debug:main gcc_select 0.1_9  is active
286:debug:main Merging existing variants '' into variants
287:debug:main new fully merged portvariants:
288:debug:main Changing to port directory: /opt/local/var/macports/sources/rsync.macports.org/macports/release/tarballs/ports/sysutils/gcc_select
289:debug:main OS darwin/20.3.0 (macOS 11.2) arch i386
290:debug:main Sourcing PortGroup select 1.0 from /opt/local/var/macports/sources/rsync.macports.org/macports/release/tarballs/ports/_resources/port1.0/group/select-1.0.tcl
291:debug:main universal_variant is false, so not adding the default universal variant
292:debug:main Running callback portconfigure::add_automatic_compiler_dependencies
293:debug:main Finished running callback portconfigure::add_automatic_compiler_dependencies
294:debug:main Running callback portbuild::add_automatic_buildsystem_dependencies
295:debug:main Finished running callback portbuild::add_automatic_buildsystem_dependencies
296:debug:main Running callback portstartupitem::add_notes
297:debug:main Finished running callback portstartupitem::add_notes
298:debug:main No need to upgrade! gcc_select 0.1_9 >= gcc_select 0.1_9
299:debug:main epoch: in tree: 3 installed: 3
300:debug:main libgcc9 9.3.0_3 exists in the ports tree
301:debug:main libgcc9 9.3.0_3  is the latest installed
302:debug:main libgcc9 9.3.0_3  is active
303:debug:main Merging existing variants '' into variants
304:debug:main new fully merged portvariants:
305:debug:main Changing to port directory: /opt/local/var/macports/sources/rsync.macports.org/macports/release/tarballs/ports/lang/gcc9
306:debug:main OS darwin/20.3.0 (macOS 11.2) arch i386
307:debug:main Sourcing PortGroup select 1.0 from /opt/local/var/macports/sources/rsync.macports.org/macports/release/tarballs/ports/_resources/port1.0/group/select-1.0.tcl
308:debug:main Sourcing PortGroup compiler_blacklist_versions 1.0 from /opt/local/var/macports/sources/rsync.macports.org/macports/release/tarballs/ports/_resources/port1.0/group/compiler_blacklist_versions-1.0.tcl
309:debug:main Sourcing PortGroup active_variants 1.1 from /opt/local/var/macports/sources/rsync.macports.org/macports/release/tarballs/ports/_resources/port1.0/group/active_variants-1.1.tcl
310:debug:main Sourcing PortGroup conflicts_build 1.0 from /opt/local/var/macports/sources/rsync.macports.org/macports/release/tarballs/ports/_resources/port1.0/group/conflicts_build-1.0.tcl
311:debug:main Sourcing PortGroup cltversion 1.0 from /opt/local/var/macports/sources/rsync.macports.org/macports/release/tarballs/ports/_resources/port1.0/group/cltversion-1.0.tcl
312:debug:main Sourcing PortGroup xcode_workaround 1.0 from /opt/local/var/macports/sources/rsync.macports.org/macports/release/tarballs/ports/_resources/port1.0/group/xcode_workaround-1.0.tcl
313:debug:main compiler clang 1200.0.32.29 not blacklisted because it doesn't match {clang < 800}
314:debug:main Reading variant descriptions from /opt/local/var/macports/sources/rsync.macports.org/macports/release/tarballs/ports/_resources/port1.0/variant_descriptions.conf
315:debug:main universal variant already exists, so not adding the default one
316:debug:main Running callback portconfigure::add_automatic_compiler_dependencies
317:debug:main Finished running callback portconfigure::add_automatic_compiler_dependencies
318:debug:main Running callback portbuild::add_automatic_buildsystem_dependencies
319:debug:main Finished running callback portbuild::add_automatic_buildsystem_dependencies
320:debug:main Running callback portstartupitem::add_notes
321:debug:main Finished running callback portstartupitem::add_notes
322:debug:main Running callback xcode_workaround::xcode_workaround.appy_fix
323:debug:main Finished running callback xcode_workaround::xcode_workaround.appy_fix
324:debug:main No need to upgrade! libgcc9 9.3.0_3 >= libgcc9 9.3.0_3
325:debug:main epoch: in tree: 3 installed: 3
326:debug:main libgcc 3.0_0 exists in the ports tree
327:debug:main libgcc 3.0_0  is the latest installed
328:debug:main libgcc 3.0_0  is active
329:debug:main Merging existing variants '' into variants
330:debug:main new fully merged portvariants:
331:debug:main Changing to port directory: /opt/local/var/macports/sources/rsync.macports.org/macports/release/tarballs/ports/lang/libgcc
332:debug:main OS darwin/20.3.0 (macOS 11.2) arch i386
333:debug:main Sourcing PortGroup select 1.0 from /opt/local/var/macports/sources/rsync.macports.org/macports/release/tarballs/ports/_resources/port1.0/group/select-1.0.tcl
334:debug:main Reading variant descriptions from /opt/local/var/macports/sources/rsync.macports.org/macports/release/tarballs/ports/_resources/port1.0/variant_descriptions.conf
335:debug:main universal variant already exists, so not adding the default one
336:debug:main Running callback portconfigure::add_automatic_compiler_dependencies
337:debug:main Finished running callback portconfigure::add_automatic_compiler_dependencies
338:debug:main Running callback portbuild::add_automatic_buildsystem_dependencies
339:debug:main Finished running callback portbuild::add_automatic_buildsystem_dependencies
340:debug:main Running callback portstartupitem::add_notes
341:debug:main Finished running callback portstartupitem::add_notes
342:debug:main No need to upgrade! libgcc 3.0_0 >= libgcc 3.0_0
343:debug:main epoch: in tree: 5 installed: 5
344:debug:main libgcc10 10.2.0_3 exists in the ports tree
345:debug:main libgcc10 10.2.0_3  is the latest installed
346:debug:main libgcc10 10.2.0_3  is active
347:debug:main Merging existing variants '' into variants
348:debug:main new fully merged portvariants:
349:debug:main Changing to port directory: /opt/local/var/macports/sources/rsync.macports.org/macports/release/tarballs/ports/lang/gcc10
350:debug:main OS darwin/20.3.0 (macOS 11.2) arch i386
351:debug:main Sourcing PortGroup select 1.0 from /opt/local/var/macports/sources/rsync.macports.org/macports/release/tarballs/ports/_resources/port1.0/group/select-1.0.tcl
352:debug:main Sourcing PortGroup compiler_blacklist_versions 1.0 from /opt/local/var/macports/sources/rsync.macports.org/macports/release/tarballs/ports/_resources/port1.0/group/compiler_blacklist_versions-1.0.tcl
353:debug:main Sourcing PortGroup active_variants 1.1 from /opt/local/var/macports/sources/rsync.macports.org/macports/release/tarballs/ports/_resources/port1.0/group/active_variants-1.1.tcl
354:debug:main Sourcing PortGroup conflicts_build 1.0 from /opt/local/var/macports/sources/rsync.macports.org/macports/release/tarballs/ports/_resources/port1.0/group/conflicts_build-1.0.tcl
355:debug:main compiler clang 1200.0.32.29 not blacklisted because it doesn't match {clang < 800}
356:debug:main Reading variant descriptions from /opt/local/var/macports/sources/rsync.macports.org/macports/release/tarballs/ports/_resources/port1.0/variant_descriptions.conf
357:debug:main universal variant already exists, so not adding the default one
358:debug:main Running callback portconfigure::add_automatic_compiler_dependencies
359:debug:main Finished running callback portconfigure::add_automatic_compiler_dependencies
360:debug:main Running callback portbuild::add_automatic_buildsystem_dependencies
361:debug:main Finished running callback portbuild::add_automatic_buildsystem_dependencies
362:debug:main Running callback portstartupitem::add_notes
363:debug:main Finished running callback portstartupitem::add_notes
364:debug:main No need to upgrade! libgcc10 10.2.0_3 >= libgcc10 10.2.0_3
365:debug:main epoch: in tree: 0 installed: 0
366:debug:main libGLU 9.0.1_0 exists in the ports tree
367:debug:main libGLU 9.0.1_0  is the latest installed
368:debug:main libGLU 9.0.1_0  is active
369:debug:main Merging existing variants '' into variants
370:debug:main new fully merged portvariants:
371:debug:main Changing to port directory: /opt/local/var/macports/sources/rsync.macports.org/macports/release/tarballs/ports/x11/libGLU
372:debug:main OS darwin/20.3.0 (macOS 11.2) arch i386
373:debug:main adding the default universal variant
374:debug:main Reading variant descriptions from /opt/local/var/macports/sources/rsync.macports.org/macports/release/tarballs/ports/_resources/port1.0/variant_descriptions.conf
375:debug:main Running callback portconfigure::add_automatic_compiler_dependencies
376:debug:main Finished running callback portconfigure::add_automatic_compiler_dependencies
377:debug:main Running callback portbuild::add_automatic_buildsystem_dependencies
378:debug:main Finished running callback portbuild::add_automatic_buildsystem_dependencies
379:debug:main Running callback portstartupitem::add_notes
380:debug:main Finished running callback portstartupitem::add_notes
381:debug:main No need to upgrade! libGLU 9.0.1_0 >= libGLU 9.0.1_0
382:debug:main epoch: in tree: 1 installed: 1
383:debug:main mesa 19.0.8_1 exists in the ports tree
384:debug:main mesa 19.0.8_1 +osmesa+python27 is the latest installed
385:debug:main mesa 19.0.8_1 +osmesa+python27 is active
386:debug:main Merging existing variants '+osmesa+python27' into variants
387:debug:main new fully merged portvariants: osmesa + python27 +
388:debug:main Changing to port directory: /opt/local/var/macports/sources/rsync.macports.org/macports/release/tarballs/ports/x11/mesa
389:debug:main OS darwin/20.3.0 (macOS 11.2) arch i386
390:debug:main Sourcing PortGroup compiler_blacklist_versions 1.0 from /opt/local/var/macports/sources/rsync.macports.org/macports/release/tarballs/ports/_resources/port1.0/group/compiler_blacklist_versions-1.0.tcl
391:debug:main Removing legacy build support
392:debug:main Sourcing PortGroup legacysupport 1.0 from /opt/local/var/macports/sources/rsync.macports.org/macports/release/tarballs/ports/_resources/port1.0/group/legacysupport-1.0.tcl
393:debug:main compiler clang 1200.0.32.29 not blacklisted because it doesn't match {clang < 800}
394:debug:main adding the default universal variant
395:debug:main Reading variant descriptions from /opt/local/var/macports/sources/rsync.macports.org/macports/release/tarballs/ports/_resources/port1.0/variant_descriptions.conf
396:debug:main Executing variant python27 provides python27
397:debug:main Executing variant osmesa provides osmesa
398:debug:main Running callback portconfigure::add_automatic_compiler_dependencies
399:debug:main Finished running callback portconfigure::add_automatic_compiler_dependencies
400:debug:main Running callback portbuild::add_automatic_buildsystem_dependencies
401:debug:main Finished running callback portbuild::add_automatic_buildsystem_dependencies
402:debug:main Running callback portstartupitem::add_notes
403:debug:main Finished running callback portstartupitem::add_notes
404:debug:main Running callback add_legacysupport
405:debug:main Removing legacy build support
406:debug:main Finished running callback add_legacysupport
407:debug:main No need to upgrade! mesa 19.0.8_1 >= mesa 19.0.8_1
408:debug:main epoch: in tree: 0 installed: 0
409:debug:main expat 2.2.10_0 exists in the ports tree
410:debug:main expat 2.2.10_0  is the latest installed
411:debug:main expat 2.2.10_0  is active
412:debug:main Merging existing variants '' into variants
413:debug:main new fully merged portvariants:
414:debug:main Changing to port directory: /opt/local/var/macports/sources/rsync.macports.org/macports/release/tarballs/ports/textproc/expat
415:debug:main OS darwin/20.3.0 (macOS 11.2) arch i386
416:debug:main Sourcing PortGroup muniversal 1.0 from /opt/local/var/macports/sources/rsync.macports.org/macports/release/tarballs/ports/_resources/port1.0/group/muniversal-1.0.tcl
417:debug:main muniversal: adding universal variant
418:debug:main Reading variant descriptions from /opt/local/var/macports/sources/rsync.macports.org/macports/release/tarballs/ports/_resources/port1.0/variant_descriptions.conf
419:debug:main Running callback portconfigure::add_automatic_compiler_dependencies
420:debug:main Finished running callback portconfigure::add_automatic_compiler_dependencies
421:debug:main Running callback portbuild::add_automatic_buildsystem_dependencies
422:debug:main Finished running callback portbuild::add_automatic_buildsystem_dependencies
423:debug:main Running callback portstartupitem::add_notes
424:debug:main Finished running callback portstartupitem::add_notes
425:debug:main No need to upgrade! expat 2.2.10_0 >= expat 2.2.10_0
426:debug:main epoch: in tree: 1 installed: 1
427:debug:main xorg-xorgproto 2021.3_0 exists in the ports tree
428:debug:main xorg-xorgproto 2021.3_0  is the latest installed
429:debug:main xorg-xorgproto 2021.3_0  is active
430:debug:main Merging existing variants '' into variants
431:debug:main new fully merged portvariants:
432:debug:main Changing to port directory: /opt/local/var/macports/sources/rsync.macports.org/macports/release/tarballs/ports/x11/xorg-xorgproto
433:debug:main OS darwin/20.3.0 (macOS 11.2) arch i386
434:debug:main only one arch supported, so not adding the default universal variant
435:debug:main Running callback portconfigure::add_automatic_compiler_dependencies
436:debug:main Finished running callback portconfigure::add_automatic_compiler_dependencies
437:debug:main Running callback portbuild::add_automatic_buildsystem_dependencies
438:debug:main Finished running callback portbuild::add_automatic_buildsystem_dependencies
439:debug:main Running callback portstartupitem::add_notes
440:debug:main Finished running callback portstartupitem::add_notes
441:debug:main No need to upgrade! xorg-xorgproto 2021.3_0 >= xorg-xorgproto 2021.3_0
442:debug:main epoch: in tree: 0 installed: 0
443:debug:main xorg-libxcb 1.14_0 exists in the ports tree
444:debug:main xorg-libxcb 1.14_0 +python38 is the latest installed
445:debug:main xorg-libxcb 1.14_0 +python38 is active
446:debug:main Merging existing variants '+python38' into variants
447:debug:main new fully merged portvariants: python38 +
448:debug:main Changing to port directory: /opt/local/var/macports/sources/rsync.macports.org/macports/release/tarballs/ports/x11/xorg-libxcb
449:debug:main OS darwin/20.3.0 (macOS 11.2) arch i386
450:debug:main adding the default universal variant
451:debug:main Reading variant descriptions from /opt/local/var/macports/sources/rsync.macports.org/macports/release/tarballs/ports/_resources/port1.0/variant_descriptions.conf
452:debug:main Executing variant python38 provides python38
453:debug:main Running callback portconfigure::add_automatic_compiler_dependencies
454:debug:main Finished running callback portconfigure::add_automatic_compiler_dependencies
455:debug:main Running callback portbuild::add_automatic_buildsystem_dependencies
456:debug:main Finished running callback portbuild::add_automatic_buildsystem_dependencies
457:debug:main Running callback portstartupitem::add_notes
458:debug:main Finished running callback portstartupitem::add_notes
459:debug:main No need to upgrade! xorg-libxcb 1.14_0 >= xorg-libxcb 1.14_0
460:debug:main epoch: in tree: 0 installed: 0
461:debug:main xorg-libXau 1.0.9_0 exists in the ports tree
462:debug:main xorg-libXau 1.0.9_0  is the latest installed
463:debug:main xorg-libXau 1.0.9_0  is active
464:debug:main Merging existing variants '' into variants
465:debug:main new fully merged portvariants:
466:debug:main Changing to port directory: /opt/local/var/macports/sources/rsync.macports.org/macports/release/tarballs/ports/x11/xorg-libXau
467:debug:main OS darwin/20.3.0 (macOS 11.2) arch i386
468:debug:main adding the default universal variant
469:debug:main Reading variant descriptions from /opt/local/var/macports/sources/rsync.macports.org/macports/release/tarballs/ports/_resources/port1.0/variant_descriptions.conf
470:debug:main Running callback portconfigure::add_automatic_compiler_dependencies
471:debug:main Finished running callback portconfigure::add_automatic_compiler_dependencies
472:debug:main Running callback portbuild::add_automatic_buildsystem_dependencies
473:debug:main Finished running callback portbuild::add_automatic_buildsystem_dependencies
474:debug:main Running callback portstartupitem::add_notes
475:debug:main Finished running callback portstartupitem::add_notes
476:debug:main No need to upgrade! xorg-libXau 1.0.9_0 >= xorg-libXau 1.0.9_0
477:debug:main epoch: in tree: 0 installed: 0
478:debug:main xorg-libXdmcp 1.1.3_0 exists in the ports tree
479:debug:main xorg-libXdmcp 1.1.3_0  is the latest installed
480:debug:main xorg-libXdmcp 1.1.3_0  is active
481:debug:main Merging existing variants '' into variants
482:debug:main new fully merged portvariants:
483:debug:main Changing to port directory: /opt/local/var/macports/sources/rsync.macports.org/macports/release/tarballs/ports/x11/xorg-libXdmcp
484:debug:main OS darwin/20.3.0 (macOS 11.2) arch i386
485:debug:main adding the default universal variant
486:debug:main Reading variant descriptions from /opt/local/var/macports/sources/rsync.macports.org/macports/release/tarballs/ports/_resources/port1.0/variant_descriptions.conf
487:debug:main Running callback portconfigure::add_automatic_compiler_dependencies
488:debug:main Finished running callback portconfigure::add_automatic_compiler_dependencies
489:debug:main Running callback portbuild::add_automatic_buildsystem_dependencies
490:debug:main Finished running callback portbuild::add_automatic_buildsystem_dependencies
491:debug:main Running callback portstartupitem::add_notes
492:debug:main Finished running callback portstartupitem::add_notes
493:debug:main No need to upgrade! xorg-libXdmcp 1.1.3_0 >= xorg-libXdmcp 1.1.3_0
494:debug:main epoch: in tree: 0 installed: 0
495:debug:main xorg-xcb-proto 1.14.1_0 exists in the ports tree
496:debug:main xorg-xcb-proto 1.14.1_0 +python38 is the latest installed
497:debug:main xorg-xcb-proto 1.14.1_0 +python38 is active
498:debug:main Merging existing variants '+python38' into variants
499:debug:main new fully merged portvariants: python38 +
500:debug:main Changing to port directory: /opt/local/var/macports/sources/rsync.macports.org/macports/release/tarballs/ports/x11/xorg-xcb-proto
501:debug:main OS darwin/20.3.0 (macOS 11.2) arch i386
502:debug:main only one arch supported, so not adding the default universal variant
503:debug:main Executing variant python38 provides python38
504:debug:main Running callback portconfigure::add_automatic_compiler_dependencies
505:debug:main Finished running callback portconfigure::add_automatic_compiler_dependencies
506:debug:main Running callback portbuild::add_automatic_buildsystem_dependencies
507:debug:main Finished running callback portbuild::add_automatic_buildsystem_dependencies
508:debug:main Running callback portstartupitem::add_notes
509:debug:main Finished running callback portstartupitem::add_notes
510:debug:main No need to upgrade! xorg-xcb-proto 1.14.1_0 >= xorg-xcb-proto 1.14.1_0
511:debug:main epoch: in tree: 0 installed: 0
512:debug:main libxml2 2.9.10_1 exists in the ports tree
513:debug:main libxml2 2.9.10_1  is the latest installed
514:debug:main libxml2 2.9.10_1  is active
515:debug:main Merging existing variants '' into variants
516:debug:main new fully merged portvariants:
517:debug:main Changing to port directory: /opt/local/var/macports/sources/rsync.macports.org/macports/release/tarballs/ports/textproc/libxml2
518:debug:main OS darwin/20.3.0 (macOS 11.2) arch i386
519:debug:main Sourcing PortGroup clang_dependency 1.0 from /opt/local/var/macports/sources/rsync.macports.org/macports/release/tarballs/ports/_resources/port1.0/group/clang_dependency-1.0.tcl
520:debug:main adding the default universal variant
521:debug:main Reading variant descriptions from /opt/local/var/macports/sources/rsync.macports.org/macports/release/tarballs/ports/_resources/port1.0/variant_descriptions.conf
522:debug:main Running callback portconfigure::add_automatic_compiler_dependencies
523:debug:main Finished running callback portconfigure::add_automatic_compiler_dependencies
524:debug:main Running callback portbuild::add_automatic_buildsystem_dependencies
525:debug:main Finished running callback portbuild::add_automatic_buildsystem_dependencies
526:debug:main Running callback portstartupitem::add_notes
527:debug:main Finished running callback portstartupitem::add_notes
528:debug:main No need to upgrade! libxml2 2.9.10_1 >= libxml2 2.9.10_1
529:debug:main epoch: in tree: 0 installed: 0
530:debug:main icu 67.1_3 exists in the ports tree
531:debug:main icu 67.1_3  is the latest installed
532:debug:main icu 67.1_3  is active
533:debug:main Merging existing variants '' into variants
534:debug:main new fully merged portvariants:
535:debug:main Changing to port directory: /opt/local/var/macports/sources/rsync.macports.org/macports/release/tarballs/ports/devel/icu
536:debug:main OS darwin/20.3.0 (macOS 11.2) arch i386
537:debug:main Sourcing PortGroup clang_dependency 1.0 from /opt/local/var/macports/sources/rsync.macports.org/macports/release/tarballs/ports/_resources/port1.0/group/clang_dependency-1.0.tcl
538:debug:main Sourcing PortGroup muniversal 1.0 from /opt/local/var/macports/sources/rsync.macports.org/macports/release/tarballs/ports/_resources/port1.0/group/muniversal-1.0.tcl
539:debug:main muniversal: adding universal variant
540:debug:main Reading variant descriptions from /opt/local/var/macports/sources/rsync.macports.org/macports/release/tarballs/ports/_resources/port1.0/variant_descriptions.conf
541:debug:main Running callback portconfigure::add_automatic_compiler_dependencies
542:debug:main Finished running callback portconfigure::add_automatic_compiler_dependencies
543:debug:main Running callback portbuild::add_automatic_buildsystem_dependencies
544:debug:main Finished running callback portbuild::add_automatic_buildsystem_dependencies
545:debug:main Running callback portstartupitem::add_notes
546:debug:main Finished running callback portstartupitem::add_notes
547:debug:main No need to upgrade! icu 67.1_3 >= icu 67.1_3
548:debug:main epoch: in tree: 0 installed: 0
549:debug:main xz 5.2.5_0 exists in the ports tree
550:debug:main xz 5.2.5_0  is the latest installed
551:debug:main xz 5.2.5_0  is active
552:debug:main Merging existing variants '' into variants
553:debug:main new fully merged portvariants:
554:debug:main Changing to port directory: /opt/local/var/macports/sources/rsync.macports.org/macports/release/tarballs/ports/archivers/xz
555:debug:main OS darwin/20.3.0 (macOS 11.2) arch i386
556:debug:main Sourcing PortGroup clang_dependency 1.0 from /opt/local/var/macports/sources/rsync.macports.org/macports/release/tarballs/ports/_resources/port1.0/group/clang_dependency-1.0.tcl
557:debug:main adding the default universal variant
558:debug:main Reading variant descriptions from /opt/local/var/macports/sources/rsync.macports.org/macports/release/tarballs/ports/_resources/port1.0/variant_descriptions.conf
559:debug:main Running callback portconfigure::add_automatic_compiler_dependencies
560:debug:main Finished running callback portconfigure::add_automatic_compiler_dependencies
561:debug:main Running callback portbuild::add_automatic_buildsystem_dependencies
562:debug:main Finished running callback portbuild::add_automatic_buildsystem_dependencies
563:debug:main Running callback portstartupitem::add_notes
564:debug:main Finished running callback portstartupitem::add_notes
565:debug:main No need to upgrade! xz 5.2.5_0 >= xz 5.2.5_0
566:debug:main epoch: in tree: 0 installed: 0
567:debug:main xorg-libpthread-stubs 0.4_0 exists in the ports tree
568:debug:main xorg-libpthread-stubs 0.4_0  is the latest installed
569:debug:main xorg-libpthread-stubs 0.4_0  is active
570:debug:main Merging existing variants '' into variants
571:debug:main new fully merged portvariants:
572:debug:main Changing to port directory: /opt/local/var/macports/sources/rsync.macports.org/macports/release/tarballs/ports/x11/xorg-libpthread-stubs
573:debug:main OS darwin/20.3.0 (macOS 11.2) arch i386
574:debug:main only one arch supported, so not adding the default universal variant
575:debug:main Running callback portconfigure::add_automatic_compiler_dependencies
576:debug:main Finished running callback portconfigure::add_automatic_compiler_dependencies
577:debug:main Running callback portbuild::add_automatic_buildsystem_dependencies
578:debug:main Finished running callback portbuild::add_automatic_buildsystem_dependencies
579:debug:main Running callback portstartupitem::add_notes
580:debug:main Finished running callback portstartupitem::add_notes
581:debug:main No need to upgrade! xorg-libpthread-stubs 0.4_0 >= xorg-libpthread-stubs 0.4_0
582:debug:main epoch: in tree: 0 installed: 0
583:debug:main xorg-libX11 1.7.0_0 exists in the ports tree
584:debug:main xorg-libX11 1.7.0_0  is the latest installed
585:debug:main xorg-libX11 1.7.0_0  is active
586:debug:main Merging existing variants '' into variants
587:debug:main new fully merged portvariants:
588:debug:main Changing to port directory: /opt/local/var/macports/sources/rsync.macports.org/macports/release/tarballs/ports/x11/xorg-libX11
589:debug:main OS darwin/20.3.0 (macOS 11.2) arch i386
590:debug:main Sourcing PortGroup compiler_blacklist_versions 1.0 from /opt/local/var/macports/sources/rsync.macports.org/macports/release/tarballs/ports/_resources/port1.0/group/compiler_blacklist_versions-1.0.tcl
591:debug:main adding the default universal variant
592:debug:main Reading variant descriptions from /opt/local/var/macports/sources/rsync.macports.org/macports/release/tarballs/ports/_resources/port1.0/variant_descriptions.conf
593:debug:main Running callback portconfigure::add_automatic_compiler_dependencies
594:debug:main Finished running callback portconfigure::add_automatic_compiler_dependencies
595:debug:main Running callback portbuild::add_automatic_buildsystem_dependencies
596:debug:main Finished running callback portbuild::add_automatic_buildsystem_dependencies
597:debug:main Running callback portstartupitem::add_notes
598:debug:main Finished running callback portstartupitem::add_notes
599:debug:main No need to upgrade! xorg-libX11 1.7.0_0 >= xorg-libX11 1.7.0_0
600:debug:main epoch: in tree: 0 installed: 0
601:debug:main xorg-libXext 1.3.4_0 exists in the ports tree
602:debug:main xorg-libXext 1.3.4_0  is the latest installed
603:debug:main xorg-libXext 1.3.4_0  is active
604:debug:main Merging existing variants '' into variants
605:debug:main new fully merged portvariants:
606:debug:main Changing to port directory: /opt/local/var/macports/sources/rsync.macports.org/macports/release/tarballs/ports/x11/xorg-libXext
607:debug:main OS darwin/20.3.0 (macOS 11.2) arch i386
608:debug:main adding the default universal variant
609:debug:main Reading variant descriptions from /opt/local/var/macports/sources/rsync.macports.org/macports/release/tarballs/ports/_resources/port1.0/variant_descriptions.conf
610:debug:main Running callback portconfigure::add_automatic_compiler_dependencies
611:debug:main Finished running callback portconfigure::add_automatic_compiler_dependencies
612:debug:main Running callback portbuild::add_automatic_buildsystem_dependencies
613:debug:main Finished running callback portbuild::add_automatic_buildsystem_dependencies
614:debug:main Running callback portstartupitem::add_notes
615:debug:main Finished running callback portstartupitem::add_notes
616:debug:main No need to upgrade! xorg-libXext 1.3.4_0 >= xorg-libXext 1.3.4_0
617:debug:main epoch: in tree: 0 installed: 0
618:debug:main xorg-libXdamage 1.1.5_0 exists in the ports tree
619:debug:main xorg-libXdamage 1.1.5_0  is the latest installed
620:debug:main xorg-libXdamage 1.1.5_0  is active
621:debug:main Merging existing variants '' into variants
622:debug:main new fully merged portvariants:
623:debug:main Changing to port directory: /opt/local/var/macports/sources/rsync.macports.org/macports/release/tarballs/ports/x11/xorg-libXdamage
624:debug:main OS darwin/20.3.0 (macOS 11.2) arch i386
625:debug:main adding the default universal variant
626:debug:main Reading variant descriptions from /opt/local/var/macports/sources/rsync.macports.org/macports/release/tarballs/ports/_resources/port1.0/variant_descriptions.conf
627:debug:main Running callback portconfigure::add_automatic_compiler_dependencies
628:debug:main Finished running callback portconfigure::add_automatic_compiler_dependencies
629:debug:main Running callback portbuild::add_automatic_buildsystem_dependencies
630:debug:main Finished running callback portbuild::add_automatic_buildsystem_dependencies
631:debug:main Running callback portstartupitem::add_notes
632:debug:main Finished running callback portstartupitem::add_notes
633:debug:main No need to upgrade! xorg-libXdamage 1.1.5_0 >= xorg-libXdamage 1.1.5_0
634:debug:main epoch: in tree: 0 installed: 0
635:debug:main xorg-libXfixes 5.0.3_1 exists in the ports tree
636:debug:main xorg-libXfixes 5.0.3_1  is the latest installed
637:debug:main xorg-libXfixes 5.0.3_1  is active
638:debug:main Merging existing variants '' into variants
639:debug:main new fully merged portvariants:
640:debug:main Changing to port directory: /opt/local/var/macports/sources/rsync.macports.org/macports/release/tarballs/ports/x11/xorg-libXfixes
641:debug:main OS darwin/20.3.0 (macOS 11.2) arch i386
642:debug:main adding the default universal variant
643:debug:main Reading variant descriptions from /opt/local/var/macports/sources/rsync.macports.org/macports/release/tarballs/ports/_resources/port1.0/variant_descriptions.conf
644:debug:main Running callback portconfigure::add_automatic_compiler_dependencies
645:debug:main Finished running callback portconfigure::add_automatic_compiler_dependencies
646:debug:main Running callback portbuild::add_automatic_buildsystem_dependencies
647:debug:main Finished running callback portbuild::add_automatic_buildsystem_dependencies
648:debug:main Running callback portstartupitem::add_notes
649:debug:main Finished running callback portstartupitem::add_notes
650:debug:main No need to upgrade! xorg-libXfixes 5.0.3_1 >= xorg-libXfixes 5.0.3_1
651:debug:main epoch: in tree: 0 installed: 0
652:debug:main xorg-libXi 1.7.10_0 exists in the ports tree
653:debug:main xorg-libXi 1.7.10_0  is the latest installed
654:debug:main xorg-libXi 1.7.10_0  is active
655:debug:main Merging existing variants '' into variants
656:debug:main new fully merged portvariants:
657:debug:main Changing to port directory: /opt/local/var/macports/sources/rsync.macports.org/macports/release/tarballs/ports/x11/xorg-libXi
658:debug:main OS darwin/20.3.0 (macOS 11.2) arch i386
659:debug:main adding the default universal variant
660:debug:main Reading variant descriptions from /opt/local/var/macports/sources/rsync.macports.org/macports/release/tarballs/ports/_resources/port1.0/variant_descriptions.conf
661:debug:main Running callback portconfigure::add_automatic_compiler_dependencies
662:debug:main Finished running callback portconfigure::add_automatic_compiler_dependencies
663:debug:main Running callback portbuild::add_automatic_buildsystem_dependencies
664:debug:main Finished running callback portbuild::add_automatic_buildsystem_dependencies
665:debug:main Running callback portstartupitem::add_notes
666:debug:main Finished running callback portstartupitem::add_notes
667:debug:main No need to upgrade! xorg-libXi 1.7.10_0 >= xorg-libXi 1.7.10_0
668:debug:main epoch: in tree: 0 installed: 0
669:debug:main xorg-libXmu 1.1.3_0 exists in the ports tree
670:debug:main xorg-libXmu 1.1.3_0  is the latest installed
671:debug:main xorg-libXmu 1.1.3_0  is active
672:debug:main Merging existing variants '' into variants
673:debug:main new fully merged portvariants:
674:debug:main Changing to port directory: /opt/local/var/macports/sources/rsync.macports.org/macports/release/tarballs/ports/x11/xorg-libXmu
675:debug:main OS darwin/20.3.0 (macOS 11.2) arch i386
676:debug:main adding the default universal variant
677:debug:main Reading variant descriptions from /opt/local/var/macports/sources/rsync.macports.org/macports/release/tarballs/ports/_resources/port1.0/variant_descriptions.conf
678:debug:main Running callback portconfigure::add_automatic_compiler_dependencies
679:debug:main Finished running callback portconfigure::add_automatic_compiler_dependencies
680:debug:main Running callback portbuild::add_automatic_buildsystem_dependencies
681:debug:main Finished running callback portbuild::add_automatic_buildsystem_dependencies
682:debug:main Running callback portstartupitem::add_notes
683:debug:main Finished running callback portstartupitem::add_notes
684:debug:main No need to upgrade! xorg-libXmu 1.1.3_0 >= xorg-libXmu 1.1.3_0
685:debug:main epoch: in tree: 0 installed: 0
686:debug:main xorg-libXt 1.2.1_0 exists in the ports tree
687:debug:main xorg-libXt 1.2.1_0  is the latest installed
688:debug:main xorg-libXt 1.2.1_0  is active
689:debug:main Merging existing variants '' into variants
690:debug:main new fully merged portvariants:
691:debug:main Changing to port directory: /opt/local/var/macports/sources/rsync.macports.org/macports/release/tarballs/ports/x11/xorg-libXt
692:debug:main OS darwin/20.3.0 (macOS 11.2) arch i386
693:debug:main adding the default universal variant
694:debug:main Reading variant descriptions from /opt/local/var/macports/sources/rsync.macports.org/macports/release/tarballs/ports/_resources/port1.0/variant_descriptions.conf
695:debug:main Running callback portconfigure::add_automatic_compiler_dependencies
696:debug:main Finished running callback portconfigure::add_automatic_compiler_dependencies
697:debug:main Running callback portbuild::add_automatic_buildsystem_dependencies
698:debug:main Finished running callback portbuild::add_automatic_buildsystem_dependencies
699:debug:main Running callback portstartupitem::add_notes
700:debug:main Finished running callback portstartupitem::add_notes
701:debug:main No need to upgrade! xorg-libXt 1.2.1_0 >= xorg-libXt 1.2.1_0
702:debug:main epoch: in tree: 0 installed: 0
703:debug:main xorg-libsm 1.2.3_0 exists in the ports tree
704:debug:main xorg-libsm 1.2.3_0  is the latest installed
705:debug:main xorg-libsm 1.2.3_0  is active
706:debug:main Merging existing variants '' into variants
707:debug:main new fully merged portvariants:
708:debug:main Changing to port directory: /opt/local/var/macports/sources/rsync.macports.org/macports/release/tarballs/ports/x11/xorg-libsm
709:debug:main OS darwin/20.3.0 (macOS 11.2) arch i386
710:debug:main adding the default universal variant
711:debug:main Reading variant descriptions from /opt/local/var/macports/sources/rsync.macports.org/macports/release/tarballs/ports/_resources/port1.0/variant_descriptions.conf
712:debug:main Running callback portconfigure::add_automatic_compiler_dependencies
713:debug:main Finished running callback portconfigure::add_automatic_compiler_dependencies
714:debug:main Running callback portbuild::add_automatic_buildsystem_dependencies
715:debug:main Finished running callback portbuild::add_automatic_buildsystem_dependencies
716:debug:main Running callback portstartupitem::add_notes
717:debug:main Finished running callback portstartupitem::add_notes
718:debug:main No need to upgrade! xorg-libsm 1.2.3_0 >= xorg-libsm 1.2.3_0
719:debug:main epoch: in tree: 0 installed: 0
720:debug:main xorg-libice 1.0.10_0 exists in the ports tree
721:debug:main xorg-libice 1.0.10_0  is the latest installed
722:debug:main xorg-libice 1.0.10_0  is active
723:debug:main Merging existing variants '' into variants
724:debug:main new fully merged portvariants:
725:debug:main Changing to port directory: /opt/local/var/macports/sources/rsync.macports.org/macports/release/tarballs/ports/x11/xorg-libice
726:debug:main OS darwin/20.3.0 (macOS 11.2) arch i386
727:debug:main adding the default universal variant
728:debug:main Reading variant descriptions from /opt/local/var/macports/sources/rsync.macports.org/macports/release/tarballs/ports/_resources/port1.0/variant_descriptions.conf
729:debug:main Running callback portconfigure::add_automatic_compiler_dependencies
730:debug:main Finished running callback portconfigure::add_automatic_compiler_dependencies
731:debug:main Running callback portbuild::add_automatic_buildsystem_dependencies
732:debug:main Finished running callback portbuild::add_automatic_buildsystem_dependencies
733:debug:main Running callback portstartupitem::add_notes
734:debug:main Finished running callback portstartupitem::add_notes
735:debug:main No need to upgrade! xorg-libice 1.0.10_0 >= xorg-libice 1.0.10_0
736:debug:main epoch: in tree: 0 installed: 0
737:debug:main xorg-libXxf86vm 1.1.4_1 exists in the ports tree
738:debug:main xorg-libXxf86vm 1.1.4_1  is the latest installed
739:debug:main xorg-libXxf86vm 1.1.4_1  is active
740:debug:main Merging existing variants '' into variants
741:debug:main new fully merged portvariants:
742:debug:main Changing to port directory: /opt/local/var/macports/sources/rsync.macports.org/macports/release/tarballs/ports/x11/xorg-libXxf86vm
743:debug:main OS darwin/20.3.0 (macOS 11.2) arch i386
744:debug:main adding the default universal variant
745:debug:main Reading variant descriptions from /opt/local/var/macports/sources/rsync.macports.org/macports/release/tarballs/ports/_resources/port1.0/variant_descriptions.conf
746:debug:main Running callback portconfigure::add_automatic_compiler_dependencies
747:debug:main Finished running callback portconfigure::add_automatic_compiler_dependencies
748:debug:main Running callback portbuild::add_automatic_buildsystem_dependencies
749:debug:main Finished running callback portbuild::add_automatic_buildsystem_dependencies
750:debug:main Running callback portstartupitem::add_notes
751:debug:main Finished running callback portstartupitem::add_notes
752:debug:main No need to upgrade! xorg-libXxf86vm 1.1.4_1 >= xorg-libXxf86vm 1.1.4_1
753:msg:main --->  Computing dependencies for molden:info:main .:debug:main molden has no conflicts
754:debug:main Searching for dependency: gmake
755:debug:main Found Dependency: receipt exists for gmake
756:debug:main Searching for dependency: makedepend
757:debug:main Found Dependency: receipt exists for makedepend
758:debug:main Searching for dependency: gcc9
759:debug:main Found Dependency: receipt exists for gcc9
760:debug:main Searching for dependency: libGLU
761:debug:main Found Dependency: receipt exists for libGLU
762:debug:main Searching for dependency: mesa
763:debug:main Found Dependency: receipt exists for mesa
764:debug:main Searching for dependency: xorg-libX11
765:debug:main Found Dependency: receipt exists for xorg-libX11
766:debug:main Searching for dependency: xorg-libXmu
767:debug:main Found Dependency: receipt exists for xorg-libXmu
768:debug:main Searching for dependency: libgcc
769:debug:main Found Dependency: receipt exists for libgcc
770:debug:main Searching for dependency: libgcc9
771:debug:main Found Dependency: receipt exists for libgcc9
772:debug:main Executing org.macports.main (molden)
773:debug:main dropping privileges: euid changed to 505, egid changed to 502.
774:debug:archivefetch archivefetch phase started at Wed Mar 17 13:44:32 CET 2021
775:msg:archivefetch --->  Fetching archive for molden
776:debug:archivefetch Executing proc-pre-org.macports.archivefetch-archivefetch-0
777:debug:archivefetch Executing org.macports.archivefetch (molden)
778:debug:archivefetch euid/egid changed to: 0/0
779:debug:archivefetch chowned /opt/local/var/macports/incoming to macports
780:debug:archivefetch euid/egid changed to: 505/502
781:info:archivefetch --->  molden-6.7-20210202142200_0+gcc9.darwin_20.x86_64.tbz2 doesn't seem to exist in /opt/local/var/macports/incoming/verified
782:msg:archivefetch --->  Attempting to fetch molden-6.7-20210202142200_0+gcc9.darwin_20.x86_64.tbz2 from https://lil.fr.packages.macports.org/molden
783:debug:archivefetch Fetching archive failed: The requested URL returned error: 404 Not Found
784:msg:archivefetch --->  Attempting to fetch molden-6.7-20210202142200_0+gcc9.darwin_20.x86_64.tbz2 from https://mse.uk.packages.macports.org/molden
785:debug:archivefetch Fetching archive failed: The requested URL returned error: 404 Not Found
786:msg:archivefetch --->  Attempting to fetch molden-6.7-20210202142200_0+gcc9.darwin_20.x86_64.tbz2 from https://packages.macports.org/molden
787:debug:archivefetch Fetching archive failed: The requested URL returned error: 404 Not Found
788:debug:archivefetch Privilege de-escalation not attempted as not running as root.
789:debug:fetch fetch phase started at Wed Mar 17 13:44:33 CET 2021
790:notice:fetch --->  Fetching distfiles for molden
791:debug:fetch Executing proc-pre-org.macports.fetch-fetch-0
792:debug:fetch Executing org.macports.fetch (molden)
793:debug:fetch Privilege de-escalation not attempted as not running as root.
794:debug:checksum checksum phase started at Wed Mar 17 13:44:33 CET 2021
795:notice:checksum --->  Verifying checksums for molden
796:debug:checksum Executing org.macports.checksum (molden)
797:info:checksum --->  Checksumming molden6.7.tar.gz
798:debug:checksum Calculated (rmd160) is dfa7e0421d5b0991bf7f954715423004bb7539a4
799:debug:checksum Correct (rmd160) checksum for molden6.7.tar.gz
800:debug:checksum Calculated (sha256) is ebd73e8d95271eb82a1464a7eab28a042662483bbff6e6dcc7db0d1c9b2e4432
801:debug:checksum Correct (sha256) checksum for molden6.7.tar.gz
802:debug:checksum Calculated (size) is 11600372
803:debug:checksum Correct (size) checksum for molden6.7.tar.gz
804:debug:checksum Privilege de-escalation not attempted as not running as root.
805:debug:extract extract phase started at Wed Mar 17 13:44:33 CET 2021
806:notice:extract --->  Extracting molden
807:debug:extract Executing proc-pre-org.macports.extract-extract-0
808:debug:extract Executing org.macports.extract (molden)
809:info:extract --->  Extracting molden6.7.tar.gz
810:debug:extract setting option extract.args to '/opt/local/var/macports/distfiles/molden/6.7-20210202142200/molden6.7.tar.gz'
811:debug:extract Environment:
812:debug:extract CC_PRINT_OPTIONS='YES'
813:debug:extract CC_PRINT_OPTIONS_FILE='/opt/local/var/macports/build/_opt_local_var_macports_sources_rsync.macports.org_macports_release_tarballs_ports_science_molden/molden/work/.CC_PRINT_OPTIONS'
814:debug:extract CPATH='/opt/local/include'
815:debug:extract DEVELOPER_DIR='/Library/Developer/CommandLineTools'
816:debug:extract LIBRARY_PATH='/opt/local/lib'
817:debug:extract MACOSX_DEPLOYMENT_TARGET='11.2'
818:debug:extract SDKROOT='/Library/Developer/CommandLineTools/SDKs/MacOSX.sdk'
819:info:extract Executing:  cd "/opt/local/var/macports/build/_opt_local_var_macports_sources_rsync.macports.org_macports_release_tarballs_ports_science_molden/molden/work" && /usr/bin/gzip -dc '/opt/local/var/macports/distfiles/molden/6.7-20210202142200/molden6.7.tar.gz' | /usr/bin/tar -xf -
820:debug:extract system:  cd "/opt/local/var/macports/build/_opt_local_var_macports_sources_rsync.macports.org_macports_release_tarballs_ports_science_molden/molden/work" && /usr/bin/gzip -dc '/opt/local/var/macports/distfiles/molden/6.7-20210202142200/molden6.7.tar.gz' | /usr/bin/tar -xf -
821:debug:extract euid/egid changed to: 0/0
822:debug:extract chowned /opt/local/var/macports/build/_opt_local_var_macports_sources_rsync.macports.org_macports_release_tarballs_ports_science_molden/molden/work to macports
823:debug:extract euid/egid changed to: 505/502
824:debug:extract Executing proc-post-org.macports.extract-extract-0
825:debug:extract Privilege de-escalation not attempted as not running as root.
826:debug:patch patch phase started at Wed Mar 17 13:44:43 CET 2021
827:debug:patch Executing org.macports.patch (molden)
828:notice:patch --->  Applying patches to molden
829:info:patch --->  Applying patch-makefile.diff
830:debug:patch Environment:
831:debug:patch CC_PRINT_OPTIONS='YES'
832:debug:patch CC_PRINT_OPTIONS_FILE='/opt/local/var/macports/build/_opt_local_var_macports_sources_rsync.macports.org_macports_release_tarballs_ports_science_molden/molden/work/.CC_PRINT_OPTIONS'
833:debug:patch CPATH='/opt/local/include'
834:debug:patch DEVELOPER_DIR='/Library/Developer/CommandLineTools'
835:debug:patch LIBRARY_PATH='/opt/local/lib'
836:debug:patch MACOSX_DEPLOYMENT_TARGET='11.2'
837:debug:patch SDKROOT='/Library/Developer/CommandLineTools/SDKs/MacOSX.sdk'
838:info:patch Executing:  cd "/opt/local/var/macports/build/_opt_local_var_macports_sources_rsync.macports.org_macports_release_tarballs_ports_science_molden/molden/work/molden6.7" && /usr/bin/patch -p0 < '/opt/local/var/macports/sources/rsync.macports.org/macports/release/tarballs/ports/science/molden/files/patch-makefile.diff'
839:debug:patch system:  cd "/opt/local/var/macports/build/_opt_local_var_macports_sources_rsync.macports.org_macports_release_tarballs_ports_science_molden/molden/work/molden6.7" && /usr/bin/patch -p0 < '/opt/local/var/macports/sources/rsync.macports.org/macports/release/tarballs/ports/science/molden/files/patch-makefile.diff'
840:info:patch patching file makefile
841:info:patch --->  Applying implicit.patch
842:debug:patch Environment:
843:debug:patch CC_PRINT_OPTIONS='YES'
844:debug:patch CC_PRINT_OPTIONS_FILE='/opt/local/var/macports/build/_opt_local_var_macports_sources_rsync.macports.org_macports_release_tarballs_ports_science_molden/molden/work/.CC_PRINT_OPTIONS'
845:debug:patch CPATH='/opt/local/include'
846:debug:patch DEVELOPER_DIR='/Library/Developer/CommandLineTools'
847:debug:patch LIBRARY_PATH='/opt/local/lib'
848:debug:patch MACOSX_DEPLOYMENT_TARGET='11.2'
849:debug:patch SDKROOT='/Library/Developer/CommandLineTools/SDKs/MacOSX.sdk'
850:info:patch Executing:  cd "/opt/local/var/macports/build/_opt_local_var_macports_sources_rsync.macports.org_macports_release_tarballs_ports_science_molden/molden/work/molden6.7" && /usr/bin/patch -p0 < '/opt/local/var/macports/sources/rsync.macports.org/macports/release/tarballs/ports/science/molden/files/implicit.patch'
851:debug:patch system:  cd "/opt/local/var/macports/build/_opt_local_var_macports_sources_rsync.macports.org_macports_release_tarballs_ports_science_molden/molden/work/molden6.7" && /usr/bin/patch -p0 < '/opt/local/var/macports/sources/rsync.macports.org/macports/release/tarballs/ports/science/molden/files/implicit.patch'
852:info:patch patching file src/xwin.c
853:debug:patch Privilege de-escalation not attempted as not running as root.
854:debug:configure configure phase started at Wed Mar 17 13:44:43 CET 2021
855:notice:configure --->  Configuring molden
856:debug:configure Preferred compilers: clang macports-clang-9.0 macports-clang-11 macports-clang-10
857:debug:configure Using compiler 'Xcode Clang'
858:debug:configure Executing proc-pre-org.macports.configure-configure-0
859:debug:configure Active variants check for source-type install considers depends_fetch depends_extract depends_lib depends_build depends_run: libGLU mesa xorg-libX11 xorg-libXmu libgcc libgcc9 gmake makedepend gcc9
860:debug:configure Executing proc-pre-org.macports.configure-configure-1
861:debug:configure compilers.enforce_c list:
862:debug:configure compilers.enforce_fortran list:
863:debug:configure compilers.enforce_some_fortran list:
864:debug:configure Executing proc-pre-org.macports.configure-configure-2
865:debug:configure system -W /opt/local/var/macports/build/_opt_local_var_macports_sources_rsync.macports.org_macports_release_tarballs_ports_science_molden/molden/work/molden6.7: /opt/local/bin/gmake clean
866:info:configure rm -f src/src/atomdens.o src/molden.o src/above.o src/actcal.o src/basprt.o src/calc.o src/caldis.o src/calfa.o src/cntour.o src/cnvgam.o src/cnvgau.o src/convzmat.o src/cross.o src/crprod.o src/datin.o src/defpc.o src/defrad.o src/del.o src/denmak.o src/densmat.o src/distot.o src/dmat.o src/docent.o src/draw.o src/euler.o src/eulerh.o src/files.o src/fndcal.o src/gampoi.o src/gaupoi.o src/gaussian.o src/geogam.o src/geogau.o src/getmul.o src/getpoi.o src/getreal.o src/gmmcnv.o src/grdcal.o src/gstr.o src/hidedr.o src/impsc.o src/locatc.o src/maxmin.o src/mdout.o src/mmcnv.o src/mopaco.o src/mopin.o src/mulprt.o src/occin.o src/oriin.o src/parang.o src/pareul.o src/parfc.o src/parori.o src/parpla.o src/parstp.o src/planky.o src/plend.o src/plini.o src/plmol.o src/plotgh.o src/plotgr.o src/plotin.o src/plpost.o src/prev.o src/proato.o src/procnv.o src/progeo.o src/rdbas.o src/rdcor.o src/rdgam.o src/rdgaus.o src/rdinfo.o src/rdpdb.o src/rdvect.o src/reada.o src/readel.o src/readvv.o src/renorm.o src/rmomen.o src/rota.o src/rotatg.o src/rotb.o src/rotc.o src/rotcor.o src/rotd.o src/rotfir.o src/rotm.o src/rotmom.o src/scback.o src/search.o src/searchd.o src/setang.o src/setbas.o src/settc.o src/shsort.o src/site.o src/slater.o src/stoc.o src/tessa.o src/tk4014.o src/tocap.o src/tocapf.o src/tomold.o src/under.o src/vaxdum.o src/vclr.o src/vec.o src/vlen.o src/vsc1.o src/wrinfo.o src/zread.o src/samino.o src/prtcal.o src/actss.o src/actami.o src/plden.o src/heaps.o src/den3d.o src/dencnt.o src/plhead.o src/pltab.o src/eucmol.o src/pl3dm.o src/plbox.o src/selsol.o src/atmd.o src/dolift.o src/spaced.o src/snypnt.o src/eulstr.o src/calct.o src/coeffs.o src/epint.o src/espot.o src/fcij.o src/fmt.o src/genaos.o src/rys.o src/ryspol.o src/rysrot.o src/thrcen.o src/twocen.o src/ifblen.o src/rott.o src/plmolp.o src/wrzmat.o src/rdchx.o src/obin.o src/pred.o src/gargpl.o src/inferr.o src/freqs.o src/getmop.o src/brklin.o src/getzm.o src/xyzcoo.o src/geomop.o src/dumzm.o src/getxyz.o src/espchrg.o src/proxim.o src/rdgamu.o src/plvrml.o src/molsint.o src/runjob.o src/rdmsf.o src/wrmsf.o src/rdmolf.o src/adf_fun.o src/rotpol.o src/extbas.o src/rdcpmd.o src/eem.o src/asspmf.o src/srfcal.o src/rdqchm.o src/rdorca.o src/rdmaux.o src/rdnwch.o src/mpdum.o src/xwin.o src/xwingl.o bin/molden bin/gmolden bin/ambfor bin/ambmd bin/surf src/ambfor/*.o src/surf/*.o
867:debug:configure Executing org.macports.configure (molden)
868:debug:configure Privilege de-escalation not attempted as not running as root.
869:debug:build build phase started at Wed Mar 17 13:44:43 CET 2021
870:notice:build --->  Building molden
871:debug:build Executing proc-pre-org.macports.build-build-0
872:debug:build Executing org.macports.build (molden)
873:debug:build port disallows a parallel build
874:debug:build Environment:
875:debug:build CC_PRINT_OPTIONS='YES'
876:debug:build CC_PRINT_OPTIONS_FILE='/opt/local/var/macports/build/_opt_local_var_macports_sources_rsync.macports.org_macports_release_tarballs_ports_science_molden/molden/work/.CC_PRINT_OPTIONS'
877:debug:build CPATH='/opt/local/include'
878:debug:build DEVELOPER_DIR='/Library/Developer/CommandLineTools'
879:debug:build LIBRARY_PATH='/opt/local/lib'
880:debug:build MACOSX_DEPLOYMENT_TARGET='11.2'
881:debug:build SDKROOT='/Library/Developer/CommandLineTools/SDKs/MacOSX.sdk'
882:info:build Executing:  cd "/opt/local/var/macports/build/_opt_local_var_macports_sources_rsync.macports.org_macports_release_tarballs_ports_science_molden/molden/work/molden6.7" && /opt/local/bin/gmake -w all CC=/usr/bin/clang FC=/opt/local/bin/gfortran-mp-9 PREFIX=/opt/local
883:debug:build system:  cd "/opt/local/var/macports/build/_opt_local_var_macports_sources_rsync.macports.org_macports_release_tarballs_ports_science_molden/molden/work/molden6.7" && /opt/local/bin/gmake -w all CC=/usr/bin/clang FC=/opt/local/bin/gfortran-mp-9 PREFIX=/opt/local
884:info:build gmake: Entering directory '/opt/local/var/macports/build/_opt_local_var_macports_sources_rsync.macports.org_macports_release_tarballs_ports_science_molden/molden/work/molden6.7'
885:info:build /opt/local/bin/gfortran-mp-9 -O3 -funroll-loops  -c -o src/atomdens.o src/atomdens.f
886:info:build /opt/local/bin/gfortran-mp-9 -O3 -funroll-loops  -c -o src/molden.o src/molden.f
887:info:build /opt/local/bin/gfortran-mp-9 -O3 -funroll-loops  -c -o src/above.o src/above.f
888:info:build /opt/local/bin/gfortran-mp-9 -O3 -funroll-loops  -c -o src/actcal.o src/actcal.f
889:info:build /opt/local/bin/gfortran-mp-9 -O3 -funroll-loops  -c -o src/basprt.o src/basprt.f
890:info:build /opt/local/bin/gfortran-mp-9 -O3 -funroll-loops  -c -o src/calc.o src/calc.f
891:info:build /opt/local/bin/gfortran-mp-9 -O3 -funroll-loops  -c -o src/caldis.o src/caldis.f
892:info:build /opt/local/bin/gfortran-mp-9 -O3 -funroll-loops  -c -o src/calfa.o src/calfa.f
893:info:build /opt/local/bin/gfortran-mp-9 -O3 -funroll-loops  -c -o src/cntour.o src/cntour.f
894:info:build /opt/local/bin/gfortran-mp-9 -O3 -funroll-loops  -c -o src/cnvgam.o src/cnvgam.f
895:info:build /opt/local/bin/gfortran-mp-9 -O3 -funroll-loops  -c -o src/cnvgau.o src/cnvgau.f
896:info:build /opt/local/bin/gfortran-mp-9 -O3 -funroll-loops  -c -o src/convzmat.o src/convzmat.f
897:info:build /opt/local/bin/gfortran-mp-9 -O3 -funroll-loops  -c -o src/cross.o src/cross.f
898:info:build /opt/local/bin/gfortran-mp-9 -O3 -funroll-loops  -c -o src/crprod.o src/crprod.f
899:info:build /opt/local/bin/gfortran-mp-9 -O3 -funroll-loops  -c -o src/datin.o src/datin.f
900:info:build /opt/local/bin/gfortran-mp-9 -O3 -funroll-loops  -c -o src/defpc.o src/defpc.f
901:info:build /opt/local/bin/gfortran-mp-9 -O3 -funroll-loops  -c -o src/defrad.o src/defrad.f
902:info:build /opt/local/bin/gfortran-mp-9 -O3 -funroll-loops  -c -o src/del.o src/del.f
903:info:build /opt/local/bin/gfortran-mp-9 -O3 -funroll-loops  -c -o src/denmak.o src/denmak.f
904:info:build /opt/local/bin/gfortran-mp-9 -O3 -funroll-loops  -c -o src/densmat.o src/densmat.f
905:info:build /opt/local/bin/gfortran-mp-9 -O3 -funroll-loops  -c -o src/distot.o src/distot.f
906:info:build /opt/local/bin/gfortran-mp-9 -O3 -funroll-loops  -c -o src/dmat.o src/dmat.f
907:info:build /opt/local/bin/gfortran-mp-9 -O3 -funroll-loops  -c -o src/docent.o src/docent.f
908:info:build /opt/local/bin/gfortran-mp-9 -O3 -funroll-loops  -c -o src/draw.o src/draw.f
909:info:build /opt/local/bin/gfortran-mp-9 -O3 -funroll-loops  -c -o src/euler.o src/euler.f
910:info:build /opt/local/bin/gfortran-mp-9 -O3 -funroll-loops  -c -o src/eulerh.o src/eulerh.f
911:info:build /opt/local/bin/gfortran-mp-9 -O3 -funroll-loops  -c -o src/files.o src/files.f
912:info:build /opt/local/bin/gfortran-mp-9 -O3 -funroll-loops  -c -o src/fndcal.o src/fndcal.f
913:info:build /opt/local/bin/gfortran-mp-9 -O3 -funroll-loops  -c -o src/gampoi.o src/gampoi.f
914:info:build /opt/local/bin/gfortran-mp-9 -O3 -funroll-loops  -c -o src/gaupoi.o src/gaupoi.f
915:info:build src/gaupoi.f:105:72:
916:info:build   105 |          if(itemp(i))400,500,500
917:info:build       |                                                                        1
918:info:build Warning: Fortran 2018 deleted feature: Arithmetic IF statement at (1)
919:info:build /opt/local/bin/gfortran-mp-9 -O3 -funroll-loops  -c -o src/gaussian.o src/gaussian.f
920:info:build src/gaussian.f:636:0:
921:info:build   636 |                    psi(ipos) = psi(ipos) + g15to9(k,j)*tpsi(k)
922:info:build       |
923:info:build Warning: iteration 10 invokes undefined behavior [-Waggressive-loop-optimizations]
924:info:build src/gaussian.f:635:0:
925:info:build   635 |                 do k=1,15
926:info:build       |
927:info:build note: within this loop
928:info:build /opt/local/bin/gfortran-mp-9 -O3 -funroll-loops  -c -o src/geogam.o src/geogam.f
929:info:build /opt/local/bin/gfortran-mp-9 -O3 -funroll-loops  -c -o src/geogau.o src/geogau.f
930:info:build /opt/local/bin/gfortran-mp-9 -O3 -funroll-loops  -c -o src/getmul.o src/getmul.f
931:info:build /opt/local/bin/gfortran-mp-9 -O3 -funroll-loops  -c -o src/getpoi.o src/getpoi.f
932:info:build /opt/local/bin/gfortran-mp-9 -O3 -funroll-loops  -c -o src/getreal.o src/getreal.f
933:info:build /opt/local/bin/gfortran-mp-9 -O3 -funroll-loops  -c -o src/gmmcnv.o src/gmmcnv.f
934:info:build /opt/local/bin/gfortran-mp-9 -O3 -funroll-loops  -c -o src/grdcal.o src/grdcal.f
935:info:build /opt/local/bin/gfortran-mp-9 -O3 -funroll-loops  -c -o src/gstr.o src/gstr.f
936:info:build /opt/local/bin/gfortran-mp-9 -O3 -funroll-loops  -c -o src/hidedr.o src/hidedr.f
937:info:build /opt/local/bin/gfortran-mp-9 -O3 -funroll-loops  -c -o src/impsc.o src/impsc.f
938:info:build /opt/local/bin/gfortran-mp-9 -O3 -funroll-loops  -c -o src/locatc.o src/locatc.f
939:info:build /opt/local/bin/gfortran-mp-9 -O3 -funroll-loops  -c -o src/maxmin.o src/maxmin.f
940:info:build src/maxmin.f:14:72:
941:info:build    14 |           do 20 j=2,npts2-1
942:info:build       |                                                                        1
943:info:build Warning: Fortran 2018 deleted feature: Shared DO termination label 20 at (1)
944:info:build src/maxmin.f:40:72:
945:info:build    40 |           do 40 j=2,npts2-1
946:info:build       |                                                                        1
947:info:build Warning: Fortran 2018 deleted feature: Shared DO termination label 40 at (1)
948:info:build /opt/local/bin/gfortran-mp-9 -O3 -funroll-loops  -c -o src/mdout.o src/mdout.f
949:info:build /opt/local/bin/gfortran-mp-9 -O3 -funroll-loops  -c -o src/mmcnv.o src/mmcnv.f
950:info:build /opt/local/bin/gfortran-mp-9 -O3 -funroll-loops  -c -o src/mopaco.o src/mopaco.f
951:info:build /opt/local/bin/gfortran-mp-9 -O3 -funroll-loops  -c -o src/mopin.o src/mopin.f
952:info:build /opt/local/bin/gfortran-mp-9 -O3 -funroll-loops  -c -o src/mulprt.o src/mulprt.f
953:info:build /opt/local/bin/gfortran-mp-9 -O3 -funroll-loops  -c -o src/occin.o src/occin.f
954:info:build /opt/local/bin/gfortran-mp-9 -O3 -funroll-loops  -c -o src/oriin.o src/oriin.f
955:info:build /opt/local/bin/gfortran-mp-9 -O3 -funroll-loops  -c -o src/parang.o src/parang.f
956:info:build /opt/local/bin/gfortran-mp-9 -O3 -funroll-loops  -c -o src/pareul.o src/pareul.f
957:info:build /opt/local/bin/gfortran-mp-9 -O3 -funroll-loops  -c -o src/parfc.o src/parfc.f
958:info:build /opt/local/bin/gfortran-mp-9 -O3 -funroll-loops  -c -o src/parori.o src/parori.f
959:info:build /opt/local/bin/gfortran-mp-9 -O3 -funroll-loops  -c -o src/parpla.o src/parpla.f
960:info:build /opt/local/bin/gfortran-mp-9 -O3 -funroll-loops  -c -o src/parstp.o src/parstp.f
961:info:build src/parstp.f:30:72:
962:info:build    30 |   215        if(pmax*cut.lt.setval(i)) goto 216
963:info:build       |                                                                        1
964:info:build Warning: Fortran 2018 deleted feature: DO termination statement which is not END DO or CONTINUE with label 215 at (1)
965:info:build /opt/local/bin/gfortran-mp-9 -O3 -funroll-loops  -c -o src/planky.o src/planky.f
966:info:build /opt/local/bin/gfortran-mp-9 -O3 -funroll-loops  -c -o src/plend.o src/plend.f
967:info:build /opt/local/bin/gfortran-mp-9 -O3 -funroll-loops  -c -o src/plini.o src/plini.f
968:info:build /opt/local/bin/gfortran-mp-9 -O3 -funroll-loops  -c -o src/plmol.o src/plmol.f
969:info:build /opt/local/bin/gfortran-mp-9 -O3 -funroll-loops  -c -o src/plotgh.o src/plotgh.f
970:info:build /opt/local/bin/gfortran-mp-9 -O3 -funroll-loops  -c -o src/plotgr.o src/plotgr.f
971:info:build /opt/local/bin/gfortran-mp-9 -O3 -funroll-loops  -c -o src/plotin.o src/plotin.f
972:info:build /opt/local/bin/gfortran-mp-9 -O3 -funroll-loops  -c -o src/plpost.o src/plpost.f
973:info:build /opt/local/bin/gfortran-mp-9 -O3 -funroll-loops  -c -o src/prev.o src/prev.f
974:info:build /opt/local/bin/gfortran-mp-9 -O3 -funroll-loops  -c -o src/proato.o src/proato.f
975:info:build /opt/local/bin/gfortran-mp-9 -O3 -funroll-loops  -c -o src/procnv.o src/procnv.f
976:info:build /opt/local/bin/gfortran-mp-9 -O3 -funroll-loops  -c -o src/progeo.o src/progeo.f
977:info:build /opt/local/bin/gfortran-mp-9 -O3 -funroll-loops  -c -o src/rdbas.o src/rdbas.f
978:info:build /opt/local/bin/gfortran-mp-9 -O3 -funroll-loops  -c -o src/rdcor.o src/rdcor.f
979:info:build /opt/local/bin/gfortran-mp-9 -O3 -funroll-loops  -c -o src/rdgam.o src/rdgam.f
980:info:build /opt/local/bin/gfortran-mp-9 -O3 -funroll-loops  -c -o src/rdgaus.o src/rdgaus.f
981:info:build src/rdgaus.f:556:72:
982:info:build   556 |          call byter(buff(26),npts1)
983:info:build       |                                                                        1
984:info:build Warning: Type mismatch in argument 'intin' at (1); passed CHARACTER(1) to INTEGER(4) [-Wargument-mismatch]
985:info:build src/rdgaus.f:557:72:
986:info:build   557 |          call byter(buff(27),npts2)
987:info:build       |                                                                        1
988:info:build Warning: Type mismatch in argument 'intin' at (1); passed CHARACTER(1) to INTEGER(4) [-Wargument-mismatch]
989:info:build src/rdgaus.f:558:72:
990:info:build   558 |          call byter(buff(28),npts3)
991:info:build       |                                                                        1
992:info:build Warning: Type mismatch in argument 'intin' at (1); passed CHARACTER(1) to INTEGER(4) [-Wargument-mismatch]
993:info:build src/rdgaus.f:1741:72:
994:info:build  1741 |       call byter(buff(26),npts2)
995:info:build       |                                                                        1
996:info:build Warning: Type mismatch in argument 'intin' at (1); passed CHARACTER(1) to INTEGER(4) [-Wargument-mismatch]
997:info:build src/rdgaus.f:1742:72:
998:info:build  1742 |       call byter(buff(27),npts1)
999:info:build       |                                                                        1
1000:info:build Warning: Type mismatch in argument 'intin' at (1); passed CHARACTER(1) to INTEGER(4) [-Wargument-mismatch]
1001:info:build src/rdgaus.f:1743:72:
1002:info:build  1743 |       call byter(buff(28),npts3)
1003:info:build       |                                                                        1
1004:info:build Warning: Type mismatch in argument 'intin' at (1); passed CHARACTER(1) to INTEGER(4) [-Wargument-mismatch]
1005:info:build src/rdgaus.f:1747:72:
1006:info:build  1747 |       call byter(buff(29),ra)
1007:info:build       |                                                                        1
1008:info:build Warning: Type mismatch in argument 'intin' at (1); passed CHARACTER(1) to INTEGER(4) [-Wargument-mismatch]
1009:info:build src/rdgaus.f:1753:72:
1010:info:build  1753 |       call byter(buff(30),orig(2))
1011:info:build       |                                                                        1
1012:info:build Warning: Type mismatch in argument 'intin' at (1); passed CHARACTER(1) to INTEGER(4) [-Wargument-mismatch]
1013:info:build src/rdgaus.f:1754:72:
1014:info:build  1754 |       call byter(buff(31),orig(1))
1015:info:build       |                                                                        1
1016:info:build Warning: Type mismatch in argument 'intin' at (1); passed CHARACTER(1) to INTEGER(4) [-Wargument-mismatch]
1017:info:build src/rdgaus.f:1755:72:
1018:info:build  1755 |       call byter(buff(32),orig(3))
1019:info:build       |                                                                        1
1020:info:build Warning: Type mismatch in argument 'intin' at (1); passed CHARACTER(1) to INTEGER(4) [-Wargument-mismatch]
1021:info:build src/rdgaus.f:1812:72:
1022:info:build  1812 |          call byter(buff(1),nz)
1023:info:build       |                                                                        1
1024:info:build Warning: Type mismatch in argument 'intin' at (1); passed CHARACTER(1) to INTEGER(4) [-Wargument-mismatch]
1025:info:build src/rdgaus.f:1813:72:
1026:info:build  1813 |          call byter(buff(2),nx)
1027:info:build       |                                                                        1
1028:info:build Warning: Type mismatch in argument 'intin' at (1); passed CHARACTER(1) to INTEGER(4) [-Wargument-mismatch]
1029:info:build src/rdgaus.f:1814:72:
1030:info:build  1814 |          call byter(buff(3),ny)
1031:info:build       |                                                                        1
1032:info:build Warning: Type mismatch in argument 'intin' at (1); passed CHARACTER(1) to INTEGER(4) [-Wargument-mismatch]
1033:info:build src/rdgaus.f:1824:72:
1034:info:build  1824 |                call byter(buff(ij),den)
1035:info:build       |                                                                        1
1036:info:build Warning: Type mismatch in argument 'intin' at (1); passed CHARACTER(1) to INTEGER(4) [-Wargument-mismatch]
1037:info:build /opt/local/bin/gfortran-mp-9 -O3 -funroll-loops  -c -o src/rdinfo.o src/rdinfo.f
1038:info:build /opt/local/bin/gfortran-mp-9 -O3 -funroll-loops  -c -o src/rdpdb.o src/rdpdb.f
1039:info:build /opt/local/bin/gfortran-mp-9 -O3 -funroll-loops  -c -o src/rdvect.o src/rdvect.f
1040:info:build /opt/local/bin/gfortran-mp-9 -O3 -funroll-loops  -c -o src/reada.o src/reada.f
1041:info:build /opt/local/bin/gfortran-mp-9 -O3 -funroll-loops  -c -o src/readel.o src/readel.f
1042:info:build /opt/local/bin/gfortran-mp-9 -O3 -funroll-loops  -c -o src/readvv.o src/readvv.f
1043:info:build /opt/local/bin/gfortran-mp-9 -O3 -funroll-loops  -c -o src/renorm.o src/renorm.f
1044:info:build /opt/local/bin/gfortran-mp-9 -O3 -funroll-loops  -c -o src/rmomen.o src/rmomen.f
1045:info:build /opt/local/bin/gfortran-mp-9 -O3 -funroll-loops  -c -o src/rota.o src/rota.f
1046:info:build /opt/local/bin/gfortran-mp-9 -O3 -funroll-loops  -c -o src/rotatg.o src/rotatg.f
1047:info:build /opt/local/bin/gfortran-mp-9 -O3 -funroll-loops  -c -o src/rotb.o src/rotb.f
1048:info:build /opt/local/bin/gfortran-mp-9 -O3 -funroll-loops  -c -o src/rotc.o src/rotc.f
1049:info:build /opt/local/bin/gfortran-mp-9 -O3 -funroll-loops  -c -o src/rotcor.o src/rotcor.f
1050:info:build /opt/local/bin/gfortran-mp-9 -O3 -funroll-loops  -c -o src/rotd.o src/rotd.f
1051:info:build /opt/local/bin/gfortran-mp-9 -O3 -funroll-loops  -c -o src/rotfir.o src/rotfir.f
1052:info:build /opt/local/bin/gfortran-mp-9 -O3 -funroll-loops  -c -o src/rotm.o src/rotm.f
1053:info:build /opt/local/bin/gfortran-mp-9 -O3 -funroll-loops  -c -o src/rotmom.o src/rotmom.f
1054:info:build /opt/local/bin/gfortran-mp-9 -O3 -funroll-loops  -c -o src/scback.o src/scback.f
1055:info:build /opt/local/bin/gfortran-mp-9 -O3 -funroll-loops  -c -o src/search.o src/search.f
1056:info:build /opt/local/bin/gfortran-mp-9 -O3 -funroll-loops  -c -o src/searchd.o src/searchd.f
1057:info:build /opt/local/bin/gfortran-mp-9 -O3 -funroll-loops  -c -o src/setang.o src/setang.f
1058:info:build /opt/local/bin/gfortran-mp-9 -O3 -funroll-loops  -c -o src/setbas.o src/setbas.f
1059:info:build /opt/local/bin/gfortran-mp-9 -O3 -funroll-loops  -c -o src/settc.o src/settc.f
1060:info:build /opt/local/bin/gfortran-mp-9 -O3 -funroll-loops  -c -o src/shsort.o src/shsort.f
1061:info:build /opt/local/bin/gfortran-mp-9 -O3 -funroll-loops  -c -o src/site.o src/site.f
1062:info:build /opt/local/bin/gfortran-mp-9 -O3 -funroll-loops  -c -o src/slater.o src/slater.f
1063:info:build /opt/local/bin/gfortran-mp-9 -O3 -funroll-loops  -c -o src/stoc.o src/stoc.f
1064:info:build /opt/local/bin/gfortran-mp-9 -O3 -funroll-loops  -c -o src/tessa.o src/tessa.f
1065:info:build /opt/local/bin/gfortran-mp-9 -O3 -funroll-loops  -c -o src/tk4014.o src/tk4014.f
1066:info:build /opt/local/bin/gfortran-mp-9 -O3 -funroll-loops  -c -o src/tocap.o src/tocap.f
1067:info:build /opt/local/bin/gfortran-mp-9 -O3 -funroll-loops  -c -o src/tocapf.o src/tocapf.f
1068:info:build /opt/local/bin/gfortran-mp-9 -O3 -funroll-loops  -c -o src/tomold.o src/tomold.f
1069:info:build /opt/local/bin/gfortran-mp-9 -O3 -funroll-loops  -c -o src/under.o src/under.f
1070:info:build /opt/local/bin/gfortran-mp-9 -O3 -funroll-loops  -c -o src/vaxdum.o src/vaxdum.f
1071:info:build /opt/local/bin/gfortran-mp-9 -O3 -funroll-loops  -c -o src/vclr.o src/vclr.f
1072:info:build /opt/local/bin/gfortran-mp-9 -O3 -funroll-loops  -c -o src/vec.o src/vec.f
1073:info:build /opt/local/bin/gfortran-mp-9 -O3 -funroll-loops  -c -o src/vlen.o src/vlen.f
1074:info:build /opt/local/bin/gfortran-mp-9 -O3 -funroll-loops  -c -o src/vsc1.o src/vsc1.f
1075:info:build /opt/local/bin/gfortran-mp-9 -O3 -funroll-loops  -c -o src/wrinfo.o src/wrinfo.f
1076:info:build /opt/local/bin/gfortran-mp-9 -O3 -funroll-loops  -c -o src/zread.o src/zread.f
1077:info:build /opt/local/bin/gfortran-mp-9 -O3 -funroll-loops  -c -o src/samino.o src/samino.f
1078:info:build /opt/local/bin/gfortran-mp-9 -O3 -funroll-loops  -c -o src/prtcal.o src/prtcal.f
1079:info:build /opt/local/bin/gfortran-mp-9 -O3 -funroll-loops  -c -o src/actss.o src/actss.f
1080:info:build /opt/local/bin/gfortran-mp-9 -O3 -funroll-loops  -c -o src/actami.o src/actami.f
1081:info:build /opt/local/bin/gfortran-mp-9 -O3 -funroll-loops  -c -o src/plden.o src/plden.f
1082:info:build /opt/local/bin/gfortran-mp-9 -O3 -funroll-loops  -c -o src/heaps.o src/heaps.f
1083:info:build /opt/local/bin/gfortran-mp-9 -O3 -funroll-loops  -c -o src/den3d.o src/den3d.f
1084:info:build /opt/local/bin/gfortran-mp-9 -O3 -funroll-loops  -c -o src/dencnt.o src/dencnt.f
1085:info:build /opt/local/bin/gfortran-mp-9 -O3 -funroll-loops  -c -o src/plhead.o src/plhead.f
1086:info:build /opt/local/bin/gfortran-mp-9 -O3 -funroll-loops  -c -o src/pltab.o src/pltab.f
1087:info:build /opt/local/bin/gfortran-mp-9 -O3 -funroll-loops  -c -o src/eucmol.o src/eucmol.f
1088:info:build /opt/local/bin/gfortran-mp-9 -O3 -funroll-loops  -c -o src/pl3dm.o src/pl3dm.f
1089:info:build /opt/local/bin/gfortran-mp-9 -O3 -funroll-loops  -c -o src/plbox.o src/plbox.f
1090:info:build /opt/local/bin/gfortran-mp-9 -O3 -funroll-loops  -c -o src/selsol.o src/selsol.f
1091:info:build /opt/local/bin/gfortran-mp-9 -O3 -funroll-loops  -c -o src/atmd.o src/atmd.f
1092:info:build /opt/local/bin/gfortran-mp-9 -O3 -funroll-loops  -c -o src/dolift.o src/dolift.f
1093:info:build /opt/local/bin/gfortran-mp-9 -O3 -funroll-loops  -c -o src/spaced.o src/spaced.f
1094:info:build /opt/local/bin/gfortran-mp-9 -O3 -funroll-loops  -c -o src/snypnt.o src/snypnt.f
1095:info:build /opt/local/bin/gfortran-mp-9 -O3 -funroll-loops  -c -o src/eulstr.o src/eulstr.f
1096:info:build /opt/local/bin/gfortran-mp-9 -O3 -funroll-loops  -c -o src/calct.o src/calct.f
1097:info:build /opt/local/bin/gfortran-mp-9 -O3 -funroll-loops  -c -o src/coeffs.o src/coeffs.f
1098:info:build /opt/local/bin/gfortran-mp-9 -O3 -funroll-loops  -c -o src/epint.o src/epint.f
1099:info:build /opt/local/bin/gfortran-mp-9 -O3 -funroll-loops  -c -o src/espot.o src/espot.f
1100:info:build /opt/local/bin/gfortran-mp-9 -O3 -funroll-loops  -c -o src/fcij.o src/fcij.f
1101:info:build /opt/local/bin/gfortran-mp-9 -O3 -funroll-loops  -c -o src/fmt.o src/fmt.f
1102:info:build /opt/local/bin/gfortran-mp-9 -O3 -funroll-loops  -c -o src/genaos.o src/genaos.f
1103:info:build /opt/local/bin/gfortran-mp-9 -O3 -funroll-loops  -c -o src/rys.o src/rys.f
1104:info:build /opt/local/bin/gfortran-mp-9 -O3 -funroll-loops  -c -o src/ryspol.o src/ryspol.f
1105:info:build /opt/local/bin/gfortran-mp-9 -O3 -funroll-loops  -c -o src/rysrot.o src/rysrot.f
1106:info:build /opt/local/bin/gfortran-mp-9 -O3 -funroll-loops  -c -o src/thrcen.o src/thrcen.f
1107:info:build /opt/local/bin/gfortran-mp-9 -O3 -funroll-loops  -c -o src/twocen.o src/twocen.f
1108:info:build /opt/local/bin/gfortran-mp-9 -O3 -funroll-loops  -c -o src/ifblen.o src/ifblen.f
1109:info:build /opt/local/bin/gfortran-mp-9 -O3 -funroll-loops  -c -o src/rott.o src/rott.f
1110:info:build /opt/local/bin/gfortran-mp-9 -O3 -funroll-loops  -c -o src/plmolp.o src/plmolp.f
1111:info:build /opt/local/bin/gfortran-mp-9 -O3 -funroll-loops  -c -o src/wrzmat.o src/wrzmat.f
1112:info:build /opt/local/bin/gfortran-mp-9 -O3 -funroll-loops  -c -o src/rdchx.o src/rdchx.f
1113:info:build /opt/local/bin/gfortran-mp-9 -O3 -funroll-loops  -c -o src/obin.o src/obin.f
1114:info:build /opt/local/bin/gfortran-mp-9 -O3 -funroll-loops  -c -o src/pred.o src/pred.f
1115:info:build /opt/local/bin/gfortran-mp-9 -O3 -funroll-loops  -c -o src/gargpl.o src/gargpl.f
1116:info:build /opt/local/bin/gfortran-mp-9 -O3 -funroll-loops  -c -o src/inferr.o src/inferr.f
1117:info:build /opt/local/bin/gfortran-mp-9 -O3 -funroll-loops  -c -o src/freqs.o src/freqs.f
1118:info:build /opt/local/bin/gfortran-mp-9 -O3 -funroll-loops  -c -o src/getmop.o src/getmop.f
1119:info:build /opt/local/bin/gfortran-mp-9 -O3 -funroll-loops  -c -o src/brklin.o src/brklin.f
1120:info:build /opt/local/bin/gfortran-mp-9 -O3 -funroll-loops  -c -o src/getzm.o src/getzm.f
1121:info:build /opt/local/bin/gfortran-mp-9 -O3 -funroll-loops  -c -o src/xyzcoo.o src/xyzcoo.f
1122:info:build /opt/local/bin/gfortran-mp-9 -O3 -funroll-loops  -c -o src/geomop.o src/geomop.f
1123:info:build /opt/local/bin/gfortran-mp-9 -O3 -funroll-loops  -c -o src/dumzm.o src/dumzm.f
1124:info:build /opt/local/bin/gfortran-mp-9 -O3 -funroll-loops  -c -o src/getxyz.o src/getxyz.f
1125:info:build /opt/local/bin/gfortran-mp-9 -O3 -funroll-loops  -c -o src/espchrg.o src/espchrg.f
1126:info:build /opt/local/bin/gfortran-mp-9 -O3 -funroll-loops  -c -o src/proxim.o src/proxim.f
1127:info:build /opt/local/bin/gfortran-mp-9 -O3 -funroll-loops  -c -o src/rdgamu.o src/rdgamu.f
1128:info:build /opt/local/bin/gfortran-mp-9 -O3 -funroll-loops  -c -o src/plvrml.o src/plvrml.f
1129:info:build /opt/local/bin/gfortran-mp-9 -O3 -funroll-loops  -c -o src/molsint.o src/molsint.f
1130:info:build /opt/local/bin/gfortran-mp-9 -O3 -funroll-loops  -c -o src/runjob.o src/runjob.f
1131:info:build /opt/local/bin/gfortran-mp-9 -O3 -funroll-loops  -c -o src/rdmsf.o src/rdmsf.f
1132:info:build /opt/local/bin/gfortran-mp-9 -O3 -funroll-loops  -c -o src/wrmsf.o src/wrmsf.f
1133:info:build /opt/local/bin/gfortran-mp-9 -O3 -funroll-loops  -c -o src/rdmolf.o src/rdmolf.f
1134:info:build /opt/local/bin/gfortran-mp-9 -O3 -funroll-loops  -c -o src/adf_fun.o src/adf_fun.f
1135:info:build /opt/local/bin/gfortran-mp-9 -O3 -funroll-loops  -c -o src/rotpol.o src/rotpol.f
1136:info:build /opt/local/bin/gfortran-mp-9 -O3 -funroll-loops  -c -o src/extbas.o src/extbas.f
1137:info:build /opt/local/bin/gfortran-mp-9 -O3 -funroll-loops  -c -o src/rdcpmd.o src/rdcpmd.f
1138:info:build /opt/local/bin/gfortran-mp-9 -O3 -funroll-loops  -c -o src/eem.o src/eem.f
1139:info:build src/eem.f:825:72:
1140:info:build   825 |       assign 30 to next
1141:info:build       |                                                                        1
1142:info:build Warning: Deleted feature: ASSIGN statement at (1)
1143:info:build src/eem.f:830:19:
1144:info:build   830 |    20    go to next,(30, 50, 70, 110)
1145:info:build       |                   1
1146:info:build Warning: Deleted feature: Assigned GOTO statement at (1)
1147:info:build src/eem.f:832:72:
1148:info:build   832 |       assign 50 to next
1149:info:build       |                                                                        1
1150:info:build Warning: Deleted feature: ASSIGN statement at (1)
1151:info:build src/eem.f:841:72:
1152:info:build   841 |       assign 70 to next
1153:info:build       |                                                                        1
1154:info:build Warning: Deleted feature: ASSIGN statement at (1)
1155:info:build src/eem.f:847:72:
1156:info:build   847 |       assign 110 to next
1157:info:build       |                                                                        1
1158:info:build Warning: Deleted feature: ASSIGN statement at (1)
1159:info:build src/eem.f:883:72:
1160:info:build   883 |    95    sum = sum + dx(j)**2
1161:info:build       |                                                                        1
1162:info:build Warning: Fortran 2018 deleted feature: DO termination statement which is not END DO or CONTINUE with label 95 at (1)
1163:info:build /opt/local/bin/gfortran-mp-9 -O3 -funroll-loops  -c -o src/asspmf.o src/asspmf.f
1164:info:build /opt/local/bin/gfortran-mp-9 -O3 -funroll-loops  -c -o src/srfcal.o src/srfcal.f
1165:info:build /opt/local/bin/gfortran-mp-9 -O3 -funroll-loops  -c -o src/rdqchm.o src/rdqchm.f
1166:info:build /opt/local/bin/gfortran-mp-9 -O3 -funroll-loops  -c -o src/rdorca.o src/rdorca.f
1167:info:build /opt/local/bin/gfortran-mp-9 -O3 -funroll-loops  -c -o src/rdmaux.o src/rdmaux.f
1168:info:build /opt/local/bin/gfortran-mp-9 -O3 -funroll-loops  -c -o src/rdnwch.o src/rdnwch.f
1169:info:build /opt/local/bin/gfortran-mp-9 -O3 -funroll-loops  -c -o src/mpdum.o src/mpdum.f
1170:info:build /usr/bin/clang -g -std=gnu89 -Wno-return-type -DDARWIN -I/opt/local/include -DDOBACK -DHASTIMER -DCOLOR_OFFSET=0.0 -Wno-logical-op-parentheses -Wno-implicit-function-declaration -Wno-tautological-pointer-compare -Wno-tautological-constant-out-of-range-compare   -c -o src/xwin.o src/xwin.c
1171:info:build /opt/local/bin/gfortran-mp-9 -o molden src/atomdens.o src/molden.o src/above.o src/actcal.o src/basprt.o src/calc.o src/caldis.o src/calfa.o src/cntour.o src/cnvgam.o src/cnvgau.o src/convzmat.o src/cross.o src/crprod.o src/datin.o src/defpc.o src/defrad.o src/del.o src/denmak.o src/densmat.o src/distot.o src/dmat.o src/docent.o src/draw.o src/euler.o src/eulerh.o src/files.o src/fndcal.o src/gampoi.o src/gaupoi.o src/gaussian.o src/geogam.o src/geogau.o src/getmul.o src/getpoi.o src/getreal.o src/gmmcnv.o src/grdcal.o src/gstr.o src/hidedr.o src/impsc.o src/locatc.o src/maxmin.o src/mdout.o src/mmcnv.o src/mopaco.o src/mopin.o src/mulprt.o src/occin.o src/oriin.o src/parang.o src/pareul.o src/parfc.o src/parori.o src/parpla.o src/parstp.o src/planky.o src/plend.o src/plini.o src/plmol.o src/plotgh.o src/plotgr.o src/plotin.o src/plpost.o src/prev.o src/proato.o src/procnv.o src/progeo.o src/rdbas.o src/rdcor.o src/rdgam.o src/rdgaus.o src/rdinfo.o src/rdpdb.o src/rdvect.o src/reada.o src/readel.o src/readvv.o src/renorm.o src/rmomen.o src/rota.o src/rotatg.o src/rotb.o src/rotc.o src/rotcor.o src/rotd.o src/rotfir.o src/rotm.o src/rotmom.o src/scback.o src/search.o src/searchd.o src/setang.o src/setbas.o src/settc.o src/shsort.o src/site.o src/slater.o src/stoc.o src/tessa.o src/tk4014.o src/tocap.o src/tocapf.o src/tomold.o src/under.o src/vaxdum.o src/vclr.o src/vec.o src/vlen.o src/vsc1.o src/wrinfo.o src/zread.o src/samino.o src/prtcal.o src/actss.o src/actami.o src/plden.o src/heaps.o src/den3d.o src/dencnt.o src/plhead.o src/pltab.o src/eucmol.o src/pl3dm.o src/plbox.o src/selsol.o src/atmd.o src/dolift.o src/spaced.o src/snypnt.o src/eulstr.o src/calct.o src/coeffs.o src/epint.o src/espot.o src/fcij.o src/fmt.o src/genaos.o src/rys.o src/ryspol.o src/rysrot.o src/thrcen.o src/twocen.o src/ifblen.o src/rott.o src/plmolp.o src/wrzmat.o src/rdchx.o src/obin.o src/pred.o src/gargpl.o src/inferr.o src/freqs.o src/getmop.o src/brklin.o src/getzm.o src/xyzcoo.o src/geomop.o src/dumzm.o src/getxyz.o src/espchrg.o src/proxim.o src/rdgamu.o src/plvrml.o src/molsint.o src/runjob.o src/rdmsf.o src/wrmsf.o src/rdmolf.o src/adf_fun.o src/rotpol.o src/extbas.o src/rdcpmd.o src/eem.o src/asspmf.o src/srfcal.o src/rdqchm.o src/rdorca.o src/rdmaux.o src/rdnwch.o src/mpdum.o src/xwin.o -L/opt/local/lib -lX11 -lm
1172:info:build mv molden bin/molden
1173:info:build /usr/bin/clang -g -std=gnu89 -Wno-return-type -DDARWIN -I/opt/local/include -DDOBACK -DHASTIMER -DCOLOR_OFFSET=0.0 -Wno-logical-op-parentheses -Wno-implicit-function-declaration -Wno-tautological-pointer-compare -Wno-tautological-constant-out-of-range-compare -DDOGL -c src/xwin.c -o src/xwingl.o
1174:info:build src/xwin.c:5707:24: warning: cast to 'GLhandleARB' (aka 'void *') from smaller integer type 'GLenum' (aka 'unsigned int') [-Wint-to-void-pointer-cast]
1175:info:build         status = printInfoLog((GLhandleARB) fragment_shader[prg]);
1176:info:build                               ^
1177:info:build src/xwin.c:5710:24: warning: cast to 'GLhandleARB' (aka 'void *') from smaller integer type 'GLenum' (aka 'unsigned int') [-Wint-to-void-pointer-cast]
1178:info:build         status = printInfoLog((GLhandleARB) vertex_shader[prg]);
1179:info:build                               ^
1180:info:build src/xwin.c:5715:27: warning: cast to 'GLhandleARB' (aka 'void *') from smaller integer type 'GLenum' (aka 'unsigned int') [-Wint-to-void-pointer-cast]
1181:info:build            status = printInfoLog((GLhandleARB) vertex_shader[prg]);
1182:info:build                                  ^
1183:info:build 3 warnings generated.
1184:info:build /opt/local/bin/gfortran-mp-9 -fno-builtin -o gmolden src/atomdens.o src/molden.o src/above.o src/actcal.o src/basprt.o src/calc.o src/caldis.o src/calfa.o src/cntour.o src/cnvgam.o src/cnvgau.o src/convzmat.o src/cross.o src/crprod.o src/datin.o src/defpc.o src/defrad.o src/del.o src/denmak.o src/densmat.o src/distot.o src/dmat.o src/docent.o src/draw.o src/euler.o src/eulerh.o src/files.o src/fndcal.o src/gampoi.o src/gaupoi.o src/gaussian.o src/geogam.o src/geogau.o src/getmul.o src/getpoi.o src/getreal.o src/gmmcnv.o src/grdcal.o src/gstr.o src/hidedr.o src/impsc.o src/locatc.o src/maxmin.o src/mdout.o src/mmcnv.o src/mopaco.o src/mopin.o src/mulprt.o src/occin.o src/oriin.o src/parang.o src/pareul.o src/parfc.o src/parori.o src/parpla.o src/parstp.o src/planky.o src/plend.o src/plini.o src/plmol.o src/plotgh.o src/plotgr.o src/plotin.o src/plpost.o src/prev.o src/proato.o src/procnv.o src/progeo.o src/rdbas.o src/rdcor.o src/rdgam.o src/rdgaus.o src/rdinfo.o src/rdpdb.o src/rdvect.o src/reada.o src/readel.o src/readvv.o src/renorm.o src/rmomen.o src/rota.o src/rotatg.o src/rotb.o src/rotc.o src/rotcor.o src/rotd.o src/rotfir.o src/rotm.o src/rotmom.o src/scback.o src/search.o src/searchd.o src/setang.o src/setbas.o src/settc.o src/shsort.o src/site.o src/slater.o src/stoc.o src/tessa.o src/tk4014.o src/tocap.o src/tocapf.o src/tomold.o src/under.o src/vaxdum.o src/vclr.o src/vec.o src/vlen.o src/vsc1.o src/wrinfo.o src/zread.o src/samino.o src/prtcal.o src/actss.o src/actami.o src/plden.o src/heaps.o src/den3d.o src/dencnt.o src/plhead.o src/pltab.o src/eucmol.o src/pl3dm.o src/plbox.o src/selsol.o src/atmd.o src/dolift.o src/spaced.o src/snypnt.o src/eulstr.o src/calct.o src/coeffs.o src/epint.o src/espot.o src/fcij.o src/fmt.o src/genaos.o src/rys.o src/ryspol.o src/rysrot.o src/thrcen.o src/twocen.o src/ifblen.o src/rott.o src/plmolp.o src/wrzmat.o src/rdchx.o src/obin.o src/pred.o src/gargpl.o src/inferr.o src/freqs.o src/getmop.o src/brklin.o src/getzm.o src/xyzcoo.o src/geomop.o src/dumzm.o src/getxyz.o src/espchrg.o src/proxim.o src/rdgamu.o src/plvrml.o src/molsint.o src/runjob.o src/rdmsf.o src/wrmsf.o src/rdmolf.o src/adf_fun.o src/rotpol.o src/extbas.o src/rdcpmd.o src/eem.o src/asspmf.o src/srfcal.o src/rdqchm.o src/rdorca.o src/rdmaux.o src/rdnwch.o src/mpdum.o src/xwingl.o -L/opt/local/lib -lGLU "-Wl,-dylib_file,/System/Library/Frameworks/OpenGL.framework/Versions/A/Libraries/libGL.dylib:/System/Library/Frameworks/OpenGL.framework/Versions/A/Libraries/libGL.dylib" -lGL -lXmu -lX11 -lm
1185:info:build mv gmolden bin/gmolden
1186:info:build /opt/local/bin/gmake -C src/ambfor FC=/opt/local/bin/gfortran-mp-9 LDR="/opt/local/bin/gfortran-mp-9" EXT="-std=gnu89 -Wno-return-type -DDARWIN "
1187:info:build gmake[1]: Entering directory '/opt/local/var/macports/build/_opt_local_var_macports_sources_rsync.macports.org_macports_release_tarballs_ports_science_molden/molden/work/molden6.7/src/ambfor'
1188:info:build /opt/local/bin/gfortran-mp-9 -c -g -ffast-math -funroll-loops -o ambfor.o ambfor.f
1189:info:build /opt/local/bin/gfortran-mp-9 -c -g -ffast-math -funroll-loops -O3  -c -o qvdw.o qvdw.f
1190:info:build /usr/bin/clang -c -g -std=gnu89 -Wno-return-type -DDARWIN  -Wno-implicit-function-declaration -c alloc.c -o alloc.o
1191:info:build /opt/local/bin/gfortran-mp-9 -c -g -ffast-math -funroll-loops -O3  -c -o optimise.o optimise.f
1192:info:build /opt/local/bin/gfortran-mp-9 -c -g -ffast-math -funroll-loops -O3  -c -o lbfgs.o lbfgs.f
1193:info:build /opt/local/bin/gfortran-mp-9 -c -g -ffast-math -funroll-loops -O3  -c -o angle.o angle.f
1194:info:build /opt/local/bin/gfortran-mp-9 -c -g -ffast-math -funroll-loops -O3  -c -o bond.o bond.f
1195:info:build /opt/local/bin/gfortran-mp-9 -c -g -ffast-math -funroll-loops -O3  -c -o charge.o charge.f
1196:info:build /opt/local/bin/gfortran-mp-9 -c -g -ffast-math -funroll-loops -O3  -c -o conn.o conn.f
1197:info:build /opt/local/bin/gfortran-mp-9 -c -g -ffast-math -funroll-loops -O3  -c -o enegrd.o enegrd.f
1198:info:build /opt/local/bin/gfortran-mp-9 -c -g -ffast-math -funroll-loops -O3  -c -o getinp.o getinp.f
1199:info:build /opt/local/bin/gfortran-mp-9 -c -g -ffast-math -funroll-loops -O3  -c -o param.o param.f
1200:info:build /opt/local/bin/gfortran-mp-9 -c -g -ffast-math -funroll-loops -O3  -c -o tors.o tors.f
1201:info:build /opt/local/bin/gfortran-mp-9 -c -g -ffast-math -funroll-loops -O3  -c -o vdwlj.o vdwlj.f
1202:info:build /opt/local/bin/gfortran-mp-9 -c -g -ffast-math -funroll-loops -O3  -c -o math.o math.f
1203:info:build /opt/local/bin/gfortran-mp-9 -c -g -ffast-math -funroll-loops -O3  -c -o switch.o switch.f
1204:info:build /opt/local/bin/gfortran-mp-9 -c -g -ffast-math -funroll-loops -O3  -c -o wrtout.o wrtout.f
1205:info:build /opt/local/bin/gfortran-mp-9 -c -g -ffast-math -funroll-loops -O3  -c -o pbc.o pbc.f
1206:info:build /opt/local/bin/gfortran-mp-9 -c -g -ffast-math -funroll-loops -O3  -c -o bsolv.o bsolv.f
1207:info:build /opt/local/bin/gfortran-mp-9 -o ambfor ambfor.o qvdw.o alloc.o optimise.o lbfgs.o angle.o bond.o charge.o conn.o enegrd.o getinp.o param.o tors.o vdwlj.o math.o switch.o wrtout.o pbc.o bsolv.o -lm
1208:info:build /opt/local/bin/gfortran-mp-9 -c -g -ffast-math -funroll-loops -O3  -c -o md.o md.f
1209:info:build /opt/local/bin/gfortran-mp-9 -c -g -ffast-math -funroll-loops -O3  -c -o verlet.o verlet.f
1210:info:build /usr/bin/clang -c -g -std=gnu89 -Wno-return-type -DDARWIN  -Wno-implicit-function-declaration -DMD -c alloc.c -o allocmd.o
1211:info:build /opt/local/bin/gfortran-mp-9 -o ambmd md.o verlet.o qvdw.o allocmd.o angle.o bond.o charge.o conn.o enegrd.o getinp.o param.o tors.o vdwlj.o math.o switch.o wrtout.o pbc.o bsolv.o -lm
1212:info:build gmake[1]: Leaving directory '/opt/local/var/macports/build/_opt_local_var_macports_sources_rsync.macports.org_macports_release_tarballs_ports_science_molden/molden/work/molden6.7/src/ambfor'
1213:info:build mv src/ambfor/ambfor bin/ambfor
1214:info:build /opt/local/bin/gmake -C src/ambfor ambmd FC=/opt/local/bin/gfortran-mp-9 LDR="/opt/local/bin/gfortran-mp-9" EXT="-std=gnu89 -Wno-return-type -DDARWIN "
1215:info:build gmake[1]: Entering directory '/opt/local/var/macports/build/_opt_local_var_macports_sources_rsync.macports.org_macports_release_tarballs_ports_science_molden/molden/work/molden6.7/src/ambfor'
1216:info:build gmake[1]: 'ambmd' is up to date.
1217:info:build gmake[1]: Leaving directory '/opt/local/var/macports/build/_opt_local_var_macports_sources_rsync.macports.org_macports_release_tarballs_ports_science_molden/molden/work/molden6.7/src/ambfor'
1218:info:build mv src/ambfor/ambmd bin/ambmd
1219:info:build /opt/local/bin/gmake -C src/surf depend
1220:info:build gmake[1]: Entering directory '/opt/local/var/macports/build/_opt_local_var_macports_sources_rsync.macports.org_macports_release_tarballs_ports_science_molden/molden/work/molden6.7/src/surf'
1221:info:build making dependencies...
1222:info:build makedepend: warning:  surf.c (reading surf.h, line 1): cannot find include file "stdio.h"
1223:info:build     not in ./stdio.h
1224:info:build     not in /usr/include/stdio.h
1225:info:build makedepend: warning:  surf.c (reading surf.h, line 2): cannot find include file "math.h"
1226:info:build     not in ./math.h
1227:info:build     not in /usr/include/math.h
1228:info:build makedepend: warning:  surf.c (reading surf.h, line 3): cannot find include file "stdlib.h"
1229:info:build     not in ./stdlib.h
1230:info:build     not in /usr/include/stdlib.h
1231:info:build makedepend: warning:  surf.c (reading surf.h, line 4): cannot find include file "string.h"
1232:info:build     not in ./string.h
1233:info:build     not in /usr/include/string.h
1234:info:build makedepend: warning:  surf.c (reading surf.h, line 5): cannot find include file "sys/time.h"
1235:info:build     not in ./sys/time.h
1236:info:build     not in /usr/include/sys/time.h
1237:info:build makedepend: warning:  compute.c (reading chull.h, line 8): cannot find include file "stdio.h"
1238:info:build     not in ./stdio.h
1239:info:build     not in /usr/include/stdio.h
1240:info:build makedepend: warning:  compute.c (reading chull.h, line 9): cannot find include file "math.h"
1241:info:build     not in ./math.h
1242:info:build     not in /usr/include/math.h
1243:info:build makedepend: warning:  compute.c (reading chull.h, line 10): cannot find include file "string.h"
1244:info:build     not in ./string.h
1245:info:build     not in /usr/include/string.h
1246:info:build makedepend: warning:  compute.c (reading chull.h, line 11): cannot find include file "stdlib.h"
1247:info:build     not in ./stdlib.h
1248:info:build     not in /usr/include/stdlib.h
1249:info:build done.
1250:info:build gmake[1]: Leaving directory '/opt/local/var/macports/build/_opt_local_var_macports_sources_rsync.macports.org_macports_release_tarballs_ports_science_molden/molden/work/molden6.7/src/surf'
1251:info:build /opt/local/bin/gmake -C src/surf EXT="-std=gnu89 -Wno-return-type -DDARWIN "
1252:info:build gmake[1]: Entering directory '/opt/local/var/macports/build/_opt_local_var_macports_sources_rsync.macports.org_macports_release_tarballs_ports_science_molden/molden/work/molden6.7/src/surf'
1253:info:build /usr/bin/clang -Wno-implicit-int -O2  -I.  -std=gnu89 -Wno-return-type -DDARWIN  -c surf.c
1254:info:build surf.c:10:1: warning: return type of 'main' is not 'int' [-Wmain-return-type]
1255:info:build void
1256:info:build ^
1257:info:build surf.c:10:1: note: change return type to 'int'
1258:info:build void
1259:info:build ^~~~
1260:info:build int
1261:info:build surf.c:25:4: error: implicit declaration of function 'deal_wif_options' [-Werror,-Wimplicit-function-declaration]
1262:info:build    deal_wif_options(ac,av, filename);  /* set the filename */
1263:info:build    ^
1264:info:build surf.c:35:4: error: implicit declaration of function 'input_dataset' [-Werror,-Wimplicit-function-declaration]
1265:info:build    input_dataset(filename);
1266:info:build    ^
1267:info:build surf.c:38:6: error: implicit declaration of function 'begin_output_dataset' [-Werror,-Wimplicit-function-declaration]
1268:info:build      begin_output_dataset(outfile);
1269:info:build      ^
1270:info:build surf.c:46:4: error: implicit declaration of function 'init_and_compute' [-Werror,-Wimplicit-function-declaration]
1271:info:build    init_and_compute();
1272:info:build    ^
1273:info:build surf.c:56:27: error: implicit declaration of function 'output_dataset' [-Werror,-Wimplicit-function-declaration]
1274:info:build    if (Write_Option == 2) output_dataset();
1275:info:build                           ^
1276:info:build surf.c:56:27: note: did you mean 'input_dataset'?
1277:info:build surf.c:35:4: note: 'input_dataset' declared here
1278:info:build    input_dataset(filename);
1279:info:build    ^
1280:info:build surf.c:58:22: error: implicit declaration of function 'end_output_dataset' [-Werror,-Wimplicit-function-declaration]
1281:info:build    if (Write_Option) end_output_dataset();
1282:info:build                      ^
1283:info:build 1 warning and 6 errors generated.
1284:info:build gmake[1]: *** [Makefile:41: surf.o] Error 1
1285:info:build gmake[1]: Leaving directory '/opt/local/var/macports/build/_opt_local_var_macports_sources_rsync.macports.org_macports_release_tarballs_ports_science_molden/molden/work/molden6.7/src/surf'
1286:info:build gmake: *** [makefile:298: surf/surf] Error 2
1287:info:build gmake: Leaving directory '/opt/local/var/macports/build/_opt_local_var_macports_sources_rsync.macports.org_macports_release_tarballs_ports_science_molden/molden/work/molden6.7'
1288:info:build Command failed:  cd "/opt/local/var/macports/build/_opt_local_var_macports_sources_rsync.macports.org_macports_release_tarballs_ports_science_molden/molden/work/molden6.7" && /opt/local/bin/gmake -w all CC=/usr/bin/clang FC=/opt/local/bin/gfortran-mp-9 PREFIX=/opt/local
1289:info:build Exit code: 2
1290:error:build Failed to build molden: command execution failed
1291:debug:build Error code: CHILDSTATUS 32988 2
1292:debug:build Backtrace: command execution failed
1293:debug:build     while executing
1294:debug:build "system {*}$notty {*}$nice $fullcmdstring"
1295:debug:build     invoked from within
1296:debug:build "command_exec build"
1297:debug:build     (procedure "portbuild::build_main" line 8)
1298:debug:build     invoked from within
1299:debug:build "$procedure $targetname"
1300:error:build See /opt/local/var/macports/logs/_opt_local_var_macports_sources_rsync.macports.org_macports_release_tarballs_ports_science_molden/molden/main.log for details.