Ticket #61635: main.log

File main.log, 20.1 KB (added by leuliett (Eric Leuliette), 3 months ago)

calc/main.log

Line 
1version:1
2:debug:sysinfo macOS 11.0 (darwin/20.1.0) arch i386
3:debug:sysinfo MacPorts 2.6.4
4:debug:sysinfo Xcode none
5:debug:sysinfo SDK 11.0
6:debug:sysinfo MACOSX_DEPLOYMENT_TARGET: 11.0
7:debug:main Executing org.macports.main (calc)
8:debug:main dropping privileges: euid changed to 502, egid changed to 501.
9:debug:archivefetch archivefetch phase started at Mon Nov 23 16:58:24 EST 2020
10:msg:archivefetch --->  Fetching archive for calc
11:warn:archivefetch Your DNS servers incorrectly claim to know the address of nonexistent hosts. This may cause checksum mismatches for some ports. See this page for more information: <https://trac.macports.org/wiki/MisbehavingServers>
12:debug:archivefetch Executing org.macports.archivefetch (calc)
13:debug:archivefetch euid/egid changed to: 0/0
14:debug:archivefetch chowned /opt/local/var/macports/incoming to macports
15:debug:archivefetch euid/egid changed to: 502/501
16:info:archivefetch --->  calc-2.12.6.8_1.darwin_20.x86_64.tbz2 doesn't seem to exist in /opt/local/var/macports/incoming/verified
17:msg:archivefetch --->  Attempting to fetch calc-2.12.6.8_1.darwin_20.x86_64.tbz2 from https://packages.macports.org/calc
18:debug:archivefetch Fetching archive failed: The requested URL returned error: 404
19:msg:archivefetch --->  Attempting to fetch calc-2.12.6.8_1.darwin_20.x86_64.tbz2 from https://ywg.ca.packages.macports.org/mirror/macports/packages/calc/calc
20:debug:archivefetch Fetching archive failed: The requested URL returned error: 404 Not Found
21:msg:archivefetch --->  Attempting to fetch calc-2.12.6.8_1.darwin_20.x86_64.tbz2 from https://mse.uk.packages.macports.org/calc
22:debug:archivefetch Fetching archive failed: The requested URL returned error: 404 Not Found
23version:1
24:debug:sysinfo macOS 11.0 (darwin/20.1.0) arch i386
25:debug:sysinfo MacPorts 2.6.4
26:debug:sysinfo Xcode none
27:debug:sysinfo SDK 11.0
28:debug:sysinfo MACOSX_DEPLOYMENT_TARGET: 11.0
29:msg:archivefetch --->  Computing dependencies for calc:info:archivefetch .:debug:archivefetch Searching for dependency: ncurses
30:debug:archivefetch Found Dependency: receipt exists for ncurses
31:debug:archivefetch Searching for dependency: readline
32:debug:archivefetch Found Dependency: receipt exists for readline
33:debug:main Executing org.macports.main (calc)
34:debug:main dropping privileges: euid changed to 502, egid changed to 501.
35:debug:fetch fetch phase started at Mon Nov 23 16:58:28 EST 2020
36:notice:fetch --->  Fetching distfiles for calc
37:debug:fetch Executing org.macports.fetch (calc)
38:debug:fetch Privilege de-escalation not attempted as not running as root.
39:debug:checksum checksum phase started at Mon Nov 23 16:58:28 EST 2020
40:notice:checksum --->  Verifying checksums for calc
41:debug:checksum Executing org.macports.checksum (calc)
42:info:checksum --->  Checksumming calc-2.12.6.8.tar.bz2
43:debug:checksum Calculated (rmd160) is f38589f666d57ca0339b89394b944165ce4924b0
44:debug:checksum Correct (rmd160) checksum for calc-2.12.6.8.tar.bz2
45:debug:checksum Calculated (sha256) is 0b92d5c72d26759c2a65bf85de0c111fa9653d9e2756578639100e952fa88a90
46:debug:checksum Correct (sha256) checksum for calc-2.12.6.8.tar.bz2
47:debug:checksum Calculated (size) is 964386
48:debug:checksum Correct (size) checksum for calc-2.12.6.8.tar.bz2
49:debug:checksum Privilege de-escalation not attempted as not running as root.
50:debug:extract extract phase started at Mon Nov 23 16:58:28 EST 2020
51:notice:extract --->  Extracting calc
52:debug:extract setting option extract.cmd to /usr/bin/bzip2
53:debug:extract Executing org.macports.extract (calc)
54:info:extract --->  Extracting calc-2.12.6.8.tar.bz2
55:debug:extract setting option extract.args to '/opt/local/var/macports/distfiles/calc/calc-2.12.6.8.tar.bz2'
56:debug:extract Environment:
57:debug:extract CC_PRINT_OPTIONS='YES'
58:debug:extract CC_PRINT_OPTIONS_FILE='/opt/local/var/macports/build/_opt_local_var_macports_sources_rsync.macports.org_macports_release_tarballs_ports_math_calc/calc/work/.CC_PRINT_OPTIONS'
59:debug:extract CPATH='/opt/local/include'
60:debug:extract DEVELOPER_DIR='/Library/Developer/CommandLineTools'
61:debug:extract LIBRARY_PATH='/opt/local/lib'
62:debug:extract MACOSX_DEPLOYMENT_TARGET='11.0'
63:debug:extract SDKROOT='/Library/Developer/CommandLineTools/SDKs/MacOSX11.0.sdk'
64:info:extract Executing:  cd "/opt/local/var/macports/build/_opt_local_var_macports_sources_rsync.macports.org_macports_release_tarballs_ports_math_calc/calc/work" && /usr/bin/bzip2 -dc '/opt/local/var/macports/distfiles/calc/calc-2.12.6.8.tar.bz2' | /usr/bin/tar -xf -
65:debug:extract system:  cd "/opt/local/var/macports/build/_opt_local_var_macports_sources_rsync.macports.org_macports_release_tarballs_ports_math_calc/calc/work" && /usr/bin/bzip2 -dc '/opt/local/var/macports/distfiles/calc/calc-2.12.6.8.tar.bz2' | /usr/bin/tar -xf -
66:debug:extract euid/egid changed to: 0/0
67:debug:extract chowned /opt/local/var/macports/build/_opt_local_var_macports_sources_rsync.macports.org_macports_release_tarballs_ports_math_calc/calc/work to macports
68:debug:extract euid/egid changed to: 502/501
69:debug:extract Privilege de-escalation not attempted as not running as root.
70:debug:patch patch phase started at Mon Nov 23 16:58:28 EST 2020
71:debug:patch Executing org.macports.patch (calc)
72:notice:patch --->  Applying patches to calc
73:info:patch --->  Applying patch-Makefile.diff
74:debug:patch Environment:
75:debug:patch CC_PRINT_OPTIONS='YES'
76:debug:patch CC_PRINT_OPTIONS_FILE='/opt/local/var/macports/build/_opt_local_var_macports_sources_rsync.macports.org_macports_release_tarballs_ports_math_calc/calc/work/.CC_PRINT_OPTIONS'
77:debug:patch CPATH='/opt/local/include'
78:debug:patch DEVELOPER_DIR='/Library/Developer/CommandLineTools'
79:debug:patch LIBRARY_PATH='/opt/local/lib'
80:debug:patch MACOSX_DEPLOYMENT_TARGET='11.0'
81:debug:patch SDKROOT='/Library/Developer/CommandLineTools/SDKs/MacOSX11.0.sdk'
82:info:patch Executing:  cd "/opt/local/var/macports/build/_opt_local_var_macports_sources_rsync.macports.org_macports_release_tarballs_ports_math_calc/calc/work/calc-2.12.6.8" && /usr/bin/patch -p0 < '/opt/local/var/macports/sources/rsync.macports.org/macports/release/tarballs/ports/math/calc/files/patch-Makefile.diff'
83:debug:patch system:  cd "/opt/local/var/macports/build/_opt_local_var_macports_sources_rsync.macports.org_macports_release_tarballs_ports_math_calc/calc/work/calc-2.12.6.8" && /usr/bin/patch -p0 < '/opt/local/var/macports/sources/rsync.macports.org/macports/release/tarballs/ports/math/calc/files/patch-Makefile.diff'
84:info:patch patching file Makefile
85:debug:patch Executing proc-post-org.macports.patch-patch-0
86:info:patch --->  Patching Makefile: s|___PREFIX___|/opt/local|
87:debug:patch Executing reinplace: /usr/bin/sed s|___PREFIX___|/opt/local| </opt/local/var/macports/build/_opt_local_var_macports_sources_rsync.macports.org_macports_release_tarballs_ports_math_calc/calc/work/calc-2.12.6.8/Makefile >@file12
88:debug:patch euid/egid changed to: 0/0
89:debug:patch chowned /opt/local/var/macports/build/_opt_local_var_macports_sources_rsync.macports.org_macports_release_tarballs_ports_math_calc/calc/work/calc-2.12.6.8/Makefile to macports
90:debug:patch euid/egid changed to: 502/501
91:debug:patch euid/egid changed to: 0/0
92:debug:patch setting attributes on /opt/local/var/macports/build/_opt_local_var_macports_sources_rsync.macports.org_macports_release_tarballs_ports_math_calc/calc/work/calc-2.12.6.8/Makefile
93:debug:patch euid/egid changed to: 502/501
94:info:patch --->  Patching Makefile: s|___SDK_PREFIX___|/Library/Developer/CommandLineTools/SDKs/MacOSX11.0.sdk|
95:debug:patch Executing reinplace: /usr/bin/sed s|___SDK_PREFIX___|/Library/Developer/CommandLineTools/SDKs/MacOSX11.0.sdk| </opt/local/var/macports/build/_opt_local_var_macports_sources_rsync.macports.org_macports_release_tarballs_ports_math_calc/calc/work/calc-2.12.6.8/Makefile >@file12
96:debug:patch euid/egid changed to: 0/0
97:debug:patch chowned /opt/local/var/macports/build/_opt_local_var_macports_sources_rsync.macports.org_macports_release_tarballs_ports_math_calc/calc/work/calc-2.12.6.8/Makefile to macports
98:debug:patch euid/egid changed to: 502/501
99:debug:patch euid/egid changed to: 0/0
100:debug:patch setting attributes on /opt/local/var/macports/build/_opt_local_var_macports_sources_rsync.macports.org_macports_release_tarballs_ports_math_calc/calc/work/calc-2.12.6.8/Makefile
101:debug:patch euid/egid changed to: 502/501
102:debug:patch Privilege de-escalation not attempted as not running as root.
103:debug:configure configure phase started at Mon Nov 23 16:58:28 EST 2020
104:notice:configure --->  Configuring calc
105:debug:configure Preferred compilers: clang macports-clang-9.0 macports-clang-8.0 macports-clang-7.0 macports-clang-6.0 macports-clang-5.0
106:debug:configure Using compiler 'Xcode Clang'
107:debug:configure Executing org.macports.configure (calc)
108:debug:configure Privilege de-escalation not attempted as not running as root.
109:debug:build build phase started at Mon Nov 23 16:58:28 EST 2020
110:notice:build --->  Building calc
111:debug:build Executing org.macports.build (calc)
112:debug:build port disallows a parallel build
113:debug:build Environment:
114:debug:build CC_PRINT_OPTIONS='YES'
115:debug:build CC_PRINT_OPTIONS_FILE='/opt/local/var/macports/build/_opt_local_var_macports_sources_rsync.macports.org_macports_release_tarballs_ports_math_calc/calc/work/.CC_PRINT_OPTIONS'
116:debug:build CPATH='/opt/local/include'
117:debug:build DEVELOPER_DIR='/Library/Developer/CommandLineTools'
118:debug:build LIBRARY_PATH='/opt/local/lib'
119:debug:build MACOSX_DEPLOYMENT_TARGET='11.0'
120:debug:build SDKROOT='/Library/Developer/CommandLineTools/SDKs/MacOSX11.0.sdk'
121:info:build Executing:  cd "/opt/local/var/macports/build/_opt_local_var_macports_sources_rsync.macports.org_macports_release_tarballs_ports_math_calc/calc/work/calc-2.12.6.8" && /usr/bin/make -w all CC=/usr/bin/clang DARWIN_ARCH="-arch x86_64"
122:debug:build system:  cd "/opt/local/var/macports/build/_opt_local_var_macports_sources_rsync.macports.org_macports_release_tarballs_ports_math_calc/calc/work/calc-2.12.6.8" && /usr/bin/make -w all CC=/usr/bin/clang DARWIN_ARCH="-arch x86_64"
123:info:build make: Entering directory `/opt/local/var/macports/build/_opt_local_var_macports_sources_rsync.macports.org_macports_release_tarballs_ports_math_calc/calc/work/calc-2.12.6.8'
124:info:build forming have_unistd.h
125:info:build have_unistd.h formed
126:info:build forming have_stdlib.h
127:info:build have_stdlib.h formed
128:info:build /usr/bin/clang -DCALC_SRC -DCUSTOM -Wall -arch x86_64   -fPIC longbits.c -c
129:info:build rm -f longbits
130:info:build /usr/bin/clang -DCALC_SRC -DCUSTOM -Wall -arch x86_64   -fPIC longbits.o -o longbits
131:info:build forming longbits.h
132:info:build longbits.h formed
133:info:build forming align32.h
134:info:build align32.h formed
135:info:build forming have_string.h
136:info:build have_string.h formed
137:info:build forming args.h
138:info:build args.h formed
139:info:build forming calcerr.h
140:info:build calcerr.h formed
141:info:build forming conf.h
142:info:build conf.h formed
143:info:build /usr/bin/clang -DCALC_SRC -DCUSTOM -Wall -arch x86_64   -fPIC  endian.c -c
144:info:build rm -f endian
145:info:build /usr/bin/clang -DCALC_SRC -DCUSTOM -Wall -arch x86_64   -fPIC endian.o -o endian
146:info:build forming endian_calc.h
147:info:build endian_calc.h formed
148:info:build forming have_fpos.h
149:info:build have_fpos.h formed
150:info:build forming have_posscl.h
151:info:build have_posscl.h formed
152:info:build forming have_fpos_pos.h
153:info:build have_fpos_pos.h formed
154:info:build forming have_offscl.h
155:info:build have_offscl.h formed
156:info:build forming fposval.h
157:info:build fposval.h formed
158:info:build forming have_const.h
159:info:build have_const.h formed
160:info:build forming have_memmv.h
161:info:build have_memmv.h formed
162:info:build forming have_newstr.h
163:info:build have_newstr.h formed
164:info:build forming have_times.h
165:info:build have_times.h formed
166:info:build forming have_uid_t.h
167:info:build have_uid_t.h formed
168:info:build forming terminal.h
169:info:build terminal.h formed
170:info:build forming have_ustat.h
171:info:build have_ustat.h formed
172:info:build forming have_getsid.h
173:info:build have_getsid.h formed
174:info:build forming have_getpgid.h
175:info:build have_getpgid.h formed
176:info:build forming have_gettime.h
177:info:build have_gettime.h formed
178:info:build forming have_getprid.h
179:info:build have_getprid.h formed
180:info:build forming have_urandom.h
181:info:build have_urandom.h formed
182:info:build forming have_rusage.h
183:info:build have_rusage.h formed
184:info:build forming have_strdup.h
185:info:build have_strdup.h formed
186:info:build forming have_unused.h
187:info:build have_unused.h formed
188:info:build forming calcerr.c
189:info:build calcerr.c formed
190:info:build rm -f custom/.all
191:info:build cd custom; make -f Makefile ALLOW_CUSTOM="-DCUSTOM" AR=ar AWK=awk BINDIR="/opt/local/bin" BLD_TYPE="calc-dynamic-only" CALC_INCDIR="/opt/local/include/calc" CALC_SHAREDIR="/opt/local/share/calc" CAT=cat CC="/usr/bin/clang" CCERR="" CCMISC="-arch x86_64" CCOPT="-O3 -g3" CCWARN="-Wall" CC_SHARE="-fPIC" CFLAGS="-DCALC_SRC -DCUSTOM -Wall -arch x86_64   -fPIC -O3 -g3 -I.." CHMOD=chmod CMP=cmp CO=co COMMON_ADD="" COMMON_CFLAGS="-DCALC_SRC -DCUSTOM -Wall -arch x86_64   -I.." COMMON_LDFLAGS=" " CP=cp CUSTOMCALDIR="/opt/local/share/calc/custom" CUSTOMHELPDIR="/opt/local/share/calc/custhelp" CUSTOMINCDIR="/opt/local/include/calc/custom" DEBUG="-O3 -g3" DEFAULT_LIB_INSTALL_PATH="/opt/local/var/macports/build/_opt_local_var_macports_sources_rsync.macports.org_macports_release_tarballs_ports_math_calc/calc/work/calc-2.12.6.8:/opt/local/lib:/usr/local/lib" FMT=fmt GREP=egrep HELPDIR="/opt/local/share/calc/help" ICFLAGS="-DCALC_SRC -DCUSTOM -Wall -arch x86_64   -fPIC -I.." ILDFLAGS=" " INCDIR="/Library/Developer/CommandLineTools/SDKs/MacOSX11.0.sdk/usr/include" LANG=C LCC="/usr/bin/clang" LDCONFIG= LDFLAGS="  " LD_SHARE="-arch x86_64" LIBCUSTCALC_SHLIB="-single_module -undefined dynamic_lookup -dynamiclib -install_name /opt/local/lib/libcustcalc.2.12.6.8.dylib -arch x86_64" LIBDIR="/opt/local/lib" LN=ln MAKE=make MAKEDEPEND=makedepend MAKE_FILE=Makefile MKDIR=mkdir MV=mv PURIFY="" Q="@" RANLIB="ranlib" RM=rm RMDIR=rmdir SCRIPTDIR="/opt/local/bin/cscript" SED=sed SORT=sort T= TOP_MAKE_FILE=Makefile TOUCH=touch TRUE=true VERSION=2.12.6.8 target=Darwin all
192:info:build make[1]: Entering directory `/opt/local/var/macports/build/_opt_local_var_macports_sources_rsync.macports.org_macports_release_tarballs_ports_math_calc/calc/work/calc-2.12.6.8/custom'
193:info:build /usr/bin/clang -DCALC_SRC -DCUSTOM -Wall -arch x86_64   -fPIC -O3 -g3 -I..   -c -o custtbl.o custtbl.c
194:info:build In file included from custtbl.c:30:
195:info:build In file included from ../value.h:33:
196:info:build In file included from ../cmath.h:32:
197:info:build In file included from ../qmath.h:32:
198:info:build In file included from ../zmath.h:39:
199:info:build ../alloc.h:88:14: error: expected parameter declarator
200:info:build E_FUNC void *memmove(void *s1, CONST void *s2, MEMMOVE_SIZE_T n);
201:info:build              ^
202:info:build /Library/Developer/CommandLineTools/SDKs/MacOSX11.0.sdk/usr/include/secure/_string.h:70:47: note: expanded from macro 'memmove'
203:info:build                 __builtin___memmove_chk (dest, __VA_ARGS__, __darwin_obsz0 (dest))
204:info:build                                                             ^
205:info:build /Library/Developer/CommandLineTools/SDKs/MacOSX11.0.sdk/usr/include/secure/_common.h:38:63: note: expanded from macro '__darwin_obsz0'
206:info:build #define __darwin_obsz0(object) __builtin_object_size (object, 0)
207:info:build                                                               ^
208:info:build In file included from custtbl.c:30:
209:info:build In file included from ../value.h:33:
210:info:build In file included from ../cmath.h:32:
211:info:build In file included from ../qmath.h:32:
212:info:build In file included from ../zmath.h:39:
213:info:build ../alloc.h:88:14: error: expected ')'
214:info:build /Library/Developer/CommandLineTools/SDKs/MacOSX11.0.sdk/usr/include/secure/_string.h:70:47: note: expanded from macro 'memmove'
215:info:build                 __builtin___memmove_chk (dest, __VA_ARGS__, __darwin_obsz0 (dest))
216:info:build                                                             ^
217:info:build /Library/Developer/CommandLineTools/SDKs/MacOSX11.0.sdk/usr/include/secure/_common.h:38:63: note: expanded from macro '__darwin_obsz0'
218:info:build #define __darwin_obsz0(object) __builtin_object_size (object, 0)
219:info:build                                                               ^
220:info:build ../alloc.h:88:14: note: to match this '('
221:info:build /Library/Developer/CommandLineTools/SDKs/MacOSX11.0.sdk/usr/include/secure/_string.h:70:47: note: expanded from macro 'memmove'
222:info:build                 __builtin___memmove_chk (dest, __VA_ARGS__, __darwin_obsz0 (dest))
223:info:build                                                             ^
224:info:build /Library/Developer/CommandLineTools/SDKs/MacOSX11.0.sdk/usr/include/secure/_common.h:38:54: note: expanded from macro '__darwin_obsz0'
225:info:build #define __darwin_obsz0(object) __builtin_object_size (object, 0)
226:info:build                                                      ^
227:info:build In file included from custtbl.c:30:
228:info:build In file included from ../value.h:33:
229:info:build In file included from ../cmath.h:32:
230:info:build In file included from ../qmath.h:32:
231:info:build In file included from ../zmath.h:39:
232:info:build ../alloc.h:88:14: warning: type specifier missing, defaults to 'int' [-Wimplicit-int]
233:info:build E_FUNC void *memmove(void *s1, CONST void *s2, MEMMOVE_SIZE_T n);
234:info:build              ^
235:info:build /Library/Developer/CommandLineTools/SDKs/MacOSX11.0.sdk/usr/include/secure/_string.h:70:47: note: expanded from macro 'memmove'
236:info:build                 __builtin___memmove_chk (dest, __VA_ARGS__, __darwin_obsz0 (dest))
237:info:build                                                             ^
238:info:build /Library/Developer/CommandLineTools/SDKs/MacOSX11.0.sdk/usr/include/secure/_common.h:38:32: note: expanded from macro '__darwin_obsz0'
239:info:build #define __darwin_obsz0(object) __builtin_object_size (object, 0)
240:info:build                                ^
241:info:build In file included from custtbl.c:30:
242:info:build In file included from ../value.h:33:
243:info:build In file included from ../cmath.h:32:
244:info:build In file included from ../qmath.h:32:
245:info:build In file included from ../zmath.h:39:
246:info:build ../alloc.h:88:14: error: conflicting types for '__builtin___memmove_chk'
247:info:build /Library/Developer/CommandLineTools/SDKs/MacOSX11.0.sdk/usr/include/secure/_string.h:70:3: note: expanded from macro 'memmove'
248:info:build                 __builtin___memmove_chk (dest, __VA_ARGS__, __darwin_obsz0 (dest))
249:info:build                 ^
250:info:build ../alloc.h:88:14: note: '__builtin___memmove_chk' is a builtin with type 'void *(void *, const void *, unsigned long, unsigned long)'
251:info:build /Library/Developer/CommandLineTools/SDKs/MacOSX11.0.sdk/usr/include/secure/_string.h:70:3: note: expanded from macro 'memmove'
252:info:build                 __builtin___memmove_chk (dest, __VA_ARGS__, __darwin_obsz0 (dest))
253:info:build                 ^
254:info:build 1 warning and 3 errors generated.
255:info:build make[1]: *** [custtbl.o] Error 1
256:info:build make[1]: Leaving directory `/opt/local/var/macports/build/_opt_local_var_macports_sources_rsync.macports.org_macports_release_tarballs_ports_math_calc/calc/work/calc-2.12.6.8/custom'
257:info:build make: *** [custom/.all] Error 2
258:info:build make: Leaving directory `/opt/local/var/macports/build/_opt_local_var_macports_sources_rsync.macports.org_macports_release_tarballs_ports_math_calc/calc/work/calc-2.12.6.8'
259:info:build Command failed:  cd "/opt/local/var/macports/build/_opt_local_var_macports_sources_rsync.macports.org_macports_release_tarballs_ports_math_calc/calc/work/calc-2.12.6.8" && /usr/bin/make -w all CC=/usr/bin/clang DARWIN_ARCH="-arch x86_64"
260:info:build Exit code: 2
261:error:build Failed to build calc: command execution failed
262:debug:build Error code: CHILDSTATUS 86443 2
263:debug:build Backtrace: command execution failed
264:debug:build     while executing
265:debug:build "system {*}$notty {*}$nice $fullcmdstring"
266:debug:build     invoked from within
267:debug:build "command_exec build"
268:debug:build     (procedure "portbuild::build_main" line 8)
269:debug:build     invoked from within
270:debug:build "$procedure $targetname"
271:error:build See /opt/local/var/macports/logs/_opt_local_var_macports_sources_rsync.macports.org_macports_release_tarballs_ports_math_calc/calc/main.log for details.