Ticket #61639: main.log

File main.log, 90.1 KB (added by mtetcs, 14 months ago)

main.log

Line 
1version:1
2:debug:sysinfo macOS 11.0 (darwin/20.1.0) arch i386
3:debug:sysinfo MacPorts 2.6.4
4:debug:sysinfo Xcode 12.2
5:debug:sysinfo SDK 11.0
6:debug:sysinfo MACOSX_DEPLOYMENT_TARGET: 11.0
7:debug:main epoch: in tree: 0 installed: 0
8:debug:main bzip2 1.0.8_0 exists in the ports tree
9:debug:main bzip2 1.0.8_0  is the latest installed
10:debug:main bzip2 1.0.8_0  is active
11:debug:main Merging existing variants '' into variants
12:debug:main new fully merged portvariants:
13:debug:main Changing to port directory: /opt/local/var/macports/sources/rsync.macports.org/macports/release/tarballs/ports/archivers/bzip2
14:debug:main OS darwin/20.1.0 (macOS 11.0) arch i386
15:debug:main Reading variant descriptions from /opt/local/var/macports/sources/rsync.macports.org/macports/release/tarballs/ports/_resources/port1.0/variant_descriptions.conf
16:debug:main universal variant already exists, so not adding the default one
17:debug:main Running callback portconfigure::add_automatic_compiler_dependencies
18:debug:main Finished running callback portconfigure::add_automatic_compiler_dependencies
19:debug:main Running callback portbuild::add_automatic_buildsystem_dependencies
20:debug:main Finished running callback portbuild::add_automatic_buildsystem_dependencies
21:debug:main Running callback portstartupitem::add_notes
22:debug:main Finished running callback portstartupitem::add_notes
23:debug:main No need to upgrade! bzip2 1.0.8_0 >= bzip2 1.0.8_0
24:debug:main epoch: in tree: 0 installed: 0
25:debug:main readline 8.0.000_0 exists in the ports tree
26:debug:main readline 8.0.000_0  is the latest installed
27:debug:main readline 8.0.000_0  is active
28:debug:main Merging existing variants '' into variants
29:debug:main new fully merged portvariants:
30:debug:main Changing to port directory: /opt/local/var/macports/sources/rsync.macports.org/macports/release/tarballs/ports/devel/readline
31:debug:main OS darwin/20.1.0 (macOS 11.0) arch i386
32:debug:main Reading variant descriptions from /opt/local/var/macports/sources/rsync.macports.org/macports/release/tarballs/ports/_resources/port1.0/variant_descriptions.conf
33:debug:main Sourcing PortGroup muniversal 1.0 from /opt/local/var/macports/sources/rsync.macports.org/macports/release/tarballs/ports/_resources/port1.0/group/muniversal-1.0.tcl
34:debug:main Sourcing PortGroup clang_dependency 1.0 from /opt/local/var/macports/sources/rsync.macports.org/macports/release/tarballs/ports/_resources/port1.0/group/clang_dependency-1.0.tcl
35:debug:main universal variant already exists, so not adding the default one
36:debug:main Running callback portconfigure::add_automatic_compiler_dependencies
37:debug:main Finished running callback portconfigure::add_automatic_compiler_dependencies
38:debug:main Running callback portbuild::add_automatic_buildsystem_dependencies
39:debug:main Finished running callback portbuild::add_automatic_buildsystem_dependencies
40:debug:main Running callback portstartupitem::add_notes
41:debug:main Finished running callback portstartupitem::add_notes
42:debug:main No need to upgrade! readline 8.0.000_0 >= readline 8.0.000_0
43:debug:main epoch: in tree: 0 installed: 0
44:debug:main ncurses 6.2_0 exists in the ports tree
45:debug:main ncurses 6.2_0  is the latest installed
46:debug:main ncurses 6.2_0  is active
47:debug:main Merging existing variants '' into variants
48:debug:main new fully merged portvariants:
49:debug:main Changing to port directory: /opt/local/var/macports/sources/rsync.macports.org/macports/release/tarballs/ports/devel/ncurses
50:debug:main OS darwin/20.1.0 (macOS 11.0) arch i386
51:debug:main Sourcing PortGroup clang_dependency 1.0 from /opt/local/var/macports/sources/rsync.macports.org/macports/release/tarballs/ports/_resources/port1.0/group/clang_dependency-1.0.tcl
52:debug:main adding the default universal variant
53:debug:main Reading variant descriptions from /opt/local/var/macports/sources/rsync.macports.org/macports/release/tarballs/ports/_resources/port1.0/variant_descriptions.conf
54:debug:main Running callback portconfigure::add_automatic_compiler_dependencies
55:debug:main Finished running callback portconfigure::add_automatic_compiler_dependencies
56:debug:main Running callback portbuild::add_automatic_buildsystem_dependencies
57:debug:main Finished running callback portbuild::add_automatic_buildsystem_dependencies
58:debug:main Running callback portstartupitem::add_notes
59:debug:main Finished running callback portstartupitem::add_notes
60:debug:main No need to upgrade! ncurses 6.2_0 >= ncurses 6.2_0
61:debug:main epoch: in tree: 0 installed: 0
62:debug:main zlib 1.2.11_0 exists in the ports tree
63:debug:main zlib 1.2.11_0  is the latest installed
64:debug:main zlib 1.2.11_0  is active
65:debug:main Merging existing variants '' into variants
66:debug:main new fully merged portvariants:
67:debug:main Changing to port directory: /opt/local/var/macports/sources/rsync.macports.org/macports/release/tarballs/ports/archivers/zlib
68:debug:main OS darwin/20.1.0 (macOS 11.0) arch i386
69:debug:main Sourcing PortGroup xcodeversion 1.0 from /opt/local/var/macports/sources/rsync.macports.org/macports/release/tarballs/ports/_resources/port1.0/group/xcodeversion-1.0.tcl
70:debug:main adding the default universal variant
71:debug:main Reading variant descriptions from /opt/local/var/macports/sources/rsync.macports.org/macports/release/tarballs/ports/_resources/port1.0/variant_descriptions.conf
72:debug:main Running callback portconfigure::add_automatic_compiler_dependencies
73:debug:main Finished running callback portconfigure::add_automatic_compiler_dependencies
74:debug:main Running callback portbuild::add_automatic_buildsystem_dependencies
75:debug:main Finished running callback portbuild::add_automatic_buildsystem_dependencies
76:debug:main Running callback portstartupitem::add_notes
77:debug:main Finished running callback portstartupitem::add_notes
78:debug:main No need to upgrade! zlib 1.2.11_0 >= zlib 1.2.11_0
79:msg:main --->  Computing dependencies for iverilog:info:main .:debug:main iverilog has no conflicts
80:debug:main Searching for dependency: bzip2
81:debug:main Found Dependency: receipt exists for bzip2
82:debug:main Searching for dependency: readline
83:debug:main Found Dependency: receipt exists for readline
84:debug:main Searching for dependency: zlib
85:debug:main Found Dependency: receipt exists for zlib
86:debug:main Executing org.macports.main (iverilog)
87:debug:main dropping privileges: euid changed to 502, egid changed to 501.
88:debug:archivefetch archivefetch phase started at Tue Nov 24 12:35:17 GMT 2020
89:msg:archivefetch --->  Fetching archive for iverilog
90:debug:archivefetch Executing org.macports.archivefetch (iverilog)
91:debug:archivefetch euid/egid changed to: 0/0
92:debug:archivefetch chowned /opt/local/var/macports/incoming to macports
93:debug:archivefetch euid/egid changed to: 502/501
94:info:archivefetch --->  iverilog-10.3_0.darwin_20.x86_64.tbz2 doesn't seem to exist in /opt/local/var/macports/incoming/verified
95:msg:archivefetch --->  Attempting to fetch iverilog-10.3_0.darwin_20.x86_64.tbz2 from https://packages.macports.org/iverilog
96:debug:archivefetch Fetching archive failed: The requested URL returned error: 404
97:msg:archivefetch --->  Attempting to fetch iverilog-10.3_0.darwin_20.x86_64.tbz2 from https://mse.uk.packages.macports.org/iverilog
98:debug:archivefetch Fetching archive failed: The requested URL returned error: 404 Not Found
99:msg:archivefetch --->  Attempting to fetch iverilog-10.3_0.darwin_20.x86_64.tbz2 from https://lil.fr.packages.macports.org/iverilog
100:debug:archivefetch Fetching archive failed: The requested URL returned error: 404 Not Found
101:debug:archivefetch Privilege de-escalation not attempted as not running as root.
102:debug:fetch fetch phase started at Tue Nov 24 12:35:19 GMT 2020
103:notice:fetch --->  Fetching distfiles for iverilog
104:debug:fetch Executing org.macports.fetch (iverilog)
105:debug:fetch Privilege de-escalation not attempted as not running as root.
106:debug:checksum checksum phase started at Tue Nov 24 12:35:19 GMT 2020
107:notice:checksum --->  Verifying checksums for iverilog
108:debug:checksum Executing org.macports.checksum (iverilog)
109:info:checksum --->  Checksumming verilog-10.3.tar.gz
110:debug:checksum Calculated (rmd160) is e6d58c825399404698c1e865aa71be45556e78be
111:debug:checksum Correct (rmd160) checksum for verilog-10.3.tar.gz
112:debug:checksum Calculated (sha256) is 86bd45e7e12d1bc8772c3cdd394e68a9feccb2a6d14aaf7dae0773b7274368ef
113:debug:checksum Correct (sha256) checksum for verilog-10.3.tar.gz
114:debug:checksum Calculated (size) is 1698889
115:debug:checksum Correct (size) checksum for verilog-10.3.tar.gz
116:debug:checksum Privilege de-escalation not attempted as not running as root.
117:debug:extract extract phase started at Tue Nov 24 12:35:19 GMT 2020
118:notice:extract --->  Extracting iverilog
119:debug:extract Executing org.macports.extract (iverilog)
120:info:extract --->  Extracting verilog-10.3.tar.gz
121:debug:extract setting option extract.args to '/opt/local/var/macports/distfiles/iverilog/verilog-10.3.tar.gz'
122:debug:extract Environment:
123:debug:extract CC_PRINT_OPTIONS='YES'
124:debug:extract CC_PRINT_OPTIONS_FILE='/opt/local/var/macports/build/_opt_local_var_macports_sources_rsync.macports.org_macports_release_tarballs_ports_science_iverilog/iverilog/work/.CC_PRINT_OPTIONS'
125:debug:extract CPATH='/opt/local/include'
126:debug:extract DEVELOPER_DIR='/Library/Developer/CommandLineTools'
127:debug:extract LIBRARY_PATH='/opt/local/lib'
128:debug:extract MACOSX_DEPLOYMENT_TARGET='11.0'
129:debug:extract SDKROOT='/Library/Developer/CommandLineTools/SDKs/MacOSX11.0.sdk'
130:info:extract Executing:  cd "/opt/local/var/macports/build/_opt_local_var_macports_sources_rsync.macports.org_macports_release_tarballs_ports_science_iverilog/iverilog/work" && /usr/bin/gzip -dc '/opt/local/var/macports/distfiles/iverilog/verilog-10.3.tar.gz' | /usr/bin/tar -xf -
131:debug:extract system:  cd "/opt/local/var/macports/build/_opt_local_var_macports_sources_rsync.macports.org_macports_release_tarballs_ports_science_iverilog/iverilog/work" && /usr/bin/gzip -dc '/opt/local/var/macports/distfiles/iverilog/verilog-10.3.tar.gz' | /usr/bin/tar -xf -
132:debug:extract euid/egid changed to: 0/0
133:debug:extract chowned /opt/local/var/macports/build/_opt_local_var_macports_sources_rsync.macports.org_macports_release_tarballs_ports_science_iverilog/iverilog/work to macports
134:debug:extract euid/egid changed to: 502/501
135:debug:extract Privilege de-escalation not attempted as not running as root.
136:debug:patch patch phase started at Tue Nov 24 12:35:19 GMT 2020
137:debug:patch Executing org.macports.patch (iverilog)
138:debug:patch Privilege de-escalation not attempted as not running as root.
139:debug:configure configure phase started at Tue Nov 24 12:35:19 GMT 2020
140:notice:configure --->  Configuring iverilog
141:debug:configure Preferred compilers: clang macports-clang-9.0 macports-clang-8.0 macports-clang-7.0 macports-clang-6.0 macports-clang-5.0
142:debug:configure Using compiler 'Xcode Clang'
143:debug:configure Executing org.macports.configure (iverilog)
144:debug:configure Environment:
145:debug:configure CC='/usr/bin/clang'
146:debug:configure CC_PRINT_OPTIONS='YES'
147:debug:configure CC_PRINT_OPTIONS_FILE='/opt/local/var/macports/build/_opt_local_var_macports_sources_rsync.macports.org_macports_release_tarballs_ports_science_iverilog/iverilog/work/.CC_PRINT_OPTIONS'
148:debug:configure CFLAGS='-pipe -Os -isysroot/Library/Developer/CommandLineTools/SDKs/MacOSX11.0.sdk -arch x86_64'
149:debug:configure CPATH='/opt/local/include'
150:debug:configure CPPFLAGS='-I/opt/local/include -isysroot/Library/Developer/CommandLineTools/SDKs/MacOSX11.0.sdk'
151:debug:configure CXX='/usr/bin/clang++'
152:debug:configure CXXFLAGS='-pipe -Os -stdlib=libc++ -isysroot/Library/Developer/CommandLineTools/SDKs/MacOSX11.0.sdk -arch x86_64'
153:debug:configure DEVELOPER_DIR='/Library/Developer/CommandLineTools'
154:debug:configure F90FLAGS='-pipe -Os -m64'
155:debug:configure FCFLAGS='-pipe -Os -m64'
156:debug:configure FFLAGS='-pipe -Os -m64'
157:debug:configure INSTALL='/usr/bin/install -c'
158:debug:configure LDFLAGS='-L/opt/local/lib -Wl,-headerpad_max_install_names -Wl,-syslibroot,/Library/Developer/CommandLineTools/SDKs/MacOSX11.0.sdk -arch x86_64'
159:debug:configure LIBRARY_PATH='/opt/local/lib'
160:debug:configure MACOSX_DEPLOYMENT_TARGET='11.0'
161:debug:configure OBJC='/usr/bin/clang'
162:debug:configure OBJCFLAGS='-pipe -Os -isysroot/Library/Developer/CommandLineTools/SDKs/MacOSX11.0.sdk -arch x86_64'
163:debug:configure OBJCXX='/usr/bin/clang++'
164:debug:configure OBJCXXFLAGS='-pipe -Os -stdlib=libc++ -isysroot/Library/Developer/CommandLineTools/SDKs/MacOSX11.0.sdk -arch x86_64'
165:debug:configure SDKROOT='/Library/Developer/CommandLineTools/SDKs/MacOSX11.0.sdk'
166:info:configure Executing:  cd "/opt/local/var/macports/build/_opt_local_var_macports_sources_rsync.macports.org_macports_release_tarballs_ports_science_iverilog/iverilog/work/verilog-10.3" && ./configure --prefix=/opt/local
167:debug:configure system:  cd "/opt/local/var/macports/build/_opt_local_var_macports_sources_rsync.macports.org_macports_release_tarballs_ports_science_iverilog/iverilog/work/verilog-10.3" && ./configure --prefix=/opt/local
168:info:configure checking build system type... x86_64-apple-darwin20.1.0
169:info:configure checking host system type... x86_64-apple-darwin20.1.0
170:info:configure checking for gcc... /usr/bin/clang
171:info:configure checking whether the C compiler works... yes
172:info:configure checking for C compiler default output file name... a.out
173:info:configure checking for suffix of executables...
174:info:configure checking whether we are cross compiling... no
175:info:configure checking for suffix of object files... o
176:info:configure checking whether we are using the GNU C compiler... yes
177:info:configure checking whether /usr/bin/clang accepts -g... yes
178:info:configure checking for /usr/bin/clang option to accept ISO C89... none needed
179:info:configure checking for /usr/bin/clang option to accept ISO C99... none needed
180:info:configure checking whether we are using the GNU C++ compiler... yes
181:info:configure checking whether /usr/bin/clang++ accepts -g... yes
182:info:configure checking for ranlib... ranlib
183:info:configure checking for ld... ld
184:info:configure checking for ar... ar
185:info:configure checking for dlltool... no
186:info:configure checking for strip... strip
187:info:configure checking for windres... no
188:info:configure checking for gperf... gperf
189:info:configure checking for man... man
190:info:configure checking for ps2pdf... ps2pdf
191:info:configure checking for git... git
192:info:configure checking for flex... flex
193:info:configure checking for bison... bison
194:info:configure checking for Microsoft Windows... no
195:info:configure checking how to run the C preprocessor... /usr/bin/clang -E
196:info:configure checking for grep that handles long lines and -e... /opt/local/bin/ggrep
197:info:configure checking for egrep... /opt/local/bin/ggrep -E
198:info:configure checking for ANSI C header files... yes
199:info:configure checking for sys/types.h... yes
200:info:configure checking for sys/stat.h... yes
201:info:configure checking for stdlib.h... yes
202:info:configure checking for string.h... yes
203:info:configure checking for memory.h... yes
204:info:configure checking for strings.h... yes
205:info:configure checking for inttypes.h... yes
206:info:configure checking for stdint.h... yes
207:info:configure checking for unistd.h... yes
208:info:configure checking whether __SUNPRO_C is declared... no
209:info:configure checking if gcc supports -Wextra... yes
210:info:configure checking whether __SUNPRO_CC is declared... no
211:info:configure checking how to run the C++ preprocessor... /usr/bin/clang++ -E
212:info:configure checking getopt.h usability... yes
213:info:configure checking getopt.h presence... yes
214:info:configure checking for getopt.h... yes
215:info:configure checking for inttypes.h... (cached) yes
216:info:configure checking libiberty.h usability... no
217:info:configure checking libiberty.h presence... no
218:info:configure checking for libiberty.h... no
219:info:configure checking iosfwd usability... yes
220:info:configure checking iosfwd presence... yes
221:info:configure checking for iosfwd... yes
222:info:configure checking sys/wait.h usability... yes
223:info:configure checking sys/wait.h presence... yes
224:info:configure checking for sys/wait.h... yes
225:info:configure checking size of unsigned long long... 8
226:info:configure checking size of unsigned long... 8
227:info:configure checking size of unsigned... 4
228:info:configure checking for tputs in -ltermcap... yes
229:info:configure checking for readline in -lreadline... yes
230:info:configure checking for add_history in -lhistory... yes
231:info:configure checking readline/readline.h usability... yes
232:info:configure checking readline/readline.h presence... yes
233:info:configure checking for readline/readline.h... yes
234:info:configure checking readline/history.h usability... yes
235:info:configure checking readline/history.h presence... yes
236:info:configure checking for readline/history.h... yes
237:info:configure checking sys/resource.h usability... yes
238:info:configure checking sys/resource.h presence... yes
239:info:configure checking for sys/resource.h... yes
240:info:configure checking for pthread_create in -lpthread... yes
241:info:configure checking for gzwrite in -lz... yes
242:info:configure checking for gzwrite in -lz... (cached) yes
243:info:configure checking for BZ2_bzdopen in -lbz2... yes
244:info:configure checking for BZ2_bzdopen in -lbz2... (cached) yes
245:info:configure checking for size_t... yes
246:info:configure checking for working alloca.h... yes
247:info:configure checking for alloca... yes
248:info:configure checking for _LARGEFILE_SOURCE value needed for large files... no
249:info:configure configure: Not using valgrind hooks
250:info:configure checking for sys/times... yes
251:info:configure checking dlfcn.h usability... yes
252:info:configure checking dlfcn.h presence... yes
253:info:configure checking for dlfcn.h... yes
254:info:configure checking for dlopen in -ldl... yes
255:info:configure checking for a BSD-compatible install... /usr/bin/install -c
256:info:configure checking whether byte ordering is bigendian... no
257:info:configure checking for extra libs needed...
258:info:configure checking for flag to make position independent code... -fPIC
259:info:configure checking for realpath... yes
260:info:configure checking for fopen64... no
261:info:configure checking for library containing lround... none required
262:info:configure checking for library containing llround... none required
263:info:configure checking for library containing nan... none required
264:info:configure checking for library containing fmin... none required
265:info:configure checking for library containing fmax... none required
266:info:configure checking if uint64_t and unsigned long are identical... no
267:info:configure checking for -rdynamic compiler flag... -Wl,-all_load
268:info:configure checking for shared library link flag... -bundle -undefined suppress -flat_namespace
269:info:configure checking for leading underscores... no
270:info:configure checking for trailing underscores... no
271:info:configure checking for sanity of prefix... ok
272:info:configure checking for sanity of exec_prefix... ok
273:info:configure checking for sanity of libdir... ok
274:info:configure configure: creating ./config.status
275:info:configure config.status: creating Makefile
276:info:configure config.status: creating ivlpp/Makefile
277:info:configure config.status: creating vhdlpp/Makefile
278:info:configure config.status: creating vvp/Makefile
279:info:configure config.status: creating vpi/Makefile
280:info:configure config.status: creating driver/Makefile
281:info:configure config.status: creating driver-vpi/Makefile
282:info:configure config.status: creating cadpli/Makefile
283:info:configure config.status: creating libveriuser/Makefile
284:info:configure config.status: creating tgt-null/Makefile
285:info:configure config.status: creating tgt-stub/Makefile
286:info:configure config.status: creating tgt-vvp/Makefile
287:info:configure config.status: creating tgt-vhdl/Makefile
288:info:configure config.status: creating tgt-fpga/Makefile
289:info:configure config.status: creating tgt-verilog/Makefile
290:info:configure config.status: creating tgt-pal/Makefile
291:info:configure config.status: creating tgt-vlog95/Makefile
292:info:configure config.status: creating tgt-pcb/Makefile
293:info:configure config.status: creating tgt-blif/Makefile
294:info:configure config.status: creating tgt-sizer/Makefile
295:info:configure config.status: creating config.h
296:info:configure config.status: creating _pli_types.h
297:info:configure config.status: creating vhdlpp/vhdlpp_config.h
298:info:configure config.status: creating vvp/config.h
299:info:configure config.status: creating vpi/vpi_config.h
300:info:configure config.status: creating libveriuser/config.h
301:info:configure config.status: creating tgt-vvp/vvp_config.h
302:info:configure config.status: creating tgt-vhdl/vhdl_config.h
303:info:configure config.status: creating tgt-pcb/pcb_config.h
304:debug:configure Privilege de-escalation not attempted as not running as root.
305:debug:build build phase started at Tue Nov 24 12:35:31 GMT 2020
306:notice:build --->  Building iverilog
307:debug:build Executing org.macports.build (iverilog)
308:debug:build Environment:
309:debug:build CC_PRINT_OPTIONS='YES'
310:debug:build CC_PRINT_OPTIONS_FILE='/opt/local/var/macports/build/_opt_local_var_macports_sources_rsync.macports.org_macports_release_tarballs_ports_science_iverilog/iverilog/work/.CC_PRINT_OPTIONS'
311:debug:build CPATH='/opt/local/include'
312:debug:build DEVELOPER_DIR='/Library/Developer/CommandLineTools'
313:debug:build LIBRARY_PATH='/opt/local/lib'
314:debug:build MACOSX_DEPLOYMENT_TARGET='11.0'
315:debug:build SDKROOT='/Library/Developer/CommandLineTools/SDKs/MacOSX11.0.sdk'
316:info:build Executing:  cd "/opt/local/var/macports/build/_opt_local_var_macports_sources_rsync.macports.org_macports_release_tarballs_ports_science_iverilog/iverilog/work/verilog-10.3" && /usr/bin/make -j4 -w all
317:debug:build system:  cd "/opt/local/var/macports/build/_opt_local_var_macports_sources_rsync.macports.org_macports_release_tarballs_ports_science_iverilog/iverilog/work/verilog-10.3" && /usr/bin/make -j4 -w all
318:info:build make: Entering directory `/opt/local/var/macports/build/_opt_local_var_macports_sources_rsync.macports.org_macports_release_tarballs_ports_science_iverilog/iverilog/work/verilog-10.3'
319:info:build mkdir dep
320:info:build /usr/bin/clang++ -DHAVE_CONFIG_H -I. -Ilibmisc -I/opt/local/include -isysroot/Library/Developer/CommandLineTools/SDKs/MacOSX11.0.sdk -Wall -Wextra -Wshadow   -pipe -Os -stdlib=libc++ -isysroot/Library/Developer/CommandLineTools/SDKs/MacOSX11.0.sdk -arch x86_64 -MD -c main.cc -o main.o
321:info:build /usr/bin/clang++ -DHAVE_CONFIG_H -I. -Ilibmisc -I/opt/local/include -isysroot/Library/Developer/CommandLineTools/SDKs/MacOSX11.0.sdk -Wall -Wextra -Wshadow   -pipe -Os -stdlib=libc++ -isysroot/Library/Developer/CommandLineTools/SDKs/MacOSX11.0.sdk -arch x86_64 -MD -c async.cc -o async.o
322:info:build /usr/bin/clang++ -DHAVE_CONFIG_H -I. -Ilibmisc -I/opt/local/include -isysroot/Library/Developer/CommandLineTools/SDKs/MacOSX11.0.sdk -Wall -Wextra -Wshadow   -pipe -Os -stdlib=libc++ -isysroot/Library/Developer/CommandLineTools/SDKs/MacOSX11.0.sdk -arch x86_64 -MD -c design_dump.cc -o design_dump.o
323:info:build /usr/bin/clang++ -DHAVE_CONFIG_H -I. -Ilibmisc -I/opt/local/include -isysroot/Library/Developer/CommandLineTools/SDKs/MacOSX11.0.sdk -Wall -Wextra -Wshadow   -pipe -Os -stdlib=libc++ -isysroot/Library/Developer/CommandLineTools/SDKs/MacOSX11.0.sdk -arch x86_64 -MD -c discipline.cc -o discipline.o
324:info:build mv discipline.d dep/discipline.d
325:info:build /usr/bin/clang++ -DHAVE_CONFIG_H -I. -Ilibmisc -I/opt/local/include -isysroot/Library/Developer/CommandLineTools/SDKs/MacOSX11.0.sdk -Wall -Wextra -Wshadow   -pipe -Os -stdlib=libc++ -isysroot/Library/Developer/CommandLineTools/SDKs/MacOSX11.0.sdk -arch x86_64 -MD -c dup_expr.cc -o dup_expr.o
326:info:build mv async.d dep/async.d
327:info:build /usr/bin/clang++ -DHAVE_CONFIG_H -I. -Ilibmisc -I/opt/local/include -isysroot/Library/Developer/CommandLineTools/SDKs/MacOSX11.0.sdk -Wall -Wextra -Wshadow   -pipe -Os -stdlib=libc++ -isysroot/Library/Developer/CommandLineTools/SDKs/MacOSX11.0.sdk -arch x86_64 -MD -c elaborate.cc -o elaborate.o
328:info:build mv dup_expr.d dep/dup_expr.d
329:info:build /usr/bin/clang++ -DHAVE_CONFIG_H -I. -Ilibmisc -I/opt/local/include -isysroot/Library/Developer/CommandLineTools/SDKs/MacOSX11.0.sdk -Wall -Wextra -Wshadow   -pipe -Os -stdlib=libc++ -isysroot/Library/Developer/CommandLineTools/SDKs/MacOSX11.0.sdk -arch x86_64 -MD -c elab_expr.cc -o elab_expr.o
330:info:build mv design_dump.d dep/design_dump.d
331:info:build /usr/bin/clang++ -DHAVE_CONFIG_H -I. -Ilibmisc -I/opt/local/include -isysroot/Library/Developer/CommandLineTools/SDKs/MacOSX11.0.sdk -Wall -Wextra -Wshadow   -pipe -Os -stdlib=libc++ -isysroot/Library/Developer/CommandLineTools/SDKs/MacOSX11.0.sdk -arch x86_64 -MD -c elaborate_analog.cc -o elaborate_analog.o
332:info:build mv main.d dep/main.d
333:info:build /usr/bin/clang++ -DHAVE_CONFIG_H -I. -Ilibmisc -I/opt/local/include -isysroot/Library/Developer/CommandLineTools/SDKs/MacOSX11.0.sdk -Wall -Wextra -Wshadow   -pipe -Os -stdlib=libc++ -isysroot/Library/Developer/CommandLineTools/SDKs/MacOSX11.0.sdk -arch x86_64 -MD -c elab_lval.cc -o elab_lval.o
334:info:build mv elaborate_analog.d dep/elaborate_analog.d
335:info:build /usr/bin/clang++ -DHAVE_CONFIG_H -I. -Ilibmisc -I/opt/local/include -isysroot/Library/Developer/CommandLineTools/SDKs/MacOSX11.0.sdk -Wall -Wextra -Wshadow   -pipe -Os -stdlib=libc++ -isysroot/Library/Developer/CommandLineTools/SDKs/MacOSX11.0.sdk -arch x86_64 -MD -c elab_net.cc -o elab_net.o
336:info:build mv elab_lval.d dep/elab_lval.d
337:info:build /usr/bin/clang++ -DHAVE_CONFIG_H -I. -Ilibmisc -I/opt/local/include -isysroot/Library/Developer/CommandLineTools/SDKs/MacOSX11.0.sdk -Wall -Wextra -Wshadow   -pipe -Os -stdlib=libc++ -isysroot/Library/Developer/CommandLineTools/SDKs/MacOSX11.0.sdk -arch x86_64 -MD -c elab_scope.cc -o elab_scope.o
338:info:build mv elab_net.d dep/elab_net.d
339:info:build /usr/bin/clang++ -DHAVE_CONFIG_H -I. -Ilibmisc -I/opt/local/include -isysroot/Library/Developer/CommandLineTools/SDKs/MacOSX11.0.sdk -Wall -Wextra -Wshadow   -pipe -Os -stdlib=libc++ -isysroot/Library/Developer/CommandLineTools/SDKs/MacOSX11.0.sdk -arch x86_64 -MD -c elab_sig.cc -o elab_sig.o
340:info:build mv elab_expr.d dep/elab_expr.d
341:info:build /usr/bin/clang++ -DHAVE_CONFIG_H -I. -Ilibmisc -I/opt/local/include -isysroot/Library/Developer/CommandLineTools/SDKs/MacOSX11.0.sdk -Wall -Wextra -Wshadow   -pipe -Os -stdlib=libc++ -isysroot/Library/Developer/CommandLineTools/SDKs/MacOSX11.0.sdk -arch x86_64 -MD -c elab_sig_analog.cc -o elab_sig_analog.o
342:info:build mv elaborate.d dep/elaborate.d
343:info:build /usr/bin/clang++ -DHAVE_CONFIG_H -I. -Ilibmisc -I/opt/local/include -isysroot/Library/Developer/CommandLineTools/SDKs/MacOSX11.0.sdk -Wall -Wextra -Wshadow   -pipe -Os -stdlib=libc++ -isysroot/Library/Developer/CommandLineTools/SDKs/MacOSX11.0.sdk -arch x86_64 -MD -c elab_type.cc -o elab_type.o
344:info:build mv elab_sig_analog.d dep/elab_sig_analog.d
345:info:build /usr/bin/clang++ -DHAVE_CONFIG_H -I. -Ilibmisc -I/opt/local/include -isysroot/Library/Developer/CommandLineTools/SDKs/MacOSX11.0.sdk -Wall -Wextra -Wshadow   -pipe -Os -stdlib=libc++ -isysroot/Library/Developer/CommandLineTools/SDKs/MacOSX11.0.sdk -arch x86_64 -MD -c emit.cc -o emit.o
346:info:build mv elab_sig.d dep/elab_sig.d
347:info:build /usr/bin/clang++ -DHAVE_CONFIG_H -I. -Ilibmisc -I/opt/local/include -isysroot/Library/Developer/CommandLineTools/SDKs/MacOSX11.0.sdk -Wall -Wextra -Wshadow   -pipe -Os -stdlib=libc++ -isysroot/Library/Developer/CommandLineTools/SDKs/MacOSX11.0.sdk -arch x86_64 -MD -c eval.cc -o eval.o
348:info:build mv elab_scope.d dep/elab_scope.d
349:info:build /usr/bin/clang++ -DHAVE_CONFIG_H -I. -Ilibmisc -I/opt/local/include -isysroot/Library/Developer/CommandLineTools/SDKs/MacOSX11.0.sdk -Wall -Wextra -Wshadow   -pipe -Os -stdlib=libc++ -isysroot/Library/Developer/CommandLineTools/SDKs/MacOSX11.0.sdk -arch x86_64 -MD -c eval_attrib.cc -o eval_attrib.o
350:info:build mv elab_type.d dep/elab_type.d
351:info:build /usr/bin/clang++ -DHAVE_CONFIG_H -I. -Ilibmisc -I/opt/local/include -isysroot/Library/Developer/CommandLineTools/SDKs/MacOSX11.0.sdk -Wall -Wextra -Wshadow   -pipe -Os -stdlib=libc++ -isysroot/Library/Developer/CommandLineTools/SDKs/MacOSX11.0.sdk -arch x86_64 -MD -c eval_tree.cc -o eval_tree.o
352:info:build mv eval_attrib.d dep/eval_attrib.d
353:info:build /usr/bin/clang++ -DHAVE_CONFIG_H -I. -Ilibmisc -I/opt/local/include -isysroot/Library/Developer/CommandLineTools/SDKs/MacOSX11.0.sdk -Wall -Wextra -Wshadow   -pipe -Os -stdlib=libc++ -isysroot/Library/Developer/CommandLineTools/SDKs/MacOSX11.0.sdk -arch x86_64 -MD -c expr_synth.cc -o expr_synth.o
354:info:build mv eval.d dep/eval.d
355:info:build /usr/bin/clang++ -DHAVE_CONFIG_H -I. -Ilibmisc -I/opt/local/include -isysroot/Library/Developer/CommandLineTools/SDKs/MacOSX11.0.sdk -Wall -Wextra -Wshadow   -pipe -Os -stdlib=libc++ -isysroot/Library/Developer/CommandLineTools/SDKs/MacOSX11.0.sdk -arch x86_64 -MD -c functor.cc -o functor.o
356:info:build mv emit.d dep/emit.d
357:info:build flex -s -t lexor.lex > lexor.cc
358:info:build bison --verbose -t -p VL -d -o parse.cc parse.y
359:info:build mv functor.d dep/functor.d
360:info:build /usr/bin/clang++ -DHAVE_CONFIG_H -I. -Ilibmisc -I/opt/local/include -isysroot/Library/Developer/CommandLineTools/SDKs/MacOSX11.0.sdk -Wall -Wextra -Wshadow   -pipe -Os -stdlib=libc++ -isysroot/Library/Developer/CommandLineTools/SDKs/MacOSX11.0.sdk -arch x86_64 -MD -c link_const.cc -o link_const.o
361:info:build mv expr_synth.d dep/expr_synth.d
362:info:build /usr/bin/clang++ -DHAVE_CONFIG_H -I. -Ilibmisc -I/opt/local/include -isysroot/Library/Developer/CommandLineTools/SDKs/MacOSX11.0.sdk -Wall -Wextra -Wshadow   -pipe -Os -stdlib=libc++ -isysroot/Library/Developer/CommandLineTools/SDKs/MacOSX11.0.sdk -arch x86_64 -MD -c load_module.cc -o load_module.o
363:info:build /usr/bin/clang++ -DHAVE_CONFIG_H -I. -Ilibmisc -I/opt/local/include -isysroot/Library/Developer/CommandLineTools/SDKs/MacOSX11.0.sdk -Wall -Wextra -Wshadow   -pipe -Os -stdlib=libc++ -isysroot/Library/Developer/CommandLineTools/SDKs/MacOSX11.0.sdk -arch x86_64 -MD -c netlist.cc -o netlist.o
364:info:build mv eval_tree.d dep/eval_tree.d
365:info:build /usr/bin/clang++ -DHAVE_CONFIG_H -I. -Ilibmisc -I/opt/local/include -isysroot/Library/Developer/CommandLineTools/SDKs/MacOSX11.0.sdk -Wall -Wextra -Wshadow   -pipe -Os -stdlib=libc++ -isysroot/Library/Developer/CommandLineTools/SDKs/MacOSX11.0.sdk -arch x86_64 -MD -c netmisc.cc -o netmisc.o
366:info:build mv link_const.d dep/link_const.d
367:info:build /usr/bin/clang++ -DHAVE_CONFIG_H -I. -Ilibmisc -I/opt/local/include -isysroot/Library/Developer/CommandLineTools/SDKs/MacOSX11.0.sdk -Wall -Wextra -Wshadow   -pipe -Os -stdlib=libc++ -isysroot/Library/Developer/CommandLineTools/SDKs/MacOSX11.0.sdk -arch x86_64 -MD -c nettypes.cc -o nettypes.o
368:info:build mv nettypes.d dep/nettypes.d
369:info:build /usr/bin/clang++ -DHAVE_CONFIG_H -I. -Ilibmisc -I/opt/local/include -isysroot/Library/Developer/CommandLineTools/SDKs/MacOSX11.0.sdk -Wall -Wextra -Wshadow   -pipe -Os -stdlib=libc++ -isysroot/Library/Developer/CommandLineTools/SDKs/MacOSX11.0.sdk -arch x86_64 -MD -c net_analog.cc -o net_analog.o
370:info:build mv load_module.d dep/load_module.d
371:info:build /usr/bin/clang++ -DHAVE_CONFIG_H -I. -Ilibmisc -I/opt/local/include -isysroot/Library/Developer/CommandLineTools/SDKs/MacOSX11.0.sdk -Wall -Wextra -Wshadow   -pipe -Os -stdlib=libc++ -isysroot/Library/Developer/CommandLineTools/SDKs/MacOSX11.0.sdk -arch x86_64 -MD -c net_assign.cc -o net_assign.o
372:info:build mv net_analog.d dep/net_analog.d
373:info:build /usr/bin/clang++ -DHAVE_CONFIG_H -I. -Ilibmisc -I/opt/local/include -isysroot/Library/Developer/CommandLineTools/SDKs/MacOSX11.0.sdk -Wall -Wextra -Wshadow   -pipe -Os -stdlib=libc++ -isysroot/Library/Developer/CommandLineTools/SDKs/MacOSX11.0.sdk -arch x86_64 -MD -c net_design.cc -o net_design.o
374:info:build mv net_assign.d dep/net_assign.d
375:info:build /usr/bin/clang++ -DHAVE_CONFIG_H -I. -Ilibmisc -I/opt/local/include -isysroot/Library/Developer/CommandLineTools/SDKs/MacOSX11.0.sdk -Wall -Wextra -Wshadow   -pipe -Os -stdlib=libc++ -isysroot/Library/Developer/CommandLineTools/SDKs/MacOSX11.0.sdk -arch x86_64 -MD -c netclass.cc -o netclass.o
376:info:build mv netmisc.d dep/netmisc.d
377:info:build /usr/bin/clang++ -DHAVE_CONFIG_H -I. -Ilibmisc -I/opt/local/include -isysroot/Library/Developer/CommandLineTools/SDKs/MacOSX11.0.sdk -Wall -Wextra -Wshadow   -pipe -Os -stdlib=libc++ -isysroot/Library/Developer/CommandLineTools/SDKs/MacOSX11.0.sdk -arch x86_64 -MD -c netdarray.cc -o netdarray.o
378:info:build mv netdarray.d dep/netdarray.d
379:info:build /usr/bin/clang++ -DHAVE_CONFIG_H -I. -Ilibmisc -I/opt/local/include -isysroot/Library/Developer/CommandLineTools/SDKs/MacOSX11.0.sdk -Wall -Wextra -Wshadow   -pipe -Os -stdlib=libc++ -isysroot/Library/Developer/CommandLineTools/SDKs/MacOSX11.0.sdk -arch x86_64 -MD -c netenum.cc -o netenum.o
380:info:build mv netlist.d dep/netlist.d
381:info:build /usr/bin/clang++ -DHAVE_CONFIG_H -I. -Ilibmisc -I/opt/local/include -isysroot/Library/Developer/CommandLineTools/SDKs/MacOSX11.0.sdk -Wall -Wextra -Wshadow   -pipe -Os -stdlib=libc++ -isysroot/Library/Developer/CommandLineTools/SDKs/MacOSX11.0.sdk -arch x86_64 -MD -c netparray.cc -o netparray.o
382:info:build mv netclass.d dep/netclass.d
383:info:build /usr/bin/clang++ -DHAVE_CONFIG_H -I. -Ilibmisc -I/opt/local/include -isysroot/Library/Developer/CommandLineTools/SDKs/MacOSX11.0.sdk -Wall -Wextra -Wshadow   -pipe -Os -stdlib=libc++ -isysroot/Library/Developer/CommandLineTools/SDKs/MacOSX11.0.sdk -arch x86_64 -MD -c netqueue.cc -o netqueue.o
384:info:build mv netparray.d dep/netparray.d
385:info:build /usr/bin/clang++ -DHAVE_CONFIG_H -I. -Ilibmisc -I/opt/local/include -isysroot/Library/Developer/CommandLineTools/SDKs/MacOSX11.0.sdk -Wall -Wextra -Wshadow   -pipe -Os -stdlib=libc++ -isysroot/Library/Developer/CommandLineTools/SDKs/MacOSX11.0.sdk -arch x86_64 -MD -c netscalar.cc -o netscalar.o
386:info:build mv netqueue.d dep/netqueue.d
387:info:build /usr/bin/clang++ -DHAVE_CONFIG_H -I. -Ilibmisc -I/opt/local/include -isysroot/Library/Developer/CommandLineTools/SDKs/MacOSX11.0.sdk -Wall -Wextra -Wshadow   -pipe -Os -stdlib=libc++ -isysroot/Library/Developer/CommandLineTools/SDKs/MacOSX11.0.sdk -arch x86_64 -MD -c netstruct.cc -o netstruct.o
388:info:build mv netscalar.d dep/netscalar.d
389:info:build /usr/bin/clang++ -DHAVE_CONFIG_H -I. -Ilibmisc -I/opt/local/include -isysroot/Library/Developer/CommandLineTools/SDKs/MacOSX11.0.sdk -Wall -Wextra -Wshadow   -pipe -Os -stdlib=libc++ -isysroot/Library/Developer/CommandLineTools/SDKs/MacOSX11.0.sdk -arch x86_64 -MD -c netvector.cc -o netvector.o
390:info:build mv netenum.d dep/netenum.d
391:info:build /usr/bin/clang++ -DHAVE_CONFIG_H -I. -Ilibmisc -I/opt/local/include -isysroot/Library/Developer/CommandLineTools/SDKs/MacOSX11.0.sdk -Wall -Wextra -Wshadow   -pipe -Os -stdlib=libc++ -isysroot/Library/Developer/CommandLineTools/SDKs/MacOSX11.0.sdk -arch x86_64 -MD -c net_event.cc -o net_event.o
392:info:build mv net_design.d dep/net_design.d
393:info:build /usr/bin/clang++ -DHAVE_CONFIG_H -I. -Ilibmisc -I/opt/local/include -isysroot/Library/Developer/CommandLineTools/SDKs/MacOSX11.0.sdk -Wall -Wextra -Wshadow   -pipe -Os -stdlib=libc++ -isysroot/Library/Developer/CommandLineTools/SDKs/MacOSX11.0.sdk -arch x86_64 -MD -c net_expr.cc -o net_expr.o
394:info:build mv netvector.d dep/netvector.d
395:info:build /usr/bin/clang++ -DHAVE_CONFIG_H -I. -Ilibmisc -I/opt/local/include -isysroot/Library/Developer/CommandLineTools/SDKs/MacOSX11.0.sdk -Wall -Wextra -Wshadow   -pipe -Os -stdlib=libc++ -isysroot/Library/Developer/CommandLineTools/SDKs/MacOSX11.0.sdk -arch x86_64 -MD -c net_func.cc -o net_func.o
396:info:build mv netstruct.d dep/netstruct.d
397:info:build /usr/bin/clang++ -DHAVE_CONFIG_H -I. -Ilibmisc -I/opt/local/include -isysroot/Library/Developer/CommandLineTools/SDKs/MacOSX11.0.sdk -Wall -Wextra -Wshadow   -pipe -Os -stdlib=libc++ -isysroot/Library/Developer/CommandLineTools/SDKs/MacOSX11.0.sdk -arch x86_64 -MD -c net_func_eval.cc -o net_func_eval.o
398:info:build mv net_event.d dep/net_event.d
399:info:build /usr/bin/clang++ -DHAVE_CONFIG_H -I. -Ilibmisc -I/opt/local/include -isysroot/Library/Developer/CommandLineTools/SDKs/MacOSX11.0.sdk -Wall -Wextra -Wshadow   -pipe -Os -stdlib=libc++ -isysroot/Library/Developer/CommandLineTools/SDKs/MacOSX11.0.sdk -arch x86_64 -MD -c net_link.cc -o net_link.o
400:info:build mv net_expr.d dep/net_expr.d
401:info:build /usr/bin/clang++ -DHAVE_CONFIG_H -I. -Ilibmisc -I/opt/local/include -isysroot/Library/Developer/CommandLineTools/SDKs/MacOSX11.0.sdk -Wall -Wextra -Wshadow   -pipe -Os -stdlib=libc++ -isysroot/Library/Developer/CommandLineTools/SDKs/MacOSX11.0.sdk -arch x86_64 -MD -c net_modulo.cc -o net_modulo.o
402:info:build mv net_func.d dep/net_func.d
403:info:build /usr/bin/clang++ -DHAVE_CONFIG_H -I. -Ilibmisc -I/opt/local/include -isysroot/Library/Developer/CommandLineTools/SDKs/MacOSX11.0.sdk -Wall -Wextra -Wshadow   -pipe -Os -stdlib=libc++ -isysroot/Library/Developer/CommandLineTools/SDKs/MacOSX11.0.sdk -arch x86_64 -MD -c net_nex_input.cc -o net_nex_input.o
404:info:build mv net_modulo.d dep/net_modulo.d
405:info:build /usr/bin/clang++ -DHAVE_CONFIG_H -I. -Ilibmisc -I/opt/local/include -isysroot/Library/Developer/CommandLineTools/SDKs/MacOSX11.0.sdk -Wall -Wextra -Wshadow   -pipe -Os -stdlib=libc++ -isysroot/Library/Developer/CommandLineTools/SDKs/MacOSX11.0.sdk -arch x86_64 -MD -c net_nex_output.cc -o net_nex_output.o
406:info:build mv net_link.d dep/net_link.d
407:info:build /usr/bin/clang++ -DHAVE_CONFIG_H -I. -Ilibmisc -I/opt/local/include -isysroot/Library/Developer/CommandLineTools/SDKs/MacOSX11.0.sdk -Wall -Wextra -Wshadow   -pipe -Os -stdlib=libc++ -isysroot/Library/Developer/CommandLineTools/SDKs/MacOSX11.0.sdk -arch x86_64 -MD -c net_proc.cc -o net_proc.o
408:info:build mv net_nex_input.d dep/net_nex_input.d
409:info:build /usr/bin/clang++ -DHAVE_CONFIG_H -I. -Ilibmisc -I/opt/local/include -isysroot/Library/Developer/CommandLineTools/SDKs/MacOSX11.0.sdk -Wall -Wextra -Wshadow   -pipe -Os -stdlib=libc++ -isysroot/Library/Developer/CommandLineTools/SDKs/MacOSX11.0.sdk -arch x86_64 -MD -c net_scope.cc -o net_scope.o
410:info:build mv net_func_eval.d dep/net_func_eval.d
411:info:build /usr/bin/clang++ -DHAVE_CONFIG_H -I. -Ilibmisc -I/opt/local/include -isysroot/Library/Developer/CommandLineTools/SDKs/MacOSX11.0.sdk -Wall -Wextra -Wshadow   -pipe -Os -stdlib=libc++ -isysroot/Library/Developer/CommandLineTools/SDKs/MacOSX11.0.sdk -arch x86_64 -MD -c net_tran.cc -o net_tran.o
412:info:build mv net_nex_output.d dep/net_nex_output.d
413:info:build /usr/bin/clang++ -DHAVE_CONFIG_H -I. -Ilibmisc -I/opt/local/include -isysroot/Library/Developer/CommandLineTools/SDKs/MacOSX11.0.sdk -Wall -Wextra -Wshadow   -pipe -Os -stdlib=libc++ -isysroot/Library/Developer/CommandLineTools/SDKs/MacOSX11.0.sdk -arch x86_64 -MD -c net_udp.cc -o net_udp.o
414:info:build mv net_proc.d dep/net_proc.d
415:info:build /usr/bin/clang++ -DHAVE_CONFIG_H -I. -Ilibmisc -I/opt/local/include -isysroot/Library/Developer/CommandLineTools/SDKs/MacOSX11.0.sdk -Wall -Wextra -Wshadow   -pipe -Os -stdlib=libc++ -isysroot/Library/Developer/CommandLineTools/SDKs/MacOSX11.0.sdk -arch x86_64 -MD -c pad_to_width.cc -o pad_to_width.o
416:info:build mv net_tran.d dep/net_tran.d
417:info:build /usr/bin/clang++ -DHAVE_CONFIG_H -I. -Ilibmisc -I/opt/local/include -isysroot/Library/Developer/CommandLineTools/SDKs/MacOSX11.0.sdk -Wall -Wextra -Wshadow   -pipe -Os -stdlib=libc++ -isysroot/Library/Developer/CommandLineTools/SDKs/MacOSX11.0.sdk -arch x86_64 -MD -c parse.cc -o parse.o
418:info:build mv net_udp.d dep/net_udp.d
419:info:build /usr/bin/clang++ -DHAVE_CONFIG_H -I. -Ilibmisc -I/opt/local/include -isysroot/Library/Developer/CommandLineTools/SDKs/MacOSX11.0.sdk -Wall -Wextra -Wshadow   -pipe -Os -stdlib=libc++ -isysroot/Library/Developer/CommandLineTools/SDKs/MacOSX11.0.sdk -arch x86_64 -MD -c parse_misc.cc -o parse_misc.o
420:info:build mv pad_to_width.d dep/pad_to_width.d
421:info:build /usr/bin/clang++ -DHAVE_CONFIG_H -I. -Ilibmisc -I/opt/local/include -isysroot/Library/Developer/CommandLineTools/SDKs/MacOSX11.0.sdk -Wall -Wextra -Wshadow   -pipe -Os -stdlib=libc++ -isysroot/Library/Developer/CommandLineTools/SDKs/MacOSX11.0.sdk -arch x86_64 -MD -c pform.cc -o pform.o
422:info:build parse.cc:7885:18: warning: missing field 'text' initializer [-Wmissing-field-initializers]
423:info:build   = { 1, 1, 1, 1 }
424:info:build                  ^
425:info:build mv net_scope.d dep/net_scope.d
426:info:build /usr/bin/clang++ -DHAVE_CONFIG_H -I. -Ilibmisc -I/opt/local/include -isysroot/Library/Developer/CommandLineTools/SDKs/MacOSX11.0.sdk -Wall -Wextra -Wshadow   -pipe -Os -stdlib=libc++ -isysroot/Library/Developer/CommandLineTools/SDKs/MacOSX11.0.sdk -arch x86_64 -MD -c pform_analog.cc -o pform_analog.o
427:info:build mv parse_misc.d dep/parse_misc.d
428:info:build /usr/bin/clang++ -DHAVE_CONFIG_H -I. -Ilibmisc -I/opt/local/include -isysroot/Library/Developer/CommandLineTools/SDKs/MacOSX11.0.sdk -Wall -Wextra -Wshadow   -pipe -Os -stdlib=libc++ -isysroot/Library/Developer/CommandLineTools/SDKs/MacOSX11.0.sdk -arch x86_64 -MD -c pform_disciplines.cc -o pform_disciplines.o
429:info:build mv pform_analog.d dep/pform_analog.d
430:info:build /usr/bin/clang++ -DHAVE_CONFIG_H -I. -Ilibmisc -I/opt/local/include -isysroot/Library/Developer/CommandLineTools/SDKs/MacOSX11.0.sdk -Wall -Wextra -Wshadow   -pipe -Os -stdlib=libc++ -isysroot/Library/Developer/CommandLineTools/SDKs/MacOSX11.0.sdk -arch x86_64 -MD -c pform_dump.cc -o pform_dump.o
431:info:build mv pform_disciplines.d dep/pform_disciplines.d
432:info:build /usr/bin/clang++ -DHAVE_CONFIG_H -I. -Ilibmisc -I/opt/local/include -isysroot/Library/Developer/CommandLineTools/SDKs/MacOSX11.0.sdk -Wall -Wextra -Wshadow   -pipe -Os -stdlib=libc++ -isysroot/Library/Developer/CommandLineTools/SDKs/MacOSX11.0.sdk -arch x86_64 -MD -c pform_package.cc -o pform_package.o
433:info:build pform_dump.cc:239:56: warning: expression with side effects will be evaluated despite being used as an operand to 'typeid' [-Wpotentially-evaluated-expression]
434:info:build       out << setw(indent) << "" << (type.get()? typeid(*type).name() : "<nil type>");
435:info:build                                                        ^
436:info:build mv pform_package.d dep/pform_package.d
437:info:build /usr/bin/clang++ -DHAVE_CONFIG_H -I. -Ilibmisc -I/opt/local/include -isysroot/Library/Developer/CommandLineTools/SDKs/MacOSX11.0.sdk -Wall -Wextra -Wshadow   -pipe -Os -stdlib=libc++ -isysroot/Library/Developer/CommandLineTools/SDKs/MacOSX11.0.sdk -arch x86_64 -MD -c pform_pclass.cc -o pform_pclass.o
438:info:build 1 warning generated.
439:info:build mv pform_dump.d dep/pform_dump.d
440:info:build /usr/bin/clang++ -DHAVE_CONFIG_H -I. -Ilibmisc -I/opt/local/include -isysroot/Library/Developer/CommandLineTools/SDKs/MacOSX11.0.sdk -Wall -Wextra -Wshadow   -pipe -Os -stdlib=libc++ -isysroot/Library/Developer/CommandLineTools/SDKs/MacOSX11.0.sdk -arch x86_64 -MD -c pform_class_type.cc -o pform_class_type.o
441:info:build 1 warning generated.
442:info:build mv parse.d dep/parse.d
443:info:build /usr/bin/clang++ -DHAVE_CONFIG_H -I. -Ilibmisc -I/opt/local/include -isysroot/Library/Developer/CommandLineTools/SDKs/MacOSX11.0.sdk -Wall -Wextra -Wshadow   -pipe -Os -stdlib=libc++ -isysroot/Library/Developer/CommandLineTools/SDKs/MacOSX11.0.sdk -arch x86_64 -MD -c pform_string_type.cc -o pform_string_type.o
444:info:build mv pform_pclass.d dep/pform_pclass.d
445:info:build /usr/bin/clang++ -DHAVE_CONFIG_H -I. -Ilibmisc -I/opt/local/include -isysroot/Library/Developer/CommandLineTools/SDKs/MacOSX11.0.sdk -Wall -Wextra -Wshadow   -pipe -Os -stdlib=libc++ -isysroot/Library/Developer/CommandLineTools/SDKs/MacOSX11.0.sdk -arch x86_64 -MD -c pform_struct_type.cc -o pform_struct_type.o
446:info:build mv pform_class_type.d dep/pform_class_type.d
447:info:build /usr/bin/clang++ -DHAVE_CONFIG_H -I. -Ilibmisc -I/opt/local/include -isysroot/Library/Developer/CommandLineTools/SDKs/MacOSX11.0.sdk -Wall -Wextra -Wshadow   -pipe -Os -stdlib=libc++ -isysroot/Library/Developer/CommandLineTools/SDKs/MacOSX11.0.sdk -arch x86_64 -MD -c pform_types.cc -o pform_types.o
448:info:build mv pform.d dep/pform.d
449:info:build /usr/bin/clang++ -DHAVE_CONFIG_H -I. -Ilibmisc -I/opt/local/include -isysroot/Library/Developer/CommandLineTools/SDKs/MacOSX11.0.sdk -Wall -Wextra -Wshadow   -pipe -Os -stdlib=libc++ -isysroot/Library/Developer/CommandLineTools/SDKs/MacOSX11.0.sdk -arch x86_64 -MD -c symbol_search.cc -o symbol_search.o
450:info:build mv pform_string_type.d dep/pform_string_type.d
451:info:build /usr/bin/clang++ -DHAVE_CONFIG_H -I. -Ilibmisc -I/opt/local/include -isysroot/Library/Developer/CommandLineTools/SDKs/MacOSX11.0.sdk -Wall -Wextra -Wshadow   -pipe -Os -stdlib=libc++ -isysroot/Library/Developer/CommandLineTools/SDKs/MacOSX11.0.sdk -arch x86_64 -MD -c sync.cc -o sync.o
452:info:build mv pform_types.d dep/pform_types.d
453:info:build /usr/bin/clang++ -DHAVE_CONFIG_H -I. -Ilibmisc -I/opt/local/include -isysroot/Library/Developer/CommandLineTools/SDKs/MacOSX11.0.sdk -Wall -Wextra -Wshadow   -pipe -Os -stdlib=libc++ -isysroot/Library/Developer/CommandLineTools/SDKs/MacOSX11.0.sdk -arch x86_64 -MD -c sys_funcs.cc -o sys_funcs.o
454:info:build mv pform_struct_type.d dep/pform_struct_type.d
455:info:build /usr/bin/clang++ -DHAVE_CONFIG_H -I. -Ilibmisc -I/opt/local/include -isysroot/Library/Developer/CommandLineTools/SDKs/MacOSX11.0.sdk -Wall -Wextra -Wshadow   -pipe -Os -stdlib=libc++ -isysroot/Library/Developer/CommandLineTools/SDKs/MacOSX11.0.sdk -arch x86_64 -MD -c verinum.cc -o verinum.o
456:info:build mv symbol_search.d dep/symbol_search.d
457:info:build /usr/bin/clang++ -DHAVE_CONFIG_H -I. -Ilibmisc -I/opt/local/include -isysroot/Library/Developer/CommandLineTools/SDKs/MacOSX11.0.sdk -Wall -Wextra -Wshadow   -pipe -Os -stdlib=libc++ -isysroot/Library/Developer/CommandLineTools/SDKs/MacOSX11.0.sdk -arch x86_64 -MD -c verireal.cc -o verireal.o
458:info:build mv sync.d dep/sync.d
459:info:build /usr/bin/clang++ -DHAVE_CONFIG_H -I. -Ilibmisc -I/opt/local/include -isysroot/Library/Developer/CommandLineTools/SDKs/MacOSX11.0.sdk -Wall -Wextra -Wshadow   -pipe -Os -stdlib=libc++ -isysroot/Library/Developer/CommandLineTools/SDKs/MacOSX11.0.sdk -arch x86_64 -MD -c target.cc -o target.o
460:info:build mv sys_funcs.d dep/sys_funcs.d
461:info:build /usr/bin/clang++ -DHAVE_CONFIG_H -I. -Ilibmisc -I/opt/local/include -isysroot/Library/Developer/CommandLineTools/SDKs/MacOSX11.0.sdk -Wall -Wextra -Wshadow   -pipe -Os -stdlib=libc++ -isysroot/Library/Developer/CommandLineTools/SDKs/MacOSX11.0.sdk -arch x86_64 -MD -c Attrib.cc -o Attrib.o
462:info:build mv Attrib.d dep/Attrib.d
463:info:build /usr/bin/clang++ -DHAVE_CONFIG_H -I. -Ilibmisc -I/opt/local/include -isysroot/Library/Developer/CommandLineTools/SDKs/MacOSX11.0.sdk -Wall -Wextra -Wshadow   -pipe -Os -stdlib=libc++ -isysroot/Library/Developer/CommandLineTools/SDKs/MacOSX11.0.sdk -arch x86_64 -MD -c HName.cc -o HName.o
464:info:build mv verinum.d dep/verinum.d
465:info:build /usr/bin/clang++ -DHAVE_CONFIG_H -I. -Ilibmisc -I/opt/local/include -isysroot/Library/Developer/CommandLineTools/SDKs/MacOSX11.0.sdk -Wall -Wextra -Wshadow   -pipe -Os -stdlib=libc++ -isysroot/Library/Developer/CommandLineTools/SDKs/MacOSX11.0.sdk -arch x86_64 -MD -c Module.cc -o Module.o
466:info:build mv verireal.d dep/verireal.d
467:info:build /usr/bin/clang++ -DHAVE_CONFIG_H -I. -Ilibmisc -I/opt/local/include -isysroot/Library/Developer/CommandLineTools/SDKs/MacOSX11.0.sdk -Wall -Wextra -Wshadow   -pipe -Os -stdlib=libc++ -isysroot/Library/Developer/CommandLineTools/SDKs/MacOSX11.0.sdk -arch x86_64 -MD -c PClass.cc -o PClass.o
468:info:build mv HName.d dep/HName.d
469:info:build /usr/bin/clang++ -DHAVE_CONFIG_H -I. -Ilibmisc -I/opt/local/include -isysroot/Library/Developer/CommandLineTools/SDKs/MacOSX11.0.sdk -Wall -Wextra -Wshadow   -pipe -Os -stdlib=libc++ -isysroot/Library/Developer/CommandLineTools/SDKs/MacOSX11.0.sdk -arch x86_64 -MD -c PDelays.cc -o PDelays.o
470:info:build mv target.d dep/target.d
471:info:build /usr/bin/clang++ -DHAVE_CONFIG_H -I. -Ilibmisc -I/opt/local/include -isysroot/Library/Developer/CommandLineTools/SDKs/MacOSX11.0.sdk -Wall -Wextra -Wshadow   -pipe -Os -stdlib=libc++ -isysroot/Library/Developer/CommandLineTools/SDKs/MacOSX11.0.sdk -arch x86_64 -MD -c PEvent.cc -o PEvent.o
472:info:build mv PClass.d dep/PClass.d
473:info:build /usr/bin/clang++ -DHAVE_CONFIG_H -I. -Ilibmisc -I/opt/local/include -isysroot/Library/Developer/CommandLineTools/SDKs/MacOSX11.0.sdk -Wall -Wextra -Wshadow   -pipe -Os -stdlib=libc++ -isysroot/Library/Developer/CommandLineTools/SDKs/MacOSX11.0.sdk -arch x86_64 -MD -c PExpr.cc -o PExpr.o
474:info:build mv PEvent.d dep/PEvent.d
475:info:build /usr/bin/clang++ -DHAVE_CONFIG_H -I. -Ilibmisc -I/opt/local/include -isysroot/Library/Developer/CommandLineTools/SDKs/MacOSX11.0.sdk -Wall -Wextra -Wshadow   -pipe -Os -stdlib=libc++ -isysroot/Library/Developer/CommandLineTools/SDKs/MacOSX11.0.sdk -arch x86_64 -MD -c PGate.cc -o PGate.o
476:info:build mv Module.d dep/Module.d
477:info:build /usr/bin/clang++ -DHAVE_CONFIG_H -I. -Ilibmisc -I/opt/local/include -isysroot/Library/Developer/CommandLineTools/SDKs/MacOSX11.0.sdk -Wall -Wextra -Wshadow   -pipe -Os -stdlib=libc++ -isysroot/Library/Developer/CommandLineTools/SDKs/MacOSX11.0.sdk -arch x86_64 -MD -c PGenerate.cc -o PGenerate.o
478:info:build mv PDelays.d dep/PDelays.d
479:info:build /usr/bin/clang++ -DHAVE_CONFIG_H -I. -Ilibmisc -I/opt/local/include -isysroot/Library/Developer/CommandLineTools/SDKs/MacOSX11.0.sdk -Wall -Wextra -Wshadow   -pipe -Os -stdlib=libc++ -isysroot/Library/Developer/CommandLineTools/SDKs/MacOSX11.0.sdk -arch x86_64 -MD -c PModport.cc -o PModport.o
480:info:build mv PGate.d dep/PGate.d
481:info:build /usr/bin/clang++ -DHAVE_CONFIG_H -I. -Ilibmisc -I/opt/local/include -isysroot/Library/Developer/CommandLineTools/SDKs/MacOSX11.0.sdk -Wall -Wextra -Wshadow   -pipe -Os -stdlib=libc++ -isysroot/Library/Developer/CommandLineTools/SDKs/MacOSX11.0.sdk -arch x86_64 -MD -c PPackage.cc -o PPackage.o
482:info:build mv PModport.d dep/PModport.d
483:info:build /usr/bin/clang++ -DHAVE_CONFIG_H -I. -Ilibmisc -I/opt/local/include -isysroot/Library/Developer/CommandLineTools/SDKs/MacOSX11.0.sdk -Wall -Wextra -Wshadow   -pipe -Os -stdlib=libc++ -isysroot/Library/Developer/CommandLineTools/SDKs/MacOSX11.0.sdk -arch x86_64 -MD -c PScope.cc -o PScope.o
484:info:build mv PExpr.d dep/PExpr.d
485:info:build /usr/bin/clang++ -DHAVE_CONFIG_H -I. -Ilibmisc -I/opt/local/include -isysroot/Library/Developer/CommandLineTools/SDKs/MacOSX11.0.sdk -Wall -Wextra -Wshadow   -pipe -Os -stdlib=libc++ -isysroot/Library/Developer/CommandLineTools/SDKs/MacOSX11.0.sdk -arch x86_64 -MD -c PSpec.cc -o PSpec.o
486:info:build mv PPackage.d dep/PPackage.d
487:info:build /usr/bin/clang++ -DHAVE_CONFIG_H -I. -Ilibmisc -I/opt/local/include -isysroot/Library/Developer/CommandLineTools/SDKs/MacOSX11.0.sdk -Wall -Wextra -Wshadow   -pipe -Os -stdlib=libc++ -isysroot/Library/Developer/CommandLineTools/SDKs/MacOSX11.0.sdk -arch x86_64 -MD -c PTask.cc -o PTask.o
488:info:build mv PGenerate.d dep/PGenerate.d
489:info:build /usr/bin/clang++ -DHAVE_CONFIG_H -I. -Ilibmisc -I/opt/local/include -isysroot/Library/Developer/CommandLineTools/SDKs/MacOSX11.0.sdk -Wall -Wextra -Wshadow   -pipe -Os -stdlib=libc++ -isysroot/Library/Developer/CommandLineTools/SDKs/MacOSX11.0.sdk -arch x86_64 -MD -c PUdp.cc -o PUdp.o
490:info:build mv PSpec.d dep/PSpec.d
491:info:build /usr/bin/clang++ -DHAVE_CONFIG_H -I. -Ilibmisc -I/opt/local/include -isysroot/Library/Developer/CommandLineTools/SDKs/MacOSX11.0.sdk -Wall -Wextra -Wshadow   -pipe -Os -stdlib=libc++ -isysroot/Library/Developer/CommandLineTools/SDKs/MacOSX11.0.sdk -arch x86_64 -MD -c PFunction.cc -o PFunction.o
492:info:build mv PUdp.d dep/PUdp.d
493:info:build /usr/bin/clang++ -DHAVE_CONFIG_H -I. -Ilibmisc -I/opt/local/include -isysroot/Library/Developer/CommandLineTools/SDKs/MacOSX11.0.sdk -Wall -Wextra -Wshadow   -pipe -Os -stdlib=libc++ -isysroot/Library/Developer/CommandLineTools/SDKs/MacOSX11.0.sdk -arch x86_64 -MD -c PWire.cc -o PWire.o
494:info:build mv PScope.d dep/PScope.d
495:info:build /usr/bin/clang++ -DHAVE_CONFIG_H -I. -Ilibmisc -I/opt/local/include -isysroot/Library/Developer/CommandLineTools/SDKs/MacOSX11.0.sdk -Wall -Wextra -Wshadow   -pipe -Os -stdlib=libc++ -isysroot/Library/Developer/CommandLineTools/SDKs/MacOSX11.0.sdk -arch x86_64 -MD -c Statement.cc -o Statement.o
496:info:build mv PTask.d dep/PTask.d
497:info:build /usr/bin/clang++ -DHAVE_CONFIG_H -I. -Ilibmisc -I/opt/local/include -isysroot/Library/Developer/CommandLineTools/SDKs/MacOSX11.0.sdk -Wall -Wextra -Wshadow   -pipe -Os -stdlib=libc++ -isysroot/Library/Developer/CommandLineTools/SDKs/MacOSX11.0.sdk -arch x86_64 -MD -c AStatement.cc -o AStatement.o
498:info:build mv PFunction.d dep/PFunction.d
499:info:build /usr/bin/clang++ -DHAVE_CONFIG_H -I. -Ilibmisc -I/opt/local/include -isysroot/Library/Developer/CommandLineTools/SDKs/MacOSX11.0.sdk -Wall -Wextra -Wshadow   -pipe -Os -stdlib=libc++ -isysroot/Library/Developer/CommandLineTools/SDKs/MacOSX11.0.sdk -arch x86_64 -MD -c ./libmisc/LineInfo.cc -o LineInfo.o
500:info:build mv PWire.d dep/PWire.d
501:info:build /usr/bin/clang++ -DHAVE_CONFIG_H -I. -Ilibmisc -I/opt/local/include -isysroot/Library/Developer/CommandLineTools/SDKs/MacOSX11.0.sdk -Wall -Wextra -Wshadow   -pipe -Os -stdlib=libc++ -isysroot/Library/Developer/CommandLineTools/SDKs/MacOSX11.0.sdk -arch x86_64 -MD -c ./libmisc/StringHeap.cc -o StringHeap.o
502:info:build mv AStatement.d dep/AStatement.d
503:info:build /usr/bin/clang++ -DHAVE_CONFIG_H -I. -Ilibmisc -I/opt/local/include -isysroot/Library/Developer/CommandLineTools/SDKs/MacOSX11.0.sdk -Wall -Wextra -Wshadow   -pipe -Os -stdlib=libc++ -isysroot/Library/Developer/CommandLineTools/SDKs/MacOSX11.0.sdk -arch x86_64 -MD -c cprop.cc -o cprop.o
504:info:build mv LineInfo.d dep/LineInfo.d
505:info:build /usr/bin/clang++ -DHAVE_CONFIG_H -I. -Ilibmisc -I/opt/local/include -isysroot/Library/Developer/CommandLineTools/SDKs/MacOSX11.0.sdk -Wall -Wextra -Wshadow   -pipe -Os -stdlib=libc++ -isysroot/Library/Developer/CommandLineTools/SDKs/MacOSX11.0.sdk -arch x86_64 -MD -c nodangle.cc -o nodangle.o
506:info:build mv StringHeap.d dep/StringHeap.d
507:info:build /usr/bin/clang++ -DHAVE_CONFIG_H -I. -Ilibmisc -I/opt/local/include -isysroot/Library/Developer/CommandLineTools/SDKs/MacOSX11.0.sdk -Wall -Wextra -Wshadow   -pipe -Os -stdlib=libc++ -isysroot/Library/Developer/CommandLineTools/SDKs/MacOSX11.0.sdk -arch x86_64 -MD -c synth.cc -o synth.o
508:info:build mv Statement.d dep/Statement.d
509:info:build /usr/bin/clang++ -DHAVE_CONFIG_H -I. -Ilibmisc -I/opt/local/include -isysroot/Library/Developer/CommandLineTools/SDKs/MacOSX11.0.sdk -Wall -Wextra -Wshadow   -pipe -Os -stdlib=libc++ -isysroot/Library/Developer/CommandLineTools/SDKs/MacOSX11.0.sdk -arch x86_64 -MD -c synth2.cc -o synth2.o
510:info:build mv nodangle.d dep/nodangle.d
511:info:build bison --verbose -t -p syn_ -o syn-rules.cc syn-rules.y
512:info:build mv synth.d dep/synth.d
513:info:build mv cprop.d dep/cprop.d
514:info:build /usr/bin/clang++ -DHAVE_CONFIG_H -I. -Ilibmisc -I/opt/local/include -isysroot/Library/Developer/CommandLineTools/SDKs/MacOSX11.0.sdk -Wall -Wextra -Wshadow   -pipe -Os -stdlib=libc++ -isysroot/Library/Developer/CommandLineTools/SDKs/MacOSX11.0.sdk -arch x86_64 -MD -c t-dll.cc -o t-dll.o
515:info:build /usr/bin/clang++ -DHAVE_CONFIG_H -I. -Ilibmisc -I/opt/local/include -isysroot/Library/Developer/CommandLineTools/SDKs/MacOSX11.0.sdk -Wall -Wextra -Wshadow   -pipe -Os -stdlib=libc++ -isysroot/Library/Developer/CommandLineTools/SDKs/MacOSX11.0.sdk -arch x86_64 -MD -c t-dll-api.cc -o t-dll-api.o
516:info:build /usr/bin/clang++ -DHAVE_CONFIG_H -I. -Ilibmisc -I/opt/local/include -isysroot/Library/Developer/CommandLineTools/SDKs/MacOSX11.0.sdk -Wall -Wextra -Wshadow   -pipe -Os -stdlib=libc++ -isysroot/Library/Developer/CommandLineTools/SDKs/MacOSX11.0.sdk -arch x86_64 -MD -c t-dll-expr.cc -o t-dll-expr.o
517:info:build mv t-dll-expr.d dep/t-dll-expr.d
518:info:build /usr/bin/clang++ -DHAVE_CONFIG_H -I. -Ilibmisc -I/opt/local/include -isysroot/Library/Developer/CommandLineTools/SDKs/MacOSX11.0.sdk -Wall -Wextra -Wshadow   -pipe -Os -stdlib=libc++ -isysroot/Library/Developer/CommandLineTools/SDKs/MacOSX11.0.sdk -arch x86_64 -MD -c t-dll-proc.cc -o t-dll-proc.o
519:info:build mv t-dll-api.d dep/t-dll-api.d
520:info:build /usr/bin/clang++ -DHAVE_CONFIG_H -I. -Ilibmisc -I/opt/local/include -isysroot/Library/Developer/CommandLineTools/SDKs/MacOSX11.0.sdk -Wall -Wextra -Wshadow   -pipe -Os -stdlib=libc++ -isysroot/Library/Developer/CommandLineTools/SDKs/MacOSX11.0.sdk -arch x86_64 -MD -c t-dll-analog.cc -o t-dll-analog.o
521:info:build mv t-dll-proc.d dep/t-dll-proc.d
522:info:build /usr/bin/clang -Wall -Wextra -Wshadow -Wstrict-prototypes  -pipe -Os -isysroot/Library/Developer/CommandLineTools/SDKs/MacOSX11.0.sdk -arch x86_64 -o version.exe -I. -I. ./version.c
523:info:build sed -e 's;@SHARED@;-bundle -undefined suppress -flat_namespace;' -e 's;@PIC@;-fPIC;' \
524:info:build         -e 's;@SUFFIX@;;' \
525:info:build         -e 's;@IVCC@;/usr/bin/clang;' \
526:info:build         -e 's;@IVCXX@;/usr/bin/clang++;' \
527:info:build         -e 's;@IVCFLAGS@;-Wall -Wextra -Wshadow -Wstrict-prototypes  -pipe -Os -isysroot/Library/Developer/CommandLineTools/SDKs/MacOSX11.0.sdk -arch x86_64;' \
528:info:build         -e 's;@IVCXXFLAGS@;-Wall -Wextra -Wshadow   -pipe -Os -stdlib=libc++ -isysroot/Library/Developer/CommandLineTools/SDKs/MacOSX11.0.sdk -arch x86_64;' \
529:info:build         -e 's;@IVCTARGETFLAGS@;;' \
530:info:build         -e 's;@INCLUDEDIR@;/opt/local/include/iverilog;' \
531:info:build         -e 's;@LIBDIR@;/opt/local/lib;' iverilog-vpi.sh > iverilog-vpi
532:info:build chmod +x iverilog-vpi
533:info:build mv parse.cc.h parse.h 2>/dev/null || mv parse.hh parse.h
534:info:build touch parse.h
535:info:build /usr/bin/clang++ -DHAVE_CONFIG_H -I. -Ilibmisc -I/opt/local/include -isysroot/Library/Developer/CommandLineTools/SDKs/MacOSX11.0.sdk -Wall -Wextra -Wshadow   -pipe -Os -stdlib=libc++ -isysroot/Library/Developer/CommandLineTools/SDKs/MacOSX11.0.sdk -arch x86_64 -MD -c syn-rules.cc -o syn-rules.o
536:info:build mv synth2.d dep/synth2.d
537:info:build ./version.exe `head -1 ./iverilog-vpi.man.in`'\n' > iverilog-vpi.man
538:info:build tail -n +2 ./iverilog-vpi.man.in >> iverilog-vpi.man
539:info:build /usr/bin/clang++ -DHAVE_CONFIG_H -I. -Ilibmisc -I/opt/local/include -isysroot/Library/Developer/CommandLineTools/SDKs/MacOSX11.0.sdk -Wall -Wextra -Wshadow   -pipe -Os -stdlib=libc++ -isysroot/Library/Developer/CommandLineTools/SDKs/MacOSX11.0.sdk -arch x86_64 -MD -c lexor.cc -o lexor.o
540:info:build mv t-dll.d dep/t-dll.d
541:info:build /usr/bin/clang++ -DHAVE_CONFIG_H -I. -Ilibmisc -I/opt/local/include -isysroot/Library/Developer/CommandLineTools/SDKs/MacOSX11.0.sdk -Wall -Wextra -Wshadow   -pipe -Os -stdlib=libc++ -isysroot/Library/Developer/CommandLineTools/SDKs/MacOSX11.0.sdk -arch x86_64 -MD -c lexor_keyword.cc -o lexor_keyword.o
542:info:build mv t-dll-analog.d dep/t-dll-analog.d
543:info:build mv syn-rules.d dep/syn-rules.d
544:info:build mv lexor_keyword.d dep/lexor_keyword.d
545:info:build mv lexor.d dep/lexor.d
546:info:build /usr/bin/clang++ -Wl,-all_load  -L/opt/local/lib -Wl,-headerpad_max_install_names -Wl,-syslibroot,/Library/Developer/CommandLineTools/SDKs/MacOSX11.0.sdk -arch x86_64 -o ivl main.o async.o design_dump.o discipline.o dup_expr.o elaborate.o elab_expr.o elaborate_analog.o elab_lval.o elab_net.o elab_scope.o elab_sig.o elab_sig_analog.o elab_type.o emit.o eval.o eval_attrib.o eval_tree.o expr_synth.o functor.o lexor.o lexor_keyword.o link_const.o load_module.o netlist.o netmisc.o nettypes.o net_analog.o net_assign.o net_design.o netclass.o netdarray.o netenum.o netparray.o netqueue.o netscalar.o netstruct.o netvector.o net_event.o net_expr.o net_func.o net_func_eval.o net_link.o net_modulo.o net_nex_input.o net_nex_output.o net_proc.o net_scope.o net_tran.o net_udp.o pad_to_width.o parse.o parse_misc.o pform.o pform_analog.o pform_disciplines.o pform_dump.o pform_package.o pform_pclass.o pform_class_type.o pform_string_type.o pform_struct_type.o pform_types.o symbol_search.o sync.o sys_funcs.o verinum.o verireal.o target.o Attrib.o HName.o Module.o PClass.o PDelays.o PEvent.o PExpr.o PGate.o PGenerate.o PModport.o PPackage.o PScope.o PSpec.o PTask.o PUdp.o PFunction.o PWire.o Statement.o AStatement.o LineInfo.o StringHeap.o cprop.o nodangle.o synth.o synth2.o syn-rules.o t-dll.o t-dll-api.o t-dll-expr.o t-dll-proc.o t-dll-analog.o -ldl
547:info:build /Library/Developer/CommandLineTools/usr/bin/make -C ivlpp all &&  /Library/Developer/CommandLineTools/usr/bin/make -C vhdlpp all &&  /Library/Developer/CommandLineTools/usr/bin/make -C vvp all &&  /Library/Developer/CommandLineTools/usr/bin/make -C vpi all &&  /Library/Developer/CommandLineTools/usr/bin/make -C libveriuser all &&  /Library/Developer/CommandLineTools/usr/bin/make -C cadpli all &&  /Library/Developer/CommandLineTools/usr/bin/make -C tgt-null all &&  /Library/Developer/CommandLineTools/usr/bin/make -C tgt-stub all &&  /Library/Developer/CommandLineTools/usr/bin/make -C tgt-vvp all &&  /Library/Developer/CommandLineTools/usr/bin/make -C tgt-vhdl all &&  /Library/Developer/CommandLineTools/usr/bin/make -C tgt-vlog95 all &&  /Library/Developer/CommandLineTools/usr/bin/make -C tgt-pcb all &&  /Library/Developer/CommandLineTools/usr/bin/make -C tgt-blif all &&  /Library/Developer/CommandLineTools/usr/bin/make -C tgt-sizer all &&  /Library/Developer/CommandLineTools/usr/bin/make -C driver all &&  true
548:info:build make[1]: Entering directory `/opt/local/var/macports/build/_opt_local_var_macports_sources_rsync.macports.org_macports_release_tarballs_ports_science_iverilog/iverilog/work/verilog-10.3/ivlpp'
549:info:build /usr/bin/clang -Wall -Wextra -Wshadow -Wstrict-prototypes  -pipe -Os -isysroot/Library/Developer/CommandLineTools/SDKs/MacOSX11.0.sdk -arch x86_64 -I. -I.. -I/opt/local/include -isysroot/Library/Developer/CommandLineTools/SDKs/MacOSX11.0.sdk -DHAVE_CONFIG_H  -c -o main.o main.c
550:info:build flex -t lexor.lex > lexor.c
551:info:build /usr/bin/clang -Wall -Wextra -Wshadow -Wstrict-prototypes  -pipe -Os -isysroot/Library/Developer/CommandLineTools/SDKs/MacOSX11.0.sdk -arch x86_64 -I. -I.. -I/opt/local/include -isysroot/Library/Developer/CommandLineTools/SDKs/MacOSX11.0.sdk -DHAVE_CONFIG_H  -c -o lexor.o lexor.c
552:info:build /usr/bin/clang -L/opt/local/lib -Wl,-headerpad_max_install_names -Wl,-syslibroot,/Library/Developer/CommandLineTools/SDKs/MacOSX11.0.sdk -arch x86_64 main.o lexor.o -o ivlpp
553:info:build make[1]: Leaving directory `/opt/local/var/macports/build/_opt_local_var_macports_sources_rsync.macports.org_macports_release_tarballs_ports_science_iverilog/iverilog/work/verilog-10.3/ivlpp'
554:info:build make[1]: Entering directory `/opt/local/var/macports/build/_opt_local_var_macports_sources_rsync.macports.org_macports_release_tarballs_ports_science_iverilog/iverilog/work/verilog-10.3/vhdlpp'
555:info:build mkdir dep
556:info:build /usr/bin/clang++ -I. -I.. -I../libmisc -I/opt/local/include -isysroot/Library/Developer/CommandLineTools/SDKs/MacOSX11.0.sdk -DHAVE_CONFIG_H -Wall -Wextra -Wshadow   -pipe -Os -stdlib=libc++ -isysroot/Library/Developer/CommandLineTools/SDKs/MacOSX11.0.sdk -arch x86_64 -MD -c main.cc -o main.o
557:info:build /usr/bin/clang++ -I. -I.. -I../libmisc -I/opt/local/include -isysroot/Library/Developer/CommandLineTools/SDKs/MacOSX11.0.sdk -DHAVE_CONFIG_H -Wall -Wextra -Wshadow   -pipe -Os -stdlib=libc++ -isysroot/Library/Developer/CommandLineTools/SDKs/MacOSX11.0.sdk -arch x86_64 -MD -c architec.cc -o architec.o
558:info:build /usr/bin/clang++ -I. -I.. -I../libmisc -I/opt/local/include -isysroot/Library/Developer/CommandLineTools/SDKs/MacOSX11.0.sdk -DHAVE_CONFIG_H -Wall -Wextra -Wshadow   -pipe -Os -stdlib=libc++ -isysroot/Library/Developer/CommandLineTools/SDKs/MacOSX11.0.sdk -arch x86_64 -MD -c compiler.cc -o compiler.o
559:info:build /usr/bin/clang++ -I. -I.. -I../libmisc -I/opt/local/include -isysroot/Library/Developer/CommandLineTools/SDKs/MacOSX11.0.sdk -DHAVE_CONFIG_H -Wall -Wextra -Wshadow   -pipe -Os -stdlib=libc++ -isysroot/Library/Developer/CommandLineTools/SDKs/MacOSX11.0.sdk -arch x86_64 -MD -c entity.cc -o entity.o
560:info:build mv compiler.d dep/compiler.d
561:info:build /usr/bin/clang++ -I. -I.. -I../libmisc -I/opt/local/include -isysroot/Library/Developer/CommandLineTools/SDKs/MacOSX11.0.sdk -DHAVE_CONFIG_H -Wall -Wextra -Wshadow   -pipe -Os -stdlib=libc++ -isysroot/Library/Developer/CommandLineTools/SDKs/MacOSX11.0.sdk -arch x86_64 -MD -c std_funcs.cc -o std_funcs.o
562:info:build In file included from architec.cc:22:
563:info:build ./parse_types.h:59:39: warning: declaration shadows a variable in the global namespace [-Wshadow]
564:info:build       typedef enum { ALL = 0, OTHERS, NONE } application_domain_t;
565:info:build                                       ^
566:info:build ./vtype.h:40:31: note: previous declaration is here
567:info:build typedef enum typedef_topo_e { NONE=0, PENDING, MARKED } typedef_topo_t;
568:info:build                               ^
569:info:build mv main.d dep/main.d
570:info:build /usr/bin/clang++ -I. -I.. -I../libmisc -I/opt/local/include -isysroot/Library/Developer/CommandLineTools/SDKs/MacOSX11.0.sdk -DHAVE_CONFIG_H -Wall -Wextra -Wshadow   -pipe -Os -stdlib=libc++ -isysroot/Library/Developer/CommandLineTools/SDKs/MacOSX11.0.sdk -arch x86_64 -MD -c std_types.cc -o std_types.o
571:info:build mv entity.d dep/entity.d
572:info:build /usr/bin/clang++ -I. -I.. -I../libmisc -I/opt/local/include -isysroot/Library/Developer/CommandLineTools/SDKs/MacOSX11.0.sdk -DHAVE_CONFIG_H -Wall -Wextra -Wshadow   -pipe -Os -stdlib=libc++ -isysroot/Library/Developer/CommandLineTools/SDKs/MacOSX11.0.sdk -arch x86_64 -MD -c expression.cc -o expression.o
573:info:build 1 warning generated.
574:info:build mv architec.d dep/architec.d
575:info:build /usr/bin/clang++ -I. -I.. -I../libmisc -I/opt/local/include -isysroot/Library/Developer/CommandLineTools/SDKs/MacOSX11.0.sdk -DHAVE_CONFIG_H -Wall -Wextra -Wshadow   -pipe -Os -stdlib=libc++ -isysroot/Library/Developer/CommandLineTools/SDKs/MacOSX11.0.sdk -arch x86_64 -MD -c package.cc -o package.o
576:info:build mv std_funcs.d dep/std_funcs.d
577:info:build /usr/bin/clang++ -I. -I.. -I../libmisc -I/opt/local/include -isysroot/Library/Developer/CommandLineTools/SDKs/MacOSX11.0.sdk -DHAVE_CONFIG_H -Wall -Wextra -Wshadow   -pipe -Os -stdlib=libc++ -isysroot/Library/Developer/CommandLineTools/SDKs/MacOSX11.0.sdk -arch x86_64 -MD -c scope.cc -o scope.o
578:info:build In file included from expression.cc:24:
579:info:build ./parse_types.h:59:39: warning: declaration shadows a variable in the global namespace [-Wshadow]
580:info:build       typedef enum { ALL = 0, OTHERS, NONE } application_domain_t;
581:info:build                                       ^
582:info:build ./vtype.h:40:31: note: previous declaration is here
583:info:build typedef enum typedef_topo_e { NONE=0, PENDING, MARKED } typedef_topo_t;
584:info:build                               ^
585:info:build mv std_types.d dep/std_types.d
586:info:build /usr/bin/clang++ -I. -I.. -I../libmisc -I/opt/local/include -isysroot/Library/Developer/CommandLineTools/SDKs/MacOSX11.0.sdk -DHAVE_CONFIG_H -Wall -Wextra -Wshadow   -pipe -Os -stdlib=libc++ -isysroot/Library/Developer/CommandLineTools/SDKs/MacOSX11.0.sdk -arch x86_64 -MD -c sequential.cc -o sequential.o
587:info:build mv package.d dep/package.d
588:info:build /usr/bin/clang++ -I. -I.. -I../libmisc -I/opt/local/include -isysroot/Library/Developer/CommandLineTools/SDKs/MacOSX11.0.sdk -DHAVE_CONFIG_H -Wall -Wextra -Wshadow   -pipe -Os -stdlib=libc++ -isysroot/Library/Developer/CommandLineTools/SDKs/MacOSX11.0.sdk -arch x86_64 -MD -c subprogram.cc -o subprogram.o
589:info:build In file included from sequential.cc:20:
590:info:build In file included from ./sequential.h:24:
591:info:build ./parse_types.h:59:39: warning: declaration shadows a variable in the global namespace [-Wshadow]
592:info:build       typedef enum { ALL = 0, OTHERS, NONE } application_domain_t;
593:info:build                                       ^
594:info:build ./vtype.h:40:31: note: previous declaration is here
595:info:build typedef enum typedef_topo_e { NONE=0, PENDING, MARKED } typedef_topo_t;
596:info:build                               ^
597:info:build 1 warning generated.
598:info:build mv expression.d dep/expression.d
599:info:build /usr/bin/clang++ -I. -I.. -I../libmisc -I/opt/local/include -isysroot/Library/Developer/CommandLineTools/SDKs/MacOSX11.0.sdk -DHAVE_CONFIG_H -Wall -Wextra -Wshadow   -pipe -Os -stdlib=libc++ -isysroot/Library/Developer/CommandLineTools/SDKs/MacOSX11.0.sdk -arch x86_64 -MD -c vsignal.cc -o vsignal.o
600:info:build In file included from subprogram.cc:26:
601:info:build In file included from ./sequential.h:24:
602:info:build ./parse_types.h:59:39: warning: declaration shadows a variable in the global namespace [-Wshadow]
603:info:build       typedef enum { ALL = 0, OTHERS, NONE } application_domain_t;
604:info:build                                       ^
605:info:build ./vtype.h:40:31: note: previous declaration is here
606:info:build typedef enum typedef_topo_e { NONE=0, PENDING, MARKED } typedef_topo_t;
607:info:build                               ^
608:info:build 1 warning generated.
609:info:build mv sequential.d dep/sequential.d
610:info:build /usr/bin/clang++ -I. -I.. -I../libmisc -I/opt/local/include -isysroot/Library/Developer/CommandLineTools/SDKs/MacOSX11.0.sdk -DHAVE_CONFIG_H -Wall -Wextra -Wshadow   -pipe -Os -stdlib=libc++ -isysroot/Library/Developer/CommandLineTools/SDKs/MacOSX11.0.sdk -arch x86_64 -MD -c vtype.cc -o vtype.o
611:info:build mv vsignal.d dep/vsignal.d
612:info:build /usr/bin/clang++ -I. -I.. -I../libmisc -I/opt/local/include -isysroot/Library/Developer/CommandLineTools/SDKs/MacOSX11.0.sdk -DHAVE_CONFIG_H -Wall -Wextra -Wshadow   -pipe -Os -stdlib=libc++ -isysroot/Library/Developer/CommandLineTools/SDKs/MacOSX11.0.sdk -arch x86_64 -MD -c vtype_match.cc -o vtype_match.o
613:info:build mv scope.d dep/scope.d
614:info:build /usr/bin/clang++ -I. -I.. -I../libmisc -I/opt/local/include -isysroot/Library/Developer/CommandLineTools/SDKs/MacOSX11.0.sdk -DHAVE_CONFIG_H -Wall -Wextra -Wshadow   -pipe -Os -stdlib=libc++ -isysroot/Library/Developer/CommandLineTools/SDKs/MacOSX11.0.sdk -arch x86_64 -MD -c architec_elaborate.cc -o architec_elaborate.o
615:info:build In file included from vtype.cc:21:
616:info:build ./parse_types.h:59:39: warning: declaration shadows a variable in the global namespace [-Wshadow]
617:info:build       typedef enum { ALL = 0, OTHERS, NONE } application_domain_t;
618:info:build                                       ^
619:info:build ./vtype.h:40:31: note: previous declaration is here
620:info:build typedef enum typedef_topo_e { NONE=0, PENDING, MARKED } typedef_topo_t;
621:info:build                               ^
622:info:build 1 warning generated.
623:info:build mv subprogram.d dep/subprogram.d
624:info:build /usr/bin/clang++ -I. -I.. -I../libmisc -I/opt/local/include -isysroot/Library/Developer/CommandLineTools/SDKs/MacOSX11.0.sdk -DHAVE_CONFIG_H -Wall -Wextra -Wshadow   -pipe -Os -stdlib=libc++ -isysroot/Library/Developer/CommandLineTools/SDKs/MacOSX11.0.sdk -arch x86_64 -MD -c entity_elaborate.cc -o entity_elaborate.o
625:info:build mv vtype_match.d dep/vtype_match.d
626:info:build /usr/bin/clang++ -I. -I.. -I../libmisc -I/opt/local/include -isysroot/Library/Developer/CommandLineTools/SDKs/MacOSX11.0.sdk -DHAVE_CONFIG_H -Wall -Wextra -Wshadow   -pipe -Os -stdlib=libc++ -isysroot/Library/Developer/CommandLineTools/SDKs/MacOSX11.0.sdk -arch x86_64 -MD -c expression_elaborate.cc -o expression_elaborate.o
627:info:build In file included from architec_elaborate.cc:23:
628:info:build In file included from ./sequential.h:24:
629:info:build ./parse_types.h:59:39: warning: declaration shadows a variable in the global namespace [-Wshadow]
630:info:build       typedef enum { ALL = 0, OTHERS, NONE } application_domain_t;
631:info:build                                       ^
632:info:build ./vtype.h:40:31: note: previous declaration is here
633:info:build typedef enum typedef_topo_e { NONE=0, PENDING, MARKED } typedef_topo_t;
634:info:build                               ^
635:info:build 1 warning generated.
636:info:build mv vtype.d dep/vtype.d
637:info:build /usr/bin/clang++ -I. -I.. -I../libmisc -I/opt/local/include -isysroot/Library/Developer/CommandLineTools/SDKs/MacOSX11.0.sdk -DHAVE_CONFIG_H -Wall -Wextra -Wshadow   -pipe -Os -stdlib=libc++ -isysroot/Library/Developer/CommandLineTools/SDKs/MacOSX11.0.sdk -arch x86_64 -MD -c expression_evaluate.cc -o expression_evaluate.o
638:info:build In file included from expression_elaborate.cc:31:
639:info:build ./parse_types.h:59:39: warning: declaration shadows a variable in the global namespace [-Wshadow]
640:info:build       typedef enum { ALL = 0, OTHERS, NONE } application_domain_t;
641:info:build                                       ^
642:info:build ./vtype.h:40:31: note: previous declaration is here
643:info:build typedef enum typedef_topo_e { NONE=0, PENDING, MARKED } typedef_topo_t;
644:info:build                               ^
645:info:build 1 warning generated.
646:info:build mv architec_elaborate.d dep/architec_elaborate.d
647:info:build /usr/bin/clang++ -I. -I.. -I../libmisc -I/opt/local/include -isysroot/Library/Developer/CommandLineTools/SDKs/MacOSX11.0.sdk -DHAVE_CONFIG_H -Wall -Wextra -Wshadow   -pipe -Os -stdlib=libc++ -isysroot/Library/Developer/CommandLineTools/SDKs/MacOSX11.0.sdk -arch x86_64 -MD -c sequential_elaborate.cc -o sequential_elaborate.o
648:info:build mv entity_elaborate.d dep/entity_elaborate.d
649:info:build /usr/bin/clang++ -I. -I.. -I../libmisc -I/opt/local/include -isysroot/Library/Developer/CommandLineTools/SDKs/MacOSX11.0.sdk -DHAVE_CONFIG_H -Wall -Wextra -Wshadow   -pipe -Os -stdlib=libc++ -isysroot/Library/Developer/CommandLineTools/SDKs/MacOSX11.0.sdk -arch x86_64 -MD -c vtype_elaborate.cc -o vtype_elaborate.o
650:info:build expression_evaluate.cc:265:1: warning: all paths through this function will call itself [-Winfinite-recursion]
651:info:build {
652:info:build ^
653:info:build In file included from sequential_elaborate.cc:20:
654:info:build In file included from ./sequential.h:24:
655:info:build ./parse_types.h:59:39: warning: declaration shadows a variable in the global namespace [-Wshadow]
656:info:build       typedef enum { ALL = 0, OTHERS, NONE } application_domain_t;
657:info:build                                       ^
658:info:build ./vtype.h:40:31: note: previous declaration is here
659:info:build typedef enum typedef_topo_e { NONE=0, PENDING, MARKED } typedef_topo_t;
660:info:build                               ^
661:info:build 1 warning generated.
662:info:build mv expression_evaluate.d dep/expression_evaluate.d
663:info:build /usr/bin/clang++ -I. -I.. -I../libmisc -I/opt/local/include -isysroot/Library/Developer/CommandLineTools/SDKs/MacOSX11.0.sdk -DHAVE_CONFIG_H -Wall -Wextra -Wshadow   -pipe -Os -stdlib=libc++ -isysroot/Library/Developer/CommandLineTools/SDKs/MacOSX11.0.sdk -arch x86_64 -MD -c entity_stream.cc -o entity_stream.o
664:info:build mv vtype_elaborate.d dep/vtype_elaborate.d
665:info:build /usr/bin/clang++ -I. -I.. -I../libmisc -I/opt/local/include -isysroot/Library/Developer/CommandLineTools/SDKs/MacOSX11.0.sdk -DHAVE_CONFIG_H -Wall -Wextra -Wshadow   -pipe -Os -stdlib=libc++ -isysroot/Library/Developer/CommandLineTools/SDKs/MacOSX11.0.sdk -arch x86_64 -MD -c expression_stream.cc -o expression_stream.o
666:info:build 1 warning generated.
667:info:build mv sequential_elaborate.d dep/sequential_elaborate.d
668:info:build /usr/bin/clang++ -I. -I.. -I../libmisc -I/opt/local/include -isysroot/Library/Developer/CommandLineTools/SDKs/MacOSX11.0.sdk -DHAVE_CONFIG_H -Wall -Wextra -Wshadow   -pipe -Os -stdlib=libc++ -isysroot/Library/Developer/CommandLineTools/SDKs/MacOSX11.0.sdk -arch x86_64 -MD -c vtype_stream.cc -o vtype_stream.o
669:info:build 1 warning generated.
670:info:build mv expression_elaborate.d dep/expression_elaborate.d
671:info:build flex -s -olexor.cc ./lexor.lex
672:info:build bison --verbose -t -d -o parse.cc parse.y
673:info:build parse.y:2.1-12: warning: deprecated directive: ‘%pure-parser’, use ‘%define api.pure’ [-Wdeprecated]
674:info:build     2 | %pure-parser
675:info:build       | ^~~~~~~~~~~~
676:info:build       | %define api.pure
677:info:build In file included from expression_stream.cc:21:
678:info:build ./parse_types.h:59:39: warning: declaration shadows a variable in the global namespace [-Wshadow]
679:info:build       typedef enum { ALL = 0, OTHERS, NONE } application_domain_t;
680:info:build                                       ^
681:info:build ./vtype.h:40:31: note: previous declaration is here
682:info:build typedef enum typedef_topo_e { NONE=0, PENDING, MARKED } typedef_topo_t;
683:info:build                               ^
684:info:build mv entity_stream.d dep/entity_stream.d
685:info:build /usr/bin/clang++ -I. -I.. -I../libmisc -I/opt/local/include -isysroot/Library/Developer/CommandLineTools/SDKs/MacOSX11.0.sdk -DHAVE_CONFIG_H -Wall -Wextra -Wshadow   -pipe -Os -stdlib=libc++ -isysroot/Library/Developer/CommandLineTools/SDKs/MacOSX11.0.sdk -arch x86_64 -MD -c parse_misc.cc -o parse_misc.o
686:info:build 1 warning generated.
687:info:build mv expression_stream.d dep/expression_stream.d
688:info:build /usr/bin/clang++ -I. -I.. -I../libmisc -I/opt/local/include -isysroot/Library/Developer/CommandLineTools/SDKs/MacOSX11.0.sdk -DHAVE_CONFIG_H -Wall -Wextra -Wshadow   -pipe -Os -stdlib=libc++ -isysroot/Library/Developer/CommandLineTools/SDKs/MacOSX11.0.sdk -arch x86_64 -MD -c library.cc -o library.o
689:info:build mv vtype_stream.d dep/vtype_stream.d
690:info:build /usr/bin/clang++ -I. -I.. -I../libmisc -I/opt/local/include -isysroot/Library/Developer/CommandLineTools/SDKs/MacOSX11.0.sdk -DHAVE_CONFIG_H -Wall -Wextra -Wshadow   -pipe -Os -stdlib=libc++ -isysroot/Library/Developer/CommandLineTools/SDKs/MacOSX11.0.sdk -arch x86_64 -MD -c vhdlreal.cc -o vhdlreal.o
691:info:build parse.y: warning: fix-its can be applied.  Rerun with option '--update'. [-Wother]
692:info:build /usr/bin/clang++ -I. -I.. -I../libmisc -I/opt/local/include -isysroot/Library/Developer/CommandLineTools/SDKs/MacOSX11.0.sdk -DHAVE_CONFIG_H -Wall -Wextra -Wshadow   -pipe -Os -stdlib=libc++ -isysroot/Library/Developer/CommandLineTools/SDKs/MacOSX11.0.sdk -arch x86_64 -MD -c vhdlint.cc -o vhdlint.o
693:info:build In file included from parse_misc.cc:23:
694:info:build ./parse_types.h:59:39: warning: declaration shadows a variable in the global namespace [-Wshadow]
695:info:build       typedef enum { ALL = 0, OTHERS, NONE } application_domain_t;
696:info:build                                       ^
697:info:build ./vtype.h:40:31: note: previous declaration is here
698:info:build typedef enum typedef_topo_e { NONE=0, PENDING, MARKED } typedef_topo_t;
699:info:build                               ^
700:info:build mv vhdlreal.d dep/vhdlreal.d
701:info:build /usr/bin/clang++ -I. -I.. -I../libmisc -I/opt/local/include -isysroot/Library/Developer/CommandLineTools/SDKs/MacOSX11.0.sdk -DHAVE_CONFIG_H -Wall -Wextra -Wshadow   -pipe -Os -stdlib=libc++ -isysroot/Library/Developer/CommandLineTools/SDKs/MacOSX11.0.sdk -arch x86_64 -MD -c architec_emit.cc -o architec_emit.o
702:info:build 1 warning generated.
703:info:build mv parse_misc.d dep/parse_misc.d
704:info:build /usr/bin/clang++ -I. -I.. -I../libmisc -I/opt/local/include -isysroot/Library/Developer/CommandLineTools/SDKs/MacOSX11.0.sdk -DHAVE_CONFIG_H -Wall -Wextra -Wshadow   -pipe -Os -stdlib=libc++ -isysroot/Library/Developer/CommandLineTools/SDKs/MacOSX11.0.sdk -arch x86_64 -MD -c entity_emit.cc -o entity_emit.o
705:info:build mv vhdlint.d dep/vhdlint.d
706:info:build /usr/bin/clang++ -I. -I.. -I../libmisc -I/opt/local/include -isysroot/Library/Developer/CommandLineTools/SDKs/MacOSX11.0.sdk -DHAVE_CONFIG_H -Wall -Wextra -Wshadow   -pipe -Os -stdlib=libc++ -isysroot/Library/Developer/CommandLineTools/SDKs/MacOSX11.0.sdk -arch x86_64 -MD -c expression_emit.cc -o expression_emit.o
707:info:build In file included from architec_emit.cc:23:
708:info:build In file included from ./sequential.h:24:
709:info:build ./parse_types.h:59:39: warning: declaration shadows a variable in the global namespace [-Wshadow]
710:info:build       typedef enum { ALL = 0, OTHERS, NONE } application_domain_t;
711:info:build                                       ^
712:info:build ./vtype.h:40:31: note: previous declaration is here
713:info:build typedef enum typedef_topo_e { NONE=0, PENDING, MARKED } typedef_topo_t;
714:info:build                               ^
715:info:build In file included from expression_emit.cc:28:
716:info:build ./parse_types.h:59:39: warning: declaration shadows a variable in the global namespace [-Wshadow]
717:info:build       typedef enum { ALL = 0, OTHERS, NONE } application_domain_t;
718:info:build                                       ^
719:info:build ./vtype.h:40:31: note: previous declaration is here
720:info:build typedef enum typedef_topo_e { NONE=0, PENDING, MARKED } typedef_topo_t;
721:info:build                               ^
722:info:build mv entity_emit.d dep/entity_emit.d
723:info:build /usr/bin/clang++ -I. -I.. -I../libmisc -I/opt/local/include -isysroot/Library/Developer/CommandLineTools/SDKs/MacOSX11.0.sdk -DHAVE_CONFIG_H -Wall -Wextra -Wshadow   -pipe -Os -stdlib=libc++ -isysroot/Library/Developer/CommandLineTools/SDKs/MacOSX11.0.sdk -arch x86_64 -MD -c package_emit.cc -o package_emit.o
724:info:build 1 warning generated.
725:info:build mv architec_emit.d dep/architec_emit.d
726:info:build /usr/bin/clang++ -I. -I.. -I../libmisc -I/opt/local/include -isysroot/Library/Developer/CommandLineTools/SDKs/MacOSX11.0.sdk -DHAVE_CONFIG_H -Wall -Wextra -Wshadow   -pipe -Os -stdlib=libc++ -isysroot/Library/Developer/CommandLineTools/SDKs/MacOSX11.0.sdk -arch x86_64 -MD -c sequential_emit.cc -o sequential_emit.o
727:info:build mv library.d dep/library.d
728:info:build /usr/bin/clang++ -I. -I.. -I../libmisc -I/opt/local/include -isysroot/Library/Developer/CommandLineTools/SDKs/MacOSX11.0.sdk -DHAVE_CONFIG_H -Wall -Wextra -Wshadow   -pipe -Os -stdlib=libc++ -isysroot/Library/Developer/CommandLineTools/SDKs/MacOSX11.0.sdk -arch x86_64 -MD -c subprogram_emit.cc -o subprogram_emit.o
729:info:build 1 warning generated.
730:info:build mv expression_emit.d dep/expression_emit.d
731:info:build /usr/bin/clang++ -I. -I.. -I../libmisc -I/opt/local/include -isysroot/Library/Developer/CommandLineTools/SDKs/MacOSX11.0.sdk -DHAVE_CONFIG_H -Wall -Wextra -Wshadow   -pipe -Os -stdlib=libc++ -isysroot/Library/Developer/CommandLineTools/SDKs/MacOSX11.0.sdk -arch x86_64 -MD -c vtype_emit.cc -o vtype_emit.o
732:info:build In file included from sequential_emit.cc:23:
733:info:build In file included from ./sequential.h:24:
734:info:build ./parse_types.h:59:39: warning: declaration shadows a variable in the global namespace [-Wshadow]
735:info:build       typedef enum { ALL = 0, OTHERS, NONE } application_domain_t;
736:info:build                                       ^
737:info:build ./vtype.h:40:31: note: previous declaration is here
738:info:build typedef enum typedef_topo_e { NONE=0, PENDING, MARKED } typedef_topo_t;
739:info:build                               ^
740:info:build In file included from subprogram_emit.cc:22:
741:info:build In file included from ./sequential.h:24:
742:info:build ./parse_types.h:59:39: warning: declaration shadows a variable in the global namespace [-Wshadow]
743:info:build       typedef enum { ALL = 0, OTHERS, NONE } application_domain_t;
744:info:build                                       ^
745:info:build ./vtype.h:40:31: note: previous declaration is here
746:info:build typedef enum typedef_topo_e { NONE=0, PENDING, MARKED } typedef_topo_t;
747:info:build                               ^
748:info:build mv package_emit.d dep/package_emit.d
749:info:build /usr/bin/clang++ -I. -I.. -I../libmisc -I/opt/local/include -isysroot/Library/Developer/CommandLineTools/SDKs/MacOSX11.0.sdk -DHAVE_CONFIG_H -Wall -Wextra -Wshadow   -pipe -Os -stdlib=libc++ -isysroot/Library/Developer/CommandLineTools/SDKs/MacOSX11.0.sdk -arch x86_64 -MD -c debug.cc -o debug.o
750:info:build 1 warning generated.
751:info:build mv subprogram_emit.d dep/subprogram_emit.d
752:info:build /usr/bin/clang++ -I. -I.. -I../libmisc -I/opt/local/include -isysroot/Library/Developer/CommandLineTools/SDKs/MacOSX11.0.sdk -DHAVE_CONFIG_H -Wall -Wextra -Wshadow   -pipe -Os -stdlib=libc++ -isysroot/Library/Developer/CommandLineTools/SDKs/MacOSX11.0.sdk -arch x86_64 -MD -c architec_debug.cc -o architec_debug.o
753:info:build 1 warning generated.
754:info:build mv sequential_emit.d dep/sequential_emit.d
755:info:build /usr/bin/clang++ -I. -I.. -I../libmisc -I/opt/local/include -isysroot/Library/Developer/CommandLineTools/SDKs/MacOSX11.0.sdk -DHAVE_CONFIG_H -Wall -Wextra -Wshadow   -pipe -Os -stdlib=libc++ -isysroot/Library/Developer/CommandLineTools/SDKs/MacOSX11.0.sdk -arch x86_64 -MD -c expression_debug.cc -o expression_debug.o
756:info:build mv vtype_emit.d dep/vtype_emit.d
757:info:build /usr/bin/clang++ -I. -I.. -I../libmisc -I/opt/local/include -isysroot/Library/Developer/CommandLineTools/SDKs/MacOSX11.0.sdk -DHAVE_CONFIG_H -Wall -Wextra -Wshadow   -pipe -Os -stdlib=libc++ -isysroot/Library/Developer/CommandLineTools/SDKs/MacOSX11.0.sdk -arch x86_64 -MD -c sequential_debug.cc -o sequential_debug.o
758:info:build In file included from debug.cc:26:
759:info:build ./parse_types.h:59:39: warning: declaration shadows a variable in the global namespace [-Wshadow]
760:info:build       typedef enum { ALL = 0, OTHERS, NONE } application_domain_t;
761:info:build                                       ^
762:info:build ./vtype.h:40:31: note: previous declaration is here
763:info:build typedef enum typedef_topo_e { NONE=0, PENDING, MARKED } typedef_topo_t;
764:info:build                               ^
765:info:build In file included from architec_debug.cc:22:
766:info:build In file included from ./sequential.h:24:
767:info:build ./parse_types.h:59:39: warning: declaration shadows a variable in the global namespace [-Wshadow]
768:info:build       typedef enum { ALL = 0, OTHERS, NONE } application_domain_t;
769:info:build                                       ^
770:info:build ./vtype.h:40:31: note: previous declaration is here
771:info:build typedef enum typedef_topo_e { NONE=0, PENDING, MARKED } typedef_topo_t;
772:info:build                               ^
773:info:build In file included from sequential_debug.cc:20:
774:info:build In file included from ./sequential.h:24:
775:info:build ./parse_types.h:59:39: warning: declaration shadows a variable in the global namespace [-Wshadow]
776:info:build       typedef enum { ALL = 0, OTHERS, NONE } application_domain_t;
777:info:build                                       ^
778:info:build ./vtype.h:40:31: note: previous declaration is here
779:info:build typedef enum typedef_topo_e { NONE=0, PENDING, MARKED } typedef_topo_t;
780:info:build                               ^
781:info:build 1 warning generated.
782:info:build mv architec_debug.d dep/architec_debug.d
783:info:build /usr/bin/clang++ -I. -I.. -I../libmisc -I/opt/local/include -isysroot/Library/Developer/CommandLineTools/SDKs/MacOSX11.0.sdk -DHAVE_CONFIG_H -Wall -Wextra -Wshadow   -pipe -Os -stdlib=libc++ -isysroot/Library/Developer/CommandLineTools/SDKs/MacOSX11.0.sdk -arch x86_64 -MD -c ../libmisc/StringHeap.cc -o StringHeap.o
784:info:build mv expression_debug.d dep/expression_debug.d
785:info:build /usr/bin/clang++ -I. -I.. -I../libmisc -I/opt/local/include -isysroot/Library/Developer/CommandLineTools/SDKs/MacOSX11.0.sdk -DHAVE_CONFIG_H -Wall -Wextra -Wshadow   -pipe -Os -stdlib=libc++ -isysroot/Library/Developer/CommandLineTools/SDKs/MacOSX11.0.sdk -arch x86_64 -MD -c ../libmisc/LineInfo.cc -o LineInfo.o
786:info:build 1 warning generated.
787:info:build mv debug.d dep/debug.d
788:info:build mv parse.cc.h parse.h 2>/dev/null || mv parse.hh parse.h
789:info:build touch parse.h
790:info:build /usr/bin/clang++ -I. -I.. -I../libmisc -I/opt/local/include -isysroot/Library/Developer/CommandLineTools/SDKs/MacOSX11.0.sdk -DHAVE_CONFIG_H -Wall -Wextra -Wshadow   -pipe -Os -stdlib=libc++ -isysroot/Library/Developer/CommandLineTools/SDKs/MacOSX11.0.sdk -arch x86_64 -MD -c parse.cc -o parse.o
791:info:build 1 warning generated.
792:info:build mv sequential_debug.d dep/sequential_debug.d
793:info:build /usr/bin/clang++ -I. -I.. -I../libmisc -I/opt/local/include -isysroot/Library/Developer/CommandLineTools/SDKs/MacOSX11.0.sdk -DHAVE_CONFIG_H -Wall -Wextra -Wshadow   -pipe -Os -stdlib=libc++ -isysroot/Library/Developer/CommandLineTools/SDKs/MacOSX11.0.sdk -arch x86_64 -MD -c lexor.cc -o lexor.o
794:info:build mv StringHeap.d dep/StringHeap.d
795:info:build /usr/bin/clang++ -I. -I.. -I../libmisc -I/opt/local/include -isysroot/Library/Developer/CommandLineTools/SDKs/MacOSX11.0.sdk -DHAVE_CONFIG_H -Wall -Wextra -Wshadow   -pipe -Os -stdlib=libc++ -isysroot/Library/Developer/CommandLineTools/SDKs/MacOSX11.0.sdk -arch x86_64 -MD -c lexor_keyword.cc -o lexor_keyword.o
796:info:build mv LineInfo.d dep/LineInfo.d
797:info:build In file included from parse.y:37:
798:info:build In file included from ./sequential.h:24:
799:info:build ./parse_types.h:59:39: warning: declaration shadows a variable in the global namespace [-Wshadow]
800:info:build       typedef enum { ALL = 0, OTHERS, NONE } application_domain_t;
801:info:build                                       ^
802:info:build ./vtype.h:40:31: note: previous declaration is here
803:info:build typedef enum typedef_topo_e { NONE=0, PENDING, MARKED } typedef_topo_t;
804:info:build                               ^
805:info:build parse.cc:299:10: fatal error: 'parse.hh' file not found
806:info:build #include "parse.hh"
807:info:build          ^~~~~~~~~~
808:info:build 1 warning and 1 error generated.
809:info:build make[1]: *** [parse.o] Error 1
810:info:build make[1]: *** Waiting for unfinished jobs....
811:info:build In file included from ./lexor.lex:31:
812:info:build In file included from ./parse_wrap.h:33:
813:info:build In file included from ./sequential.h:24:
814:info:build ./parse_types.h:59:39: warning: declaration shadows a variable in the global namespace [-Wshadow]
815:info:build       typedef enum { ALL = 0, OTHERS, NONE } application_domain_t;
816:info:build                                       ^
817:info:build ./vtype.h:40:31: note: previous declaration is here
818:info:build typedef enum typedef_topo_e { NONE=0, PENDING, MARKED } typedef_topo_t;
819:info:build                               ^
820:info:build In file included from ./lexor_keyword.gperf:15:
821:info:build In file included from ./parse_wrap.h:33:
822:info:build In file included from ./sequential.h:24:
823:info:build ./parse_types.h:59:39: warning: declaration shadows a variable in the global namespace [-Wshadow]
824:info:build       typedef enum { ALL = 0, OTHERS, NONE } application_domain_t;
825:info:build                                       ^
826:info:build ./vtype.h:40:31: note: previous declaration is here
827:info:build typedef enum typedef_topo_e { NONE=0, PENDING, MARKED } typedef_topo_t;
828:info:build                               ^
829:info:build 1 warning generated.
830:info:build mv lexor_keyword.d dep/lexor_keyword.d
831:info:build 1 warning generated.
832:info:build mv lexor.d dep/lexor.d
833:info:build make[1]: Leaving directory `/opt/local/var/macports/build/_opt_local_var_macports_sources_rsync.macports.org_macports_release_tarballs_ports_science_iverilog/iverilog/work/verilog-10.3/vhdlpp'
834:info:build make: *** [all] Error 2
835:info:build make: Leaving directory `/opt/local/var/macports/build/_opt_local_var_macports_sources_rsync.macports.org_macports_release_tarballs_ports_science_iverilog/iverilog/work/verilog-10.3'
836:info:build Command failed:  cd "/opt/local/var/macports/build/_opt_local_var_macports_sources_rsync.macports.org_macports_release_tarballs_ports_science_iverilog/iverilog/work/verilog-10.3" && /usr/bin/make -j4 -w all
837:info:build Exit code: 2
838:error:build Failed to build iverilog: command execution failed
839:debug:build Error code: CHILDSTATUS 53624 2
840:debug:build Backtrace: command execution failed
841:debug:build     while executing
842:debug:build "system {*}$notty {*}$nice $fullcmdstring"
843:debug:build     invoked from within
844:debug:build "command_exec build"
845:debug:build     (procedure "portbuild::build_main" line 8)
846:debug:build     invoked from within
847:debug:build "$procedure $targetname"
848:error:build See /opt/local/var/macports/logs/_opt_local_var_macports_sources_rsync.macports.org_macports_release_tarballs_ports_science_iverilog/iverilog/main.log for details.