Ticket #62169: main.log

File main.log, 84.5 KB (added by murrayE, 2 years ago)

main.log

Line 
1version:1
2:debug:sysinfo macOS 11.1 (darwin/20.2.0) arch i386
3:debug:sysinfo MacPorts 2.6.99
4:debug:sysinfo Xcode 12.3
5:debug:sysinfo SDK 11
6:debug:sysinfo MACOSX_DEPLOYMENT_TARGET: 11.0
7:debug:main epoch: in tree: 0 installed: 0
8:debug:main apache2 2.4.46_1 exists in the ports tree
9:debug:main apache2 2.4.46_1 +preforkmpm is the latest installed
10:debug:main apache2 2.4.46_1 +preforkmpm is active
11:debug:main Merging existing variants '+preforkmpm' into variants
12:debug:main new fully merged portvariants: preforkmpm +
13:debug:main Changing to port directory: /opt/local/var/macports/sources/rsync.macports.org/release/tarballs/ports/www/apache2
14:debug:main OS darwin/20.2.0 (macOS 11.1) arch i386
15:debug:main Sourcing PortGroup apache2 1.0 from /opt/local/var/macports/sources/rsync.macports.org/release/tarballs/ports/_resources/port1.0/group/apache2-1.0.tcl
16:debug:main adding the default universal variant
17:debug:main Reading variant descriptions from /opt/local/var/macports/sources/rsync.macports.org/release/tarballs/ports/_resources/port1.0/variant_descriptions.conf
18:debug:main Executing variant preforkmpm provides preforkmpm
19:debug:main Running callback portconfigure::add_automatic_compiler_dependencies
20:debug:main Finished running callback portconfigure::add_automatic_compiler_dependencies
21:debug:main Running callback portbuild::add_automatic_buildsystem_dependencies
22:debug:main Finished running callback portbuild::add_automatic_buildsystem_dependencies
23:debug:main Running callback portstartupitem::add_notes
24:debug:main Finished running callback portstartupitem::add_notes
25:debug:main No need to upgrade! apache2 2.4.46_1 >= apache2 2.4.46_1
26:debug:main epoch: in tree: 0 installed: 0
27:debug:main apr 1.7.0_2 exists in the ports tree
28:debug:main apr 1.7.0_2  is the latest installed
29:debug:main apr 1.7.0_2  is active
30:debug:main Merging existing variants '' into variants
31:debug:main new fully merged portvariants:
32:debug:main Changing to port directory: /opt/local/var/macports/sources/rsync.macports.org/release/tarballs/ports/devel/apr
33:debug:main OS darwin/20.2.0 (macOS 11.1) arch i386
34:debug:main adding the default universal variant
35:debug:main Reading variant descriptions from /opt/local/var/macports/sources/rsync.macports.org/release/tarballs/ports/_resources/port1.0/variant_descriptions.conf
36:debug:main Running callback portconfigure::add_automatic_compiler_dependencies
37:debug:main Finished running callback portconfigure::add_automatic_compiler_dependencies
38:debug:main Running callback portbuild::add_automatic_buildsystem_dependencies
39:debug:main Finished running callback portbuild::add_automatic_buildsystem_dependencies
40:debug:main Running callback portstartupitem::add_notes
41:debug:main Finished running callback portstartupitem::add_notes
42:debug:main No need to upgrade! apr 1.7.0_2 >= apr 1.7.0_2
43:debug:main epoch: in tree: 0 installed: 0
44:debug:main apr-util 1.6.1_2 exists in the ports tree
45:debug:main apr-util 1.6.1_2  is the latest installed
46:debug:main apr-util 1.6.1_2  is active
47:debug:main Merging existing variants '' into variants
48:debug:main new fully merged portvariants:
49:debug:main Changing to port directory: /opt/local/var/macports/sources/rsync.macports.org/release/tarballs/ports/devel/apr-util
50:debug:main OS darwin/20.2.0 (macOS 11.1) arch i386
51:debug:main adding the default universal variant
52:debug:main Reading variant descriptions from /opt/local/var/macports/sources/rsync.macports.org/release/tarballs/ports/_resources/port1.0/variant_descriptions.conf
53:debug:main Running callback portconfigure::add_automatic_compiler_dependencies
54:debug:main Finished running callback portconfigure::add_automatic_compiler_dependencies
55:debug:main Running callback portbuild::add_automatic_buildsystem_dependencies
56:debug:main Finished running callback portbuild::add_automatic_buildsystem_dependencies
57:debug:main Running callback portstartupitem::add_notes
58:debug:main Finished running callback portstartupitem::add_notes
59:debug:main No need to upgrade! apr-util 1.6.1_2 >= apr-util 1.6.1_2
60:debug:main epoch: in tree: 0 installed: 0
61:debug:main expat 2.2.10_0 exists in the ports tree
62:debug:main expat 2.2.10_0  is the latest installed
63:debug:main expat 2.2.10_0  is active
64:debug:main Merging existing variants '' into variants
65:debug:main new fully merged portvariants:
66:debug:main Changing to port directory: /opt/local/var/macports/sources/rsync.macports.org/release/tarballs/ports/textproc/expat
67:debug:main OS darwin/20.2.0 (macOS 11.1) arch i386
68:debug:main Reading variant descriptions from /opt/local/var/macports/sources/rsync.macports.org/release/tarballs/ports/_resources/port1.0/variant_descriptions.conf
69:debug:main Sourcing PortGroup muniversal 1.0 from /opt/local/var/macports/sources/rsync.macports.org/release/tarballs/ports/_resources/port1.0/group/muniversal-1.0.tcl
70:debug:main universal variant already exists, so not adding the default one
71:debug:main Running callback portconfigure::add_automatic_compiler_dependencies
72:debug:main Finished running callback portconfigure::add_automatic_compiler_dependencies
73:debug:main Running callback portbuild::add_automatic_buildsystem_dependencies
74:debug:main Finished running callback portbuild::add_automatic_buildsystem_dependencies
75:debug:main Running callback portstartupitem::add_notes
76:debug:main Finished running callback portstartupitem::add_notes
77:debug:main No need to upgrade! expat 2.2.10_0 >= expat 2.2.10_0
78:debug:main epoch: in tree: 0 installed: 0
79:debug:main libiconv 1.16_1 exists in the ports tree
80:debug:main libiconv 1.16_1  is the latest installed
81:debug:main libiconv 1.16_1  is active
82:debug:main Merging existing variants '' into variants
83:debug:main new fully merged portvariants:
84:debug:main Changing to port directory: /opt/local/var/macports/sources/rsync.macports.org/release/tarballs/ports/textproc/libiconv
85:debug:main OS darwin/20.2.0 (macOS 11.1) arch i386
86:debug:main Reading variant descriptions from /opt/local/var/macports/sources/rsync.macports.org/release/tarballs/ports/_resources/port1.0/variant_descriptions.conf
87:debug:main Sourcing PortGroup muniversal 1.0 from /opt/local/var/macports/sources/rsync.macports.org/release/tarballs/ports/_resources/port1.0/group/muniversal-1.0.tcl
88:debug:main Sourcing PortGroup clang_dependency 1.0 from /opt/local/var/macports/sources/rsync.macports.org/release/tarballs/ports/_resources/port1.0/group/clang_dependency-1.0.tcl
89:debug:main Sourcing PortGroup xcodeversion 1.0 from /opt/local/var/macports/sources/rsync.macports.org/release/tarballs/ports/_resources/port1.0/group/xcodeversion-1.0.tcl
90:debug:main universal variant already exists, so not adding the default one
91:debug:main Running callback portconfigure::add_automatic_compiler_dependencies
92:debug:main Finished running callback portconfigure::add_automatic_compiler_dependencies
93:debug:main Running callback portbuild::add_automatic_buildsystem_dependencies
94:debug:main Finished running callback portbuild::add_automatic_buildsystem_dependencies
95:debug:main Running callback portstartupitem::add_notes
96:debug:main Finished running callback portstartupitem::add_notes
97:debug:main No need to upgrade! libiconv 1.16_1 >= libiconv 1.16_1
98:debug:main epoch: in tree: 0 installed: 0
99:debug:main db48 4.8.30_4 exists in the ports tree
100:debug:main db48 4.8.30_4  is the latest installed
101:debug:main db48 4.8.30_4  is active
102:debug:main Merging existing variants '' into variants
103:debug:main new fully merged portvariants:
104:debug:main Changing to port directory: /opt/local/var/macports/sources/rsync.macports.org/release/tarballs/ports/databases/db48
105:debug:main OS darwin/20.2.0 (macOS 11.1) arch i386
106:debug:main Reading variant descriptions from /opt/local/var/macports/sources/rsync.macports.org/release/tarballs/ports/_resources/port1.0/variant_descriptions.conf
107:debug:main Sourcing PortGroup muniversal 1.0 from /opt/local/var/macports/sources/rsync.macports.org/release/tarballs/ports/_resources/port1.0/group/muniversal-1.0.tcl
108:debug:main Sourcing PortGroup clang_dependency 1.0 from /opt/local/var/macports/sources/rsync.macports.org/release/tarballs/ports/_resources/port1.0/group/clang_dependency-1.0.tcl
109:debug:main universal variant already exists, so not adding the default one
110:debug:main Running callback portconfigure::add_automatic_compiler_dependencies
111:debug:main Finished running callback portconfigure::add_automatic_compiler_dependencies
112:debug:main Running callback portbuild::add_automatic_buildsystem_dependencies
113:debug:main Finished running callback portbuild::add_automatic_buildsystem_dependencies
114:debug:main Running callback portstartupitem::add_notes
115:debug:main Finished running callback portstartupitem::add_notes
116:debug:main No need to upgrade! db48 4.8.30_4 >= db48 4.8.30_4
117:debug:main epoch: in tree: 0 installed: 0
118:debug:main sqlite3 3.34.1_0 exists in the ports tree
119:debug:main sqlite3 3.34.1_0  is the latest installed
120:debug:main sqlite3 3.34.1_0  is active
121:debug:main Merging existing variants '' into variants
122:debug:main new fully merged portvariants:
123:debug:main Changing to port directory: /opt/local/var/macports/sources/rsync.macports.org/release/tarballs/ports/databases/sqlite3
124:debug:main OS darwin/20.2.0 (macOS 11.1) arch i386
125:debug:main Sourcing PortGroup clang_dependency 1.0 from /opt/local/var/macports/sources/rsync.macports.org/release/tarballs/ports/_resources/port1.0/group/clang_dependency-1.0.tcl
126:debug:main adding the default universal variant
127:debug:main Reading variant descriptions from /opt/local/var/macports/sources/rsync.macports.org/release/tarballs/ports/_resources/port1.0/variant_descriptions.conf
128:debug:main Running callback portconfigure::add_automatic_compiler_dependencies
129:debug:main Finished running callback portconfigure::add_automatic_compiler_dependencies
130:debug:main Running callback portbuild::add_automatic_buildsystem_dependencies
131:debug:main Finished running callback portbuild::add_automatic_buildsystem_dependencies
132:debug:main Running callback portstartupitem::add_notes
133:debug:main Finished running callback portstartupitem::add_notes
134:debug:main No need to upgrade! sqlite3 3.34.1_0 >= sqlite3 3.34.1_0
135:debug:main epoch: in tree: 20090923 installed: 20090923
136:debug:main libedit 20191231-3.1_0 exists in the ports tree
137:debug:main libedit 20191231-3.1_0  is the latest installed
138:debug:main libedit 20191231-3.1_0  is active
139:debug:main Merging existing variants '' into variants
140:debug:main new fully merged portvariants:
141:debug:main Changing to port directory: /opt/local/var/macports/sources/rsync.macports.org/release/tarballs/ports/devel/libedit
142:debug:main OS darwin/20.2.0 (macOS 11.1) arch i386
143:debug:main Reading variant descriptions from /opt/local/var/macports/sources/rsync.macports.org/release/tarballs/ports/_resources/port1.0/variant_descriptions.conf
144:debug:main Sourcing PortGroup muniversal 1.0 from /opt/local/var/macports/sources/rsync.macports.org/release/tarballs/ports/_resources/port1.0/group/muniversal-1.0.tcl
145:debug:main Sourcing PortGroup clang_dependency 1.0 from /opt/local/var/macports/sources/rsync.macports.org/release/tarballs/ports/_resources/port1.0/group/clang_dependency-1.0.tcl
146:debug:main universal variant already exists, so not adding the default one
147:debug:main Running callback portconfigure::add_automatic_compiler_dependencies
148:debug:main Finished running callback portconfigure::add_automatic_compiler_dependencies
149:debug:main Running callback portbuild::add_automatic_buildsystem_dependencies
150:debug:main Finished running callback portbuild::add_automatic_buildsystem_dependencies
151:debug:main Running callback portstartupitem::add_notes
152:debug:main Finished running callback portstartupitem::add_notes
153:debug:main No need to upgrade! libedit 20191231-3.1_0 >= libedit 20191231-3.1_0
154:debug:main epoch: in tree: 0 installed: 0
155:debug:main ncurses 6.2_1 exists in the ports tree
156:debug:main ncurses 6.2_1  is the latest installed
157:debug:main ncurses 6.2_1  is active
158:debug:main Merging existing variants '' into variants
159:debug:main new fully merged portvariants:
160:debug:main Changing to port directory: /opt/local/var/macports/sources/rsync.macports.org/release/tarballs/ports/devel/ncurses
161:debug:main OS darwin/20.2.0 (macOS 11.1) arch i386
162:debug:main Sourcing PortGroup clang_dependency 1.0 from /opt/local/var/macports/sources/rsync.macports.org/release/tarballs/ports/_resources/port1.0/group/clang_dependency-1.0.tcl
163:debug:main adding the default universal variant
164:debug:main Reading variant descriptions from /opt/local/var/macports/sources/rsync.macports.org/release/tarballs/ports/_resources/port1.0/variant_descriptions.conf
165:debug:main Running callback portconfigure::add_automatic_compiler_dependencies
166:debug:main Finished running callback portconfigure::add_automatic_compiler_dependencies
167:debug:main Running callback portbuild::add_automatic_buildsystem_dependencies
168:debug:main Finished running callback portbuild::add_automatic_buildsystem_dependencies
169:debug:main Running callback portstartupitem::add_notes
170:debug:main Finished running callback portstartupitem::add_notes
171:debug:main No need to upgrade! ncurses 6.2_1 >= ncurses 6.2_1
172:debug:main epoch: in tree: 0 installed: 0
173:debug:main zlib 1.2.11_0 exists in the ports tree
174:debug:main zlib 1.2.11_0  is the latest installed
175:debug:main zlib 1.2.11_0  is active
176:debug:main Merging existing variants '' into variants
177:debug:main new fully merged portvariants:
178:debug:main Changing to port directory: /opt/local/var/macports/sources/rsync.macports.org/release/tarballs/ports/archivers/zlib
179:debug:main OS darwin/20.2.0 (macOS 11.1) arch i386
180:debug:main Sourcing PortGroup xcodeversion 1.0 from /opt/local/var/macports/sources/rsync.macports.org/release/tarballs/ports/_resources/port1.0/group/xcodeversion-1.0.tcl
181:debug:main adding the default universal variant
182:debug:main Reading variant descriptions from /opt/local/var/macports/sources/rsync.macports.org/release/tarballs/ports/_resources/port1.0/variant_descriptions.conf
183:debug:main Running callback portconfigure::add_automatic_compiler_dependencies
184:debug:main Finished running callback portconfigure::add_automatic_compiler_dependencies
185:debug:main Running callback portbuild::add_automatic_buildsystem_dependencies
186:debug:main Finished running callback portbuild::add_automatic_buildsystem_dependencies
187:debug:main Running callback portstartupitem::add_notes
188:debug:main Finished running callback portstartupitem::add_notes
189:debug:main No need to upgrade! zlib 1.2.11_0 >= zlib 1.2.11_0
190:debug:main epoch: in tree: 1 installed: 1
191:debug:main openssl 1.1.1i_0 exists in the ports tree
192:debug:main openssl 1.1.1i_0  is the latest installed
193:debug:main openssl 1.1.1i_0  is active
194:debug:main Merging existing variants '' into variants
195:debug:main new fully merged portvariants:
196:debug:main Changing to port directory: /opt/local/var/macports/sources/rsync.macports.org/release/tarballs/ports/devel/openssl
197:debug:main OS darwin/20.2.0 (macOS 11.1) arch i386
198:debug:main Reading variant descriptions from /opt/local/var/macports/sources/rsync.macports.org/release/tarballs/ports/_resources/port1.0/variant_descriptions.conf
199:debug:main Sourcing PortGroup muniversal 1.0 from /opt/local/var/macports/sources/rsync.macports.org/release/tarballs/ports/_resources/port1.0/group/muniversal-1.0.tcl
200:debug:main universal variant already exists, so not adding the default one
201:debug:main Running callback portconfigure::add_automatic_compiler_dependencies
202:debug:main Finished running callback portconfigure::add_automatic_compiler_dependencies
203:debug:main Running callback portbuild::add_automatic_buildsystem_dependencies
204:debug:main Finished running callback portbuild::add_automatic_buildsystem_dependencies
205:debug:main Running callback portstartupitem::add_notes
206:debug:main Finished running callback portstartupitem::add_notes
207:debug:main No need to upgrade! openssl 1.1.1i_0 >= openssl 1.1.1i_0
208:debug:main epoch: in tree: 0 installed: 0
209:debug:main pcre 8.44_1 exists in the ports tree
210:debug:main pcre 8.44_1  is the latest installed
211:debug:main pcre 8.44_1  is active
212:debug:main Merging existing variants '' into variants
213:debug:main new fully merged portvariants:
214:debug:main Changing to port directory: /opt/local/var/macports/sources/rsync.macports.org/release/tarballs/ports/devel/pcre
215:debug:main OS darwin/20.2.0 (macOS 11.1) arch i386
216:debug:main Reading variant descriptions from /opt/local/var/macports/sources/rsync.macports.org/release/tarballs/ports/_resources/port1.0/variant_descriptions.conf
217:debug:main Sourcing PortGroup clang_dependency 1.0 from /opt/local/var/macports/sources/rsync.macports.org/release/tarballs/ports/_resources/port1.0/group/clang_dependency-1.0.tcl
218:debug:main universal variant already exists, so not adding the default one
219:debug:main Running callback portconfigure::add_automatic_compiler_dependencies
220:debug:main Finished running callback portconfigure::add_automatic_compiler_dependencies
221:debug:main Running callback portbuild::add_automatic_buildsystem_dependencies
222:debug:main Finished running callback portbuild::add_automatic_buildsystem_dependencies
223:debug:main Running callback portstartupitem::add_notes
224:debug:main Finished running callback portstartupitem::add_notes
225:debug:main No need to upgrade! pcre 8.44_1 >= pcre 8.44_1
226:debug:main epoch: in tree: 0 installed: 0
227:debug:main bzip2 1.0.8_0 exists in the ports tree
228:debug:main bzip2 1.0.8_0  is the latest installed
229:debug:main bzip2 1.0.8_0  is active
230:debug:main Merging existing variants '' into variants
231:debug:main new fully merged portvariants:
232:debug:main Changing to port directory: /opt/local/var/macports/sources/rsync.macports.org/release/tarballs/ports/archivers/bzip2
233:debug:main OS darwin/20.2.0 (macOS 11.1) arch i386
234:debug:main Reading variant descriptions from /opt/local/var/macports/sources/rsync.macports.org/release/tarballs/ports/_resources/port1.0/variant_descriptions.conf
235:debug:main universal variant already exists, so not adding the default one
236:debug:main Running callback portconfigure::add_automatic_compiler_dependencies
237:debug:main Finished running callback portconfigure::add_automatic_compiler_dependencies
238:debug:main Running callback portbuild::add_automatic_buildsystem_dependencies
239:debug:main Finished running callback portbuild::add_automatic_buildsystem_dependencies
240:debug:main Running callback portstartupitem::add_notes
241:debug:main Finished running callback portstartupitem::add_notes
242:debug:main No need to upgrade! bzip2 1.0.8_0 >= bzip2 1.0.8_0
243:debug:main epoch: in tree: 0 installed: 0
244:debug:main perl5 5.28.3_0 exists in the ports tree
245:debug:main perl5 5.28.3_0 +perl5_30 is the latest installed
246:debug:main perl5 5.28.3_0 +perl5_30 is active
247:debug:main Merging existing variants '+perl5_30' into variants
248:debug:main new fully merged portvariants: perl5_30 +
249:debug:main Changing to port directory: /opt/local/var/macports/sources/rsync.macports.org/release/tarballs/ports/lang/perl5
250:debug:main OS darwin/20.2.0 (macOS 11.1) arch i386
251:debug:main Re-registering default for configure.universal_args
252:debug:main Sourcing PortGroup perl5 1.0 from /opt/local/var/macports/sources/rsync.macports.org/release/tarballs/ports/_resources/port1.0/group/perl5-1.0.tcl
253:debug:main Sourcing PortGroup clang_dependency 1.0 from /opt/local/var/macports/sources/rsync.macports.org/release/tarballs/ports/_resources/port1.0/group/clang_dependency-1.0.tcl
254:debug:main universal_variant is false, so not adding the default universal variant
255:debug:main Executing variant perl5_30 provides perl5_30
256:debug:main Running callback portconfigure::add_automatic_compiler_dependencies
257:debug:main Finished running callback portconfigure::add_automatic_compiler_dependencies
258:debug:main Running callback portbuild::add_automatic_buildsystem_dependencies
259:debug:main Finished running callback portbuild::add_automatic_buildsystem_dependencies
260:debug:main Running callback portstartupitem::add_notes
261:debug:main Finished running callback portstartupitem::add_notes
262:debug:main No need to upgrade! perl5 5.28.3_0 >= perl5 5.28.3_0
263:debug:main epoch: in tree: 0 installed: 0
264:debug:main perl5.30 5.30.3_0 exists in the ports tree
265:debug:main perl5.30 5.30.3_0  is the latest installed
266:debug:main perl5.30 5.30.3_0  is active
267:debug:main Merging existing variants '' into variants
268:debug:main new fully merged portvariants:
269:debug:main Changing to port directory: /opt/local/var/macports/sources/rsync.macports.org/release/tarballs/ports/lang/perl5
270:debug:main OS darwin/20.2.0 (macOS 11.1) arch i386
271:debug:main Re-registering default for configure.universal_args
272:debug:main Sourcing PortGroup perl5 1.0 from /opt/local/var/macports/sources/rsync.macports.org/release/tarballs/ports/_resources/port1.0/group/perl5-1.0.tcl
273:debug:main Sourcing PortGroup clang_dependency 1.0 from /opt/local/var/macports/sources/rsync.macports.org/release/tarballs/ports/_resources/port1.0/group/clang_dependency-1.0.tcl
274:debug:main adding the default universal variant
275:debug:main Reading variant descriptions from /opt/local/var/macports/sources/rsync.macports.org/release/tarballs/ports/_resources/port1.0/variant_descriptions.conf
276:debug:main Running callback portconfigure::add_automatic_compiler_dependencies
277:debug:main Finished running callback portconfigure::add_automatic_compiler_dependencies
278:debug:main Running callback portbuild::add_automatic_buildsystem_dependencies
279:debug:main Finished running callback portbuild::add_automatic_buildsystem_dependencies
280:debug:main Running callback portstartupitem::add_notes
281:debug:main Finished running callback portstartupitem::add_notes
282:debug:main No need to upgrade! perl5.30 5.30.3_0 >= perl5.30 5.30.3_0
283:debug:main epoch: in tree: 0 installed: 0
284:debug:main gdbm 1.18.1_1 exists in the ports tree
285:debug:main gdbm 1.18.1_1  is the latest installed
286:debug:main gdbm 1.18.1_1  is active
287:debug:main Merging existing variants '' into variants
288:debug:main new fully merged portvariants:
289:debug:main Changing to port directory: /opt/local/var/macports/sources/rsync.macports.org/release/tarballs/ports/databases/gdbm
290:debug:main OS darwin/20.2.0 (macOS 11.1) arch i386
291:debug:main Sourcing PortGroup clang_dependency 1.0 from /opt/local/var/macports/sources/rsync.macports.org/release/tarballs/ports/_resources/port1.0/group/clang_dependency-1.0.tcl
292:debug:main adding the default universal variant
293:debug:main Reading variant descriptions from /opt/local/var/macports/sources/rsync.macports.org/release/tarballs/ports/_resources/port1.0/variant_descriptions.conf
294:debug:main Running callback portconfigure::add_automatic_compiler_dependencies
295:debug:main Finished running callback portconfigure::add_automatic_compiler_dependencies
296:debug:main Running callback portbuild::add_automatic_buildsystem_dependencies
297:debug:main Finished running callback portbuild::add_automatic_buildsystem_dependencies
298:debug:main Running callback portstartupitem::add_notes
299:debug:main Finished running callback portstartupitem::add_notes
300:debug:main No need to upgrade! gdbm 1.18.1_1 >= gdbm 1.18.1_1
301:debug:main epoch: in tree: 2 installed: 2
302:debug:main gettext 0.19.8.1_2 exists in the ports tree
303:debug:main gettext 0.19.8.1_2  is the latest installed
304:debug:main gettext 0.19.8.1_2  is active
305:debug:main Merging existing variants '' into variants
306:debug:main new fully merged portvariants:
307:debug:main Changing to port directory: /opt/local/var/macports/sources/rsync.macports.org/release/tarballs/ports/devel/gettext
308:debug:main OS darwin/20.2.0 (macOS 11.1) arch i386
309:debug:main Sourcing PortGroup compiler_blacklist_versions 1.0 from /opt/local/var/macports/sources/rsync.macports.org/release/tarballs/ports/_resources/port1.0/group/compiler_blacklist_versions-1.0.tcl
310:debug:main Reading variant descriptions from /opt/local/var/macports/sources/rsync.macports.org/release/tarballs/ports/_resources/port1.0/variant_descriptions.conf
311:debug:main Sourcing PortGroup muniversal 1.0 from /opt/local/var/macports/sources/rsync.macports.org/release/tarballs/ports/_resources/port1.0/group/muniversal-1.0.tcl
312:debug:main Sourcing PortGroup clang_dependency 1.0 from /opt/local/var/macports/sources/rsync.macports.org/release/tarballs/ports/_resources/port1.0/group/clang_dependency-1.0.tcl
313:debug:main compiler clang 1200.0.32.28 not blacklisted because it doesn't match {clang < 211.10.1}
314:debug:main universal variant already exists, so not adding the default one
315:debug:main Running callback portconfigure::add_automatic_compiler_dependencies
316:debug:main Finished running callback portconfigure::add_automatic_compiler_dependencies
317:debug:main Running callback portbuild::add_automatic_buildsystem_dependencies
318:debug:main Finished running callback portbuild::add_automatic_buildsystem_dependencies
319:debug:main Running callback portstartupitem::add_notes
320:debug:main Finished running callback portstartupitem::add_notes
321:debug:main No need to upgrade! gettext 0.19.8.1_2 >= gettext 0.19.8.1_2
322:debug:main epoch: in tree: 0 installed: 0
323:debug:main readline 8.1.000_0 exists in the ports tree
324:debug:main readline 8.1.000_0  is the latest installed
325:debug:main readline 8.1.000_0  is active
326:debug:main Merging existing variants '' into variants
327:debug:main new fully merged portvariants:
328:debug:main Changing to port directory: /opt/local/var/macports/sources/rsync.macports.org/release/tarballs/ports/devel/readline
329:debug:main OS darwin/20.2.0 (macOS 11.1) arch i386
330:debug:main Reading variant descriptions from /opt/local/var/macports/sources/rsync.macports.org/release/tarballs/ports/_resources/port1.0/variant_descriptions.conf
331:debug:main Sourcing PortGroup muniversal 1.0 from /opt/local/var/macports/sources/rsync.macports.org/release/tarballs/ports/_resources/port1.0/group/muniversal-1.0.tcl
332:debug:main Sourcing PortGroup clang_dependency 1.0 from /opt/local/var/macports/sources/rsync.macports.org/release/tarballs/ports/_resources/port1.0/group/clang_dependency-1.0.tcl
333:debug:main universal variant already exists, so not adding the default one
334:debug:main Running callback portconfigure::add_automatic_compiler_dependencies
335:debug:main Finished running callback portconfigure::add_automatic_compiler_dependencies
336:debug:main Running callback portbuild::add_automatic_buildsystem_dependencies
337:debug:main Finished running callback portbuild::add_automatic_buildsystem_dependencies
338:debug:main Running callback portstartupitem::add_notes
339:debug:main Finished running callback portstartupitem::add_notes
340:debug:main No need to upgrade! readline 8.1.000_0 >= readline 8.1.000_0
341:msg:main --->  Computing dependencies for mod_perl2:info:main .:debug:main mod_perl2 has no conflicts
342:debug:main Searching for dependency: apache2
343:debug:main Found Dependency: receipt exists for apache2
344:debug:main Searching for dependency: perl5.30
345:debug:main Found Dependency: receipt exists for perl5.30
346:debug:main Executing org.macports.main (mod_perl2)
347:debug:main dropping privileges: euid changed to 502, egid changed to 501.
348:debug:archivefetch archivefetch phase started at Wed Jan 27 20:20:54 EST 2021
349:msg:archivefetch --->  Fetching archive for mod_perl2
350:debug:archivefetch Executing org.macports.archivefetch (mod_perl2)
351:debug:archivefetch euid/egid changed to: 0/0
352:debug:archivefetch chowned /opt/local/var/macports/incoming to macports
353:debug:archivefetch euid/egid changed to: 502/501
354:info:archivefetch --->  mod_perl2-2.0.11_0+perl5_30.darwin_20.x86_64.tbz2 doesn't seem to exist in /opt/local/var/macports/incoming/verified
355:msg:archivefetch --->  Attempting to fetch mod_perl2-2.0.11_0+perl5_30.darwin_20.x86_64.tbz2 from https://ywg.ca.packages.macports.org/mirror/macports/packages/mod_perl2
356:debug:archivefetch Fetching archive failed: The requested URL returned error: 404 Not Found
357:msg:archivefetch --->  Attempting to fetch mod_perl2-2.0.11_0+perl5_30.darwin_20.x86_64.tbz2 from https://mse.uk.packages.macports.org/mod_perl2
358:debug:archivefetch Fetching archive failed: The requested URL returned error: 404 Not Found
359:msg:archivefetch --->  Attempting to fetch mod_perl2-2.0.11_0+perl5_30.darwin_20.x86_64.tbz2 from https://lil.fr.packages.macports.org/mod_perl2
360:debug:archivefetch Fetching archive failed: The requested URL returned error: 404 Not Found
361:debug:archivefetch Privilege de-escalation not attempted as not running as root.
362:debug:fetch fetch phase started at Wed Jan 27 20:20:55 EST 2021
363:notice:fetch --->  Fetching distfiles for mod_perl2
364:debug:fetch Executing proc-pre-org.macports.fetch-fetch-0
365:debug:fetch Executing org.macports.fetch (mod_perl2)
366:debug:fetch Privilege de-escalation not attempted as not running as root.
367:debug:checksum checksum phase started at Wed Jan 27 20:20:55 EST 2021
368:notice:checksum --->  Verifying checksums for mod_perl2
369:debug:checksum Executing org.macports.checksum (mod_perl2)
370:info:checksum --->  Checksumming mod_perl-2.0.11.tar.gz
371:debug:checksum Calculated (rmd160) is c96405de064cd378b3b69225ea20e5d950ddacd5
372:debug:checksum Correct (rmd160) checksum for mod_perl-2.0.11.tar.gz
373:debug:checksum Calculated (sha256) is ca2a9e18cdf90f9c6023e786369d5ba75e8dac292ebfea9900c29bf42dc16f74
374:debug:checksum Correct (sha256) checksum for mod_perl-2.0.11.tar.gz
375:debug:checksum Calculated (size) is 3848147
376:debug:checksum Correct (size) checksum for mod_perl-2.0.11.tar.gz
377:debug:checksum Privilege de-escalation not attempted as not running as root.
378:debug:extract extract phase started at Wed Jan 27 20:20:55 EST 2021
379:notice:extract --->  Extracting mod_perl2
380:debug:extract Executing org.macports.extract (mod_perl2)
381:info:extract --->  Extracting mod_perl-2.0.11.tar.gz
382:debug:extract setting option extract.args to '/opt/local/var/macports/distfiles/mod_perl2/mod_perl-2.0.11.tar.gz'
383:debug:extract Environment:
384:debug:extract CC_PRINT_OPTIONS='YES'
385:debug:extract CC_PRINT_OPTIONS_FILE='/opt/local/var/macports/build/_opt_local_var_macports_sources_rsync.macports.org_release_tarballs_ports_www_mod_perl2/mod_perl2/work/.CC_PRINT_OPTIONS'
386:debug:extract CPATH='/opt/local/include'
387:debug:extract DEVELOPER_DIR='/Library/Developer/CommandLineTools'
388:debug:extract LIBRARY_PATH='/opt/local/lib'
389:debug:extract MACOSX_DEPLOYMENT_TARGET='11.0'
390:debug:extract SDKROOT='/Library/Developer/CommandLineTools/SDKs/MacOSX11.0.sdk'
391:info:extract Executing:  cd "/opt/local/var/macports/build/_opt_local_var_macports_sources_rsync.macports.org_release_tarballs_ports_www_mod_perl2/mod_perl2/work" && /usr/bin/gzip -dc '/opt/local/var/macports/distfiles/mod_perl2/mod_perl-2.0.11.tar.gz' | /usr/bin/tar -xf -
392:debug:extract system:  cd "/opt/local/var/macports/build/_opt_local_var_macports_sources_rsync.macports.org_release_tarballs_ports_www_mod_perl2/mod_perl2/work" && /usr/bin/gzip -dc '/opt/local/var/macports/distfiles/mod_perl2/mod_perl-2.0.11.tar.gz' | /usr/bin/tar -xf -
393:debug:extract euid/egid changed to: 0/0
394:debug:extract chowned /opt/local/var/macports/build/_opt_local_var_macports_sources_rsync.macports.org_release_tarballs_ports_www_mod_perl2/mod_perl2/work to macports
395:debug:extract euid/egid changed to: 502/501
396:debug:extract Privilege de-escalation not attempted as not running as root.
397:debug:patch patch phase started at Wed Jan 27 20:20:56 EST 2021
398:debug:patch Executing org.macports.patch (mod_perl2)
399:notice:patch --->  Applying patches to mod_perl2
400:info:patch --->  Applying clang-compatibility_src-modules-perl-modperl_common_util.h.patch
401:debug:patch Environment:
402:debug:patch CC_PRINT_OPTIONS='YES'
403:debug:patch CC_PRINT_OPTIONS_FILE='/opt/local/var/macports/build/_opt_local_var_macports_sources_rsync.macports.org_release_tarballs_ports_www_mod_perl2/mod_perl2/work/.CC_PRINT_OPTIONS'
404:debug:patch CPATH='/opt/local/include'
405:debug:patch DEVELOPER_DIR='/Library/Developer/CommandLineTools'
406:debug:patch LIBRARY_PATH='/opt/local/lib'
407:debug:patch MACOSX_DEPLOYMENT_TARGET='11.0'
408:debug:patch SDKROOT='/Library/Developer/CommandLineTools/SDKs/MacOSX11.0.sdk'
409:info:patch Executing:  cd "/opt/local/var/macports/build/_opt_local_var_macports_sources_rsync.macports.org_release_tarballs_ports_www_mod_perl2/mod_perl2/work/mod_perl-2.0.11" && /usr/bin/patch -p0 < '/opt/local/var/macports/sources/rsync.macports.org/release/tarballs/ports/www/mod_perl2/files/clang-compatibility_src-modules-perl-modperl_common_util.h.patch'
410:debug:patch system:  cd "/opt/local/var/macports/build/_opt_local_var_macports_sources_rsync.macports.org_release_tarballs_ports_www_mod_perl2/mod_perl2/work/mod_perl-2.0.11" && /usr/bin/patch -p0 < '/opt/local/var/macports/sources/rsync.macports.org/release/tarballs/ports/www/mod_perl2/files/clang-compatibility_src-modules-perl-modperl_common_util.h.patch'
411:info:patch patching file src/modules/perl/modperl_common_util.h
412:debug:patch Privilege de-escalation not attempted as not running as root.
413:debug:configure configure phase started at Wed Jan 27 20:20:56 EST 2021
414:notice:configure --->  Configuring mod_perl2
415:debug:configure Preferred compilers: clang macports-clang-9.0 macports-clang-8.0 macports-clang-7.0 macports-clang-6.0 macports-clang-5.0
416:debug:configure Using compiler 'Xcode Clang'
417:debug:configure Executing org.macports.configure (mod_perl2)
418:debug:configure system -W /opt/local/var/macports/build/_opt_local_var_macports_sources_rsync.macports.org_release_tarballs_ports_www_mod_perl2/mod_perl2/work/mod_perl-2.0.11: /opt/local/bin/perl5.30 Makefile.PL MP_APXS=/opt/local/bin/apxs
419:info:configure Reading Makefile.PL args from @ARGV
420:info:configure    MP_APXS = /opt/local/bin/apxs
421:info:configure no conflicting prior mod_perl version found - good.
422:info:configure Using APXS => /opt/local/bin/apxs
423:info:configure Configuring Apache/2.4.46 mod_perl/2.0.11 Perl/v5.30.3
424:info:configure Argument "Apple LLVM 12" isn't numeric in numeric comparison (<=>) at lib/Apache2/Build.pm line 666.
425:info:configure Checking if your kit is complete...
426:info:configure Looks good
427:info:configure Checking if your kit is complete...
428:info:configure Looks good
429:info:configure Writing MYMETA.yml and MYMETA.json
430:info:configure Checking if your kit is complete...
431:info:configure Looks good
432:info:configure Writing MYMETA.yml and MYMETA.json
433:info:configure Subroutine set_version redefined at ./Makefile.PL line 131.
434:info:configure [   info] generating script t/TEST
435:info:configure [   info] generating script ./t/cgi-bin/next_available_port.pl
436:info:configure [   info] generating script ./t/cgi-bin/cookies.pl
437:info:configure Writing MYMETA.yml and MYMETA.json
438:info:configure Checking for Cwd...ok
439:info:configure Checking for File::Spec...ok
440:info:configure [   info] generating script t/TEST
441:info:configure Argument "Apple LLVM 12" isn't numeric in numeric comparison (<=>) at lib/Apache2/Build.pm line 666.
442:info:configure Checking if your kit is complete...
443:info:configure Looks good
444:info:configure Writing MYMETA.yml and MYMETA.json
445:info:configure Argument "Apple LLVM 12" isn't numeric in numeric comparison (<=>) at lib/Apache2/Build.pm line 666.
446:info:configure Argument "Apple LLVM 12" isn't numeric in numeric comparison (<=>) at lib/Apache2/Build.pm line 666.
447:info:configure Argument "Apple LLVM 12" isn't numeric in numeric comparison (<=>) at lib/Apache2/Build.pm line 666.
448:info:configure Writing MYMETA.yml and MYMETA.json
449:info:configure Argument "Apple LLVM 12" isn't numeric in numeric comparison (<=>) at lib/Apache2/Build.pm line 666.
450:info:configure Writing MYMETA.yml and MYMETA.json
451:info:configure Argument "Apple LLVM 12" isn't numeric in numeric comparison (<=>) at lib/Apache2/Build.pm line 666.
452:info:configure Writing MYMETA.yml and MYMETA.json
453:info:configure Argument "Apple LLVM 12" isn't numeric in numeric comparison (<=>) at lib/Apache2/Build.pm line 666.
454:info:configure Writing MYMETA.yml and MYMETA.json
455:info:configure Argument "Apple LLVM 12" isn't numeric in numeric comparison (<=>) at lib/Apache2/Build.pm line 666.
456:info:configure Writing MYMETA.yml and MYMETA.json
457:info:configure Argument "Apple LLVM 12" isn't numeric in numeric comparison (<=>) at lib/Apache2/Build.pm line 666.
458:info:configure Writing MYMETA.yml and MYMETA.json
459:info:configure Argument "Apple LLVM 12" isn't numeric in numeric comparison (<=>) at lib/Apache2/Build.pm line 666.
460:info:configure Writing MYMETA.yml and MYMETA.json
461:info:configure Argument "Apple LLVM 12" isn't numeric in numeric comparison (<=>) at lib/Apache2/Build.pm line 666.
462:info:configure Writing MYMETA.yml and MYMETA.json
463:info:configure Argument "Apple LLVM 12" isn't numeric in numeric comparison (<=>) at lib/Apache2/Build.pm line 666.
464:info:configure Writing MYMETA.yml and MYMETA.json
465:info:configure Argument "Apple LLVM 12" isn't numeric in numeric comparison (<=>) at lib/Apache2/Build.pm line 666.
466:info:configure Writing MYMETA.yml and MYMETA.json
467:info:configure Argument "Apple LLVM 12" isn't numeric in numeric comparison (<=>) at lib/Apache2/Build.pm line 666.
468:info:configure Writing MYMETA.yml and MYMETA.json
469:info:configure Argument "Apple LLVM 12" isn't numeric in numeric comparison (<=>) at lib/Apache2/Build.pm line 666.
470:info:configure Writing MYMETA.yml and MYMETA.json
471:info:configure Argument "Apple LLVM 12" isn't numeric in numeric comparison (<=>) at lib/Apache2/Build.pm line 666.
472:info:configure Writing MYMETA.yml and MYMETA.json
473:info:configure Argument "Apple LLVM 12" isn't numeric in numeric comparison (<=>) at lib/Apache2/Build.pm line 666.
474:info:configure Writing MYMETA.yml and MYMETA.json
475:info:configure Argument "Apple LLVM 12" isn't numeric in numeric comparison (<=>) at lib/Apache2/Build.pm line 666.
476:info:configure Writing MYMETA.yml and MYMETA.json
477:info:configure Argument "Apple LLVM 12" isn't numeric in numeric comparison (<=>) at lib/Apache2/Build.pm line 666.
478:info:configure Writing MYMETA.yml and MYMETA.json
479:info:configure Argument "Apple LLVM 12" isn't numeric in numeric comparison (<=>) at lib/Apache2/Build.pm line 666.
480:info:configure Writing MYMETA.yml and MYMETA.json
481:info:configure Argument "Apple LLVM 12" isn't numeric in numeric comparison (<=>) at lib/Apache2/Build.pm line 666.
482:info:configure Writing MYMETA.yml and MYMETA.json
483:info:configure Argument "Apple LLVM 12" isn't numeric in numeric comparison (<=>) at lib/Apache2/Build.pm line 666.
484:info:configure Writing MYMETA.yml and MYMETA.json
485:info:configure Argument "Apple LLVM 12" isn't numeric in numeric comparison (<=>) at lib/Apache2/Build.pm line 666.
486:info:configure Writing MYMETA.yml and MYMETA.json
487:info:configure Argument "Apple LLVM 12" isn't numeric in numeric comparison (<=>) at lib/Apache2/Build.pm line 666.
488:info:configure Writing MYMETA.yml and MYMETA.json
489:info:configure Writing MYMETA.yml and MYMETA.json
490:info:configure Argument "Apple LLVM 12" isn't numeric in numeric comparison (<=>) at lib/Apache2/Build.pm line 666.
491:info:configure Argument "Apple LLVM 12" isn't numeric in numeric comparison (<=>) at lib/Apache2/Build.pm line 666.
492:info:configure Writing MYMETA.yml and MYMETA.json
493:info:configure Argument "Apple LLVM 12" isn't numeric in numeric comparison (<=>) at lib/Apache2/Build.pm line 666.
494:info:configure Writing MYMETA.yml and MYMETA.json
495:info:configure Argument "Apple LLVM 12" isn't numeric in numeric comparison (<=>) at lib/Apache2/Build.pm line 666.
496:info:configure Writing MYMETA.yml and MYMETA.json
497:info:configure Argument "Apple LLVM 12" isn't numeric in numeric comparison (<=>) at lib/Apache2/Build.pm line 666.
498:info:configure Writing MYMETA.yml and MYMETA.json
499:info:configure Argument "Apple LLVM 12" isn't numeric in numeric comparison (<=>) at lib/Apache2/Build.pm line 666.
500:info:configure Writing MYMETA.yml and MYMETA.json
501:info:configure Argument "Apple LLVM 12" isn't numeric in numeric comparison (<=>) at lib/Apache2/Build.pm line 666.
502:info:configure Writing MYMETA.yml and MYMETA.json
503:info:configure Argument "Apple LLVM 12" isn't numeric in numeric comparison (<=>) at lib/Apache2/Build.pm line 666.
504:info:configure Writing MYMETA.yml and MYMETA.json
505:info:configure Argument "Apple LLVM 12" isn't numeric in numeric comparison (<=>) at lib/Apache2/Build.pm line 666.
506:info:configure Writing MYMETA.yml and MYMETA.json
507:info:configure Argument "Apple LLVM 12" isn't numeric in numeric comparison (<=>) at lib/Apache2/Build.pm line 666.
508:info:configure Writing MYMETA.yml and MYMETA.json
509:info:configure Argument "Apple LLVM 12" isn't numeric in numeric comparison (<=>) at lib/Apache2/Build.pm line 666.
510:info:configure Writing MYMETA.yml and MYMETA.json
511:info:configure Argument "Apple LLVM 12" isn't numeric in numeric comparison (<=>) at lib/Apache2/Build.pm line 666.
512:info:configure Writing MYMETA.yml and MYMETA.json
513:info:configure Argument "Apple LLVM 12" isn't numeric in numeric comparison (<=>) at lib/Apache2/Build.pm line 666.
514:info:configure Writing MYMETA.yml and MYMETA.json
515:info:configure Argument "Apple LLVM 12" isn't numeric in numeric comparison (<=>) at lib/Apache2/Build.pm line 666.
516:info:configure Writing MYMETA.yml and MYMETA.json
517:info:configure Argument "Apple LLVM 12" isn't numeric in numeric comparison (<=>) at lib/Apache2/Build.pm line 666.
518:info:configure Writing MYMETA.yml and MYMETA.json
519:info:configure Argument "Apple LLVM 12" isn't numeric in numeric comparison (<=>) at lib/Apache2/Build.pm line 666.
520:info:configure Writing MYMETA.yml and MYMETA.json
521:info:configure Argument "Apple LLVM 12" isn't numeric in numeric comparison (<=>) at lib/Apache2/Build.pm line 666.
522:info:configure Writing MYMETA.yml and MYMETA.json
523:info:configure Argument "Apple LLVM 12" isn't numeric in numeric comparison (<=>) at lib/Apache2/Build.pm line 666.
524:info:configure Writing MYMETA.yml and MYMETA.json
525:info:configure Argument "Apple LLVM 12" isn't numeric in numeric comparison (<=>) at lib/Apache2/Build.pm line 666.
526:info:configure Writing MYMETA.yml and MYMETA.json
527:info:configure Argument "Apple LLVM 12" isn't numeric in numeric comparison (<=>) at lib/Apache2/Build.pm line 666.
528:info:configure Writing MYMETA.yml and MYMETA.json
529:info:configure Argument "Apple LLVM 12" isn't numeric in numeric comparison (<=>) at lib/Apache2/Build.pm line 666.
530:info:configure Writing MYMETA.yml and MYMETA.json
531:info:configure Argument "Apple LLVM 12" isn't numeric in numeric comparison (<=>) at lib/Apache2/Build.pm line 666.
532:info:configure Writing MYMETA.yml and MYMETA.json
533:info:configure Argument "Apple LLVM 12" isn't numeric in numeric comparison (<=>) at lib/Apache2/Build.pm line 666.
534:info:configure Writing MYMETA.yml and MYMETA.json
535:info:configure Argument "Apple LLVM 12" isn't numeric in numeric comparison (<=>) at lib/Apache2/Build.pm line 666.
536:info:configure Writing MYMETA.yml and MYMETA.json
537:info:configure Argument "Apple LLVM 12" isn't numeric in numeric comparison (<=>) at lib/Apache2/Build.pm line 666.
538:info:configure Writing MYMETA.yml and MYMETA.json
539:info:configure Writing MYMETA.yml and MYMETA.json
540:info:configure Argument "Apple LLVM 12" isn't numeric in numeric comparison (<=>) at lib/Apache2/Build.pm line 666.
541:info:configure Argument "Apple LLVM 12" isn't numeric in numeric comparison (<=>) at lib/Apache2/Build.pm line 666.
542:info:configure Writing MYMETA.yml and MYMETA.json
543:info:configure Argument "Apple LLVM 12" isn't numeric in numeric comparison (<=>) at lib/Apache2/Build.pm line 666.
544:info:configure Writing MYMETA.yml and MYMETA.json
545:info:configure Argument "Apple LLVM 12" isn't numeric in numeric comparison (<=>) at lib/Apache2/Build.pm line 666.
546:info:configure Writing MYMETA.yml and MYMETA.json
547:info:configure Argument "Apple LLVM 12" isn't numeric in numeric comparison (<=>) at lib/Apache2/Build.pm line 666.
548:info:configure Writing MYMETA.yml and MYMETA.json
549:info:configure Argument "Apple LLVM 12" isn't numeric in numeric comparison (<=>) at lib/Apache2/Build.pm line 666.
550:info:configure Writing MYMETA.yml and MYMETA.json
551:info:configure Argument "Apple LLVM 12" isn't numeric in numeric comparison (<=>) at lib/Apache2/Build.pm line 666.
552:info:configure Writing MYMETA.yml and MYMETA.json
553:info:configure Writing MYMETA.yml and MYMETA.json
554:info:configure Writing MYMETA.yml and MYMETA.json
555:info:configure Argument "Apple LLVM 12" isn't numeric in numeric comparison (<=>) at lib/Apache2/Build.pm line 666.
556:info:configure Argument "Apple LLVM 12" isn't numeric in numeric comparison (<=>) at lib/Apache2/Build.pm line 666.
557:info:configure Argument "Apple LLVM 12" isn't numeric in numeric comparison (<=>) at lib/Apache2/Build.pm line 666.
558:info:configure Argument "Apple LLVM 12" isn't numeric in numeric comparison (<=>) at lib/Apache2/Build.pm line 666.
559:info:configure Warning (mostly harmless): No library found for -ldb-4.8
560:info:configure Warning (mostly harmless): No library found for -lpthread
561:info:configure Writing MYMETA.yml and MYMETA.json
562:info:configure Argument "Apple LLVM 12" isn't numeric in numeric comparison (<=>) at lib/Apache2/Build.pm line 666.
563:info:configure Argument "Apple LLVM 12" isn't numeric in numeric comparison (<=>) at lib/Apache2/Build.pm line 666.
564:info:configure Writing MYMETA.yml and MYMETA.json
565:info:configure Argument "Apple LLVM 12" isn't numeric in numeric comparison (<=>) at lib/Apache2/Build.pm line 666.
566:info:configure Argument "Apple LLVM 12" isn't numeric in numeric comparison (<=>) at lib/Apache2/Build.pm line 666.
567:info:configure Writing MYMETA.yml and MYMETA.json
568:info:configure Argument "Apple LLVM 12" isn't numeric in numeric comparison (<=>) at lib/Apache2/Build.pm line 666.
569:info:configure Argument "Apple LLVM 12" isn't numeric in numeric comparison (<=>) at lib/Apache2/Build.pm line 666.
570:info:configure Writing MYMETA.yml and MYMETA.json
571:info:configure Writing MYMETA.yml and MYMETA.json
572:info:configure Argument "Apple LLVM 12" isn't numeric in numeric comparison (<=>) at lib/Apache2/Build.pm line 666.
573:info:configure Argument "Apple LLVM 12" isn't numeric in numeric comparison (<=>) at lib/Apache2/Build.pm line 666.
574:info:configure Writing MYMETA.yml and MYMETA.json
575:info:configure Writing MYMETA.yml and MYMETA.json
576:info:configure Argument "Apple LLVM 12" isn't numeric in numeric comparison (<=>) at lib/Apache2/Build.pm line 666.
577:info:configure Argument "Apple LLVM 12" isn't numeric in numeric comparison (<=>) at lib/Apache2/Build.pm line 666.
578:info:configure Writing MYMETA.yml and MYMETA.json
579:info:configure Writing MYMETA.yml and MYMETA.json
580:info:configure Writing MYMETA.yml and MYMETA.json
581:info:configure Generating a Unix-style Makefile
582:info:configure Writing Makefile for mod_perl2
583:info:configure Writing MYMETA.yml and MYMETA.json
584:info:configure Argument "Apple LLVM 12" isn't numeric in numeric comparison (<=>) at lib/Apache2/Build.pm line 666.
585:info:configure [warning] mod_perl dso library will be built as mod_perl.so
586:info:configure [warning] You'll need to add the following to httpd.conf:
587:info:configure [warning]
588:info:configure [warning]   LoadModule perl_module modules/mod_perl.so
589:info:configure [warning]
590:info:configure [warning] depending on your build, mod_perl might not live in
591:info:configure [warning] the modules/ directory.
592:info:configure [warning] Check the results of
593:info:configure [warning]
594:info:configure [warning]   $ /opt/local/bin/apxs -q LIBEXECDIR
595:info:configure [warning]
596:info:configure [warning] and adjust the LoadModule directive accordingly.
597:debug:configure Executing portconfigure::configure_finish
598:debug:configure Privilege de-escalation not attempted as not running as root.
599:debug:build build phase started at Wed Jan 27 20:21:01 EST 2021
600:notice:build --->  Building mod_perl2
601:debug:build Executing org.macports.build (mod_perl2)
602:debug:build Environment:
603:debug:build CC_PRINT_OPTIONS='YES'
604:debug:build CC_PRINT_OPTIONS_FILE='/opt/local/var/macports/build/_opt_local_var_macports_sources_rsync.macports.org_release_tarballs_ports_www_mod_perl2/mod_perl2/work/.CC_PRINT_OPTIONS'
605:debug:build CPATH='/opt/local/include'
606:debug:build DEVELOPER_DIR='/Library/Developer/CommandLineTools'
607:debug:build LIBRARY_PATH='/opt/local/lib'
608:debug:build MACOSX_DEPLOYMENT_TARGET='11.0'
609:debug:build SDKROOT='/Library/Developer/CommandLineTools/SDKs/MacOSX11.0.sdk'
610:info:build Executing:  cd "/opt/local/var/macports/build/_opt_local_var_macports_sources_rsync.macports.org_release_tarballs_ports_www_mod_perl2/mod_perl2/work/mod_perl-2.0.11" && /usr/bin/make -j16 -w all
611:debug:build system:  cd "/opt/local/var/macports/build/_opt_local_var_macports_sources_rsync.macports.org_release_tarballs_ports_www_mod_perl2/mod_perl2/work/mod_perl-2.0.11" && /usr/bin/make -j16 -w all
612:info:build make: Entering directory `/opt/local/var/macports/build/_opt_local_var_macports_sources_rsync.macports.org_release_tarballs_ports_www_mod_perl2/mod_perl2/work/mod_perl-2.0.11'
613:info:build cd "src/modules/perl" && make
614:info:build make[1]: Entering directory `/opt/local/var/macports/build/_opt_local_var_macports_sources_rsync.macports.org_release_tarballs_ports_www_mod_perl2/mod_perl2/work/mod_perl-2.0.11/src/modules/perl'
615:info:build /usr/bin/clang -I/opt/local/var/macports/build/_opt_local_var_macports_sources_rsync.macports.org_release_tarballs_ports_www_mod_perl2/mod_perl2/work/mod_perl-2.0.11/src/modules/perl -I/opt/local/var/macports/build/_opt_local_var_macports_sources_rsync.macports.org_release_tarballs_ports_www_mod_perl2/mod_perl2/work/mod_perl-2.0.11/xs -I/opt/local/include/apr-1 -I/opt/local/include/apr-1 -I/opt/local/include -I/opt/local/include/apache2 -fno-common -DPERL_DARWIN -mmacosx-version-min=10.16 -pipe -Os -isysroot/Library/Developer/CommandLineTools/SDKs/MacOSX11.0.sdk -fno-strict-aliasing -fstack-protector-strong -I/opt/local/include -DPERL_USE_SAFE_PUTENV -I/opt/local/lib/perl5/5.30/darwin-thread-multi-2level/CORE -DMOD_PERL -DMP_COMPAT_1X -DDARWIN -DSIGPROCMASK_SETS_THREAD_MASK -O3  \
616:info:build     -c mod_perl.c && mv mod_perl.o mod_perl.lo
617:info:build /usr/bin/clang -I/opt/local/var/macports/build/_opt_local_var_macports_sources_rsync.macports.org_release_tarballs_ports_www_mod_perl2/mod_perl2/work/mod_perl-2.0.11/src/modules/perl -I/opt/local/var/macports/build/_opt_local_var_macports_sources_rsync.macports.org_release_tarballs_ports_www_mod_perl2/mod_perl2/work/mod_perl-2.0.11/xs -I/opt/local/include/apr-1 -I/opt/local/include/apr-1 -I/opt/local/include -I/opt/local/include/apache2 -fno-common -DPERL_DARWIN -mmacosx-version-min=10.16 -pipe -Os -isysroot/Library/Developer/CommandLineTools/SDKs/MacOSX11.0.sdk -fno-strict-aliasing -fstack-protector-strong -I/opt/local/include -DPERL_USE_SAFE_PUTENV -I/opt/local/lib/perl5/5.30/darwin-thread-multi-2level/CORE -DMOD_PERL -DMP_COMPAT_1X -DDARWIN -DSIGPROCMASK_SETS_THREAD_MASK -O3  \
618:info:build     -c modperl_interp.c && mv modperl_interp.o modperl_interp.lo
619:info:build /usr/bin/clang -I/opt/local/var/macports/build/_opt_local_var_macports_sources_rsync.macports.org_release_tarballs_ports_www_mod_perl2/mod_perl2/work/mod_perl-2.0.11/src/modules/perl -I/opt/local/var/macports/build/_opt_local_var_macports_sources_rsync.macports.org_release_tarballs_ports_www_mod_perl2/mod_perl2/work/mod_perl-2.0.11/xs -I/opt/local/include/apr-1 -I/opt/local/include/apr-1 -I/opt/local/include -I/opt/local/include/apache2 -fno-common -DPERL_DARWIN -mmacosx-version-min=10.16 -pipe -Os -isysroot/Library/Developer/CommandLineTools/SDKs/MacOSX11.0.sdk -fno-strict-aliasing -fstack-protector-strong -I/opt/local/include -DPERL_USE_SAFE_PUTENV -I/opt/local/lib/perl5/5.30/darwin-thread-multi-2level/CORE -DMOD_PERL -DMP_COMPAT_1X -DDARWIN -DSIGPROCMASK_SETS_THREAD_MASK -O3  \
620:info:build     -c modperl_tipool.c && mv modperl_tipool.o modperl_tipool.lo
621:info:build /usr/bin/clang -I/opt/local/var/macports/build/_opt_local_var_macports_sources_rsync.macports.org_release_tarballs_ports_www_mod_perl2/mod_perl2/work/mod_perl-2.0.11/src/modules/perl -I/opt/local/var/macports/build/_opt_local_var_macports_sources_rsync.macports.org_release_tarballs_ports_www_mod_perl2/mod_perl2/work/mod_perl-2.0.11/xs -I/opt/local/include/apr-1 -I/opt/local/include/apr-1 -I/opt/local/include -I/opt/local/include/apache2 -fno-common -DPERL_DARWIN -mmacosx-version-min=10.16 -pipe -Os -isysroot/Library/Developer/CommandLineTools/SDKs/MacOSX11.0.sdk -fno-strict-aliasing -fstack-protector-strong -I/opt/local/include -DPERL_USE_SAFE_PUTENV -I/opt/local/lib/perl5/5.30/darwin-thread-multi-2level/CORE -DMOD_PERL -DMP_COMPAT_1X -DDARWIN -DSIGPROCMASK_SETS_THREAD_MASK -O3  \
622:info:build     -c modperl_log.c && mv modperl_log.o modperl_log.lo
623:info:build /usr/bin/clang -I/opt/local/var/macports/build/_opt_local_var_macports_sources_rsync.macports.org_release_tarballs_ports_www_mod_perl2/mod_perl2/work/mod_perl-2.0.11/src/modules/perl -I/opt/local/var/macports/build/_opt_local_var_macports_sources_rsync.macports.org_release_tarballs_ports_www_mod_perl2/mod_perl2/work/mod_perl-2.0.11/xs -I/opt/local/include/apr-1 -I/opt/local/include/apr-1 -I/opt/local/include -I/opt/local/include/apache2 -fno-common -DPERL_DARWIN -mmacosx-version-min=10.16 -pipe -Os -isysroot/Library/Developer/CommandLineTools/SDKs/MacOSX11.0.sdk -fno-strict-aliasing -fstack-protector-strong -I/opt/local/include -DPERL_USE_SAFE_PUTENV -I/opt/local/lib/perl5/5.30/darwin-thread-multi-2level/CORE -DMOD_PERL -DMP_COMPAT_1X -DDARWIN -DSIGPROCMASK_SETS_THREAD_MASK -O3  \
624:info:build     -c modperl_config.c && mv modperl_config.o modperl_config.lo
625:info:build /usr/bin/clang -I/opt/local/var/macports/build/_opt_local_var_macports_sources_rsync.macports.org_release_tarballs_ports_www_mod_perl2/mod_perl2/work/mod_perl-2.0.11/src/modules/perl -I/opt/local/var/macports/build/_opt_local_var_macports_sources_rsync.macports.org_release_tarballs_ports_www_mod_perl2/mod_perl2/work/mod_perl-2.0.11/xs -I/opt/local/include/apr-1 -I/opt/local/include/apr-1 -I/opt/local/include -I/opt/local/include/apache2 -fno-common -DPERL_DARWIN -mmacosx-version-min=10.16 -pipe -Os -isysroot/Library/Developer/CommandLineTools/SDKs/MacOSX11.0.sdk -fno-strict-aliasing -fstack-protector-strong -I/opt/local/include -DPERL_USE_SAFE_PUTENV -I/opt/local/lib/perl5/5.30/darwin-thread-multi-2level/CORE -DMOD_PERL -DMP_COMPAT_1X -DDARWIN -DSIGPROCMASK_SETS_THREAD_MASK -O3  \
626:info:build     -c modperl_cmd.c && mv modperl_cmd.o modperl_cmd.lo
627:info:build /usr/bin/clang -I/opt/local/var/macports/build/_opt_local_var_macports_sources_rsync.macports.org_release_tarballs_ports_www_mod_perl2/mod_perl2/work/mod_perl-2.0.11/src/modules/perl -I/opt/local/var/macports/build/_opt_local_var_macports_sources_rsync.macports.org_release_tarballs_ports_www_mod_perl2/mod_perl2/work/mod_perl-2.0.11/xs -I/opt/local/include/apr-1 -I/opt/local/include/apr-1 -I/opt/local/include -I/opt/local/include/apache2 -fno-common -DPERL_DARWIN -mmacosx-version-min=10.16 -pipe -Os -isysroot/Library/Developer/CommandLineTools/SDKs/MacOSX11.0.sdk -fno-strict-aliasing -fstack-protector-strong -I/opt/local/include -DPERL_USE_SAFE_PUTENV -I/opt/local/lib/perl5/5.30/darwin-thread-multi-2level/CORE -DMOD_PERL -DMP_COMPAT_1X -DDARWIN -DSIGPROCMASK_SETS_THREAD_MASK -O3  \
628:info:build     -c modperl_options.c && mv modperl_options.o modperl_options.lo
629:info:build /usr/bin/clang -I/opt/local/var/macports/build/_opt_local_var_macports_sources_rsync.macports.org_release_tarballs_ports_www_mod_perl2/mod_perl2/work/mod_perl-2.0.11/src/modules/perl -I/opt/local/var/macports/build/_opt_local_var_macports_sources_rsync.macports.org_release_tarballs_ports_www_mod_perl2/mod_perl2/work/mod_perl-2.0.11/xs -I/opt/local/include/apr-1 -I/opt/local/include/apr-1 -I/opt/local/include -I/opt/local/include/apache2 -fno-common -DPERL_DARWIN -mmacosx-version-min=10.16 -pipe -Os -isysroot/Library/Developer/CommandLineTools/SDKs/MacOSX11.0.sdk -fno-strict-aliasing -fstack-protector-strong -I/opt/local/include -DPERL_USE_SAFE_PUTENV -I/opt/local/lib/perl5/5.30/darwin-thread-multi-2level/CORE -DMOD_PERL -DMP_COMPAT_1X -DDARWIN -DSIGPROCMASK_SETS_THREAD_MASK -O3  \
630:info:build     -c modperl_callback.c && mv modperl_callback.o modperl_callback.lo
631:info:build /usr/bin/clang -I/opt/local/var/macports/build/_opt_local_var_macports_sources_rsync.macports.org_release_tarballs_ports_www_mod_perl2/mod_perl2/work/mod_perl-2.0.11/src/modules/perl -I/opt/local/var/macports/build/_opt_local_var_macports_sources_rsync.macports.org_release_tarballs_ports_www_mod_perl2/mod_perl2/work/mod_perl-2.0.11/xs -I/opt/local/include/apr-1 -I/opt/local/include/apr-1 -I/opt/local/include -I/opt/local/include/apache2 -fno-common -DPERL_DARWIN -mmacosx-version-min=10.16 -pipe -Os -isysroot/Library/Developer/CommandLineTools/SDKs/MacOSX11.0.sdk -fno-strict-aliasing -fstack-protector-strong -I/opt/local/include -DPERL_USE_SAFE_PUTENV -I/opt/local/lib/perl5/5.30/darwin-thread-multi-2level/CORE -DMOD_PERL -DMP_COMPAT_1X -DDARWIN -DSIGPROCMASK_SETS_THREAD_MASK -O3  \
632:info:build     -c modperl_handler.c && mv modperl_handler.o modperl_handler.lo
633:info:build /usr/bin/clang -I/opt/local/var/macports/build/_opt_local_var_macports_sources_rsync.macports.org_release_tarballs_ports_www_mod_perl2/mod_perl2/work/mod_perl-2.0.11/src/modules/perl -I/opt/local/var/macports/build/_opt_local_var_macports_sources_rsync.macports.org_release_tarballs_ports_www_mod_perl2/mod_perl2/work/mod_perl-2.0.11/xs -I/opt/local/include/apr-1 -I/opt/local/include/apr-1 -I/opt/local/include -I/opt/local/include/apache2 -fno-common -DPERL_DARWIN -mmacosx-version-min=10.16 -pipe -Os -isysroot/Library/Developer/CommandLineTools/SDKs/MacOSX11.0.sdk -fno-strict-aliasing -fstack-protector-strong -I/opt/local/include -DPERL_USE_SAFE_PUTENV -I/opt/local/lib/perl5/5.30/darwin-thread-multi-2level/CORE -DMOD_PERL -DMP_COMPAT_1X -DDARWIN -DSIGPROCMASK_SETS_THREAD_MASK -O3  \
634:info:build     -c modperl_gtop.c && mv modperl_gtop.o modperl_gtop.lo
635:info:build /usr/bin/clang -I/opt/local/var/macports/build/_opt_local_var_macports_sources_rsync.macports.org_release_tarballs_ports_www_mod_perl2/mod_perl2/work/mod_perl-2.0.11/src/modules/perl -I/opt/local/var/macports/build/_opt_local_var_macports_sources_rsync.macports.org_release_tarballs_ports_www_mod_perl2/mod_perl2/work/mod_perl-2.0.11/xs -I/opt/local/include/apr-1 -I/opt/local/include/apr-1 -I/opt/local/include -I/opt/local/include/apache2 -fno-common -DPERL_DARWIN -mmacosx-version-min=10.16 -pipe -Os -isysroot/Library/Developer/CommandLineTools/SDKs/MacOSX11.0.sdk -fno-strict-aliasing -fstack-protector-strong -I/opt/local/include -DPERL_USE_SAFE_PUTENV -I/opt/local/lib/perl5/5.30/darwin-thread-multi-2level/CORE -DMOD_PERL -DMP_COMPAT_1X -DDARWIN -DSIGPROCMASK_SETS_THREAD_MASK -O3  \
636:info:build     -c modperl_util.c && mv modperl_util.o modperl_util.lo
637:info:build /usr/bin/clang -I/opt/local/var/macports/build/_opt_local_var_macports_sources_rsync.macports.org_release_tarballs_ports_www_mod_perl2/mod_perl2/work/mod_perl-2.0.11/src/modules/perl -I/opt/local/var/macports/build/_opt_local_var_macports_sources_rsync.macports.org_release_tarballs_ports_www_mod_perl2/mod_perl2/work/mod_perl-2.0.11/xs -I/opt/local/include/apr-1 -I/opt/local/include/apr-1 -I/opt/local/include -I/opt/local/include/apache2 -fno-common -DPERL_DARWIN -mmacosx-version-min=10.16 -pipe -Os -isysroot/Library/Developer/CommandLineTools/SDKs/MacOSX11.0.sdk -fno-strict-aliasing -fstack-protector-strong -I/opt/local/include -DPERL_USE_SAFE_PUTENV -I/opt/local/lib/perl5/5.30/darwin-thread-multi-2level/CORE -DMOD_PERL -DMP_COMPAT_1X -DDARWIN -DSIGPROCMASK_SETS_THREAD_MASK -O3  \
638:info:build     -c modperl_io.c && mv modperl_io.o modperl_io.lo
639:info:build /usr/bin/clang -I/opt/local/var/macports/build/_opt_local_var_macports_sources_rsync.macports.org_release_tarballs_ports_www_mod_perl2/mod_perl2/work/mod_perl-2.0.11/src/modules/perl -I/opt/local/var/macports/build/_opt_local_var_macports_sources_rsync.macports.org_release_tarballs_ports_www_mod_perl2/mod_perl2/work/mod_perl-2.0.11/xs -I/opt/local/include/apr-1 -I/opt/local/include/apr-1 -I/opt/local/include -I/opt/local/include/apache2 -fno-common -DPERL_DARWIN -mmacosx-version-min=10.16 -pipe -Os -isysroot/Library/Developer/CommandLineTools/SDKs/MacOSX11.0.sdk -fno-strict-aliasing -fstack-protector-strong -I/opt/local/include -DPERL_USE_SAFE_PUTENV -I/opt/local/lib/perl5/5.30/darwin-thread-multi-2level/CORE -DMOD_PERL -DMP_COMPAT_1X -DDARWIN -DSIGPROCMASK_SETS_THREAD_MASK -O3  \
640:info:build     -c modperl_io_apache.c && mv modperl_io_apache.o modperl_io_apache.lo
641:info:build /usr/bin/clang -I/opt/local/var/macports/build/_opt_local_var_macports_sources_rsync.macports.org_release_tarballs_ports_www_mod_perl2/mod_perl2/work/mod_perl-2.0.11/src/modules/perl -I/opt/local/var/macports/build/_opt_local_var_macports_sources_rsync.macports.org_release_tarballs_ports_www_mod_perl2/mod_perl2/work/mod_perl-2.0.11/xs -I/opt/local/include/apr-1 -I/opt/local/include/apr-1 -I/opt/local/include -I/opt/local/include/apache2 -fno-common -DPERL_DARWIN -mmacosx-version-min=10.16 -pipe -Os -isysroot/Library/Developer/CommandLineTools/SDKs/MacOSX11.0.sdk -fno-strict-aliasing -fstack-protector-strong -I/opt/local/include -DPERL_USE_SAFE_PUTENV -I/opt/local/lib/perl5/5.30/darwin-thread-multi-2level/CORE -DMOD_PERL -DMP_COMPAT_1X -DDARWIN -DSIGPROCMASK_SETS_THREAD_MASK -O3  \
642:info:build     -c modperl_filter.c && mv modperl_filter.o modperl_filter.lo
643:info:build /usr/bin/clang -I/opt/local/var/macports/build/_opt_local_var_macports_sources_rsync.macports.org_release_tarballs_ports_www_mod_perl2/mod_perl2/work/mod_perl-2.0.11/src/modules/perl -I/opt/local/var/macports/build/_opt_local_var_macports_sources_rsync.macports.org_release_tarballs_ports_www_mod_perl2/mod_perl2/work/mod_perl-2.0.11/xs -I/opt/local/include/apr-1 -I/opt/local/include/apr-1 -I/opt/local/include -I/opt/local/include/apache2 -fno-common -DPERL_DARWIN -mmacosx-version-min=10.16 -pipe -Os -isysroot/Library/Developer/CommandLineTools/SDKs/MacOSX11.0.sdk -fno-strict-aliasing -fstack-protector-strong -I/opt/local/include -DPERL_USE_SAFE_PUTENV -I/opt/local/lib/perl5/5.30/darwin-thread-multi-2level/CORE -DMOD_PERL -DMP_COMPAT_1X -DDARWIN -DSIGPROCMASK_SETS_THREAD_MASK -O3  \
644:info:build     -c modperl_bucket.c && mv modperl_bucket.o modperl_bucket.lo
645:info:build In file included from modperl_log.c:17:
646:info:build In file included from /opt/local/var/macports/build/_opt_local_var_macports_sources_rsync.macports.org_release_tarballs_ports_www_mod_perl2/mod_perl2/work/mod_perl-2.0.11/src/modules/perl/modperl_log.h:20:
647:info:build In file included from /opt/local/var/macports/build/_opt_local_var_macports_sources_rsync.macports.org_release_tarballs_ports_www_mod_perl2/mod_perl2/work/mod_perl-2.0.11/src/modules/perl/modperl_common_log.h:33:
648:info:build In file included from /opt/local/var/macports/build/_opt_local_var_macports_sources_rsync.macports.org_release_tarballs_ports_www_mod_perl2/mod_perl2/work/mod_perl-2.0.11/src/modules/perl/modperl_apr_includes.h:26:
649:info:build In file included from /opt/local/include/apr-1/apr_version.h:130:
650:info:build /opt/local/include/apr-1/apr.h:165:10: fatal error: 'sys/types.h' file not found
651:info:build #include <sys/types.h>
652:info:build          ^~~~~~~~~~~~~
653:info:build In file included from In file included from modperl_gtop.cIn file included from In file included from In file included from modperl_callback.c::In file included from 17modperl_options.cmodperl_tipool.cmodperl_bucket.c:
654:info:build 17:In file included from ::/opt/local/var/macports/build/_opt_local_var_macports_sources_rsync.macports.org_release_tarballs_ports_www_mod_perl2/mod_perl2/work/mod_perl-2.0.11/src/modules/perl/mod_perl.hIn file included from modperl_handler.cIn file included from ::
655:info:build 20In file included from modperl_io.cmodperl_config.c:
656:info:build 17::
657:info:build 17In file included from 17In file included from /opt/local/var/macports/build/_opt_local_var_macports_sources_rsync.macports.org_release_tarballs_ports_www_mod_perl2/mod_perl2/work/mod_perl-2.0.11/src/modules/perl/mod_perl.hIn file included from In file included from modperl_util.c/opt/local/var/macports/build/_opt_local_var_macports_sources_rsync.macports.org_release_tarballs_ports_www_mod_perl2/mod_perl2/work/mod_perl-2.0.11/src/modules/perl/modperl_apache_includes.hIn file included from mod_perl.cmodperl_interp.c::::
658:info:build modperl_io_apache.c:In file included from :
659:info:build /opt/local/var/macports/build/_opt_local_var_macports_sources_rsync.macports.org_release_tarballs_ports_www_mod_perl2/mod_perl2/work/mod_perl-2.0.11/src/modules/perl/mod_perl.h:In file included from 17modperl_filter.c17:20In file included from 17:
660:info:build :
661:info:build :In file included from 17/opt/local/var/macports/build/_opt_local_var_macports_sources_rsync.macports.org_release_tarballs_ports_www_mod_perl2/mod_perl2/work/mod_perl-2.0.11/src/modules/perl/mod_perl.h:
662:info:build ::/opt/local/var/macports/build/_opt_local_var_macports_sources_rsync.macports.org_release_tarballs_ports_www_mod_perl2/mod_perl2/work/mod_perl-2.0.11/src/modules/perl/mod_perl.h20:
663:info:build 27In file included from In file included from /opt/local/var/macports/build/_opt_local_var_macports_sources_rsync.macports.org_release_tarballs_ports_www_mod_perl2/mod_perl2/work/mod_perl-2.0.11/src/modules/perl/mod_perl.h:In file included from 17In file included from :
664:info:build /opt/local/var/macports/build/_opt_local_var_macports_sources_rsync.macports.org_release_tarballs_ports_www_mod_perl2/mod_perl2/work/mod_perl-2.0.11/src/modules/perl/mod_perl.h:
665:info:build ::20In file included from 2017In file included from modperl_cmd.c:
666:info:build ::
667:info:build In file included from :
668:info:build 20:/opt/local/var/macports/build/_opt_local_var_macports_sources_rsync.macports.org_release_tarballs_ports_www_mod_perl2/mod_perl2/work/mod_perl-2.0.11/src/modules/perl/modperl_apache_includes.h::
669:info:build /opt/local/var/macports/build/_opt_local_var_macports_sources_rsync.macports.org_release_tarballs_ports_www_mod_perl2/mod_perl2/work/mod_perl-2.0.11/src/modules/perl/mod_perl.h1717:
670:info:build In file included from :
671:info:build /opt/local/include/apache2/httpd.h/opt/local/var/macports/build/_opt_local_var_macports_sources_rsync.macports.org_release_tarballs_ports_www_mod_perl2/mod_perl2/work/mod_perl-2.0.11/src/modules/perl/modperl_apache_includes.h17:In file included from ::
672:info:build In file included from 27:In file included from /opt/local/var/macports/build/_opt_local_var_macports_sources_rsync.macports.org_release_tarballs_ports_www_mod_perl2/mod_perl2/work/mod_perl-2.0.11/src/modules/perl/mod_perl.h27:
673:info:build In file included from :In file included from :
674:info:build 20/opt/local/var/macports/build/_opt_local_var_macports_sources_rsync.macports.org_release_tarballs_ports_www_mod_perl2/mod_perl2/work/mod_perl-2.0.11/src/modules/perl/mod_perl.h:
675:info:build :/opt/local/var/macports/build/_opt_local_var_macports_sources_rsync.macports.org_release_tarballs_ports_www_mod_perl2/mod_perl2/work/mod_perl-2.0.11/src/modules/perl/modperl_apache_includes.h/opt/local/var/macports/build/_opt_local_var_macports_sources_rsync.macports.org_release_tarballs_ports_www_mod_perl2/mod_perl2/work/mod_perl-2.0.11/src/modules/perl/modperl_apache_includes.h/opt/local/var/macports/build/_opt_local_var_macports_sources_rsync.macports.org_release_tarballs_ports_www_mod_perl2/mod_perl2/work/mod_perl-2.0.11/src/modules/perl/mod_perl.h:
676:info:build :
677:info:build In file included from In file included from In file included from 44::/opt/local/var/macports/build/_opt_local_var_macports_sources_rsync.macports.org_release_tarballs_ports_www_mod_perl2/mod_perl2/work/mod_perl-2.0.11/src/modules/perl/mod_perl.h20/opt/local/var/macports/build/_opt_local_var_macports_sources_rsync.macports.org_release_tarballs_ports_www_mod_perl2/mod_perl2/work/mod_perl-2.0.11/src/modules/perl/modperl_apache_includes.h/opt/local/include/apache2/httpd.hIn file included from 27::In file included from :
678:info:build :
679:info:build :In file included from In file included from 20In file included from :
680:info:build 2044/opt/local/var/macports/build/_opt_local_var_macports_sources_rsync.macports.org_release_tarballs_ports_www_mod_perl2/mod_perl2/work/mod_perl-2.0.11/src/modules/perl/modperl_apache_includes.h:
681:info:build :202720/opt/local/include/apache2/ap_config.h::2725:
682:info:build :
683:info:build In file included from :
684:info:build :/opt/local/var/macports/build/_opt_local_var_macports_sources_rsync.macports.org_release_tarballs_ports_www_mod_perl2/mod_perl2/work/mod_perl-2.0.11/src/modules/perl/mod_perl.h/opt/local/var/macports/build/_opt_local_var_macports_sources_rsync.macports.org_release_tarballs_ports_www_mod_perl2/mod_perl2/work/mod_perl-2.0.11/src/modules/perl/modperl_apache_includes.h:
685:info:build :
686:info:build In file included from /opt/local/include/apache2/httpd.h/opt/local/include/apache2/httpd.h/opt/local/var/macports/build/_opt_local_var_macports_sources_rsync.macports.org_release_tarballs_ports_www_mod_perl2/mod_perl2/work/mod_perl-2.0.11/src/modules/perl/mod_perl.h27In file included from In file included from In file included from /opt/local/var/macports/build/_opt_local_var_macports_sources_rsync.macports.org_release_tarballs_ports_www_mod_perl2/mod_perl2/work/mod_perl-2.0.11/src/modules/perl/modperl_apache_includes.h:
687:info:build In file included from In file included from :/opt/local/include/apache2/ap_config.h/opt/local/include/apache2/httpd.h:27:In file included from /opt/local/include/apache2/httpd.h/opt/local/var/macports/build/_opt_local_var_macports_sources_rsync.macports.org_release_tarballs_ports_www_mod_perl2/mod_perl2/work/mod_perl-2.0.11/src/modules/perl/modperl_apache_includes.h44::
688:info:build /opt/local/var/macports/build/_opt_local_var_macports_sources_rsync.macports.org_release_tarballs_ports_www_mod_perl2/mod_perl2/work/mod_perl-2.0.11/src/modules/perl/modperl_apache_includes.hIn file included from :
689:info:build /opt/local/include/apache2/httpd.hIn file included from ::
690:info:build :::2744:/opt/local/var/macports/build/_opt_local_var_macports_sources_rsync.macports.org_release_tarballs_ports_www_mod_perl2/mod_perl2/work/mod_perl-2.0.11/src/modules/perl/modperl_apache_includes.h/opt/local/include/apache2/ap_hooks.h20:
691:info:build :
692:info:build 44In file included from In file included from ::
693:info:build In file included from :
694:info:build /opt/local/include/apache2/httpd.h20In file included from :2744In file included from :
695:info:build ::27In file included from :
696:info:build /opt/local/include/apache2/httpd.h:
697:info:build :
698:info:build In file included from In file included from 25:/opt/local/include/apache2/httpd.h/opt/local/include/apache2/ap_config.h/opt/local/include/apache2/ap_config.h:::
699:info:build 39:
700:info:build 4427:/opt/local/include/apache2/ap_config.hIn file included from ::
701:info:build :
702:info:build 25/opt/local/var/macports/build/_opt_local_var_macports_sources_rsync.macports.org_release_tarballs_ports_www_mod_perl2/mod_perl2/work/mod_perl-2.0.11/src/modules/perl/modperl_apache_includes.h/opt/local/var/macports/build/_opt_local_var_macports_sources_rsync.macports.org_release_tarballs_ports_www_mod_perl2/mod_perl2/work/mod_perl-2.0.11/src/modules/perl/modperl_apache_includes.h::In file included from In file included from 44::
703:info:build :
704:info:build /opt/local/include/apache2/httpd.hIn file included from 44In file included from :
705:info:build 25/opt/local/include/apr-1/apr.h44/opt/local/include/apache2/ap_config.h/opt/local/include/apache2/ap_config.h:
706:info:build :In file included from /opt/local/include/apache2/httpd.h44In file included from In file included from :
707:info:build /opt/local/include/apache2/ap_config.h:/opt/local/include/apache2/ap_config.h:
708:info:build ::In file included from :25:/opt/local/include/apache2/ap_config.h:25:27165/opt/local/include/apache2/ap_hooks.h254427:In file included from /opt/local/include/apache2/ap_hooks.h:25:
709:info:build ::
710:info:build :
711:info:build :
712:info:build :
713:info:build :
714:info:build :
715:info:build In file included from /opt/local/include/apache2/ap_hooks.hIn file included from In file included from /opt/local/include/apache2/ap_hooks.h10/opt/local/include/apache2/ap_config.h:/opt/local/include/apache2/ap_hooks.h::In file included from In file included from  39In file included from :In file included from /opt/local/include/apache2/httpd.h:
716:info:build /opt/local/include/apache2/ap_hooks.h:fatal error:252525/opt/local/include/apr-1/apr.h39:
717:info:build /opt/local/include/apache2/httpd.hIn file included from ::::
718:info:build 39/opt/local/include/apache2/ap_hooks.hIn file included from :
719:info:build : 165'sys/types.h' file not found/opt/local/include/apache2/ap_hooks.h44:
720:info:build 39:/opt/local/include/apache2/ap_hooks.h:
721:info:build :
722:info:build 39In file included from :
723:info:build :
724:info:build /opt/local/include/apr-1/apr.h:
725:info:build :
726:info:build 3944/opt/local/include/apache2/ap_hooks.h/opt/local/include/apr-1/apr.h/opt/local/include/apr-1/apr.h::165:In file included from :/opt/local/include/apr-1/apr.h165:::165:In file included from 16510::101039 :::
727:info:build  #include <sys/types.h>/opt/local/include/apache2/ap_config.h::3910fatal error
728:info:build  25::
729:info:build ::
730:info:build :
731:info:build In file included from fatal error/opt/local/include/apache2/ap_config.h         ^~~~~~~~~~~~~: :
732:info:build :/opt/local/include/apr-1/apr.h39: :In file included from 'sys/types.h' file not found/opt/local/include/apache2/ap_hooks.h
733:info:build 
734:info:build 10fatal error'sys/types.h' file not found:25/opt/local/include/apache2/ap_config.hfatal error:: /opt/local/include/apr-1/apr.h#include <sys/types.h>39
735:info:build 'sys/types.h' file not found: :          ^~~~~~~~~~~~~25:
736:info:build fatal error'sys/types.h' file not found/opt/local/include/apr-1/apr.h: :
737:info:build 165::39:
738:info:build 10:
739:info:build :
740:info:build :In file included from /opt/local/include/apr-1/apr.h'sys/types.h' file not found:/opt/local/include/apr-1/apr.h
741:info:build 165:In file included from :
742:info:build 165
743:info:build :165#include <sys/types.h>10/opt/local/include/apache2/ap_hooks.h
744:info:build ::39#include <sys/types.h>:#include <sys/types.h>10:
745:info:build :
746:info:build /opt/local/include/apr-1/apr.h: 165
747:info:build #include <sys/types.h>         ^~~~~~~~~~~~~:fatal error         ^~~~~~~~~~~~~
748:info:build /opt/local/include/apr-1/apr.h
749:info:build /opt/local/include/apache2/ap_hooks.h:
750:info:build :fatal error         ^~~~~~~~~~~~~: 39         ^~~~~~~~~~~~~::165
751:info:build 'sys/types.h' file not found
752:info:build :
753:info:build 1010/opt/local/include/apr-1/apr.h
754:info:build :::10165fatal error#include <sys/types.h>:
755:info:build          ^~~~~~~~~~~~~10
756:info:build :: :'sys/types.h' file not found: :'sys/types.h' file not found  fatal error: fatal error'sys/types.h' file not found
757:info:build 
758:info:build : 165 'sys/types.h' file not found:
759:info:build fatal error10: fatal error: : 'sys/types.h' file not found
760:info:build 'sys/types.h' file not found
761:info:build fatal error#include <sys/types.h>
762:info:build          ^~~~~~~~~~~~~
763:info:build : #include <sys/types.h>'sys/types.h' file not found
764:info:build          ^~~~~~~~~~~~~#include <sys/types.h>#include <sys/types.h>
765:info:build          ^~~~~~~~~~~~~
766:info:build #include <sys/types.h>
767:info:build          ^~~~~~~~~~~~~
768:info:build #include <sys/types.h>
769:info:build          ^~~~~~~~~~~~~
770:info:build #include <sys/types.h>
771:info:build          ^~~~~~~~~~~~~
772:info:build          ^~~~~~~~~~~~~
773:info:build cp lib/Apache2/PerlSections.pm blib/lib/Apache2/PerlSections.pm
774:info:build cp lib/typemap blib/arch/auto/Apache2/typemap
775:info:build cp lib/Apache2/XSLoader.pm blib/lib/Apache2/XSLoader.pm
776:info:build cp lib/Apache2/SourceTables.pm blib/lib/Apache2/SourceTables.pm
777:info:build cp lib/Apache2/PerlSections/Dump.pm blib/lib/Apache2/PerlSections/Dump.pm
778:info:build cp lib/ModPerl/CScan.pm blib/lib/ModPerl/CScan.pm
779:info:build cp lib/ModPerl/TestRun.pm blib/lib/ModPerl/TestRun.pm
780:info:build cp lib/Bundle/Apache2.pm blib/lib/Bundle/Apache2.pm
781:info:build cp lib/Apache2/Build.pm blib/lib/Apache2/Build.pm
782:info:build AutoSplitting blib/lib/Apache2/Build.pm (blib/lib/auto/Apache2/Build)
783:info:build cp lib/ModPerl/Config.pm blib/lib/ModPerl/Config.pm
784:info:build cp lib/ModPerl/MethodLookup.pm blib/lib/ModPerl/MethodLookup.pm
785:info:build cp lib/ModPerl/FunctionMap.pm blib/lib/ModPerl/FunctionMap.pm
786:info:build cp lib/Apache2/Resource.pm blib/lib/Apache2/Resource.pm
787:info:build cp lib/ModPerl/ParseSource.pm blib/lib/ModPerl/ParseSource.pm
788:info:build cp lib/Apache2/compat.pm blib/lib/Apache2/compat.pm
789:info:build cp lib/ModPerl/MM.pm blib/lib/ModPerl/MM.pm
790:info:build cp lib/ModPerl/BuildOptions.pm blib/lib/ModPerl/BuildOptions.pm
791:info:build cp lib/ModPerl/Code.pm blib/lib/ModPerl/Code.pm
792:info:build cp lib/ModPerl/StructureMap.pm blib/lib/ModPerl/StructureMap.pm
793:info:build cp lib/ModPerl/Manifest.pm blib/lib/ModPerl/Manifest.pm
794:info:build cp lib/ModPerl/TypeMap.pm blib/lib/ModPerl/TypeMap.pm
795:info:build cp lib/mod_perl2.pm blib/lib/mod_perl2.pm
796:info:build cp lib/Apache2/porting.pm blib/lib/Apache2/porting.pm
797:info:build cp lib/Apache2/ParseSource.pm blib/lib/Apache2/ParseSource.pm
798:info:build cp lib/ModPerl/TestReport.pm blib/lib/ModPerl/TestReport.pm
799:info:build cp lib/ModPerl/MapUtil.pm blib/lib/ModPerl/MapUtil.pm
800:info:build cp lib/APR/XSLoader.pm blib/lib/APR/XSLoader.pm
801:info:build cp lib/Apache2/BuildConfig.pm blib/lib/Apache2/BuildConfig.pm
802:info:build cp lib/Apache2/Status.pm blib/lib/Apache2/Status.pm
803:info:build cp lib/ModPerl/BuildMM.pm blib/lib/ModPerl/BuildMM.pm
804:info:build cp lib/ModPerl/WrapXS.pm blib/lib/ModPerl/WrapXS.pm
805:info:build cp bin/mp2bug blib/script/mp2bug
806:info:build /opt/local/bin/perl5.30 -MExtUtils::MY -e 'MY->fixin(shift)' -- blib/script/mp2bug
807:info:build /usr/bin/clang -I/opt/local/var/macports/build/_opt_local_var_macports_sources_rsync.macports.org_release_tarballs_ports_www_mod_perl2/mod_perl2/work/mod_perl-2.0.11/src/modules/perl -I/opt/local/var/macports/build/_opt_local_var_macports_sources_rsync.macports.org_release_tarballs_ports_www_mod_perl2/mod_perl2/work/mod_perl-2.0.11/xs -I/opt/local/include/apr-1 -I/opt/local/include/apr-1 -I/opt/local/include -I/opt/local/include/apache2 -fno-common -DPERL_DARWIN -mmacosx-version-min=10.16 -pipe -Os -isysroot/Library/Developer/CommandLineTools/SDKs/MacOSX11.0.sdk -fno-strict-aliasing -fstack-protector-strong -I/opt/local/include -DPERL_USE_SAFE_PUTENV -I/opt/local/lib/perl5/5.30/darwin-thread-multi-2level/CORE -DMOD_PERL -DMP_COMPAT_1X -DDARWIN -DSIGPROCMASK_SETS_THREAD_MASK -O3  \
808:info:build     -c modperl_mgv.c && mv modperl_mgv.o modperl_mgv.lo
809:info:build In file included from modperl_mgv.c:17:
810:info:build In file included from /opt/local/var/macports/build/_opt_local_var_macports_sources_rsync.macports.org_release_tarballs_ports_www_mod_perl2/mod_perl2/work/mod_perl-2.0.11/src/modules/perl/mod_perl.h:20:
811:info:build In file included from /opt/local/var/macports/build/_opt_local_var_macports_sources_rsync.macports.org_release_tarballs_ports_www_mod_perl2/mod_perl2/work/mod_perl-2.0.11/src/modules/perl/modperl_apache_includes.h:27:
812:info:build In file included from /opt/local/include/apache2/httpd.h:44:
813:info:build In file included from /opt/local/include/apache2/ap_config.h:25:
814:info:build In file included from /opt/local/include/apache2/ap_hooks.h:39:
815:info:build /opt/local/include/apr-1/apr.h:165:10: fatal error: 'sys/types.h' file not found
816:info:build #include <sys/types.h>
817:info:build          ^~~~~~~~~~~~~
818:info:build 1 error generated.
819:info:build make[1]: *** [modperl_log.lo] Error 1
820:info:build make[1]: *** Waiting for unfinished jobs....
821:info:build make[1]: Entering directory `/opt/local/var/macports/build/_opt_local_var_macports_sources_rsync.macports.org_release_tarballs_ports_www_mod_perl2/mod_perl2/work/mod_perl-2.0.11/Apache-Reload'
822:info:build cp lib/Apache/Reload.pm ../blib/lib/Apache/Reload.pm
823:info:build cp lib/Apache2/Reload.pm ../blib/lib/Apache2/Reload.pm
824:info:build Manifying 2 pod documents
825:info:build make[1]: Leaving directory `/opt/local/var/macports/build/_opt_local_var_macports_sources_rsync.macports.org_release_tarballs_ports_www_mod_perl2/mod_perl2/work/mod_perl-2.0.11/Apache-Reload'
826:info:build make[1]: Entering directory `/opt/local/var/macports/build/_opt_local_var_macports_sources_rsync.macports.org_release_tarballs_ports_www_mod_perl2/mod_perl2/work/mod_perl-2.0.11/Apache-SizeLimit'
827:info:build cp lib/Apache2/SizeLimit.pm ../blib/lib/Apache2/SizeLimit.pm
828:info:build cp lib/Apache/SizeLimit/Core.pm ../blib/lib/Apache/SizeLimit/Core.pm
829:info:build cp lib/Apache/SizeLimit.pm ../blib/lib/Apache/SizeLimit.pm
830:info:build Manifying 3 pod documents
831:info:build make[1]: Leaving directory `/opt/local/var/macports/build/_opt_local_var_macports_sources_rsync.macports.org_release_tarballs_ports_www_mod_perl2/mod_perl2/work/mod_perl-2.0.11/Apache-SizeLimit'
832:info:build make[1]: Entering directory `/opt/local/var/macports/build/_opt_local_var_macports_sources_rsync.macports.org_release_tarballs_ports_www_mod_perl2/mod_perl2/work/mod_perl-2.0.11/Apache-Test'
833:info:build cp lib/Apache/TestClient.pm ../blib/lib/Apache/TestClient.pm
834:info:build cp lib/Apache/TestPerlDB.pm ../blib/lib/Apache/TestPerlDB.pm
835:info:build cp lib/Apache/TestConfigC.pm ../blib/lib/Apache/TestConfigC.pm
836:info:build cp lib/Apache/Test.pm ../blib/lib/Apache/Test.pm
837:info:build cp lib/Apache/TestRunParrot.pm ../blib/lib/Apache/TestRunParrot.pm
838:info:build cp lib/Apache/TestUtil.pm ../blib/lib/Apache/TestUtil.pm
839:info:build cp lib/Bundle/ApacheTest.pm ../blib/lib/Bundle/ApacheTest.pm
840:info:build cp lib/Apache/TestRunPerl.pm ../blib/lib/Apache/TestRunPerl.pm
841:info:build cp lib/Apache/TestSort.pm ../blib/lib/Apache/TestSort.pm
842:info:build cp lib/Apache/TestTrace.pm ../blib/lib/Apache/TestTrace.pm
843:info:build cp lib/Apache/TestHarness.pm ../blib/lib/Apache/TestHarness.pm
844:info:build cp lib/Apache/TestCommon.pm ../blib/lib/Apache/TestCommon.pm
845:info:build cp lib/Apache/TestConfigParrot.pm ../blib/lib/Apache/TestConfigParrot.pm
846:info:build cp lib/Apache/TestSmokePerl.pm ../blib/lib/Apache/TestSmokePerl.pm
847:info:build cp lib/Apache/TestRequest.pm ../blib/lib/Apache/TestRequest.pm
848:info:build cp lib/Apache/TestRun.pm ../blib/lib/Apache/TestRun.pm
849:info:build cp lib/Apache/Test5005compat.pm ../blib/lib/Apache/Test5005compat.pm
850:info:build cp lib/Apache/TestMB.pm ../blib/lib/Apache/TestMB.pm
851:info:build cp lib/Apache/TestSSLCA.pm ../blib/lib/Apache/TestSSLCA.pm
852:info:build cp lib/Apache/TestCommonPost.pm ../blib/lib/Apache/TestCommonPost.pm
853:info:build cp lib/Apache/TestConfigPerl.pm ../blib/lib/Apache/TestConfigPerl.pm
854:info:build cp lib/Apache/TestServer.pm ../blib/lib/Apache/TestServer.pm
855:info:build cp lib/Apache/TestRunPHP.pm ../blib/lib/Apache/TestRunPHP.pm
856:info:build cp lib/Apache/TestSmoke.pm ../blib/lib/Apache/TestSmoke.pm
857:info:build cp lib/Apache/TestHarnessPHP.pm ../blib/lib/Apache/TestHarnessPHP.pm
858:info:build cp lib/Apache/TestHandler.pm ../blib/lib/Apache/TestHandler.pm
859:info:build cp lib/Apache/TestConfig.pm ../blib/lib/Apache/TestConfig.pm
860:info:build cp lib/Apache/TestBuild.pm ../blib/lib/Apache/TestBuild.pm
861:info:build cp lib/Apache/TestReportPerl.pm ../blib/lib/Apache/TestReportPerl.pm
862:info:build cp lib/Apache/TestMM.pm ../blib/lib/Apache/TestMM.pm
863:info:build cp lib/Apache/TestConfigPHP.pm ../blib/lib/Apache/TestConfigPHP.pm
864:info:build cp lib/Apache/TestConfigParse.pm ../blib/lib/Apache/TestConfigParse.pm
865:info:build cp lib/Apache/TestReport.pm ../blib/lib/Apache/TestReport.pm
866:info:build 1 error generated.
867:info:build 1 error generated.
868:info:build 1 error generated.
869:info:build 1 error generated.
870:info:build 1 error generated.
871:info:build 1 error generated.
872:info:build make[1]: *** [modperl_gtop.lo] Error 1
873:info:build make[1]: *** [modperl_options.lo] Error 1
874:info:build 1 error generated.
875:info:build make[1]: *** [modperl_bucket.lo] Error 1
876:info:build 1 error generated.
877:info:build 1 error generated.
878:info:build make[1]: *** [modperl_io_apache.lo] Error 1
879:info:build 1 error generated.
880:info:build make[1]: *** [modperl_io.lo] Error 1
881:info:build 1 error generated.
882:info:build make[1]: *** [modperl_tipool.lo] Error 1
883:info:build 1 error generated.
884:info:build make[1]: *** [modperl_config.lo] Error 1
885:info:build make[1]: *** [modperl_interp.lo] Error 1
886:info:build make[1]: *** [modperl_handler.lo] Error 1
887:info:build 1 error generated.
888:info:build make[1]: *** [modperl_mgv.lo] Error 1
889:info:build make[1]: *** [modperl_callback.lo] Error 1
890:info:build make[1]: *** [mod_perl.lo] Error 1
891:info:build 1 error generated.
892:info:build make[1]: *** [modperl_cmd.lo] Error 1
893:info:build make[1]: *** [modperl_filter.lo] Error 1
894:info:build 1 error generated.
895:info:build make[1]: *** [modperl_util.lo] Error 1
896:info:build make[1]: Leaving directory `/opt/local/var/macports/build/_opt_local_var_macports_sources_rsync.macports.org_release_tarballs_ports_www_mod_perl2/mod_perl2/work/mod_perl-2.0.11/src/modules/perl'
897:info:build make: *** [modperl_lib] Error 2
898:info:build make: *** Waiting for unfinished jobs....
899:info:build Manifying 15 pod documents
900:info:build make[1]: Leaving directory `/opt/local/var/macports/build/_opt_local_var_macports_sources_rsync.macports.org_release_tarballs_ports_www_mod_perl2/mod_perl2/work/mod_perl-2.0.11/Apache-Test'
901:info:build make: Leaving directory `/opt/local/var/macports/build/_opt_local_var_macports_sources_rsync.macports.org_release_tarballs_ports_www_mod_perl2/mod_perl2/work/mod_perl-2.0.11'
902:info:build Command failed:  cd "/opt/local/var/macports/build/_opt_local_var_macports_sources_rsync.macports.org_release_tarballs_ports_www_mod_perl2/mod_perl2/work/mod_perl-2.0.11" && /usr/bin/make -j16 -w all
903:info:build Exit code: 2
904:error:build Failed to build mod_perl2: command execution failed
905:debug:build Error code: CHILDSTATUS 3208 2
906:debug:build Backtrace: command execution failed
907:debug:build     while executing
908:debug:build "system {*}$notty {*}$callback {*}$nice $fullcmdstring"
909:debug:build     invoked from within
910:debug:build "command_exec -callback portprogress::target_progress_callback build"
911:debug:build     (procedure "portbuild::build_main" line 8)
912:debug:build     invoked from within
913:debug:build "$procedure $targetname"
914:error:build See /opt/local/var/macports/logs/_opt_local_var_macports_sources_rsync.macports.org_release_tarballs_ports_www_mod_perl2/mod_perl2/main.log for details.