Ticket #62631: main.log

File main.log, 18.1 KB (added by c-kloukinas, 7 months ago)

main installation log

Line 
1version:1
2:debug:sysinfo macOS 11.2 (darwin/20.3.0) arch i386
3:debug:sysinfo MacPorts 2.6.4
4:debug:sysinfo Xcode none
5:debug:sysinfo SDK 11.2
6:debug:sysinfo MACOSX_DEPLOYMENT_TARGET: 11.2
7:debug:main Executing org.macports.main (fuzz)
8:debug:main dropping privileges: euid changed to 503, egid changed to 501.
9:debug:archivefetch archivefetch phase started at Sun Apr  4 11:23:13 BST 2021
10:debug:archivefetch Executing org.macports.archivefetch (fuzz)
11version:1
12:debug:sysinfo macOS 11.2 (darwin/20.3.0) arch i386
13:debug:sysinfo MacPorts 2.6.4
14:debug:sysinfo Xcode none
15:debug:sysinfo SDK 11.2
16:debug:sysinfo MACOSX_DEPLOYMENT_TARGET: 11.2
17:debug:main Executing org.macports.main (fuzz)
18:debug:main dropping privileges: euid changed to 503, egid changed to 501.
19:debug:fetch fetch phase started at Sun Apr  4 11:23:14 BST 2021
20:notice:fetch --->  Fetching distfiles for fuzz
21:debug:fetch Executing org.macports.fetch (fuzz)
22:info:fetch --->  fuzz-0.6.tar.gz does not exist in /opt/local/var/macports/distfiles/fuzz
23:notice:fetch --->  Attempting to fetch fuzz-0.6.tar.gz from https://mse.uk.distfiles.macports.org/fuzz
24:debug:fetch Privilege de-escalation not attempted as not running as root.
25:debug:checksum checksum phase started at Sun Apr  4 11:23:15 BST 2021
26:notice:checksum --->  Verifying checksums for fuzz
27:debug:checksum Executing org.macports.checksum (fuzz)
28:info:checksum --->  Checksumming fuzz-0.6.tar.gz
29:debug:checksum Calculated (md5) is 8c8e7c49729e0a98c0414faac7778ec7
30:debug:checksum Correct (md5) checksum for fuzz-0.6.tar.gz
31:debug:checksum Privilege de-escalation not attempted as not running as root.
32:debug:extract extract phase started at Sun Apr  4 11:23:15 BST 2021
33:notice:extract --->  Extracting fuzz
34:debug:extract Executing org.macports.extract (fuzz)
35:info:extract --->  Extracting fuzz-0.6.tar.gz
36:debug:extract setting option extract.args to '/opt/local/var/macports/distfiles/fuzz/fuzz-0.6.tar.gz'
37:debug:extract Environment:
38:debug:extract CC_PRINT_OPTIONS='YES'
39:debug:extract CC_PRINT_OPTIONS_FILE='/opt/local/var/macports/build/_opt_local_var_macports_sources_github.com_macports_macports-ports_devel_fuzz/fuzz/work/.CC_PRINT_OPTIONS'
40:debug:extract CPATH='/opt/local/include'
41:debug:extract DEVELOPER_DIR='/Library/Developer/CommandLineTools'
42:debug:extract LIBRARY_PATH='/opt/local/lib'
43:debug:extract MACOSX_DEPLOYMENT_TARGET='11.2'
44:debug:extract SDKROOT='/Library/Developer/CommandLineTools/SDKs/MacOSX.sdk'
45:info:extract Executing:  cd "/opt/local/var/macports/build/_opt_local_var_macports_sources_github.com_macports_macports-ports_devel_fuzz/fuzz/work" && /usr/bin/gzip -dc '/opt/local/var/macports/distfiles/fuzz/fuzz-0.6.tar.gz' | /usr/bin/tar -xf -
46:debug:extract system:  cd "/opt/local/var/macports/build/_opt_local_var_macports_sources_github.com_macports_macports-ports_devel_fuzz/fuzz/work" && /usr/bin/gzip -dc '/opt/local/var/macports/distfiles/fuzz/fuzz-0.6.tar.gz' | /usr/bin/tar -xf -
47:debug:extract euid/egid changed to: 0/0
48:debug:extract chowned /opt/local/var/macports/build/_opt_local_var_macports_sources_github.com_macports_macports-ports_devel_fuzz/fuzz/work to macports
49:debug:extract euid/egid changed to: 503/501
50:debug:extract Privilege de-escalation not attempted as not running as root.
51:debug:patch patch phase started at Sun Apr  4 11:23:15 BST 2021
52:debug:patch Executing org.macports.patch (fuzz)
53:debug:patch Privilege de-escalation not attempted as not running as root.
54:debug:configure configure phase started at Sun Apr  4 11:23:15 BST 2021
55:notice:configure --->  Configuring fuzz
56:debug:configure Preferred compilers: clang macports-clang-9.0 macports-clang-11 macports-clang-10
57:debug:configure Using compiler 'Xcode Clang'
58:debug:configure Executing org.macports.configure (fuzz)
59:debug:configure Environment:
60:debug:configure CC='/usr/bin/clang'
61:debug:configure CC_PRINT_OPTIONS='YES'
62:debug:configure CC_PRINT_OPTIONS_FILE='/opt/local/var/macports/build/_opt_local_var_macports_sources_github.com_macports_macports-ports_devel_fuzz/fuzz/work/.CC_PRINT_OPTIONS'
63:debug:configure CFLAGS='-pipe -Os -isysroot/Library/Developer/CommandLineTools/SDKs/MacOSX.sdk -arch x86_64'
64:debug:configure CPATH='/opt/local/include'
65:debug:configure CPPFLAGS='-I/opt/local/include -isysroot/Library/Developer/CommandLineTools/SDKs/MacOSX.sdk'
66:debug:configure CXX='/usr/bin/clang++'
67:debug:configure CXXFLAGS='-pipe -Os -stdlib=libc++ -isysroot/Library/Developer/CommandLineTools/SDKs/MacOSX.sdk -arch x86_64'
68:debug:configure DEVELOPER_DIR='/Library/Developer/CommandLineTools'
69:debug:configure F90FLAGS='-pipe -Os -m64'
70:debug:configure FCFLAGS='-pipe -Os -m64'
71:debug:configure FFLAGS='-pipe -Os -m64'
72:debug:configure INSTALL='/usr/bin/install -c'
73:debug:configure LDFLAGS='-L/opt/local/lib -Wl,-headerpad_max_install_names -Wl,-syslibroot,/Library/Developer/CommandLineTools/SDKs/MacOSX.sdk -arch x86_64'
74:debug:configure LIBRARY_PATH='/opt/local/lib'
75:debug:configure MACOSX_DEPLOYMENT_TARGET='11.2'
76:debug:configure OBJC='/usr/bin/clang'
77:debug:configure OBJCFLAGS='-pipe -Os -isysroot/Library/Developer/CommandLineTools/SDKs/MacOSX.sdk -arch x86_64'
78:debug:configure OBJCXX='/usr/bin/clang++'
79:debug:configure OBJCXXFLAGS='-pipe -Os -stdlib=libc++ -isysroot/Library/Developer/CommandLineTools/SDKs/MacOSX.sdk -arch x86_64'
80:debug:configure SDKROOT='/Library/Developer/CommandLineTools/SDKs/MacOSX.sdk'
81:info:configure Executing:  cd "/opt/local/var/macports/build/_opt_local_var_macports_sources_github.com_macports_macports-ports_devel_fuzz/fuzz/work/fuzz-0.6" && ./configure --prefix=/opt/local --mandir=/opt/local/share/man
82:debug:configure system:  cd "/opt/local/var/macports/build/_opt_local_var_macports_sources_github.com_macports_macports-ports_devel_fuzz/fuzz/work/fuzz-0.6" && ./configure --prefix=/opt/local --mandir=/opt/local/share/man
83:info:configure creating cache ./config.cache
84:info:configure checking for a BSD compatible install... /usr/bin/install -c
85:info:configure checking whether build environment is sane... yes
86:info:configure checking whether make sets ${MAKE}... yes
87:info:configure checking for working aclocal... found
88:info:configure checking for working autoconf... found
89:info:configure checking for working automake... found
90:info:configure checking for working autoheader... found
91:info:configure checking for working makeinfo... found
92:info:configure checking for gcc... /usr/bin/clang
93:info:configure checking whether the C compiler (/usr/bin/clang -pipe -Os -isysroot/Library/Developer/CommandLineTools/SDKs/MacOSX.sdk -arch x86_64 -L/opt/local/lib -Wl,-headerpad_max_install_names -Wl,-syslibroot,/Library/Developer/CommandLineTools/SDKs/MacOSX.sdk -arch x86_64) works... yes
94:info:configure checking whether the C compiler (/usr/bin/clang -pipe -Os -isysroot/Library/Developer/CommandLineTools/SDKs/MacOSX.sdk -arch x86_64 -L/opt/local/lib -Wl,-headerpad_max_install_names -Wl,-syslibroot,/Library/Developer/CommandLineTools/SDKs/MacOSX.sdk -arch x86_64) is a cross-compiler... no
95:info:configure checking whether we are using GNU C... yes
96:info:configure checking whether /usr/bin/clang accepts -g... yes
97:info:configure checking for mawk... no
98:info:configure checking for gawk... gawk
99:info:configure checking for a BSD compatible install... /usr/bin/install -c
100:info:configure checking whether ln -s works... yes
101:info:configure checking for readline in -lreadline... yes
102:info:configure checking how to run the C preprocessor... /usr/bin/clang -E
103:info:configure checking for ANSI C header files... no
104:info:configure checking for sys/wait.h that is POSIX.1 compatible... yes
105:info:configure checking for fcntl.h... yes
106:info:configure checking for unistd.h... yes
107:info:configure checking for working const... yes
108:info:configure checking for size_t... yes
109:info:configure checking whether struct tm is in sys/time.h or time.h... time.h
110:info:configure checking return type of signal handlers... void
111:info:configure checking for getcwd... yes
112:info:configure checking for strdup... yes
113:info:configure checking for strerror... yes
114:info:configure checking for snprintf... yes
115:info:configure checking for getopt_long... yes
116:info:configure using libc's getopt_long
117:info:configure updating cache ./config.cache
118:info:configure creating ./config.status
119:info:configure creating Makefile
120:debug:configure Privilege de-escalation not attempted as not running as root.
121:debug:build build phase started at Sun Apr  4 11:23:19 BST 2021
122:notice:build --->  Building fuzz
123:debug:build Executing org.macports.build (fuzz)
124:debug:build Environment:
125:debug:build CC_PRINT_OPTIONS='YES'
126:debug:build CC_PRINT_OPTIONS_FILE='/opt/local/var/macports/build/_opt_local_var_macports_sources_github.com_macports_macports-ports_devel_fuzz/fuzz/work/.CC_PRINT_OPTIONS'
127:debug:build CPATH='/opt/local/include'
128:debug:build DEVELOPER_DIR='/Library/Developer/CommandLineTools'
129:debug:build LIBRARY_PATH='/opt/local/lib'
130:debug:build MACOSX_DEPLOYMENT_TARGET='11.2'
131:debug:build SDKROOT='/Library/Developer/CommandLineTools/SDKs/MacOSX.sdk'
132:info:build Executing:  cd "/opt/local/var/macports/build/_opt_local_var_macports_sources_github.com_macports_macports-ports_devel_fuzz/fuzz/work/fuzz-0.6" && /usr/bin/make -j8 -w all
133:debug:build system:  cd "/opt/local/var/macports/build/_opt_local_var_macports_sources_github.com_macports_macports-ports_devel_fuzz/fuzz/work/fuzz-0.6" && /usr/bin/make -j8 -w all
134:info:build make: Entering directory `/opt/local/var/macports/build/_opt_local_var_macports_sources_github.com_macports_macports-ports_devel_fuzz/fuzz/work/fuzz-0.6'
135:info:build /usr/bin/clang -DPACKAGE=\"fuzz\" -DVERSION=\"0.6\" -DHAVE_LIBREADLINE=1 -DHAVE_SYS_WAIT_H=1 -DHAVE_FCNTL_H=1 -DHAVE_UNISTD_H=1 -DRETSIGTYPE=void -DHAVE_GETCWD=1 -DHAVE_STRDUP=1 -DHAVE_STRERROR=1 -DHAVE_SNPRINTF=1  -I. -I.    -I/opt/local/include -isysroot/Library/Developer/CommandLineTools/SDKs/MacOSX.sdk  -pipe -Os -isysroot/Library/Developer/CommandLineTools/SDKs/MacOSX.sdk -arch x86_64 -c fuzz.c
136:info:build /usr/bin/clang -DPACKAGE=\"fuzz\" -DVERSION=\"0.6\" -DHAVE_LIBREADLINE=1 -DHAVE_SYS_WAIT_H=1 -DHAVE_FCNTL_H=1 -DHAVE_UNISTD_H=1 -DRETSIGTYPE=void -DHAVE_GETCWD=1 -DHAVE_STRDUP=1 -DHAVE_STRERROR=1 -DHAVE_SNPRINTF=1  -I. -I.    -I/opt/local/include -isysroot/Library/Developer/CommandLineTools/SDKs/MacOSX.sdk  -pipe -Os -isysroot/Library/Developer/CommandLineTools/SDKs/MacOSX.sdk -arch x86_64 -c getopt.c
137:info:build /usr/bin/clang -DPACKAGE=\"fuzz\" -DVERSION=\"0.6\" -DHAVE_LIBREADLINE=1 -DHAVE_SYS_WAIT_H=1 -DHAVE_FCNTL_H=1 -DHAVE_UNISTD_H=1 -DRETSIGTYPE=void -DHAVE_GETCWD=1 -DHAVE_STRDUP=1 -DHAVE_STRERROR=1 -DHAVE_SNPRINTF=1  -I. -I.    -I/opt/local/include -isysroot/Library/Developer/CommandLineTools/SDKs/MacOSX.sdk  -pipe -Os -isysroot/Library/Developer/CommandLineTools/SDKs/MacOSX.sdk -arch x86_64 -c getopt1.c
138:info:build getopt.c:580:30: error: implicitly declaring library function 'strcmp' with type 'int (const char *, const char *)' [-Werror,-Wimplicit-function-declaration]
139:info:build       if (optind != argc && !strcmp (argv[optind], "--"))
140:info:build                              ^
141:info:build getopt.c:580:30: note: include the header <string.h> or explicitly provide a declaration for 'strcmp'
142:info:build getopt.c:656:7: error: implicitly declaring library function 'strncmp' with type 'int (const char *, const char *, unsigned long)' [-Werror,-Wimplicit-function-declaration]
143:info:build         if (!strncmp (p->name, nextchar, nameend - nextchar))
144:info:build              ^
145:info:build getopt.c:656:7: note: include the header <string.h> or explicitly provide a declaration for 'strncmp'
146:info:build getopt.c:659:21: error: implicitly declaring library function 'strlen' with type 'unsigned long (const char *)' [-Werror,-Wimplicit-function-declaration]
147:info:build                 == (unsigned int) strlen (p->name))
148:info:build                                   ^
149:info:build getopt.c:659:21: note: include the header <string.h> or explicitly provide a declaration for 'strlen'
150:info:build getopt.c:707:6: warning: add explicit braces to avoid dangling else [-Wdangling-else]
151:info:build                    else
152:info:build                    ^
153:info:build 1 warning and 3 errors generated.
154:info:build make: *** [getopt.o] Error 1
155:info:build make: *** Waiting for unfinished jobs....
156:info:build fuzz.c:182:30: warning: format specifies type 'unsigned int *' but the argument has type 'unsigned long *' [-Wformat]
157:info:build       if(sscanf(optarg,"%ul",&runs)!=1){
158:info:build                         ~~   ^~~~~
159:info:build                         %lu
160:info:build fuzz.c:188:30: warning: format specifies type 'unsigned int *' but the argument has type 'unsigned long *' [-Wformat]
161:info:build       if(sscanf(optarg,"%ul",&len)!=1){
162:info:build                         ~~   ^~~~
163:info:build                         %lu
164:info:build fuzz.c:197:30: warning: format specifies type 'unsigned int *' but the argument has type 'unsigned long *' [-Wformat]
165:info:build       if(sscanf(optarg,"%ul",&linemod)!=1){
166:info:build                         ~~   ^~~~~~~~
167:info:build                         %lu
168:info:build fuzz.c:203:30: warning: format specifies type 'unsigned int *' but the argument has type 'unsigned long *' [-Wformat]
169:info:build       if(sscanf(optarg,"%ul",&maxline)!=1){
170:info:build                         ~~   ^~~~~~~~
171:info:build                         %lu
172:info:build fuzz.c:209:30: warning: format specifies type 'unsigned int *' but the argument has type 'unsigned long *' [-Wformat]
173:info:build       if(sscanf(optarg,"%ul",&timeout)!=1){
174:info:build                         ~~   ^~~~~~~~
175:info:build                         %lu
176:info:build fuzz.c:234:30: warning: format specifies type 'unsigned int *' but the argument has type 'unsigned long *' [-Wformat]
177:info:build       if(sscanf(optarg,"%ul",&max_args)!=1){
178:info:build                         ~~   ^~~~~~~~~
179:info:build                         %lu
180:info:build fuzz.c:240:30: warning: format specifies type 'unsigned int *' but the argument has type 'unsigned long *' [-Wformat]
181:info:build       if(sscanf(optarg,"%ul",&max_arglen)!=1){
182:info:build                         ~~   ^~~~~~~~~~~
183:info:build                         %lu
184:info:build fuzz.c:410:33: warning: format specifies type 'unsigned int' but the argument has type 'unsigned long' [-Wformat]
185:info:build     printf("Run: %u         %c",runs,print_bytes?'\n':'\r');
186:info:build                  ~~             ^~~~
187:info:build                  %lu
188:info:build fuzz.c:522:30: warning: format specifies type 'unsigned int' but the argument has type 'char **' [-Wformat]
189:info:build   fprintf(errs,"argv=0x%x\n",argv);
190:info:build                        ~~    ^~~~
191:info:build fuzz.c:524:40: warning: format specifies type 'unsigned int' but the argument has type 'char *' [-Wformat]
192:info:build     fprintf(errs,"\targv[%u]=0x%x\n",i,argv[i]);
193:info:build                                ~~      ^~~~~~~
194:info:build                                %s
195:info:build fuzz.c:644:26: warning: using the result of an assignment as a condition without parentheses [-Wparentheses]
196:info:build       if(execute_filename=realloc(execute_filename,
197:info:build          ~~~~~~~~~~~~~~~~^~~~~~~~~~~~~~~~~~~~~~~~~~
198:info:build fuzz.c:644:26: note: place parentheses around the assignment to silence this warning
199:info:build       if(execute_filename=realloc(execute_filename,
200:info:build                          ^
201:info:build          (
202:info:build fuzz.c:644:26: note: use '==' to turn this assignment into an equality comparison
203:info:build       if(execute_filename=realloc(execute_filename,
204:info:build                          ^
205:info:build                          ==
206:info:build fuzz.c:939:22: warning: using the result of an assignment as a condition without parentheses [-Wparentheses]
207:info:build           if(distribution[0]='K' && strncmp(distribution+1,tmpbuf,MAXPATH))
208:info:build              ~~~~~~~~~~~~~~~^~~~~~~~~~~~~~~~~~~~~~~~~~~~~~~~~~~~~~~~~~~~~~
209:info:build fuzz.c:939:22: note: place parentheses around the assignment to silence this warning
210:info:build           if(distribution[0]='K' && strncmp(distribution+1,tmpbuf,MAXPATH))
211:info:build                             ^
212:info:build              (                                                            )
213:info:build fuzz.c:939:22: note: use '==' to turn this assignment into an equality comparison
214:info:build           if(distribution[0]='K' && strncmp(distribution+1,tmpbuf,MAXPATH))
215:info:build                             ^
216:info:build                             ==
217:info:build fuzz.c:941:22: warning: using the result of an assignment as a condition without parentheses [-Wparentheses]
218:info:build           if(distribution[0]='D' && strncmp(distribution+1,tmpbuf,MAXPATH))
219:info:build              ~~~~~~~~~~~~~~~^~~~~~~~~~~~~~~~~~~~~~~~~~~~~~~~~~~~~~~~~~~~~~
220:info:build fuzz.c:941:22: note: place parentheses around the assignment to silence this warning
221:info:build           if(distribution[0]='D' && strncmp(distribution+1,tmpbuf,MAXPATH))
222:info:build                             ^
223:info:build              (                                                            )
224:info:build fuzz.c:941:22: note: use '==' to turn this assignment into an equality comparison
225:info:build           if(distribution[0]='D' && strncmp(distribution+1,tmpbuf,MAXPATH))
226:info:build                             ^
227:info:build                             ==
228:info:build 13 warnings generated.
229:info:build make: Leaving directory `/opt/local/var/macports/build/_opt_local_var_macports_sources_github.com_macports_macports-ports_devel_fuzz/fuzz/work/fuzz-0.6'
230:info:build Command failed:  cd "/opt/local/var/macports/build/_opt_local_var_macports_sources_github.com_macports_macports-ports_devel_fuzz/fuzz/work/fuzz-0.6" && /usr/bin/make -j8 -w all
231:info:build Exit code: 2
232:error:build Failed to build fuzz: command execution failed
233:debug:build Error code: CHILDSTATUS 23201 2
234:debug:build Backtrace: command execution failed
235:debug:build     while executing
236:debug:build "system {*}$notty {*}$nice $fullcmdstring"
237:debug:build     invoked from within
238:debug:build "command_exec build"
239:debug:build     (procedure "portbuild::build_main" line 8)
240:debug:build     invoked from within
241:debug:build "$procedure $targetname"
242:error:build See /opt/local/var/macports/logs/_opt_local_var_macports_sources_github.com_macports_macports-ports_devel_fuzz/fuzz/main.log for details.