Ticket #62719: main.log

File main.log, 36.3 KB (added by hpux735 (William Dillon), 6 months ago)

port logs

Line 
1version:1
2:debug:sysinfo macOS 11.2 (darwin/20.3.0) arch arm
3:debug:sysinfo MacPorts 2.6.4
4:debug:sysinfo Xcode 12.4
5:debug:sysinfo SDK 11.2
6:debug:sysinfo MACOSX_DEPLOYMENT_TARGET: 11.2
7:warn:main The macOS 11.2 SDK does not appear to be installed. Ports may not build correctly.
8:warn:main You can install it as part of the Xcode Command Line Tools package by running `xcode-select --install'.
9:debug:main epoch: in tree: 0 installed: 0
10:debug:main xz 5.2.5_0 exists in the ports tree
11:debug:main xz 5.2.5_0  is the latest installed
12:debug:main xz 5.2.5_0 +universal is active
13:debug:main Merging existing variants '+universal' into variants
14:debug:main new fully merged portvariants: universal +
15:debug:main Changing to port directory: /opt/local/var/macports/sources/rsync.macports.org/macports/release/tarballs/ports/archivers/xz
16:debug:main OS darwin/20.3.0 (macOS 11.2) arch arm
17:debug:main Sourcing PortGroup clang_dependency 1.0 from /opt/local/var/macports/sources/rsync.macports.org/macports/release/tarballs/ports/_resources/port1.0/group/clang_dependency-1.0.tcl
18:debug:main adding the default universal variant
19:debug:main Reading variant descriptions from /opt/local/var/macports/sources/rsync.macports.org/macports/release/tarballs/ports/_resources/port1.0/variant_descriptions.conf
20:debug:main Executing variant universal provides universal
21:debug:main Running callback portconfigure::add_automatic_compiler_dependencies
22:debug:main Finished running callback portconfigure::add_automatic_compiler_dependencies
23:debug:main Running callback portbuild::add_automatic_buildsystem_dependencies
24:debug:main Finished running callback portbuild::add_automatic_buildsystem_dependencies
25:debug:main Running callback portstartupitem::add_notes
26:debug:main Finished running callback portstartupitem::add_notes
27:debug:main No need to upgrade! xz 5.2.5_0 >= xz 5.2.5_0
28:debug:main epoch: in tree: 0 installed: 0
29:debug:main libiconv 1.16_1 exists in the ports tree
30:debug:main libiconv 1.16_1  is the latest installed
31:debug:main libiconv 1.16_1 +universal is active
32:debug:main Merging existing variants '+universal' into variants
33:debug:main new fully merged portvariants: universal +
34:debug:main Changing to port directory: /opt/local/var/macports/sources/rsync.macports.org/macports/release/tarballs/ports/textproc/libiconv
35:debug:main OS darwin/20.3.0 (macOS 11.2) arch arm
36:debug:main Sourcing PortGroup muniversal 1.0 from /opt/local/var/macports/sources/rsync.macports.org/macports/release/tarballs/ports/_resources/port1.0/group/muniversal-1.0.tcl
37:debug:main Sourcing PortGroup clang_dependency 1.0 from /opt/local/var/macports/sources/rsync.macports.org/macports/release/tarballs/ports/_resources/port1.0/group/clang_dependency-1.0.tcl
38:debug:main Sourcing PortGroup xcodeversion 1.0 from /opt/local/var/macports/sources/rsync.macports.org/macports/release/tarballs/ports/_resources/port1.0/group/xcodeversion-1.0.tcl
39:debug:main muniversal: adding universal variant
40:debug:main Reading variant descriptions from /opt/local/var/macports/sources/rsync.macports.org/macports/release/tarballs/ports/_resources/port1.0/variant_descriptions.conf
41:debug:main Executing variant universal provides universal
42:debug:main Running callback portconfigure::add_automatic_compiler_dependencies
43:debug:main Finished running callback portconfigure::add_automatic_compiler_dependencies
44:debug:main Running callback portbuild::add_automatic_buildsystem_dependencies
45:debug:main Finished running callback portbuild::add_automatic_buildsystem_dependencies
46:debug:main Running callback portstartupitem::add_notes
47:debug:main Finished running callback portstartupitem::add_notes
48:debug:main Running callback xcodeversions_run_check
49:debug:main Finished running callback xcodeversions_run_check
50:debug:main No need to upgrade! libiconv 1.16_1 >= libiconv 1.16_1
51:debug:main epoch: in tree: 2 installed: 2
52:debug:main gettext 0.19.8.1_2 exists in the ports tree
53:debug:main gettext 0.19.8.1_2  is the latest installed
54:debug:main gettext 0.19.8.1_2 +universal is active
55:debug:main Merging existing variants '+universal' into variants
56:debug:main new fully merged portvariants: universal +
57:debug:main Changing to port directory: /opt/local/var/macports/sources/rsync.macports.org/macports/release/tarballs/ports/devel/gettext
58:debug:main OS darwin/20.3.0 (macOS 11.2) arch arm
59:debug:main Sourcing PortGroup compiler_blacklist_versions 1.0 from /opt/local/var/macports/sources/rsync.macports.org/macports/release/tarballs/ports/_resources/port1.0/group/compiler_blacklist_versions-1.0.tcl
60:debug:main Sourcing PortGroup muniversal 1.0 from /opt/local/var/macports/sources/rsync.macports.org/macports/release/tarballs/ports/_resources/port1.0/group/muniversal-1.0.tcl
61:debug:main Sourcing PortGroup clang_dependency 1.0 from /opt/local/var/macports/sources/rsync.macports.org/macports/release/tarballs/ports/_resources/port1.0/group/clang_dependency-1.0.tcl
62:debug:main compiler clang 1200.0.32.29 not blacklisted because it doesn't match {clang < 211.10.1}
63:debug:main muniversal: adding universal variant
64:debug:main Reading variant descriptions from /opt/local/var/macports/sources/rsync.macports.org/macports/release/tarballs/ports/_resources/port1.0/variant_descriptions.conf
65:debug:main Executing variant universal provides universal
66:debug:main Running callback portconfigure::add_automatic_compiler_dependencies
67:debug:main Finished running callback portconfigure::add_automatic_compiler_dependencies
68:debug:main Running callback portbuild::add_automatic_buildsystem_dependencies
69:debug:main Finished running callback portbuild::add_automatic_buildsystem_dependencies
70:debug:main Running callback portstartupitem::add_notes
71:debug:main Finished running callback portstartupitem::add_notes
72:debug:main No need to upgrade! gettext 0.19.8.1_2 >= gettext 0.19.8.1_2
73:debug:main epoch: in tree: 0 installed: 0
74:debug:main ncurses 6.2_1 exists in the ports tree
75:debug:main ncurses 6.2_1 +universal is the latest installed
76:debug:main ncurses 6.2_1 +universal is active
77:debug:main Merging existing variants '+universal' into variants
78:debug:main new fully merged portvariants: universal +
79:debug:main Changing to port directory: /opt/local/var/macports/sources/rsync.macports.org/macports/release/tarballs/ports/devel/ncurses
80:debug:main OS darwin/20.3.0 (macOS 11.2) arch arm
81:debug:main Sourcing PortGroup clang_dependency 1.0 from /opt/local/var/macports/sources/rsync.macports.org/macports/release/tarballs/ports/_resources/port1.0/group/clang_dependency-1.0.tcl
82:debug:main adding the default universal variant
83:debug:main Reading variant descriptions from /opt/local/var/macports/sources/rsync.macports.org/macports/release/tarballs/ports/_resources/port1.0/variant_descriptions.conf
84:debug:main Executing variant universal provides universal
85:debug:main Running callback portconfigure::add_automatic_compiler_dependencies
86:debug:main Finished running callback portconfigure::add_automatic_compiler_dependencies
87:debug:main Running callback portbuild::add_automatic_buildsystem_dependencies
88:debug:main Finished running callback portbuild::add_automatic_buildsystem_dependencies
89:debug:main Running callback portstartupitem::add_notes
90:debug:main Finished running callback portstartupitem::add_notes
91:debug:main No need to upgrade! ncurses 6.2_1 >= ncurses 6.2_1
92:debug:main epoch: in tree: 0 installed: 0
93:debug:main arm-none-eabi-binutils 2.34_1 exists in the ports tree
94:debug:main arm-none-eabi-binutils 2.34_1  is the latest installed
95:debug:main arm-none-eabi-binutils 2.34_1  is active
96:debug:main Merging existing variants '' into variants
97:debug:main new fully merged portvariants:
98:debug:main Changing to port directory: /opt/local/var/macports/sources/rsync.macports.org/macports/release/tarballs/ports/cross/arm-none-eabi-binutils
99:debug:main OS darwin/20.3.0 (macOS 11.2) arch arm
100:debug:main Sourcing PortGroup crossbinutils 1.0 from /opt/local/var/macports/sources/rsync.macports.org/macports/release/tarballs/ports/_resources/port1.0/group/crossbinutils-1.0.tcl
101:debug:main universal_variant is false, so not adding the default universal variant
102:debug:main Running callback portconfigure::add_automatic_compiler_dependencies
103:debug:main Finished running callback portconfigure::add_automatic_compiler_dependencies
104:debug:main Running callback portbuild::add_automatic_buildsystem_dependencies
105:debug:main Finished running callback portbuild::add_automatic_buildsystem_dependencies
106:debug:main Running callback portstartupitem::add_notes
107:debug:main Finished running callback portstartupitem::add_notes
108:debug:main No need to upgrade! arm-none-eabi-binutils 2.34_1 >= arm-none-eabi-binutils 2.34_1
109:debug:main epoch: in tree: 0 installed: 0
110:debug:main zlib 1.2.11_0 exists in the ports tree
111:debug:main zlib 1.2.11_0  is the latest installed
112:debug:main zlib 1.2.11_0 +universal is active
113:debug:main Merging existing variants '+universal' into variants
114:debug:main new fully merged portvariants: universal +
115:debug:main Changing to port directory: /opt/local/var/macports/sources/rsync.macports.org/macports/release/tarballs/ports/archivers/zlib
116:debug:main OS darwin/20.3.0 (macOS 11.2) arch arm
117:debug:main Sourcing PortGroup xcodeversion 1.0 from /opt/local/var/macports/sources/rsync.macports.org/macports/release/tarballs/ports/_resources/port1.0/group/xcodeversion-1.0.tcl
118:debug:main adding the default universal variant
119:debug:main Reading variant descriptions from /opt/local/var/macports/sources/rsync.macports.org/macports/release/tarballs/ports/_resources/port1.0/variant_descriptions.conf
120:debug:main Executing variant universal provides universal
121:debug:main Running callback portconfigure::add_automatic_compiler_dependencies
122:debug:main Finished running callback portconfigure::add_automatic_compiler_dependencies
123:debug:main Running callback portbuild::add_automatic_buildsystem_dependencies
124:debug:main Finished running callback portbuild::add_automatic_buildsystem_dependencies
125:debug:main Running callback portstartupitem::add_notes
126:debug:main Finished running callback portstartupitem::add_notes
127:debug:main Running callback xcodeversions_run_check
128:debug:main Finished running callback xcodeversions_run_check
129:debug:main No need to upgrade! zlib 1.2.11_0 >= zlib 1.2.11_0
130:debug:main epoch: in tree: 0 installed: 0
131:debug:main gmp 6.2.1_0 exists in the ports tree
132:debug:main gmp 6.2.1_0  is the latest installed
133:debug:main gmp 6.2.1_0  is active
134:debug:main Merging existing variants '' into variants
135:debug:main new fully merged portvariants:
136:debug:main Changing to port directory: /opt/local/var/macports/sources/rsync.macports.org/macports/release/tarballs/ports/devel/gmp
137:debug:main OS darwin/20.3.0 (macOS 11.2) arch arm
138:debug:main Sourcing PortGroup muniversal 1.0 from /opt/local/var/macports/sources/rsync.macports.org/macports/release/tarballs/ports/_resources/port1.0/group/muniversal-1.0.tcl
139:debug:main Sourcing PortGroup cltversion 1.0 from /opt/local/var/macports/sources/rsync.macports.org/macports/release/tarballs/ports/_resources/port1.0/group/cltversion-1.0.tcl
140:debug:main Sourcing PortGroup xcode_workaround 1.0 from /opt/local/var/macports/sources/rsync.macports.org/macports/release/tarballs/ports/_resources/port1.0/group/xcode_workaround-1.0.tcl
141:debug:main muniversal: adding universal variant
142:debug:main Reading variant descriptions from /opt/local/var/macports/sources/rsync.macports.org/macports/release/tarballs/ports/_resources/port1.0/variant_descriptions.conf
143:debug:main Running callback portconfigure::add_automatic_compiler_dependencies
144:debug:main Finished running callback portconfigure::add_automatic_compiler_dependencies
145:debug:main Running callback portbuild::add_automatic_buildsystem_dependencies
146:debug:main Finished running callback portbuild::add_automatic_buildsystem_dependencies
147:debug:main Running callback portstartupitem::add_notes
148:debug:main Finished running callback portstartupitem::add_notes
149:debug:main Running callback xcode_workaround::xcode_workaround.appy_fix
150:debug:main Finished running callback xcode_workaround::xcode_workaround.appy_fix
151:debug:main No need to upgrade! gmp 6.2.1_0 >= gmp 6.2.1_0
152:debug:main epoch: in tree: 0 installed: 0
153:debug:main mpfr 4.1.0_0 exists in the ports tree
154:debug:main mpfr 4.1.0_0  is the latest installed
155:debug:main mpfr 4.1.0_0  is active
156:debug:main Merging existing variants '' into variants
157:debug:main new fully merged portvariants:
158:debug:main Changing to port directory: /opt/local/var/macports/sources/rsync.macports.org/macports/release/tarballs/ports/devel/mpfr
159:debug:main OS darwin/20.3.0 (macOS 11.2) arch arm
160:debug:main Sourcing PortGroup muniversal 1.0 from /opt/local/var/macports/sources/rsync.macports.org/macports/release/tarballs/ports/_resources/port1.0/group/muniversal-1.0.tcl
161:debug:main Sourcing PortGroup compiler_blacklist_versions 1.0 from /opt/local/var/macports/sources/rsync.macports.org/macports/release/tarballs/ports/_resources/port1.0/group/compiler_blacklist_versions-1.0.tcl
162:debug:main Sourcing PortGroup cltversion 1.0 from /opt/local/var/macports/sources/rsync.macports.org/macports/release/tarballs/ports/_resources/port1.0/group/cltversion-1.0.tcl
163:debug:main Sourcing PortGroup xcode_workaround 1.0 from /opt/local/var/macports/sources/rsync.macports.org/macports/release/tarballs/ports/_resources/port1.0/group/xcode_workaround-1.0.tcl
164:debug:main compiler clang 1200.0.32.29 not blacklisted because it doesn't match {clang == 211.10.1}
165:debug:main muniversal: adding universal variant
166:debug:main Reading variant descriptions from /opt/local/var/macports/sources/rsync.macports.org/macports/release/tarballs/ports/_resources/port1.0/variant_descriptions.conf
167:debug:main Running callback portconfigure::add_automatic_compiler_dependencies
168:debug:main Finished running callback portconfigure::add_automatic_compiler_dependencies
169:debug:main Running callback portbuild::add_automatic_buildsystem_dependencies
170:debug:main Finished running callback portbuild::add_automatic_buildsystem_dependencies
171:debug:main Running callback portstartupitem::add_notes
172:debug:main Finished running callback portstartupitem::add_notes
173:debug:main Running callback xcode_workaround::xcode_workaround.appy_fix
174:debug:main Finished running callback xcode_workaround::xcode_workaround.appy_fix
175:debug:main No need to upgrade! mpfr 4.1.0_0 >= mpfr 4.1.0_0
176:debug:main epoch: in tree: 3 installed: 3
177:debug:main isl 0.22.1_0 exists in the ports tree
178:debug:main isl 0.22.1_0  is the latest installed
179:debug:main isl 0.22.1_0  is active
180:debug:main Merging existing variants '' into variants
181:debug:main new fully merged portvariants:
182:debug:main Changing to port directory: /opt/local/var/macports/sources/rsync.macports.org/macports/release/tarballs/ports/devel/isl
183:debug:main OS darwin/20.3.0 (macOS 11.2) arch arm
184:debug:main Sourcing PortGroup muniversal 1.0 from /opt/local/var/macports/sources/rsync.macports.org/macports/release/tarballs/ports/_resources/port1.0/group/muniversal-1.0.tcl
185:debug:main muniversal: adding universal variant
186:debug:main Reading variant descriptions from /opt/local/var/macports/sources/rsync.macports.org/macports/release/tarballs/ports/_resources/port1.0/variant_descriptions.conf
187:debug:main Running callback portconfigure::add_automatic_compiler_dependencies
188:debug:main Finished running callback portconfigure::add_automatic_compiler_dependencies
189:debug:main Running callback portbuild::add_automatic_buildsystem_dependencies
190:debug:main Finished running callback portbuild::add_automatic_buildsystem_dependencies
191:debug:main Running callback portstartupitem::add_notes
192:debug:main Finished running callback portstartupitem::add_notes
193:debug:main No need to upgrade! isl 0.22.1_0 >= isl 0.22.1_0
194:debug:main epoch: in tree: 0 installed: 0
195:debug:main libmpc 1.2.1_0 exists in the ports tree
196:debug:main libmpc 1.2.1_0  is the latest installed
197:debug:main libmpc 1.2.1_0  is active
198:debug:main Merging existing variants '' into variants
199:debug:main new fully merged portvariants:
200:debug:main Changing to port directory: /opt/local/var/macports/sources/rsync.macports.org/macports/release/tarballs/ports/devel/libmpc
201:debug:main OS darwin/20.3.0 (macOS 11.2) arch arm
202:debug:main adding the default universal variant
203:debug:main Reading variant descriptions from /opt/local/var/macports/sources/rsync.macports.org/macports/release/tarballs/ports/_resources/port1.0/variant_descriptions.conf
204:debug:main Running callback portconfigure::add_automatic_compiler_dependencies
205:debug:main Finished running callback portconfigure::add_automatic_compiler_dependencies
206:debug:main Running callback portbuild::add_automatic_buildsystem_dependencies
207:debug:main Finished running callback portbuild::add_automatic_buildsystem_dependencies
208:debug:main Running callback portstartupitem::add_notes
209:debug:main Finished running callback portstartupitem::add_notes
210:debug:main No need to upgrade! libmpc 1.2.1_0 >= libmpc 1.2.1_0
211:msg:main --->  Computing dependencies for arm-none-eabi-gcc:info:main .:debug:main arm-none-eabi-gcc has no conflicts
212:debug:main Searching for dependency: xz
213:debug:main Found Dependency: receipt exists for xz
214:debug:main Searching for dependency: gettext
215:debug:main Found Dependency: receipt exists for gettext
216:debug:main Searching for dependency: arm-none-eabi-binutils
217:debug:main Found Dependency: receipt exists for arm-none-eabi-binutils
218:debug:main Searching for dependency: gmp
219:debug:main Found Dependency: receipt exists for gmp
220:debug:main Searching for dependency: mpfr
221:debug:main Found Dependency: receipt exists for mpfr
222:debug:main Searching for dependency: isl
223:debug:main Found Dependency: receipt exists for isl
224:debug:main Searching for dependency: libiconv
225:debug:main Found Dependency: receipt exists for libiconv
226:debug:main Searching for dependency: libmpc
227:debug:main Found Dependency: receipt exists for libmpc
228:debug:main Searching for dependency: zlib
229:debug:main Found Dependency: receipt exists for zlib
230:debug:main Executing org.macports.main (arm-none-eabi-gcc)
231:debug:main dropping privileges: euid changed to 502, egid changed to 501.
232:debug:archivefetch archivefetch phase started at Tue Apr 20 21:19:25 PDT 2021
233:msg:archivefetch --->  Fetching archive for arm-none-eabi-gcc
234:debug:archivefetch Executing org.macports.archivefetch (arm-none-eabi-gcc)
235:debug:archivefetch euid/egid changed to: 0/0
236:debug:archivefetch chowned /opt/local/var/macports/incoming to macports
237:debug:archivefetch euid/egid changed to: 502/501
238:info:archivefetch --->  arm-none-eabi-gcc-9.2.0_1.darwin_20.arm64.tbz2 doesn't seem to exist in /opt/local/var/macports/incoming/verified
239:msg:archivefetch --->  Attempting to fetch arm-none-eabi-gcc-9.2.0_1.darwin_20.arm64.tbz2 from https://ywg.ca.packages.macports.org/mirror/macports/packages/arm-none-eabi-gcc
240:debug:archivefetch Fetching archive failed: The requested URL returned error: 404 Not Found
241:msg:archivefetch --->  Attempting to fetch arm-none-eabi-gcc-9.2.0_1.darwin_20.arm64.tbz2 from https://kmq.jp.packages.macports.org/arm-none-eabi-gcc
242:debug:archivefetch Fetching archive failed: The requested URL returned error: 404 Not Found
243:msg:archivefetch --->  Attempting to fetch arm-none-eabi-gcc-9.2.0_1.darwin_20.arm64.tbz2 from https://lil.fr.packages.macports.org/arm-none-eabi-gcc
244:debug:archivefetch Fetching archive failed: The requested URL returned error: 404 Not Found
245:debug:archivefetch Privilege de-escalation not attempted as not running as root.
246:debug:archivefetch Skipping completed org.macports.fetch (arm-none-eabi-gcc)
247:debug:archivefetch Privilege de-escalation not attempted as not running as root.
248:debug:archivefetch Skipping completed org.macports.checksum (arm-none-eabi-gcc)
249:debug:archivefetch Privilege de-escalation not attempted as not running as root.
250:debug:archivefetch Skipping completed org.macports.extract (arm-none-eabi-gcc)
251:debug:archivefetch Privilege de-escalation not attempted as not running as root.
252:debug:archivefetch Skipping completed org.macports.patch (arm-none-eabi-gcc)
253:debug:archivefetch Privilege de-escalation not attempted as not running as root.
254:debug:archivefetch Skipping completed org.macports.configure (arm-none-eabi-gcc)
255:debug:archivefetch Privilege de-escalation not attempted as not running as root.
256:debug:build build phase started at Tue Apr 20 21:19:29 PDT 2021
257:notice:build --->  Building arm-none-eabi-gcc
258:debug:build Executing org.macports.build (arm-none-eabi-gcc)
259:debug:build Environment:
260:debug:build CC_PRINT_OPTIONS='YES'
261:debug:build CC_PRINT_OPTIONS_FILE='/opt/local/var/macports/build/_opt_local_var_macports_sources_rsync.macports.org_macports_release_tarballs_ports_cross_arm-none-eabi-gcc/arm-none-eabi-gcc/work/.CC_PRINT_OPTIONS'
262:debug:build DEVELOPER_DIR='/Library/Developer/CommandLineTools'
263:debug:build LIBRARY_PATH='/opt/local/lib'
264:debug:build MACOSX_DEPLOYMENT_TARGET='11.2'
265:debug:build SDKROOT='/Library/Developer/CommandLineTools/SDKs/MacOSX.sdk'
266:info:build Executing:  cd "/opt/local/var/macports/build/_opt_local_var_macports_sources_rsync.macports.org_macports_release_tarballs_ports_cross_arm-none-eabi-gcc/arm-none-eabi-gcc/work/build" && /usr/bin/make -j8 -w all
267:debug:build system:  cd "/opt/local/var/macports/build/_opt_local_var_macports_sources_rsync.macports.org_macports_release_tarballs_ports_cross_arm-none-eabi-gcc/arm-none-eabi-gcc/work/build" && /usr/bin/make -j8 -w all
268:info:build make: Entering directory `/opt/local/var/macports/build/_opt_local_var_macports_sources_rsync.macports.org_macports_release_tarballs_ports_cross_arm-none-eabi-gcc/arm-none-eabi-gcc/work/build'
269:info:build make[1]: Entering directory `/opt/local/var/macports/build/_opt_local_var_macports_sources_rsync.macports.org_macports_release_tarballs_ports_cross_arm-none-eabi-gcc/arm-none-eabi-gcc/work/build'
270:info:build make[2]: Entering directory `/opt/local/var/macports/build/_opt_local_var_macports_sources_rsync.macports.org_macports_release_tarballs_ports_cross_arm-none-eabi-gcc/arm-none-eabi-gcc/work/build/intl'
271:info:build make[2]: Nothing to be done for `all'.
272:info:build make[2]: Leaving directory `/opt/local/var/macports/build/_opt_local_var_macports_sources_rsync.macports.org_macports_release_tarballs_ports_cross_arm-none-eabi-gcc/arm-none-eabi-gcc/work/build/intl'
273:info:build make[2]: Entering directory `/opt/local/var/macports/build/_opt_local_var_macports_sources_rsync.macports.org_macports_release_tarballs_ports_cross_arm-none-eabi-gcc/arm-none-eabi-gcc/work/build/libiberty'
274:info:build make[3]: Entering directory `/opt/local/var/macports/build/_opt_local_var_macports_sources_rsync.macports.org_macports_release_tarballs_ports_cross_arm-none-eabi-gcc/arm-none-eabi-gcc/work/build/libiberty/testsuite'
275:info:build make[3]: Nothing to be done for `all'.
276:info:build make[3]: Leaving directory `/opt/local/var/macports/build/_opt_local_var_macports_sources_rsync.macports.org_macports_release_tarballs_ports_cross_arm-none-eabi-gcc/arm-none-eabi-gcc/work/build/libiberty/testsuite'
277:info:build make[2]: Entering directory `/opt/local/var/macports/build/_opt_local_var_macports_sources_rsync.macports.org_macports_release_tarballs_ports_cross_arm-none-eabi-gcc/arm-none-eabi-gcc/work/build/libbacktrace'
278:info:build /Library/Developer/CommandLineTools/usr/bin/make  all-am
279:info:build make[2]: Leaving directory `/opt/local/var/macports/build/_opt_local_var_macports_sources_rsync.macports.org_macports_release_tarballs_ports_cross_arm-none-eabi-gcc/arm-none-eabi-gcc/work/build/libiberty'
280:info:build make[2]: Entering directory `/opt/local/var/macports/build/_opt_local_var_macports_sources_rsync.macports.org_macports_release_tarballs_ports_cross_arm-none-eabi-gcc/arm-none-eabi-gcc/work/build/build-arm-apple-darwin20.3.0/libiberty'
281:info:build make[3]: Entering directory `/opt/local/var/macports/build/_opt_local_var_macports_sources_rsync.macports.org_macports_release_tarballs_ports_cross_arm-none-eabi-gcc/arm-none-eabi-gcc/work/build/libbacktrace'
282:info:build true  DO=all multi-do # /Library/Developer/CommandLineTools/usr/bin/make
283:info:build make[2]: Entering directory `/opt/local/var/macports/build/_opt_local_var_macports_sources_rsync.macports.org_macports_release_tarballs_ports_cross_arm-none-eabi-gcc/arm-none-eabi-gcc/work/build/libdecnumber'
284:info:build make[2]: Nothing to be done for `all'.
285:info:build make[2]: Leaving directory `/opt/local/var/macports/build/_opt_local_var_macports_sources_rsync.macports.org_macports_release_tarballs_ports_cross_arm-none-eabi-gcc/arm-none-eabi-gcc/work/build/libdecnumber'
286:info:build make[3]: Leaving directory `/opt/local/var/macports/build/_opt_local_var_macports_sources_rsync.macports.org_macports_release_tarballs_ports_cross_arm-none-eabi-gcc/arm-none-eabi-gcc/work/build/libbacktrace'
287:info:build make[2]: Leaving directory `/opt/local/var/macports/build/_opt_local_var_macports_sources_rsync.macports.org_macports_release_tarballs_ports_cross_arm-none-eabi-gcc/arm-none-eabi-gcc/work/build/libbacktrace'
288:info:build make[3]: Entering directory `/opt/local/var/macports/build/_opt_local_var_macports_sources_rsync.macports.org_macports_release_tarballs_ports_cross_arm-none-eabi-gcc/arm-none-eabi-gcc/work/build/build-arm-apple-darwin20.3.0/libiberty/testsuite'
289:info:build make[3]: Nothing to be done for `all'.
290:info:build make[3]: Leaving directory `/opt/local/var/macports/build/_opt_local_var_macports_sources_rsync.macports.org_macports_release_tarballs_ports_cross_arm-none-eabi-gcc/arm-none-eabi-gcc/work/build/build-arm-apple-darwin20.3.0/libiberty/testsuite'
291:info:build make[2]: Leaving directory `/opt/local/var/macports/build/_opt_local_var_macports_sources_rsync.macports.org_macports_release_tarballs_ports_cross_arm-none-eabi-gcc/arm-none-eabi-gcc/work/build/build-arm-apple-darwin20.3.0/libiberty'
292:info:build make[2]: Entering directory `/opt/local/var/macports/build/_opt_local_var_macports_sources_rsync.macports.org_macports_release_tarballs_ports_cross_arm-none-eabi-gcc/arm-none-eabi-gcc/work/build/fixincludes'
293:info:build make[2]: Nothing to be done for `all'.
294:info:build make[2]: Leaving directory `/opt/local/var/macports/build/_opt_local_var_macports_sources_rsync.macports.org_macports_release_tarballs_ports_cross_arm-none-eabi-gcc/arm-none-eabi-gcc/work/build/fixincludes'
295:info:build make[2]: Entering directory `/opt/local/var/macports/build/_opt_local_var_macports_sources_rsync.macports.org_macports_release_tarballs_ports_cross_arm-none-eabi-gcc/arm-none-eabi-gcc/work/build/lto-plugin'
296:info:build /Library/Developer/CommandLineTools/usr/bin/make  all-am
297:info:build make[3]: Entering directory `/opt/local/var/macports/build/_opt_local_var_macports_sources_rsync.macports.org_macports_release_tarballs_ports_cross_arm-none-eabi-gcc/arm-none-eabi-gcc/work/build/lto-plugin'
298:info:build make[3]: Nothing to be done for `all-am'.
299:info:build make[3]: Leaving directory `/opt/local/var/macports/build/_opt_local_var_macports_sources_rsync.macports.org_macports_release_tarballs_ports_cross_arm-none-eabi-gcc/arm-none-eabi-gcc/work/build/lto-plugin'
300:info:build make[2]: Leaving directory `/opt/local/var/macports/build/_opt_local_var_macports_sources_rsync.macports.org_macports_release_tarballs_ports_cross_arm-none-eabi-gcc/arm-none-eabi-gcc/work/build/lto-plugin'
301:info:build make[2]: Entering directory `/opt/local/var/macports/build/_opt_local_var_macports_sources_rsync.macports.org_macports_release_tarballs_ports_cross_arm-none-eabi-gcc/arm-none-eabi-gcc/work/build/libcpp'
302:info:build make[2]: Nothing to be done for `all'.
303:info:build make[2]: Leaving directory `/opt/local/var/macports/build/_opt_local_var_macports_sources_rsync.macports.org_macports_release_tarballs_ports_cross_arm-none-eabi-gcc/arm-none-eabi-gcc/work/build/libcpp'
304:info:build make[2]: Entering directory `/opt/local/var/macports/build/_opt_local_var_macports_sources_rsync.macports.org_macports_release_tarballs_ports_cross_arm-none-eabi-gcc/arm-none-eabi-gcc/work/build/build-arm-apple-darwin20.3.0/fixincludes'
305:info:build make[2]: Nothing to be done for `all'.
306:info:build make[2]: Leaving directory `/opt/local/var/macports/build/_opt_local_var_macports_sources_rsync.macports.org_macports_release_tarballs_ports_cross_arm-none-eabi-gcc/arm-none-eabi-gcc/work/build/build-arm-apple-darwin20.3.0/fixincludes'
307:info:build make[2]: Entering directory `/opt/local/var/macports/build/_opt_local_var_macports_sources_rsync.macports.org_macports_release_tarballs_ports_cross_arm-none-eabi-gcc/arm-none-eabi-gcc/work/build/build-arm-apple-darwin20.3.0/libcpp'
308:info:build make[2]: Nothing to be done for `all'.
309:info:build make[2]: Leaving directory `/opt/local/var/macports/build/_opt_local_var_macports_sources_rsync.macports.org_macports_release_tarballs_ports_cross_arm-none-eabi-gcc/arm-none-eabi-gcc/work/build/build-arm-apple-darwin20.3.0/libcpp'
310:info:build make[2]: Entering directory `/opt/local/var/macports/build/_opt_local_var_macports_sources_rsync.macports.org_macports_release_tarballs_ports_cross_arm-none-eabi-gcc/arm-none-eabi-gcc/work/build/gcc'
311:info:build /usr/bin/clang++ -no-pie   -pipe -Os -fbracket-depth=512 -isysroot/Library/Developer/CommandLineTools/SDKs/MacOSX.sdk -DIN_GCC  -DCROSS_DIRECTORY_STRUCTURE  -fno-strict-aliasing -fno-exceptions -fno-rtti -fasynchronous-unwind-tables -W -Wall -Wno-narrowing -Wwrite-strings -Wcast-qual -Wmissing-format-attribute -Woverloaded-virtual -pedantic -Wno-long-long -Wno-variadic-macros -Wno-overlength-strings   -DHAVE_CONFIG_H -L/opt/local/lib -Wl,-headerpad_max_install_names -Wl,-syslibroot,/Library/Developer/CommandLineTools/SDKs/MacOSX.sdk -o cc1 c/c-lang.o c-family/stub-objc.o attribs.o c/c-errors.o c/c-decl.o c/c-typeck.o c/c-convert.o c/c-aux-info.o c/c-objc-common.o c/c-parser.o c/c-fold.o c/gimple-parser.o c-family/c-common.o c-family/c-cppbuiltin.o c-family/c-dump.o c-family/c-format.o c-family/c-gimplify.o c-family/c-indentation.o c-family/c-lex.o c-family/c-omp.o c-family/c-opts.o c-family/c-pch.o c-family/c-ppoutput.o c-family/c-pragma.o c-family/c-pretty-print.o c-family/c-semantics.o c-family/c-ada-spec.o c-family/c-ubsan.o c-family/known-headers.o c-family/c-attribs.o c-family/c-warn.o c-family/c-spellcheck.o arm-c.o default-c.o \
312:info:build       cc1-checksum.o libbackend.a main.o libcommon-target.a libcommon.a ../libcpp/libcpp.a ../libdecnumber/libdecnumber.a libcommon.a ../libcpp/libcpp.a -lintl -liconv ../libbacktrace/.libs/libbacktrace.a ../libiberty/libiberty.a ../libdecnumber/libdecnumber.a  -lisl -L/opt/local/lib -L/opt/local/lib -L/opt/local/lib -lmpc -lmpfr -lgmp   -lz
313:info:build /usr/bin/clang++ -no-pie   -pipe -Os -fbracket-depth=512 -isysroot/Library/Developer/CommandLineTools/SDKs/MacOSX.sdk -DIN_GCC  -DCROSS_DIRECTORY_STRUCTURE  -fno-strict-aliasing -fno-exceptions -fno-rtti -fasynchronous-unwind-tables -W -Wall -Wno-narrowing -Wwrite-strings -Wcast-qual -Wmissing-format-attribute -Woverloaded-virtual -pedantic -Wno-long-long -Wno-variadic-macros -Wno-overlength-strings   -DHAVE_CONFIG_H -L/opt/local/lib -Wl,-headerpad_max_install_names -Wl,-syslibroot,/Library/Developer/CommandLineTools/SDKs/MacOSX.sdk -o cc1plus \
314:info:build           cp/cp-lang.o c-family/stub-objc.o cp/call.o cp/class.o cp/constexpr.o cp/constraint.o cp/cp-gimplify.o cp/cp-objcp-common.o cp/cp-ubsan.o cp/cvt.o cp/cxx-pretty-print.o cp/decl.o cp/decl2.o cp/dump.o cp/error.o cp/except.o cp/expr.o cp/friend.o cp/init.o cp/lambda.o cp/lex.o cp/logic.o cp/mangle.o cp/method.o cp/name-lookup.o cp/optimize.o cp/parser.o cp/pt.o cp/ptree.o cp/repo.o cp/rtti.o cp/search.o cp/semantics.o cp/tree.o cp/typeck.o cp/typeck2.o cp/vtable-class-hierarchy.o attribs.o incpath.o c-family/c-common.o c-family/c-cppbuiltin.o c-family/c-dump.o c-family/c-format.o c-family/c-gimplify.o c-family/c-indentation.o c-family/c-lex.o c-family/c-omp.o c-family/c-opts.o c-family/c-pch.o c-family/c-ppoutput.o c-family/c-pragma.o c-family/c-pretty-print.o c-family/c-semantics.o c-family/c-ada-spec.o c-family/c-ubsan.o c-family/known-headers.o c-family/c-attribs.o c-family/c-warn.o c-family/c-spellcheck.o arm-c.o default-c.o cc1plus-checksum.o libbackend.a main.o libcommon-target.a libcommon.a ../libcpp/libcpp.a ../libdecnumber/libdecnumber.a libcommon.a ../libcpp/libcpp.a -lintl -liconv ../libbacktrace/.libs/libbacktrace.a ../libiberty/libiberty.a ../libdecnumber/libdecnumber.a  -lisl -L/opt/local/lib -L/opt/local/lib -L/opt/local/lib -lmpc -lmpfr -lgmp   -lz
315:info:build /usr/bin/clang++ -no-pie   -pipe -Os -fbracket-depth=512 -isysroot/Library/Developer/CommandLineTools/SDKs/MacOSX.sdk -DIN_GCC  -DCROSS_DIRECTORY_STRUCTURE  -fno-strict-aliasing -fno-exceptions -fno-rtti -fasynchronous-unwind-tables -W -Wall -Wno-narrowing -Wwrite-strings -Wcast-qual -Wmissing-format-attribute -Woverloaded-virtual -pedantic -Wno-long-long -Wno-variadic-macros -Wno-overlength-strings   -DHAVE_CONFIG_H -L/opt/local/lib -Wl,-headerpad_max_install_names -Wl,-syslibroot,/Library/Developer/CommandLineTools/SDKs/MacOSX.sdk -o lto1 \
316:info:build             lto/lto-lang.o lto/lto.o lto/lto-object.o attribs.o lto/lto-partition.o lto/lto-symtab.o libbackend.a main.o libcommon-target.a libcommon.a ../libcpp/libcpp.a ../libdecnumber/libdecnumber.a -lisl -L/opt/local/lib -L/opt/local/lib -L/opt/local/lib -lmpc -lmpfr -lgmp   -lz libcommon.a ../libcpp/libcpp.a -lintl -liconv ../libbacktrace/.libs/libbacktrace.a ../libiberty/libiberty.a ../libdecnumber/libdecnumber.a
317:info:build clang: warning: argument unused during compilation: '-no-pie' [-Wunused-command-line-argument]
318:info:build clang: warning: argument unused during compilation: '-no-pie' [-Wunused-command-line-argument]
319:info:build clang: warning: argument unused during compilation: '-no-pie' [-Wunused-command-line-argument]
320:info:build Undefined symbols for architecture arm64:
321:info:build   "_host_hooks", referenced from:
322:info:build       c_common_no_more_pch() in c-pch.o
323:info:build       toplev::main(int, char**) in libbackend.a(toplev.o)
324:info:build       gt_pch_save(__sFILE*) in libbackend.a(ggc-common.o)
325:info:build       gt_pch_restore(__sFILE*) in libbackend.a(ggc-common.o)
326:info:build Undefined symbols for architecture arm64:
327:info:build   "_host_hooks", referenced from:
328:info:build       c_common_no_more_pch() in c-pch.o
329:info:build       toplev::main(int, char**) in libbackend.a(toplev.o)
330:info:build       gt_pch_save(__sFILE*) in libbackend.a(ggc-common.o)
331:info:build       gt_pch_restore(__sFILE*) in libbackend.a(ggc-common.o)
332:info:build Undefined symbols for architecture arm64:
333:info:build   "_host_hooks", referenced from:
334:info:build       gt_pch_save(__sFILE*) in libbackend.a(ggc-common.o)
335:info:build       gt_pch_restore(__sFILE*) in libbackend.a(ggc-common.o)
336:info:build       toplev::main(int, char**) in libbackend.a(toplev.o)
337:info:build ld: symbol(s) not found for architecture arm64
338:info:build ld: symbol(s) not found for architecture arm64
339:info:build clang: error: linker command failed with exit code 1 (use -v to see invocation)
340:info:build clang: error: linker command failed with exit code 1 (use -v to see invocation)
341:info:build make[2]: *** [cc1] Error 1
342:info:build make[2]: *** Waiting for unfinished jobs....
343:info:build make[2]: *** [cc1plus] Error 1
344:info:build ld: symbol(s) not found for architecture arm64
345:info:build clang: error: linker command failed with exit code 1 (use -v to see invocation)
346:info:build make[2]: *** [lto1] Error 1
347:info:build make[2]: Leaving directory `/opt/local/var/macports/build/_opt_local_var_macports_sources_rsync.macports.org_macports_release_tarballs_ports_cross_arm-none-eabi-gcc/arm-none-eabi-gcc/work/build/gcc'
348:info:build make[1]: *** [all-gcc] Error 2
349:info:build make[1]: Leaving directory `/opt/local/var/macports/build/_opt_local_var_macports_sources_rsync.macports.org_macports_release_tarballs_ports_cross_arm-none-eabi-gcc/arm-none-eabi-gcc/work/build'
350:info:build make: *** [all] Error 2
351:info:build make: Leaving directory `/opt/local/var/macports/build/_opt_local_var_macports_sources_rsync.macports.org_macports_release_tarballs_ports_cross_arm-none-eabi-gcc/arm-none-eabi-gcc/work/build'
352:info:build Command failed:  cd "/opt/local/var/macports/build/_opt_local_var_macports_sources_rsync.macports.org_macports_release_tarballs_ports_cross_arm-none-eabi-gcc/arm-none-eabi-gcc/work/build" && /usr/bin/make -j8 -w all
353:info:build Exit code: 2
354:error:build Failed to build arm-none-eabi-gcc: command execution failed
355:debug:build Error code: CHILDSTATUS 33502 2
356:debug:build Backtrace: command execution failed
357:debug:build     while executing
358:debug:build "system {*}$notty {*}$nice $fullcmdstring"
359:debug:build     invoked from within
360:debug:build "command_exec build"
361:debug:build     (procedure "portbuild::build_main" line 8)
362:debug:build     invoked from within
363:debug:build "$procedure $targetname"
364:error:build See /opt/local/var/macports/logs/_opt_local_var_macports_sources_rsync.macports.org_macports_release_tarballs_ports_cross_arm-none-eabi-gcc/arm-none-eabi-gcc/main.log for details.