Ticket #62820: bmon-fail-bigsur.log

File bmon-fail-bigsur.log, 40.1 KB (added by jmscott (John the Scott), 3 months ago)

main.log of failed build of bmon on clean bigsur

Line 
1version:1
2:debug:sysinfo macOS 11.3 (darwin/20.4.0) arch i386
3:debug:sysinfo MacPorts 2.6.4
4:debug:sysinfo Xcode 12.5
5:debug:sysinfo SDK 11.3
6:debug:sysinfo MACOSX_DEPLOYMENT_TARGET: 11.3
7:debug:main epoch: in tree: 2 installed: 2
8:debug:main gettext 0.19.8.1_2 exists in the ports tree
9:debug:main gettext 0.19.8.1_2  is the latest installed
10:debug:main gettext 0.19.8.1_2  is active
11:debug:main Merging existing variants '' into variants
12:debug:main new fully merged portvariants:
13:debug:main Changing to port directory: /opt/local/var/macports/sources/rsync.macports.org/macports/release/tarballs/ports/devel/gettext
14:debug:main OS darwin/20.4.0 (macOS 11.3) arch i386
15:debug:main Sourcing PortGroup compiler_blacklist_versions 1.0 from /opt/local/var/macports/sources/rsync.macports.org/macports/release/tarballs/ports/_resources/port1.0/group/compiler_blacklist_versions-1.0.tcl
16:debug:main Sourcing PortGroup muniversal 1.0 from /opt/local/var/macports/sources/rsync.macports.org/macports/release/tarballs/ports/_resources/port1.0/group/muniversal-1.0.tcl
17:debug:main Sourcing PortGroup clang_dependency 1.0 from /opt/local/var/macports/sources/rsync.macports.org/macports/release/tarballs/ports/_resources/port1.0/group/clang_dependency-1.0.tcl
18:debug:main compiler clang 1205.0.22.9 not blacklisted because it doesn't match {clang < 211.10.1}
19:debug:main muniversal: adding universal variant
20:debug:main Reading variant descriptions from /opt/local/var/macports/sources/rsync.macports.org/macports/release/tarballs/ports/_resources/port1.0/variant_descriptions.conf
21:debug:main Running callback portconfigure::add_automatic_compiler_dependencies
22:debug:main Finished running callback portconfigure::add_automatic_compiler_dependencies
23:debug:main Running callback portbuild::add_automatic_buildsystem_dependencies
24:debug:main Finished running callback portbuild::add_automatic_buildsystem_dependencies
25:debug:main Running callback portstartupitem::add_notes
26:debug:main Finished running callback portstartupitem::add_notes
27:debug:main No need to upgrade! gettext 0.19.8.1_2 >= gettext 0.19.8.1_2
28:debug:main epoch: in tree: 0 installed: 0
29:debug:main libiconv 1.16_1 exists in the ports tree
30:debug:main libiconv 1.16_1  is the latest installed
31:debug:main libiconv 1.16_1  is active
32:debug:main Merging existing variants '' into variants
33:debug:main new fully merged portvariants:
34:debug:main Changing to port directory: /opt/local/var/macports/sources/rsync.macports.org/macports/release/tarballs/ports/textproc/libiconv
35:debug:main OS darwin/20.4.0 (macOS 11.3) arch i386
36:debug:main Sourcing PortGroup muniversal 1.0 from /opt/local/var/macports/sources/rsync.macports.org/macports/release/tarballs/ports/_resources/port1.0/group/muniversal-1.0.tcl
37:debug:main Sourcing PortGroup clang_dependency 1.0 from /opt/local/var/macports/sources/rsync.macports.org/macports/release/tarballs/ports/_resources/port1.0/group/clang_dependency-1.0.tcl
38:debug:main Sourcing PortGroup xcodeversion 1.0 from /opt/local/var/macports/sources/rsync.macports.org/macports/release/tarballs/ports/_resources/port1.0/group/xcodeversion-1.0.tcl
39:debug:main muniversal: adding universal variant
40:debug:main Reading variant descriptions from /opt/local/var/macports/sources/rsync.macports.org/macports/release/tarballs/ports/_resources/port1.0/variant_descriptions.conf
41:debug:main Running callback portconfigure::add_automatic_compiler_dependencies
42:debug:main Finished running callback portconfigure::add_automatic_compiler_dependencies
43:debug:main Running callback portbuild::add_automatic_buildsystem_dependencies
44:debug:main Finished running callback portbuild::add_automatic_buildsystem_dependencies
45:debug:main Running callback portstartupitem::add_notes
46:debug:main Finished running callback portstartupitem::add_notes
47:debug:main Running callback xcodeversions_run_check
48:debug:main Finished running callback xcodeversions_run_check
49:debug:main No need to upgrade! libiconv 1.16_1 >= libiconv 1.16_1
50:debug:main epoch: in tree: 0 installed: 0
51:debug:main ncurses 6.2_1 exists in the ports tree
52:debug:main ncurses 6.2_1  is the latest installed
53:debug:main ncurses 6.2_1  is active
54:debug:main Merging existing variants '' into variants
55:debug:main new fully merged portvariants:
56:debug:main Changing to port directory: /opt/local/var/macports/sources/rsync.macports.org/macports/release/tarballs/ports/devel/ncurses
57:debug:main OS darwin/20.4.0 (macOS 11.3) arch i386
58:debug:main Sourcing PortGroup clang_dependency 1.0 from /opt/local/var/macports/sources/rsync.macports.org/macports/release/tarballs/ports/_resources/port1.0/group/clang_dependency-1.0.tcl
59:debug:main adding the default universal variant
60:debug:main Reading variant descriptions from /opt/local/var/macports/sources/rsync.macports.org/macports/release/tarballs/ports/_resources/port1.0/variant_descriptions.conf
61:debug:main Running callback portconfigure::add_automatic_compiler_dependencies
62:debug:main Finished running callback portconfigure::add_automatic_compiler_dependencies
63:debug:main Running callback portbuild::add_automatic_buildsystem_dependencies
64:debug:main Finished running callback portbuild::add_automatic_buildsystem_dependencies
65:debug:main Running callback portstartupitem::add_notes
66:debug:main Finished running callback portstartupitem::add_notes
67:debug:main No need to upgrade! ncurses 6.2_1 >= ncurses 6.2_1
68:msg:main --->  Computing dependencies for bmon:info:main .:debug:main bmon has no conflicts
69:debug:main Searching for dependency: pkgconfig
70:debug:main Didn't find receipt, going to depspec regex for: pkgconfig
71:debug:main Changing to port directory: /opt/local/var/macports/sources/rsync.macports.org/macports/release/tarballs/ports/devel/pkgconfig
72:debug:main OS darwin/20.4.0 (macOS 11.3) arch i386
73:debug:main Sourcing PortGroup clang_dependency 1.0 from /opt/local/var/macports/sources/rsync.macports.org/macports/release/tarballs/ports/_resources/port1.0/group/clang_dependency-1.0.tcl
74:debug:main Sourcing PortGroup conflicts_build 1.0 from /opt/local/var/macports/sources/rsync.macports.org/macports/release/tarballs/ports/_resources/port1.0/group/conflicts_build-1.0.tcl
75:debug:main adding the default universal variant
76:debug:main Reading variant descriptions from /opt/local/var/macports/sources/rsync.macports.org/macports/release/tarballs/ports/_resources/port1.0/variant_descriptions.conf
77:debug:main Running callback portconfigure::add_automatic_compiler_dependencies
78:debug:main Finished running callback portconfigure::add_automatic_compiler_dependencies
79:debug:main Running callback portbuild::add_automatic_buildsystem_dependencies
80:debug:main Finished running callback portbuild::add_automatic_buildsystem_dependencies
81:debug:main Running callback portstartupitem::add_notes
82:debug:main Finished running callback portstartupitem::add_notes
83:debug:main Searching for dependency: gettext
84:debug:main Found Dependency: receipt exists for gettext
85:debug:main Searching for dependency: libconfuse
86:debug:main Didn't find receipt, going to depspec regex for: libconfuse
87:debug:main Changing to port directory: /opt/local/var/macports/sources/rsync.macports.org/macports/release/tarballs/ports/devel/libconfuse
88:debug:main OS darwin/20.4.0 (macOS 11.3) arch i386
89:debug:main Sourcing PortGroup github 1.0 from /opt/local/var/macports/sources/rsync.macports.org/macports/release/tarballs/ports/_resources/port1.0/group/github-1.0.tcl
90:debug:main Re-registering default for livecheck.url
91:debug:main Re-registering default for livecheck.regex
92:debug:main adding the default universal variant
93:debug:main Reading variant descriptions from /opt/local/var/macports/sources/rsync.macports.org/macports/release/tarballs/ports/_resources/port1.0/variant_descriptions.conf
94:debug:main Running callback portconfigure::add_automatic_compiler_dependencies
95:debug:main Finished running callback portconfigure::add_automatic_compiler_dependencies
96:debug:main Running callback portbuild::add_automatic_buildsystem_dependencies
97:debug:main Finished running callback portbuild::add_automatic_buildsystem_dependencies
98:debug:main Running callback portstartupitem::add_notes
99:debug:main Finished running callback portstartupitem::add_notes
100:debug:main Searching for dependency: ncurses
101:debug:main Found Dependency: receipt exists for ncurses
102:info:main .:debug:main Checking for conflicts against pkgconfig
103:debug:main Searching for dependency: pkgconf
104:debug:main Didn't find receipt, going to depspec regex for: pkgconf
105:debug:main Searching for dependency: libiconv
106:debug:main Found Dependency: receipt exists for libiconv
107:info:main .:debug:main libconfuse has no conflicts
108:debug:main Starting logging for libconfuse
109:debug:clean Starting logging for pkgconfig
110:debug:main Executing org.macports.main (bmon)
111:debug:main dropping privileges: euid changed to 505, egid changed to 501.
112:debug:archivefetch archivefetch phase started at Wed May  5 17:51:53 CDT 2021
113:msg:archivefetch --->  Fetching archive for bmon
114:debug:archivefetch Executing org.macports.archivefetch (bmon)
115:debug:archivefetch euid/egid changed to: 0/0
116:debug:archivefetch chowned /opt/local/var/macports/incoming to macports
117:debug:archivefetch euid/egid changed to: 505/501
118:info:archivefetch --->  bmon-4.0_3.darwin_20.x86_64.tbz2 doesn't seem to exist in /opt/local/var/macports/incoming/verified
119:msg:archivefetch --->  Attempting to fetch bmon-4.0_3.darwin_20.x86_64.tbz2 from https://packages.macports.org/bmon
120:debug:archivefetch Fetching archive failed: The requested URL returned error: 404
121:msg:archivefetch --->  Attempting to fetch bmon-4.0_3.darwin_20.x86_64.tbz2 from https://ywg.ca.packages.macports.org/mirror/macports/packages/bmon
122:debug:archivefetch Fetching archive failed: The requested URL returned error: 404 Not Found
123:msg:archivefetch --->  Attempting to fetch bmon-4.0_3.darwin_20.x86_64.tbz2 from https://mse.uk.packages.macports.org/bmon
124:debug:archivefetch Fetching archive failed: The requested URL returned error: 404 Not Found
125:debug:archivefetch Privilege de-escalation not attempted as not running as root.
126:debug:fetch fetch phase started at Wed May  5 17:51:54 CDT 2021
127:notice:fetch --->  Fetching distfiles for bmon
128:debug:fetch elevating privileges for fetch: euid changed to 0, egid changed to 0.
129:debug:fetch dropping privileges: euid changed to 505, egid changed to 501.
130:debug:fetch Executing org.macports.fetch (bmon)
131:info:fetch --->  bmon-4.0.tar.gz does not exist in /opt/local/var/macports/distfiles/bmon
132:notice:fetch --->  Attempting to fetch bmon-4.0.tar.gz from https://distfiles.macports.org/bmon
133:debug:fetch Privilege de-escalation not attempted as not running as root.
134:debug:checksum checksum phase started at Wed May  5 17:51:54 CDT 2021
135:notice:checksum --->  Verifying checksums for bmon
136:debug:checksum Executing org.macports.checksum (bmon)
137:info:checksum --->  Checksumming bmon-4.0.tar.gz
138:debug:checksum Calculated (rmd160) is 9f8639ef55c77f1085169d40c02f5702ac30cfc4
139:debug:checksum Correct (rmd160) checksum for bmon-4.0.tar.gz
140:debug:checksum Calculated (sha256) is 02fdc312b8ceeb5786b28bf905f54328f414040ff42f45c83007f24b76cc9f7a
141:debug:checksum Correct (sha256) checksum for bmon-4.0.tar.gz
142:debug:checksum Calculated (size) is 202241
143:debug:checksum Correct (size) checksum for bmon-4.0.tar.gz
144:debug:checksum Privilege de-escalation not attempted as not running as root.
145:debug:extract extract phase started at Wed May  5 17:51:54 CDT 2021
146:notice:extract --->  Extracting bmon
147:debug:extract Executing org.macports.extract (bmon)
148:info:extract --->  Extracting bmon-4.0.tar.gz
149:debug:extract setting option extract.args to '/opt/local/var/macports/distfiles/bmon/bmon-4.0.tar.gz'
150:debug:extract Environment:
151:debug:extract CC_PRINT_OPTIONS='YES'
152:debug:extract CC_PRINT_OPTIONS_FILE='/opt/local/var/macports/build/_opt_local_var_macports_sources_rsync.macports.org_macports_release_tarballs_ports_net_bmon/bmon/work/.CC_PRINT_OPTIONS'
153:debug:extract CPATH='/opt/local/include'
154:debug:extract DEVELOPER_DIR='/Applications/Xcode.app/Contents/Developer'
155:debug:extract LIBRARY_PATH='/opt/local/lib'
156:debug:extract MACOSX_DEPLOYMENT_TARGET='11.3'
157:debug:extract SDKROOT='/Applications/Xcode.app/Contents/Developer/Platforms/MacOSX.platform/Developer/SDKs/MacOSX11.3.sdk'
158:info:extract Executing:  cd "/opt/local/var/macports/build/_opt_local_var_macports_sources_rsync.macports.org_macports_release_tarballs_ports_net_bmon/bmon/work" && /usr/bin/gzip -dc '/opt/local/var/macports/distfiles/bmon/bmon-4.0.tar.gz' | /usr/bin/tar -xf -
159:debug:extract system:  cd "/opt/local/var/macports/build/_opt_local_var_macports_sources_rsync.macports.org_macports_release_tarballs_ports_net_bmon/bmon/work" && /usr/bin/gzip -dc '/opt/local/var/macports/distfiles/bmon/bmon-4.0.tar.gz' | /usr/bin/tar -xf -
160:debug:extract euid/egid changed to: 0/0
161:debug:extract chowned /opt/local/var/macports/build/_opt_local_var_macports_sources_rsync.macports.org_macports_release_tarballs_ports_net_bmon/bmon/work to macports
162:debug:extract euid/egid changed to: 505/501
163:debug:extract Executing proc-post-org.macports.extract-extract-0
164:debug:extract Privilege de-escalation not attempted as not running as root.
165:debug:patch patch phase started at Wed May  5 17:51:54 CDT 2021
166:debug:patch Executing org.macports.patch (bmon)
167:debug:patch Privilege de-escalation not attempted as not running as root.
168:debug:configure configure phase started at Wed May  5 17:51:54 CDT 2021
169:notice:configure --->  Configuring bmon
170:debug:configure Preferred compilers: clang macports-clang-9.0 macports-clang-11 macports-clang-10
171:debug:configure Using compiler 'Xcode Clang'
172:debug:configure Executing org.macports.configure (bmon)
173:debug:configure Environment:
174:debug:configure CC='/usr/bin/clang'
175:debug:configure CC_PRINT_OPTIONS='YES'
176:debug:configure CC_PRINT_OPTIONS_FILE='/opt/local/var/macports/build/_opt_local_var_macports_sources_rsync.macports.org_macports_release_tarballs_ports_net_bmon/bmon/work/.CC_PRINT_OPTIONS'
177:debug:configure CFLAGS='-pipe -Os -isysroot/Applications/Xcode.app/Contents/Developer/Platforms/MacOSX.platform/Developer/SDKs/MacOSX11.3.sdk -arch x86_64'
178:debug:configure CPATH='/opt/local/include'
179:debug:configure CPPFLAGS='-I/opt/local/include -isysroot/Applications/Xcode.app/Contents/Developer/Platforms/MacOSX.platform/Developer/SDKs/MacOSX11.3.sdk'
180:debug:configure CXX='/usr/bin/clang++'
181:debug:configure CXXFLAGS='-pipe -Os -stdlib=libc++ -isysroot/Applications/Xcode.app/Contents/Developer/Platforms/MacOSX.platform/Developer/SDKs/MacOSX11.3.sdk -arch x86_64'
182:debug:configure DEVELOPER_DIR='/Applications/Xcode.app/Contents/Developer'
183:debug:configure F90FLAGS='-pipe -Os -m64'
184:debug:configure FCFLAGS='-pipe -Os -m64'
185:debug:configure FFLAGS='-pipe -Os -m64'
186:debug:configure INSTALL='/usr/bin/install -c'
187:debug:configure LDFLAGS='-L/opt/local/lib -Wl,-headerpad_max_install_names -Wl,-syslibroot,/Applications/Xcode.app/Contents/Developer/Platforms/MacOSX.platform/Developer/SDKs/MacOSX11.3.sdk -arch x86_64'
188:debug:configure LIBRARY_PATH='/opt/local/lib'
189:debug:configure MACOSX_DEPLOYMENT_TARGET='11.3'
190:debug:configure OBJC='/usr/bin/clang'
191:debug:configure OBJCFLAGS='-pipe -Os -isysroot/Applications/Xcode.app/Contents/Developer/Platforms/MacOSX.platform/Developer/SDKs/MacOSX11.3.sdk -arch x86_64'
192:debug:configure OBJCXX='/usr/bin/clang++'
193:debug:configure OBJCXXFLAGS='-pipe -Os -stdlib=libc++ -isysroot/Applications/Xcode.app/Contents/Developer/Platforms/MacOSX.platform/Developer/SDKs/MacOSX11.3.sdk -arch x86_64'
194:debug:configure SDKROOT='/Applications/Xcode.app/Contents/Developer/Platforms/MacOSX.platform/Developer/SDKs/MacOSX11.3.sdk'
195:info:configure Executing:  cd "/opt/local/var/macports/build/_opt_local_var_macports_sources_rsync.macports.org_macports_release_tarballs_ports_net_bmon/bmon/work/bmon-4.0" && ./configure --prefix=/opt/local --disable-silent-rules
196:debug:configure system:  cd "/opt/local/var/macports/build/_opt_local_var_macports_sources_rsync.macports.org_macports_release_tarballs_ports_net_bmon/bmon/work/bmon-4.0" && ./configure --prefix=/opt/local --disable-silent-rules
197:info:configure checking build system type... x86_64-apple-darwin20.4.0
198:info:configure checking host system type... x86_64-apple-darwin20.4.0
199:info:configure checking target system type... x86_64-apple-darwin20.4.0
200:info:configure checking for a BSD-compatible install... /usr/bin/install -c
201:info:configure checking whether build environment is sane... yes
202:info:configure checking for a thread-safe mkdir -p... build-aux/install-sh -c -d
203:info:configure checking for gawk... no
204:info:configure checking for mawk... no
205:info:configure checking for nawk... no
206:info:configure checking for awk... awk
207:info:configure checking whether make sets $(MAKE)... yes
208:info:configure checking whether make supports nested variables... yes
209:info:configure checking whether make supports nested variables... (cached) yes
210:info:configure checking for style of include used by make... GNU
211:info:configure checking for gcc... /usr/bin/clang
212:info:configure checking whether the C compiler works... yes
213:info:configure checking for C compiler default output file name... a.out
214:info:configure checking for suffix of executables...
215:info:configure checking whether we are cross compiling... no
216:info:configure checking for suffix of object files... o
217:info:configure checking whether we are using the GNU C compiler... yes
218:info:configure checking whether /usr/bin/clang accepts -g... yes
219:info:configure checking for /usr/bin/clang option to accept ISO C89... none needed
220:info:configure checking whether /usr/bin/clang understands -c and -o together... yes
221:info:configure checking dependency style of /usr/bin/clang... gcc3
222:info:configure checking for library containing strerror... none required
223:info:configure checking for gcc... (cached) /usr/bin/clang
224:info:configure checking whether we are using the GNU C compiler... (cached) yes
225:info:configure checking whether /usr/bin/clang accepts -g... (cached) yes
226:info:configure checking for /usr/bin/clang option to accept ISO C89... (cached) none needed
227:info:configure checking whether /usr/bin/clang understands -c and -o together... (cached) yes
228:info:configure checking dependency style of /usr/bin/clang... (cached) gcc3
229:info:configure checking for /usr/bin/clang option to accept ISO C99... none needed
230:info:configure checking for /usr/bin/clang option to accept ISO Standard C... (cached) none needed
231:info:configure checking how to run the C preprocessor... /usr/bin/clang -E
232:info:configure checking whether make sets $(MAKE)... (cached) yes
233:info:configure checking for an ANSI C-conforming const... yes
234:info:configure checking for inline... inline
235:info:configure checking whether time.h and sys/time.h may both be included... yes
236:info:configure checking for dirent.h that defines DIR... yes
237:info:configure checking for library containing opendir... none required
238:info:configure checking for grep that handles long lines and -e... /usr/bin/grep
239:info:configure checking for egrep... /usr/bin/grep -E
240:info:configure checking for ANSI C header files... yes
241:info:configure checking for sys/types.h... yes
242:info:configure checking for sys/stat.h... yes
243:info:configure checking for stdlib.h... yes
244:info:configure checking for string.h... yes
245:info:configure checking for memory.h... yes
246:info:configure checking for strings.h... yes
247:info:configure checking for inttypes.h... yes
248:info:configure checking for stdint.h... yes
249:info:configure checking for unistd.h... yes
250:info:configure checking for size_t... yes
251:info:configure checking return type of signal handlers... void
252:info:configure checking for pid_t... yes
253:info:configure checking vfork.h usability... no
254:info:configure checking vfork.h presence... no
255:info:configure checking for vfork.h... no
256:info:configure checking for fork... yes
257:info:configure checking for vfork... yes
258:info:configure checking for working fork... yes
259:info:configure checking for working vfork... (cached) yes
260:info:configure checking getopt.h usability... yes
261:info:configure checking getopt.h presence... yes
262:info:configure checking for getopt.h... yes
263:info:configure checking ncurses/ncurses.h usability... no
264:info:configure checking ncurses/ncurses.h presence... no
265:info:configure checking for ncurses/ncurses.h... no
266:info:configure checking ncurses.h usability... yes
267:info:configure checking ncurses.h presence... yes
268:info:configure checking for ncurses.h... yes
269:info:configure checking curses.h usability... yes
270:info:configure checking curses.h presence... yes
271:info:configure checking for curses.h... yes
272:info:configure checking dirent.h usability... yes
273:info:configure checking dirent.h presence... yes
274:info:configure checking for dirent.h... yes
275:info:configure checking sys/utsname.h usability... yes
276:info:configure checking sys/utsname.h presence... yes
277:info:configure checking for sys/utsname.h... yes
278:info:configure checking sys/sockio.h usability... yes
279:info:configure checking sys/sockio.h presence... yes
280:info:configure checking for sys/sockio.h... yes
281:info:configure checking netinet6/in6.h usability... no
282:info:configure checking netinet6/in6.h presence... no
283:info:configure checking for netinet6/in6.h... no
284:info:configure checking fcntl.h usability... yes
285:info:configure checking fcntl.h presence... yes
286:info:configure checking for fcntl.h... yes
287:info:configure checking netdb.h usability... yes
288:info:configure checking netdb.h presence... yes
289:info:configure checking for netdb.h... yes
290:info:configure checking netinet/in.h usability... yes
291:info:configure checking netinet/in.h presence... yes
292:info:configure checking for netinet/in.h... yes
293:info:configure checking sysctl/ioctl.h usability... no
294:info:configure checking sysctl/ioctl.h presence... no
295:info:configure checking for sysctl/ioctl.h... no
296:info:configure checking sys/param.h usability... yes
297:info:configure checking sys/param.h presence... yes
298:info:configure checking for sys/param.h... yes
299:info:configure checking sys/socket.h usability... yes
300:info:configure checking sys/socket.h presence... yes
301:info:configure checking for sys/socket.h... yes
302:info:configure checking for suseconds_t... yes
303:info:configure checking for atexit... yes
304:info:configure checking for clock_gettime... yes
305:info:configure checking for memset... yes
306:info:configure checking for pow... yes
307:info:configure checking for socket... yes
308:info:configure checking for strcasecmp... yes
309:info:configure checking for strchr... yes
310:info:configure checking for strdup... yes
311:info:configure checking for strerror... yes
312:info:configure checking for strncasecmp... yes
313:info:configure checking for strstr... yes
314:info:configure checking for strtol... yes
315:info:configure checking for uname... yes
316:info:configure checking for getdate... yes
317:info:configure checking for pkg-config... /opt/local/bin/pkg-config
318:info:configure checking for NcursesW wide-character library... yes
319:info:configure checking for working ncursesw/curses.h... no
320:info:configure checking for working ncursesw.h... no
321:info:configure checking for working ncurses.h... yes
322:info:configure checking pkg-config is at least version 0.9.0... yes
323:info:configure checking for CONFUSE... yes
324:info:configure checking for pow in -lm... yes
325:info:configure checking for clock_gettime in -lrt... no
326:info:configure checking for initscr in -lncurses... yes
327:info:configure checking for redrawwin in -lncurses... yes
328:info:configure checking for use_default_colors in -lncurses... yes
329:info:configure checking that generated files are newer than configure... done
330:info:configure configure: creating ./config.status
331:info:configure config.status: creating Makefile
332:info:configure config.status: creating include/Makefile
333:info:configure config.status: creating src/Makefile
334:info:configure config.status: creating man/Makefile
335:info:configure config.status: creating examples/Makefile
336:info:configure config.status: creating include/bmon/defs.h
337:info:configure config.status: executing depfiles commands
338:debug:configure Privilege de-escalation not attempted as not running as root.
339:debug:build build phase started at Wed May  5 17:52:02 CDT 2021
340:notice:build --->  Building bmon
341:debug:build Executing org.macports.build (bmon)
342:debug:build Environment:
343:debug:build CC_PRINT_OPTIONS='YES'
344:debug:build CC_PRINT_OPTIONS_FILE='/opt/local/var/macports/build/_opt_local_var_macports_sources_rsync.macports.org_macports_release_tarballs_ports_net_bmon/bmon/work/.CC_PRINT_OPTIONS'
345:debug:build CPATH='/opt/local/include'
346:debug:build DEVELOPER_DIR='/Applications/Xcode.app/Contents/Developer'
347:debug:build LIBRARY_PATH='/opt/local/lib'
348:debug:build MACOSX_DEPLOYMENT_TARGET='11.3'
349:debug:build SDKROOT='/Applications/Xcode.app/Contents/Developer/Platforms/MacOSX.platform/Developer/SDKs/MacOSX11.3.sdk'
350:info:build Executing:  cd "/opt/local/var/macports/build/_opt_local_var_macports_sources_rsync.macports.org_macports_release_tarballs_ports_net_bmon/bmon/work/bmon-4.0" && /usr/bin/make -j20 -w all
351:debug:build system:  cd "/opt/local/var/macports/build/_opt_local_var_macports_sources_rsync.macports.org_macports_release_tarballs_ports_net_bmon/bmon/work/bmon-4.0" && /usr/bin/make -j20 -w all
352:info:build make: Entering directory `/opt/local/var/macports/build/_opt_local_var_macports_sources_rsync.macports.org_macports_release_tarballs_ports_net_bmon/bmon/work/bmon-4.0'
353:info:build Making all in src
354:info:build make[1]: Entering directory `/opt/local/var/macports/build/_opt_local_var_macports_sources_rsync.macports.org_macports_release_tarballs_ports_net_bmon/bmon/work/bmon-4.0/src'
355:info:build /usr/bin/clang -DHAVE_CONFIG_H -I. -I../include/bmon   -I/opt/local/include -isysroot/Applications/Xcode.app/Contents/Developer/Platforms/MacOSX.platform/Developer/SDKs/MacOSX11.3.sdk -I../include -I../include -DSYSCONFDIR=\"/opt/local/etc\" -D_GNU_SOURCE -Wall     -pipe -Os -isysroot/Applications/Xcode.app/Contents/Developer/Platforms/MacOSX.platform/Developer/SDKs/MacOSX11.3.sdk -arch x86_64 -MT bmon-utils.o -MD -MP -MF .deps/bmon-utils.Tpo -c -o bmon-utils.o `test -f 'utils.c' || echo './'`utils.c
356:info:build /usr/bin/clang -DHAVE_CONFIG_H -I. -I../include/bmon   -I/opt/local/include -isysroot/Applications/Xcode.app/Contents/Developer/Platforms/MacOSX.platform/Developer/SDKs/MacOSX11.3.sdk -I../include -I../include -DSYSCONFDIR=\"/opt/local/etc\" -D_GNU_SOURCE -Wall     -pipe -Os -isysroot/Applications/Xcode.app/Contents/Developer/Platforms/MacOSX.platform/Developer/SDKs/MacOSX11.3.sdk -arch x86_64 -MT bmon-unit.o -MD -MP -MF .deps/bmon-unit.Tpo -c -o bmon-unit.o `test -f 'unit.c' || echo './'`unit.c
357:info:build /usr/bin/clang -DHAVE_CONFIG_H -I. -I../include/bmon   -I/opt/local/include -isysroot/Applications/Xcode.app/Contents/Developer/Platforms/MacOSX.platform/Developer/SDKs/MacOSX11.3.sdk -I../include -I../include -DSYSCONFDIR=\"/opt/local/etc\" -D_GNU_SOURCE -Wall     -pipe -Os -isysroot/Applications/Xcode.app/Contents/Developer/Platforms/MacOSX.platform/Developer/SDKs/MacOSX11.3.sdk -arch x86_64 -MT bmon-conf.o -MD -MP -MF .deps/bmon-conf.Tpo -c -o bmon-conf.o `test -f 'conf.c' || echo './'`conf.c
358:info:build /usr/bin/clang -DHAVE_CONFIG_H -I. -I../include/bmon   -I/opt/local/include -isysroot/Applications/Xcode.app/Contents/Developer/Platforms/MacOSX.platform/Developer/SDKs/MacOSX11.3.sdk -I../include -I../include -DSYSCONFDIR=\"/opt/local/etc\" -D_GNU_SOURCE -Wall     -pipe -Os -isysroot/Applications/Xcode.app/Contents/Developer/Platforms/MacOSX.platform/Developer/SDKs/MacOSX11.3.sdk -arch x86_64 -MT bmon-input.o -MD -MP -MF .deps/bmon-input.Tpo -c -o bmon-input.o `test -f 'input.c' || echo './'`input.c
359:info:build /usr/bin/clang -DHAVE_CONFIG_H -I. -I../include/bmon   -I/opt/local/include -isysroot/Applications/Xcode.app/Contents/Developer/Platforms/MacOSX.platform/Developer/SDKs/MacOSX11.3.sdk -I../include -I../include -DSYSCONFDIR=\"/opt/local/etc\" -D_GNU_SOURCE -Wall     -pipe -Os -isysroot/Applications/Xcode.app/Contents/Developer/Platforms/MacOSX.platform/Developer/SDKs/MacOSX11.3.sdk -arch x86_64 -MT bmon-output.o -MD -MP -MF .deps/bmon-output.Tpo -c -o bmon-output.o `test -f 'output.c' || echo './'`output.c
360:info:build /usr/bin/clang -DHAVE_CONFIG_H -I. -I../include/bmon   -I/opt/local/include -isysroot/Applications/Xcode.app/Contents/Developer/Platforms/MacOSX.platform/Developer/SDKs/MacOSX11.3.sdk -I../include -I../include -DSYSCONFDIR=\"/opt/local/etc\" -D_GNU_SOURCE -Wall     -pipe -Os -isysroot/Applications/Xcode.app/Contents/Developer/Platforms/MacOSX.platform/Developer/SDKs/MacOSX11.3.sdk -arch x86_64 -MT bmon-group.o -MD -MP -MF .deps/bmon-group.Tpo -c -o bmon-group.o `test -f 'group.c' || echo './'`group.c
361:info:build /usr/bin/clang -DHAVE_CONFIG_H -I. -I../include/bmon   -I/opt/local/include -isysroot/Applications/Xcode.app/Contents/Developer/Platforms/MacOSX.platform/Developer/SDKs/MacOSX11.3.sdk -I../include -I../include -DSYSCONFDIR=\"/opt/local/etc\" -D_GNU_SOURCE -Wall     -pipe -Os -isysroot/Applications/Xcode.app/Contents/Developer/Platforms/MacOSX.platform/Developer/SDKs/MacOSX11.3.sdk -arch x86_64 -MT bmon-element.o -MD -MP -MF .deps/bmon-element.Tpo -c -o bmon-element.o `test -f 'element.c' || echo './'`element.c
362:info:build /usr/bin/clang -DHAVE_CONFIG_H -I. -I../include/bmon   -I/opt/local/include -isysroot/Applications/Xcode.app/Contents/Developer/Platforms/MacOSX.platform/Developer/SDKs/MacOSX11.3.sdk -I../include -I../include -DSYSCONFDIR=\"/opt/local/etc\" -D_GNU_SOURCE -Wall     -pipe -Os -isysroot/Applications/Xcode.app/Contents/Developer/Platforms/MacOSX.platform/Developer/SDKs/MacOSX11.3.sdk -arch x86_64 -MT bmon-attr.o -MD -MP -MF .deps/bmon-attr.Tpo -c -o bmon-attr.o `test -f 'attr.c' || echo './'`attr.c
363:info:build /usr/bin/clang -DHAVE_CONFIG_H -I. -I../include/bmon   -I/opt/local/include -isysroot/Applications/Xcode.app/Contents/Developer/Platforms/MacOSX.platform/Developer/SDKs/MacOSX11.3.sdk -I../include -I../include -DSYSCONFDIR=\"/opt/local/etc\" -D_GNU_SOURCE -Wall     -pipe -Os -isysroot/Applications/Xcode.app/Contents/Developer/Platforms/MacOSX.platform/Developer/SDKs/MacOSX11.3.sdk -arch x86_64 -MT bmon-element_cfg.o -MD -MP -MF .deps/bmon-element_cfg.Tpo -c -o bmon-element_cfg.o `test -f 'element_cfg.c' || echo './'`element_cfg.c
364:info:build /usr/bin/clang -DHAVE_CONFIG_H -I. -I../include/bmon   -I/opt/local/include -isysroot/Applications/Xcode.app/Contents/Developer/Platforms/MacOSX.platform/Developer/SDKs/MacOSX11.3.sdk -I../include -I../include -DSYSCONFDIR=\"/opt/local/etc\" -D_GNU_SOURCE -Wall     -pipe -Os -isysroot/Applications/Xcode.app/Contents/Developer/Platforms/MacOSX.platform/Developer/SDKs/MacOSX11.3.sdk -arch x86_64 -MT bmon-history.o -MD -MP -MF .deps/bmon-history.Tpo -c -o bmon-history.o `test -f 'history.c' || echo './'`history.c
365:info:build /usr/bin/clang -DHAVE_CONFIG_H -I. -I../include/bmon   -I/opt/local/include -isysroot/Applications/Xcode.app/Contents/Developer/Platforms/MacOSX.platform/Developer/SDKs/MacOSX11.3.sdk -I../include -I../include -DSYSCONFDIR=\"/opt/local/etc\" -D_GNU_SOURCE -Wall     -pipe -Os -isysroot/Applications/Xcode.app/Contents/Developer/Platforms/MacOSX.platform/Developer/SDKs/MacOSX11.3.sdk -arch x86_64 -MT bmon-graph.o -MD -MP -MF .deps/bmon-graph.Tpo -c -o bmon-graph.o `test -f 'graph.c' || echo './'`graph.c
366:info:build /usr/bin/clang -DHAVE_CONFIG_H -I. -I../include/bmon   -I/opt/local/include -isysroot/Applications/Xcode.app/Contents/Developer/Platforms/MacOSX.platform/Developer/SDKs/MacOSX11.3.sdk -I../include -I../include -DSYSCONFDIR=\"/opt/local/etc\" -D_GNU_SOURCE -Wall     -pipe -Os -isysroot/Applications/Xcode.app/Contents/Developer/Platforms/MacOSX.platform/Developer/SDKs/MacOSX11.3.sdk -arch x86_64 -MT bmon-bmon.o -MD -MP -MF .deps/bmon-bmon.Tpo -c -o bmon-bmon.o `test -f 'bmon.c' || echo './'`bmon.c
367:info:build /usr/bin/clang -DHAVE_CONFIG_H -I. -I../include/bmon   -I/opt/local/include -isysroot/Applications/Xcode.app/Contents/Developer/Platforms/MacOSX.platform/Developer/SDKs/MacOSX11.3.sdk -I../include -I../include -DSYSCONFDIR=\"/opt/local/etc\" -D_GNU_SOURCE -Wall     -pipe -Os -isysroot/Applications/Xcode.app/Contents/Developer/Platforms/MacOSX.platform/Developer/SDKs/MacOSX11.3.sdk -arch x86_64 -MT bmon-module.o -MD -MP -MF .deps/bmon-module.Tpo -c -o bmon-module.o `test -f 'module.c' || echo './'`module.c
368:info:build /usr/bin/clang -DHAVE_CONFIG_H -I. -I../include/bmon   -I/opt/local/include -isysroot/Applications/Xcode.app/Contents/Developer/Platforms/MacOSX.platform/Developer/SDKs/MacOSX11.3.sdk -I../include -I../include -DSYSCONFDIR=\"/opt/local/etc\" -D_GNU_SOURCE -Wall     -pipe -Os -isysroot/Applications/Xcode.app/Contents/Developer/Platforms/MacOSX.platform/Developer/SDKs/MacOSX11.3.sdk -arch x86_64 -MT bmon-in_netlink.o -MD -MP -MF .deps/bmon-in_netlink.Tpo -c -o bmon-in_netlink.o `test -f 'in_netlink.c' || echo './'`in_netlink.c
369:info:build /usr/bin/clang -DHAVE_CONFIG_H -I. -I../include/bmon   -I/opt/local/include -isysroot/Applications/Xcode.app/Contents/Developer/Platforms/MacOSX.platform/Developer/SDKs/MacOSX11.3.sdk -I../include -I../include -DSYSCONFDIR=\"/opt/local/etc\" -D_GNU_SOURCE -Wall     -pipe -Os -isysroot/Applications/Xcode.app/Contents/Developer/Platforms/MacOSX.platform/Developer/SDKs/MacOSX11.3.sdk -arch x86_64 -MT bmon-in_null.o -MD -MP -MF .deps/bmon-in_null.Tpo -c -o bmon-in_null.o `test -f 'in_null.c' || echo './'`in_null.c
370:info:build /usr/bin/clang -DHAVE_CONFIG_H -I. -I../include/bmon   -I/opt/local/include -isysroot/Applications/Xcode.app/Contents/Developer/Platforms/MacOSX.platform/Developer/SDKs/MacOSX11.3.sdk -I../include -I../include -DSYSCONFDIR=\"/opt/local/etc\" -D_GNU_SOURCE -Wall     -pipe -Os -isysroot/Applications/Xcode.app/Contents/Developer/Platforms/MacOSX.platform/Developer/SDKs/MacOSX11.3.sdk -arch x86_64 -MT bmon-in_dummy.o -MD -MP -MF .deps/bmon-in_dummy.Tpo -c -o bmon-in_dummy.o `test -f 'in_dummy.c' || echo './'`in_dummy.c
371:info:build /usr/bin/clang -DHAVE_CONFIG_H -I. -I../include/bmon   -I/opt/local/include -isysroot/Applications/Xcode.app/Contents/Developer/Platforms/MacOSX.platform/Developer/SDKs/MacOSX11.3.sdk -I../include -I../include -DSYSCONFDIR=\"/opt/local/etc\" -D_GNU_SOURCE -Wall     -pipe -Os -isysroot/Applications/Xcode.app/Contents/Developer/Platforms/MacOSX.platform/Developer/SDKs/MacOSX11.3.sdk -arch x86_64 -MT bmon-in_proc.o -MD -MP -MF .deps/bmon-in_proc.Tpo -c -o bmon-in_proc.o `test -f 'in_proc.c' || echo './'`in_proc.c
372:info:build /usr/bin/clang -DHAVE_CONFIG_H -I. -I../include/bmon   -I/opt/local/include -isysroot/Applications/Xcode.app/Contents/Developer/Platforms/MacOSX.platform/Developer/SDKs/MacOSX11.3.sdk -I../include -I../include -DSYSCONFDIR=\"/opt/local/etc\" -D_GNU_SOURCE -Wall     -pipe -Os -isysroot/Applications/Xcode.app/Contents/Developer/Platforms/MacOSX.platform/Developer/SDKs/MacOSX11.3.sdk -arch x86_64 -MT bmon-in_sysctl.o -MD -MP -MF .deps/bmon-in_sysctl.Tpo -c -o bmon-in_sysctl.o `test -f 'in_sysctl.c' || echo './'`in_sysctl.c
373:info:build /usr/bin/clang -DHAVE_CONFIG_H -I. -I../include/bmon   -I/opt/local/include -isysroot/Applications/Xcode.app/Contents/Developer/Platforms/MacOSX.platform/Developer/SDKs/MacOSX11.3.sdk -I../include -I../include -DSYSCONFDIR=\"/opt/local/etc\" -D_GNU_SOURCE -Wall     -pipe -Os -isysroot/Applications/Xcode.app/Contents/Developer/Platforms/MacOSX.platform/Developer/SDKs/MacOSX11.3.sdk -arch x86_64 -MT bmon-out_null.o -MD -MP -MF .deps/bmon-out_null.Tpo -c -o bmon-out_null.o `test -f 'out_null.c' || echo './'`out_null.c
374:info:build /usr/bin/clang -DHAVE_CONFIG_H -I. -I../include/bmon   -I/opt/local/include -isysroot/Applications/Xcode.app/Contents/Developer/Platforms/MacOSX.platform/Developer/SDKs/MacOSX11.3.sdk -I../include -I../include -DSYSCONFDIR=\"/opt/local/etc\" -D_GNU_SOURCE -Wall     -pipe -Os -isysroot/Applications/Xcode.app/Contents/Developer/Platforms/MacOSX.platform/Developer/SDKs/MacOSX11.3.sdk -arch x86_64 -MT bmon-out_format.o -MD -MP -MF .deps/bmon-out_format.Tpo -c -o bmon-out_format.o `test -f 'out_format.c' || echo './'`out_format.c
375:info:build mv -f .deps/bmon-in_netlink.Tpo .deps/bmon-in_netlink.Po
376:info:build /usr/bin/clang -DHAVE_CONFIG_H -I. -I../include/bmon   -I/opt/local/include -isysroot/Applications/Xcode.app/Contents/Developer/Platforms/MacOSX.platform/Developer/SDKs/MacOSX11.3.sdk -I../include -I../include -DSYSCONFDIR=\"/opt/local/etc\" -D_GNU_SOURCE -Wall     -pipe -Os -isysroot/Applications/Xcode.app/Contents/Developer/Platforms/MacOSX.platform/Developer/SDKs/MacOSX11.3.sdk -arch x86_64 -MT bmon-out_ascii.o -MD -MP -MF .deps/bmon-out_ascii.Tpo -c -o bmon-out_ascii.o `test -f 'out_ascii.c' || echo './'`out_ascii.c
377:info:build mv -f .deps/bmon-in_null.Tpo .deps/bmon-in_null.Po
378:info:build /usr/bin/clang -DHAVE_CONFIG_H -I. -I../include/bmon   -I/opt/local/include -isysroot/Applications/Xcode.app/Contents/Developer/Platforms/MacOSX.platform/Developer/SDKs/MacOSX11.3.sdk -I../include -I../include -DSYSCONFDIR=\"/opt/local/etc\" -D_GNU_SOURCE -Wall     -pipe -Os -isysroot/Applications/Xcode.app/Contents/Developer/Platforms/MacOSX.platform/Developer/SDKs/MacOSX11.3.sdk -arch x86_64 -MT bmon-out_curses.o -MD -MP -MF .deps/bmon-out_curses.Tpo -c -o bmon-out_curses.o `test -f 'out_curses.c' || echo './'`out_curses.c
379:info:build mv -f .deps/bmon-input.Tpo .deps/bmon-input.Po
380:info:build mv -f .deps/bmon-out_null.Tpo .deps/bmon-out_null.Po
381:info:build mv -f .deps/bmon-output.Tpo .deps/bmon-output.Po
382:info:build In file included from utils.c:31:
383:info:build In file included from /Applications/Xcode.app/Contents/Developer/Platforms/MacOSX.platform/Developer/SDKs/MacOSX11.3.sdk/usr/include/mach/clock.h:13:
384:info:build /Applications/Xcode.app/Contents/Developer/Platforms/MacOSX.platform/Developer/SDKs/MacOSX11.3.sdk/usr/include/mach/mig_errors.h:113:34: error: use of undeclared identifier 'unused'
385:info:build __NDR_convert__mig_reply_error_t(__unused mig_reply_error_t *x)
386:info:build                                  ^
387:info:build /Applications/Xcode.app/Contents/Developer/Platforms/MacOSX.platform/Developer/SDKs/MacOSX11.3.sdk/usr/include/sys/cdefs.h:161:40: note: expanded from macro '__unused'
388:info:build #define __unused        __attribute__((__unused__))
389:info:build                                        ^
390:info:build ../include/bmon/bmon.h:63:36: note: expanded from macro '__unused__'
391:info:build #define __unused__ __attribute__ ((unused))
392:info:build                                    ^
393:info:build mv -f .deps/bmon-element_cfg.Tpo .deps/bmon-element_cfg.Po
394:info:build mv -f .deps/bmon-in_proc.Tpo .deps/bmon-in_proc.Po
395:info:build mv -f .deps/bmon-bmon.Tpo .deps/bmon-bmon.Po
396:info:build 1 error generated.
397:info:build mv -f .deps/bmon-unit.Tpo .deps/bmon-unit.Po
398:info:build mv -f .deps/bmon-in_dummy.Tpo .deps/bmon-in_dummy.Po
399:info:build make[1]: *** [bmon-utils.o] Error 1
400:info:build make[1]: *** Waiting for unfinished jobs....
401:info:build mv -f .deps/bmon-in_sysctl.Tpo .deps/bmon-in_sysctl.Po
402:info:build mv -f .deps/bmon-graph.Tpo .deps/bmon-graph.Po
403:info:build mv -f .deps/bmon-module.Tpo .deps/bmon-module.Po
404:info:build mv -f .deps/bmon-history.Tpo .deps/bmon-history.Po
405:info:build mv -f .deps/bmon-group.Tpo .deps/bmon-group.Po
406:info:build mv -f .deps/bmon-out_format.Tpo .deps/bmon-out_format.Po
407:info:build mv -f .deps/bmon-attr.Tpo .deps/bmon-attr.Po
408:info:build mv -f .deps/bmon-element.Tpo .deps/bmon-element.Po
409:info:build mv -f .deps/bmon-conf.Tpo .deps/bmon-conf.Po
410:info:build mv -f .deps/bmon-out_ascii.Tpo .deps/bmon-out_ascii.Po
411:info:build mv -f .deps/bmon-out_curses.Tpo .deps/bmon-out_curses.Po
412:info:build make[1]: Leaving directory `/opt/local/var/macports/build/_opt_local_var_macports_sources_rsync.macports.org_macports_release_tarballs_ports_net_bmon/bmon/work/bmon-4.0/src'
413:info:build make: *** [all-recursive] Error 1
414:info:build make: Leaving directory `/opt/local/var/macports/build/_opt_local_var_macports_sources_rsync.macports.org_macports_release_tarballs_ports_net_bmon/bmon/work/bmon-4.0'
415:info:build Command failed:  cd "/opt/local/var/macports/build/_opt_local_var_macports_sources_rsync.macports.org_macports_release_tarballs_ports_net_bmon/bmon/work/bmon-4.0" && /usr/bin/make -j20 -w all
416:info:build Exit code: 2
417:error:build Failed to build bmon: command execution failed
418:debug:build Error code: CHILDSTATUS 14376 2
419:debug:build Backtrace: command execution failed
420:debug:build     while executing
421:debug:build "system {*}$notty {*}$nice $fullcmdstring"
422:debug:build     invoked from within
423:debug:build "command_exec build"
424:debug:build     (procedure "portbuild::build_main" line 8)
425:debug:build     invoked from within
426:debug:build "$procedure $targetname"
427:error:build See /opt/local/var/macports/logs/_opt_local_var_macports_sources_rsync.macports.org_macports_release_tarballs_ports_net_bmon/bmon/main.log for details.