Ticket #63645: libqalculate_main.log

File libqalculate_main.log, 31.4 KB (added by cooljeanius (Eric Gallager), 15 months ago)

main.log for libqalculate

Line 
1version:1
2:debug:main Starting logging for libqalculate @3.21.0_0
3:debug:sysinfo macOS 11.6.1 (darwin/20.6.0) arch i386
4:debug:sysinfo MacPorts 2.7.1
5:debug:sysinfo Xcode 13.1
6:debug:sysinfo SDK 11
7:debug:sysinfo MACOSX_DEPLOYMENT_TARGET: 11.0
8:msg:main --->  Computing dependencies for libqalculate:debug:main libqalculate has no conflicts
9:debug:main Searching for dependency: intltool
10:debug:main Found Dependency: receipt exists for intltool
11:debug:main Searching for dependency: autoconf
12:debug:main Found Dependency: receipt exists for autoconf
13:debug:main Searching for dependency: automake
14:debug:main Found Dependency: receipt exists for automake
15:debug:main Searching for dependency: libtool
16:debug:main Found Dependency: receipt exists for libtool
17:debug:main Searching for dependency: pkgconfig
18:debug:main Found Dependency: receipt exists for pkgconfig
19:debug:main Searching for dependency: doxygen
20:debug:main Found Dependency: receipt exists for doxygen
21:debug:main Searching for dependency: gmp
22:debug:main Found Dependency: receipt exists for gmp
23:debug:main Searching for dependency: mpfr
24:debug:main Found Dependency: receipt exists for mpfr
25:debug:main Searching for dependency: libxml2
26:debug:main Found Dependency: receipt exists for libxml2
27:debug:main Searching for dependency: curl
28:debug:main Found Dependency: receipt exists for curl
29:debug:main Searching for dependency: icu
30:debug:main Found Dependency: receipt exists for icu
31:debug:main Searching for dependency: gettext
32:debug:main Found Dependency: receipt exists for gettext
33:debug:main Searching for dependency: readline
34:debug:main Found Dependency: receipt exists for readline
35:debug:main Searching for dependency: libiconv
36:debug:main Found Dependency: receipt exists for libiconv
37:debug:main Executing org.macports.main (libqalculate)
38:debug:main dropping privileges: euid changed to 502, egid changed to 20.
39:debug:archivefetch archivefetch phase started at Sat Nov 13 10:25:15 EST 2021
40:msg:archivefetch --->  Fetching archive for libqalculate
41:debug:archivefetch Executing org.macports.archivefetch (libqalculate)
42:debug:archivefetch euid/egid changed to: 0/0
43:debug:archivefetch chowned /opt/local/var/macports/incoming to macports
44:debug:archivefetch euid/egid changed to: 502/20
45:info:archivefetch --->  libqalculate-3.21.0_0.darwin_20.x86_64.tbz2 doesn't seem to exist in /opt/local/var/macports/incoming/verified
46:msg:archivefetch --->  Attempting to fetch libqalculate-3.21.0_0.darwin_20.x86_64.tbz2 from https://packages.macports.org/libqalculate
47:debug:archivefetch Fetching archive failed: The requested URL returned error: 404
48:msg:archivefetch --->  Attempting to fetch libqalculate-3.21.0_0.darwin_20.x86_64.tbz2 from https://ywg.ca.packages.macports.org/mirror/macports/packages/libqalculate
49:debug:archivefetch Fetching archive failed: The requested URL returned error: 404 Not Found
50:msg:archivefetch --->  Attempting to fetch libqalculate-3.21.0_0.darwin_20.x86_64.tbz2 from https://mse.uk.packages.macports.org/libqalculate
51:debug:archivefetch Fetching archive failed: The requested URL returned error: 404 Not Found
52:debug:archivefetch Privilege de-escalation not attempted as not running as root.
53:debug:fetch fetch phase started at Sat Nov 13 10:25:18 EST 2021
54:notice:fetch --->  Fetching distfiles for libqalculate
55:debug:fetch Executing org.macports.fetch (libqalculate)
56:debug:fetch Privilege de-escalation not attempted as not running as root.
57:debug:checksum checksum phase started at Sat Nov 13 10:25:18 EST 2021
58:notice:checksum --->  Verifying checksums for libqalculate
59:debug:checksum Executing org.macports.checksum (libqalculate)
60:info:checksum --->  Checksumming libqalculate-3.21.0.tar.gz
61:debug:checksum Calculated (rmd160) is 7475d538b45af06cf8a1aaecb6b2c7018aa2a0fc
62:debug:checksum Correct (rmd160) checksum for libqalculate-3.21.0.tar.gz
63:debug:checksum Calculated (sha256) is b668c8e15326ab1e8264fbbe41a9781f5bbe1575aead5ffefccf6b5bfe42729b
64:debug:checksum Correct (sha256) checksum for libqalculate-3.21.0.tar.gz
65:debug:checksum Calculated (size) is 1641377
66:debug:checksum Correct (size) checksum for libqalculate-3.21.0.tar.gz
67:debug:checksum Privilege de-escalation not attempted as not running as root.
68:debug:extract extract phase started at Sat Nov 13 10:25:18 EST 2021
69:notice:extract --->  Extracting libqalculate
70:debug:extract Executing org.macports.extract (libqalculate)
71:info:extract --->  Extracting libqalculate-3.21.0.tar.gz
72:debug:extract setting option extract.args to '/opt/local/var/macports/distfiles/libqalculate/libqalculate-3.21.0.tar.gz'
73:debug:extract Environment:
74:debug:extract CC_PRINT_OPTIONS='YES'
75:debug:extract CC_PRINT_OPTIONS_FILE='/opt/local/var/macports/build/_opt_local_var_macports_sources_rsync.macports.org_macports_release_tarballs_ports_math_libqalculate/libqalculate/work/.CC_PRINT_OPTIONS'
76:debug:extract CPATH='/opt/local/include'
77:debug:extract DEVELOPER_DIR='/Library/Developer/CommandLineTools'
78:debug:extract LIBRARY_PATH='/opt/local/lib'
79:debug:extract MACOSX_DEPLOYMENT_TARGET='11.0'
80:debug:extract MACPORTS_LEGACY_SUPPORT_DISABLED='1'
81:debug:extract SDKROOT='/Library/Developer/CommandLineTools/SDKs/MacOSX11.sdk'
82:info:extract Executing:  cd "/opt/local/var/macports/build/_opt_local_var_macports_sources_rsync.macports.org_macports_release_tarballs_ports_math_libqalculate/libqalculate/work" && /usr/bin/gzip -dc '/opt/local/var/macports/distfiles/libqalculate/libqalculate-3.21.0.tar.gz' | /usr/bin/tar -xf -
83:debug:extract system:  cd "/opt/local/var/macports/build/_opt_local_var_macports_sources_rsync.macports.org_macports_release_tarballs_ports_math_libqalculate/libqalculate/work" && /usr/bin/gzip -dc '/opt/local/var/macports/distfiles/libqalculate/libqalculate-3.21.0.tar.gz' | /usr/bin/tar -xf -
84:debug:extract euid/egid changed to: 0/0
85:debug:extract chowned /opt/local/var/macports/build/_opt_local_var_macports_sources_rsync.macports.org_macports_release_tarballs_ports_math_libqalculate/libqalculate/work to macports
86:debug:extract euid/egid changed to: 502/20
87:debug:extract Executing proc-post-org.macports.extract-extract-0
88:debug:extract Privilege de-escalation not attempted as not running as root.
89:debug:patch patch phase started at Sat Nov 13 10:25:18 EST 2021
90:debug:patch Executing org.macports.patch (libqalculate)
91:info:patch --->  Patching autogen.sh: s|libtoolize|glibtoolize|g
92:debug:patch Executing reinplace: /usr/bin/sed s|libtoolize|glibtoolize|g </opt/local/var/macports/build/_opt_local_var_macports_sources_rsync.macports.org_macports_release_tarballs_ports_math_libqalculate/libqalculate/work/libqalculate-3.21.0/autogen.sh >@file15
93:debug:patch euid/egid changed to: 0/0
94:debug:patch chowned /opt/local/var/macports/build/_opt_local_var_macports_sources_rsync.macports.org_macports_release_tarballs_ports_math_libqalculate/libqalculate/work/libqalculate-3.21.0/autogen.sh to macports
95:debug:patch euid/egid changed to: 502/20
96:debug:patch euid/egid changed to: 0/0
97:debug:patch setting attributes on /opt/local/var/macports/build/_opt_local_var_macports_sources_rsync.macports.org_macports_release_tarballs_ports_math_libqalculate/libqalculate/work/libqalculate-3.21.0/autogen.sh
98:debug:patch euid/egid changed to: 502/20
99:debug:patch Privilege de-escalation not attempted as not running as root.
100:debug:configure configure phase started at Sat Nov 13 10:25:18 EST 2021
101:notice:configure --->  Configuring libqalculate
102:debug:configure Preferred compilers: clang macports-clang-9.0 macports-clang-13 macports-clang-12 macports-clang-11 macports-clang-10
103:debug:configure Using compiler 'Xcode Clang'
104:debug:configure Executing org.macports.configure (libqalculate)
105:debug:configure Environment:
106:debug:configure CC_PRINT_OPTIONS='YES'
107:debug:configure CC_PRINT_OPTIONS_FILE='/opt/local/var/macports/build/_opt_local_var_macports_sources_rsync.macports.org_macports_release_tarballs_ports_math_libqalculate/libqalculate/work/.CC_PRINT_OPTIONS'
108:debug:configure CPATH='/opt/local/include'
109:debug:configure DEVELOPER_DIR='/Library/Developer/CommandLineTools'
110:debug:configure LIBRARY_PATH='/opt/local/lib'
111:debug:configure MACOSX_DEPLOYMENT_TARGET='11.0'
112:debug:configure NOCONFIGURE='1'
113:debug:configure SDKROOT='/Library/Developer/CommandLineTools/SDKs/MacOSX11.sdk'
114:info:configure Executing:  cd "/opt/local/var/macports/build/_opt_local_var_macports_sources_rsync.macports.org_macports_release_tarballs_ports_math_libqalculate/libqalculate/work/libqalculate-3.21.0" && ./autogen.sh --install --verbose
115:debug:configure system:  cd "/opt/local/var/macports/build/_opt_local_var_macports_sources_rsync.macports.org_macports_release_tarballs_ports_math_libqalculate/libqalculate/work/libqalculate-3.21.0" && ./autogen.sh --install --verbose
116:info:configure processing .
117:info:configure Running intltoolize...
118:info:configure Running glibtoolize...
119:info:configure glibtoolize: putting auxiliary files in '.'.
120:info:configure glibtoolize: copying file './ltmain.sh'
121:info:configure glibtoolize: putting macros in AC_CONFIG_MACRO_DIRS, 'm4'.
122:info:configure glibtoolize: copying file 'm4/libtool.m4'
123:info:configure glibtoolize: copying file 'm4/ltoptions.m4'
124:info:configure glibtoolize: copying file 'm4/ltsugar.m4'
125:info:configure glibtoolize: copying file 'm4/ltversion.m4'
126:info:configure glibtoolize: copying file 'm4/lt~obsolete.m4'
127:info:configure Running aclocal  ...
128:info:configure Running autoheader...
129:info:configure Running automake --gnu  ...
130:info:configure configure.ac:36: installing './compile'
131:info:configure configure.ac:38: installing './config.guess'
132:info:configure configure.ac:38: installing './config.sub'
133:info:configure configure.ac:11: installing './install-sh'
134:info:configure configure.ac:11: installing './missing'
135:info:configure libqalculate/Makefile.am: installing './depcomp'
136:info:configure Running autoconf ...
137:info:configure Skipping configure process.
138:debug:configure Environment:
139:debug:configure CC='/usr/bin/clang'
140:debug:configure CC_PRINT_OPTIONS='YES'
141:debug:configure CC_PRINT_OPTIONS_FILE='/opt/local/var/macports/build/_opt_local_var_macports_sources_rsync.macports.org_macports_release_tarballs_ports_math_libqalculate/libqalculate/work/.CC_PRINT_OPTIONS'
142:debug:configure CFLAGS='-pipe -Os -isysroot/Library/Developer/CommandLineTools/SDKs/MacOSX11.sdk -arch x86_64'
143:debug:configure CPATH='/opt/local/include'
144:debug:configure CPPFLAGS='-I/opt/local/include -isysroot/Library/Developer/CommandLineTools/SDKs/MacOSX11.sdk'
145:debug:configure CXX='/usr/bin/clang++'
146:debug:configure CXXFLAGS='-pipe -Os -std=c++11 -stdlib=libc++ -isysroot/Library/Developer/CommandLineTools/SDKs/MacOSX11.sdk -arch x86_64'
147:debug:configure DEVELOPER_DIR='/Library/Developer/CommandLineTools'
148:debug:configure F90FLAGS='-pipe -Os -m64'
149:debug:configure FCFLAGS='-pipe -Os -m64'
150:debug:configure FFLAGS='-pipe -Os -m64'
151:debug:configure INSTALL='/usr/bin/install -c'
152:debug:configure LDFLAGS='-L/opt/local/lib -Wl,-headerpad_max_install_names -Wl,-syslibroot,/Library/Developer/CommandLineTools/SDKs/MacOSX11.sdk -arch x86_64'
153:debug:configure LIBRARY_PATH='/opt/local/lib'
154:debug:configure MACOSX_DEPLOYMENT_TARGET='11.0'
155:debug:configure MACPORTS_LEGACY_SUPPORT_DISABLED='1'
156:debug:configure OBJC='/usr/bin/clang'
157:debug:configure OBJCFLAGS='-pipe -Os -isysroot/Library/Developer/CommandLineTools/SDKs/MacOSX11.sdk -arch x86_64'
158:debug:configure OBJCXX='/usr/bin/clang++'
159:debug:configure OBJCXXFLAGS='-pipe -Os -std=c++11 -stdlib=libc++ -isysroot/Library/Developer/CommandLineTools/SDKs/MacOSX11.sdk -arch x86_64'
160:debug:configure SDKROOT='/Library/Developer/CommandLineTools/SDKs/MacOSX11.sdk'
161:info:configure Executing:  cd "/opt/local/var/macports/build/_opt_local_var_macports_sources_rsync.macports.org_macports_release_tarballs_ports_math_libqalculate/libqalculate/work/libqalculate-3.21.0" && ./configure --prefix=/opt/local
162:debug:configure system:  cd "/opt/local/var/macports/build/_opt_local_var_macports_sources_rsync.macports.org_macports_release_tarballs_ports_math_libqalculate/libqalculate/work/libqalculate-3.21.0" && ./configure --prefix=/opt/local
163:info:configure checking for a BSD-compatible install... /usr/bin/install -c
164:info:configure checking whether build environment is sane... yes
165:info:configure checking for a race-free mkdir -p... /opt/local/bin/gmkdir -p
166:info:configure checking for gawk... gawk
167:info:configure checking whether make sets $(MAKE)... yes
168:info:configure checking whether make supports nested variables... yes
169:info:configure checking whether to enable maintainer-specific portions of Makefiles... no
170:info:configure checking for gcc... /usr/bin/clang
171:info:configure checking whether the C compiler works... yes
172:info:configure checking for C compiler default output file name... a.out
173:info:configure checking for suffix of executables...
174:info:configure checking whether we are cross compiling... no
175:info:configure checking for suffix of object files... o
176:info:configure checking whether the compiler supports GNU C... yes
177:info:configure checking whether /usr/bin/clang accepts -g... yes
178:info:configure checking for /usr/bin/clang option to enable C11 features... none needed
179:info:configure checking whether /usr/bin/clang understands -c and -o together... yes
180:info:configure checking whether make supports the include directive... yes (GNU style)
181:info:configure checking dependency style of /usr/bin/clang... gcc3
182:info:configure checking whether the compiler supports GNU C++... yes
183:info:configure checking whether /usr/bin/clang++ accepts -g... yes
184:info:configure checking for /usr/bin/clang++ option to enable C++11 features... none needed
185:info:configure checking dependency style of /usr/bin/clang++... gcc3
186:info:configure checking how to run the C preprocessor... /usr/bin/clang -E
187:info:configure checking build system type... x86_64-apple-darwin20.6.0
188:info:configure checking host system type... x86_64-apple-darwin20.6.0
189:info:configure checking for gcc... gcc
190:info:configure checking whether the compiler supports GNU C... (cached) yes
191:info:configure checking whether gcc accepts -g... yes
192:info:configure checking for gcc option to enable C11 features... (cached) none needed
193:info:configure checking whether gcc understands -c and -o together... (cached) yes
194:info:configure checking dependency style of gcc... (cached) gcc3
195:info:configure checking how to run the C preprocessor... gcc -E
196:info:configure checking how to run the C++ preprocessor... /usr/bin/clang++ -E
197:info:configure checking for g++... g++
198:info:configure checking whether the compiler supports GNU C++... (cached) yes
199:info:configure checking whether g++ accepts -g... yes
200:info:configure checking for g++ option to enable C++11 features... (cached) none needed
201:info:configure checking dependency style of g++... (cached) gcc3
202:info:configure checking how to run the C++ preprocessor... g++ -E
203:info:configure checking whether ln -s works... yes
204:info:configure checking for grep that handles long lines and -e... /opt/local/bin/ggrep
205:info:configure checking for egrep... /opt/local/bin/ggrep -E
206:info:configure checking whether NLS is requested... yes
207:info:configure checking for intltool-update... /opt/local/bin/intltool-update
208:info:configure checking for intltool-merge... /opt/local/bin/intltool-merge
209:info:configure checking for intltool-extract... /opt/local/bin/intltool-extract
210:info:configure checking for xgettext... /opt/local/bin/xgettext
211:info:configure checking for msgmerge... /opt/local/bin/msgmerge
212:info:configure checking for msgfmt... /opt/local/bin/msgfmt
213:info:configure checking for gmsgfmt... /opt/local/bin/msgfmt
214:info:configure checking how to print strings... printf
215:info:configure checking for a sed that does not truncate output... /opt/local/bin/gsed
216:info:configure checking for fgrep... /opt/local/bin/ggrep -F
217:info:configure checking for ld used by /usr/bin/clang... /Library/Developer/CommandLineTools/usr/bin/ld
218:info:configure checking if the linker (/Library/Developer/CommandLineTools/usr/bin/ld) is GNU ld... no
219:info:configure checking for BSD- or MS-compatible name lister (nm)... /opt/local/bin/nm -B
220:info:configure checking the name lister (/opt/local/bin/nm -B) interface... BSD nm
221:info:configure checking the maximum length of command line arguments... 786432
222:info:configure checking how to convert x86_64-apple-darwin20.6.0 file names to x86_64-apple-darwin20.6.0 format... func_convert_file_noop
223:info:configure checking how to convert x86_64-apple-darwin20.6.0 file names to toolchain format... func_convert_file_noop
224:info:configure checking for /Library/Developer/CommandLineTools/usr/bin/ld option to reload object files... -r
225:info:configure checking for objdump... objdump
226:info:configure checking how to recognize dependent libraries... pass_all
227:info:configure checking for dlltool... no
228:info:configure checking how to associate runtime and link libraries... printf %s\n
229:info:configure checking for ar... ar
230:info:configure checking for archiver @FILE support... no
231:info:configure checking for strip... strip
232:info:configure checking for ranlib... ranlib
233:info:configure checking command to parse /opt/local/bin/nm -B output from /usr/bin/clang object... ok
234:info:configure checking for sysroot... no
235:info:configure checking for a working dd... /bin/dd
236:info:configure checking how to truncate binary pipes... /bin/dd bs=4096 count=1
237:info:configure checking for mt... no
238:info:configure checking if : is a manifest tool... no
239:info:configure checking for dsymutil... dsymutil
240:info:configure checking for nmedit... nmedit
241:info:configure checking for lipo... lipo
242:info:configure checking for otool... otool
243:info:configure checking for otool64... no
244:info:configure checking for -single_module linker flag... yes
245:info:configure checking for -exported_symbols_list linker flag... yes
246:info:configure checking for -force_load linker flag... yes
247:info:configure checking for stdio.h... yes
248:info:configure checking for stdlib.h... yes
249:info:configure checking for string.h... yes
250:info:configure checking for inttypes.h... yes
251:info:configure checking for stdint.h... yes
252:info:configure checking for strings.h... yes
253:info:configure checking for sys/stat.h... yes
254:info:configure checking for sys/types.h... yes
255:info:configure checking for unistd.h... yes
256:info:configure checking for dlfcn.h... yes
257:info:configure checking for objdir... .libs
258:info:configure checking if /usr/bin/clang supports -fno-rtti -fno-exceptions... yes
259:info:configure checking for /usr/bin/clang option to produce PIC... -fno-common -DPIC
260:info:configure checking if /usr/bin/clang PIC flag -fno-common -DPIC works... yes
261:info:configure checking if /usr/bin/clang static flag -static works... no
262:info:configure checking if /usr/bin/clang supports -c -o file.o... yes
263:info:configure checking if /usr/bin/clang supports -c -o file.o... (cached) yes
264:info:configure checking whether the /usr/bin/clang linker (/Library/Developer/CommandLineTools/usr/bin/ld) supports shared libraries... yes
265:info:configure checking dynamic linker characteristics... darwin20.6.0 dyld
266:info:configure checking how to hardcode library paths into programs... immediate
267:info:configure checking whether stripping libraries is possible... yes
268:info:configure checking if libtool supports shared libraries... yes
269:info:configure checking whether to build shared libraries... yes
270:info:configure checking whether to build static libraries... yes
271:info:configure checking how to run the C++ preprocessor... /usr/bin/clang++ -E
272:info:configure checking for ld used by /usr/bin/clang++... /Library/Developer/CommandLineTools/usr/bin/ld
273:info:configure checking if the linker (/Library/Developer/CommandLineTools/usr/bin/ld) is GNU ld... no
274:info:configure checking whether the /usr/bin/clang++ linker (/Library/Developer/CommandLineTools/usr/bin/ld) supports shared libraries... yes
275:info:configure checking for /usr/bin/clang++ option to produce PIC... -fno-common -DPIC
276:info:configure checking if /usr/bin/clang++ PIC flag -fno-common -DPIC works... yes
277:info:configure checking if /usr/bin/clang++ static flag -static works... no
278:info:configure checking if /usr/bin/clang++ supports -c -o file.o... yes
279:info:configure checking if /usr/bin/clang++ supports -c -o file.o... (cached) yes
280:info:configure checking whether the /usr/bin/clang++ linker (/Library/Developer/CommandLineTools/usr/bin/ld) supports shared libraries... yes
281:info:configure checking dynamic linker characteristics... darwin20.6.0 dyld
282:info:configure checking how to hardcode library paths into programs... immediate
283:info:configure checking for pthread_create in -lpthread... yes
284:info:configure checking for mpfr.h... yes
285:info:configure checking for unordered_map... yes
286:info:configure checking for pipe2... no
287:info:configure checking for pkg-config... /opt/local/bin/pkg-config
288:info:configure checking pkg-config is at least version 0.9.0... yes
289:info:configure checking for libcurl... yes
290:info:configure checking for icu-uc... yes
291:info:configure checking for libxml-2.0 >= 2.3.8... yes
292:info:configure checking for ld used by /usr/bin/clang... /Library/Developer/CommandLineTools/usr/bin/ld
293:info:configure checking if the linker (/Library/Developer/CommandLineTools/usr/bin/ld) is GNU ld... no
294:info:configure checking for shared library run path origin... done
295:info:configure checking for iconv... yes
296:info:configure checking for working iconv... yes
297:info:configure checking how to link with libiconv... -liconv
298:info:configure checking for iconv declaration...
299:info:configure          extern size_t iconv (iconv_t cd, char * *inbuf, size_t *inbytesleft, char * *outbuf, size_t *outbytesleft);
300:info:configure checking for doxygen... doxygen
301:info:configure checking whether to use readline... yes
302:info:configure checking for readline/readline.h... yes
303:info:configure checking for readline/history.h... yes
304:info:configure checking for readline in -lreadline... yes
305:info:configure   Using -lreadline -lncurses
306:info:configure checking for library containing nanosleep... none required
307:info:configure checking for msgfmt... (cached) /opt/local/bin/msgfmt
308:info:configure checking for gmsgfmt... (cached) /opt/local/bin/msgfmt
309:info:configure checking for xgettext... (cached) /opt/local/bin/xgettext
310:info:configure checking for msgmerge... (cached) /opt/local/bin/msgmerge
311:info:configure checking for CFPreferencesCopyAppValue... yes
312:info:configure checking for CFLocaleCopyCurrent... yes
313:info:configure checking for GNU gettext in libc... no
314:info:configure checking for iconv... (cached) yes
315:info:configure checking for working iconv... (cached) yes
316:info:configure checking how to link with libiconv... -liconv
317:info:configure checking for GNU gettext in libintl... yes
318:info:configure checking whether to use NLS... yes
319:info:configure checking where the gettext function comes from... external libintl
320:info:configure checking how to link with libintl... -lintl -Wl,-framework -Wl,CoreFoundation
321:info:configure checking locale directory... checking for struct lconv.int_p_cs_precedes... yes
322:info:configure checking for struct lconv.int_n_cs_precedes... yes
323:info:configure "/opt/local/share/locale"
324:info:configure checking that generated files are newer than configure... done
325:info:configure configure: creating ./config.status
326:info:configure config.status: creating Makefile
327:info:configure config.status: creating src/Makefile
328:info:configure config.status: creating libqalculate/Makefile
329:info:configure config.status: creating data/Makefile
330:info:configure config.status: creating po/Makefile.in
331:info:configure config.status: creating po-defs/Makefile
332:info:configure config.status: creating po-defs/fixed/Makefile
333:info:configure config.status: creating docs/Makefile
334:info:configure config.status: creating docs/reference/Makefile
335:info:configure config.status: creating man/Makefile
336:info:configure config.status: creating libqalculate.pc
337:info:configure config.status: creating config.h
338:info:configure config.status: executing depfiles commands
339:info:configure config.status: executing libtool commands
340:info:configure config.status: executing po-directories commands
341:info:configure config.status: creating po/POTFILES
342:info:configure config.status: creating po/Makefile
343:info:configure config.status: executing po/stamp-it commands
344:debug:configure Executing portconfigure::configure_finish
345:debug:configure Privilege de-escalation not attempted as not running as root.
346:debug:build build phase started at Sat Nov 13 10:25:52 EST 2021
347:notice:build --->  Building libqalculate
348:debug:build Executing org.macports.build (libqalculate)
349:debug:build Environment:
350:debug:build CC_PRINT_OPTIONS='YES'
351:debug:build CC_PRINT_OPTIONS_FILE='/opt/local/var/macports/build/_opt_local_var_macports_sources_rsync.macports.org_macports_release_tarballs_ports_math_libqalculate/libqalculate/work/.CC_PRINT_OPTIONS'
352:debug:build CPATH='/opt/local/include'
353:debug:build DEVELOPER_DIR='/Library/Developer/CommandLineTools'
354:debug:build LIBRARY_PATH='/opt/local/lib'
355:debug:build MACOSX_DEPLOYMENT_TARGET='11.0'
356:debug:build MACPORTS_LEGACY_SUPPORT_DISABLED='1'
357:debug:build SDKROOT='/Library/Developer/CommandLineTools/SDKs/MacOSX11.sdk'
358:info:build Executing:  cd "/opt/local/var/macports/build/_opt_local_var_macports_sources_rsync.macports.org_macports_release_tarballs_ports_math_libqalculate/libqalculate/work/libqalculate-3.21.0" && /usr/bin/make -j16 -w all
359:debug:build system:  cd "/opt/local/var/macports/build/_opt_local_var_macports_sources_rsync.macports.org_macports_release_tarballs_ports_math_libqalculate/libqalculate/work/libqalculate-3.21.0" && /usr/bin/make -j16 -w all
360:info:build make: Entering directory `/opt/local/var/macports/build/_opt_local_var_macports_sources_rsync.macports.org_macports_release_tarballs_ports_math_libqalculate/libqalculate/work/libqalculate-3.21.0'
361:info:build /Library/Developer/CommandLineTools/usr/bin/make  all-recursive
362:info:build make[1]: Entering directory `/opt/local/var/macports/build/_opt_local_var_macports_sources_rsync.macports.org_macports_release_tarballs_ports_math_libqalculate/libqalculate/work/libqalculate-3.21.0'
363:info:build Making all in po-defs
364:info:build make[2]: Entering directory `/opt/local/var/macports/build/_opt_local_var_macports_sources_rsync.macports.org_macports_release_tarballs_ports_math_libqalculate/libqalculate/work/libqalculate-3.21.0/po-defs'
365:info:build g++ -g -O2    remove-untranslated.cc   -o fixpo
366:info:build Assertion failed: (!CreatedADWARFSection && "Creating regular section after DWARF"), function ChangeSection, file /opt/local/var/macports/build/_opt_local_var_macports_sources_rsync.macports.org_macports_release_tarballs_ports_lang_llvm-10/llvm-10/work/llvm-10.0.1.src/lib/MC/MCMachOStreamer.cpp, line 158.
367:info:build Stack dump:
368:info:build 0.  Program arguments: /opt/local/libexec/llvm-10/bin/clang -cc1as -triple x86_64-apple-macosx11.0.0 -filetype obj -main-file-name ccLrI06e.s -target-cpu penryn -fdebug-compilation-dir /opt/local/var/macports/build/_opt_local_var_macports_sources_rsync.macports.org_macports_release_tarballs_ports_math_libqalculate/libqalculate/work/libqalculate-3.21.0/po-defs -dwarf-debug-producer clang version 10.0.1  -dwarf-version=4 -mrelocation-model pic -o /opt/local/var/macports/build/_opt_local_var_macports_sources_rsync.macports.org_macports_release_tarballs_ports_math_libqalculate/libqalculate/work/.tmp/ccLpD206.o /opt/local/var/macports/build/_opt_local_var_macports_sources_rsync.macports.org_macports_release_tarballs_ports_math_libqalculate/libqalculate/work/.tmp/ccLrI06e.s
369:info:build 0  libLLVM.dylib            0x000000010a04ca34 llvm::sys::PrintStackTrace(llvm::raw_ostream&) + 37
370:info:build 1  libLLVM.dylib            0x000000010a04ce20 SignalHandler(int) + 208
371:info:build 2  libsystem_platform.dylib 0x00007fff2042dd7d _sigtramp + 29
372:info:build 3  libsystem_platform.dylib 0x00007ffe3fc2a890 _sigtramp + 18446744069943053104
373:info:build 4  libsystem_c.dylib        0x00007fff2033d406 abort + 125
374:info:build 5  libsystem_c.dylib        0x00007fff2033c7d8 err + 0
375:info:build 6  libLLVM.dylib            0x000000010c18d9a8 (anonymous namespace)::MCMachOStreamer::ChangeSection(llvm::MCSection*, llvm::MCExpr const*) (.cold.4) + 0
376:info:build 7  libLLVM.dylib            0x000000010ad5232a (anonymous namespace)::MCMachOStreamer::ChangeSection(llvm::MCSection*, llvm::MCExpr const*) + 676
377:info:build 8  libLLVM.dylib            0x000000010ad611b4 llvm::MCStreamer::SwitchSection(llvm::MCSection*, llvm::MCExpr const*) + 96
378:info:build 9  libLLVM.dylib            0x000000010ad9da43 (anonymous namespace)::DarwinAsmParser::parseSectionSwitch(llvm::StringRef, llvm::StringRef, unsigned int, unsigned int, unsigned int) + 195
379:info:build 10 libLLVM.dylib            0x000000010ad9e27e bool llvm::MCAsmParserExtension::HandleDirective<(anonymous namespace)::DarwinAsmParser, &((anonymous namespace)::DarwinAsmParser::parseSectionDirectiveModInitFunc(llvm::StringRef, llvm::SMLoc))>(llvm::MCAsmParserExtension*, llvm::StringRef, llvm::SMLoc) + 44
380:info:build 11 libLLVM.dylib            0x000000010ad86fc0 (anonymous namespace)::AsmParser::parseStatement((anonymous namespace)::ParseStatementInfo&, llvm::MCAsmParserSemaCallback*) + 2758
381:info:build 12 libLLVM.dylib            0x000000010ad82b87 (anonymous namespace)::AsmParser::Run(bool, bool) + 395
382:info:build 13 clang                    0x0000000107e70cac cc1as_main(llvm::ArrayRef<char const*>, char const*, void*) + 10104
383:info:build 14 clang                    0x0000000107e6b7a0 ExecuteCC1Tool(llvm::SmallVectorImpl<char const*>&) + 542
384:info:build 15 clang                    0x0000000107e6b465 main + 7760
385:info:build 16 libdyld.dylib            0x00007fff20403f3d start + 1
386:info:build clang: error: unable to execute command: Abort trap: 6
387:info:build clang: error: clang integrated assembler command failed due to signal (use -v to see invocation)
388:info:build clang version 10.0.1
389:info:build Target: x86_64-apple-darwin20.6.0
390:info:build Thread model: posix
391:info:build InstalledDir: /opt/local/libexec/llvm-10/bin
392:info:build clang: note: diagnostic msg: PLEASE submit a bug report to https://bugs.llvm.org/ and include the crash backtrace, preprocessed source, and associated run script.
393:info:build clang: note: diagnostic msg: Error generating preprocessed source(s) - no preprocessable inputs.
394:info:build make[2]: *** [fixpo] Error 1
395:info:build make[2]: Leaving directory `/opt/local/var/macports/build/_opt_local_var_macports_sources_rsync.macports.org_macports_release_tarballs_ports_math_libqalculate/libqalculate/work/libqalculate-3.21.0/po-defs'
396:info:build make[1]: *** [all-recursive] Error 1
397:info:build make[1]: Leaving directory `/opt/local/var/macports/build/_opt_local_var_macports_sources_rsync.macports.org_macports_release_tarballs_ports_math_libqalculate/libqalculate/work/libqalculate-3.21.0'
398:info:build make: *** [all] Error 2
399:info:build make: Leaving directory `/opt/local/var/macports/build/_opt_local_var_macports_sources_rsync.macports.org_macports_release_tarballs_ports_math_libqalculate/libqalculate/work/libqalculate-3.21.0'
400:info:build Command failed:  cd "/opt/local/var/macports/build/_opt_local_var_macports_sources_rsync.macports.org_macports_release_tarballs_ports_math_libqalculate/libqalculate/work/libqalculate-3.21.0" && /usr/bin/make -j16 -w all
401:info:build Exit code: 2
402:error:build Failed to build libqalculate: command execution failed
403:debug:build Error code: CHILDSTATUS 35806 2
404:debug:build Backtrace: command execution failed
405:debug:build     while executing
406:debug:build "system {*}$notty {*}$callback {*}$nice $fullcmdstring"
407:debug:build     invoked from within
408:debug:build "command_exec -callback portprogress::target_progress_callback build"
409:debug:build     (procedure "portbuild::build_main" line 8)
410:debug:build     invoked from within
411:debug:build "$procedure $targetname"
412:error:build See /opt/local/var/macports/logs/_opt_local_var_macports_sources_rsync.macports.org_macports_release_tarballs_ports_math_libqalculate/libqalculate/main.log for details.