Ticket #65121: main.3.log

File main.3.log, 179.1 KB (added by sstallion (Steven Stallion), 9 months ago)
Line 
1version:1
2:debug:main Starting logging for MacVim @8.2.snapshot171_2+cscope+huge+ruby25
3:debug:sysinfo macOS 12.3.1 (darwin/21.4.0) arch i386
4:debug:sysinfo MacPorts 2.7.2
5:debug:sysinfo Xcode 13.3.1
6:debug:sysinfo SDK 12
7:debug:sysinfo MACOSX_DEPLOYMENT_TARGET: 12.0
8:debug:main epoch: in tree: 0 installed: 0
9:debug:main ncurses 6.3_0 exists in the ports tree
10:debug:main ncurses 6.3_0  is the latest installed
11:debug:main ncurses 6.3_0  is active
12:debug:main Merging existing requested variants '' into variants
13:debug:main new fully merged portvariants:
14:debug:main Changing to port directory: /opt/local/var/macports/sources/rsync.macports.org/macports/release/tarballs/ports/devel/ncurses
15:debug:main OS darwin/21.4.0 (macOS 12.3.1) arch i386
16:debug:main Sourcing PortGroup clang_dependency 1.0 from /opt/local/var/macports/sources/rsync.macports.org/macports/release/tarballs/ports/_resources/port1.0/group/clang_dependency-1.0.tcl
17:debug:main adding the default universal variant
18:debug:main Reading variant descriptions from /opt/local/var/macports/sources/rsync.macports.org/macports/release/tarballs/ports/_resources/port1.0/variant_descriptions.conf
19:debug:main Running callback portconfigure::add_automatic_compiler_dependencies
20:debug:main Finished running callback portconfigure::add_automatic_compiler_dependencies
21:debug:main Running callback portbuild::add_automatic_buildsystem_dependencies
22:debug:main Finished running callback portbuild::add_automatic_buildsystem_dependencies
23:debug:main Running callback portstartupitem::add_notes
24:debug:main Finished running callback portstartupitem::add_notes
25:debug:main No need to upgrade! ncurses 6.3_0 >= ncurses 6.3_0
26:debug:main epoch: in tree: 2 installed: 2
27:debug:main gettext 0.21_0 exists in the ports tree
28:debug:main gettext 0.21_0  is the latest installed
29:debug:main gettext 0.21_0  is active
30:debug:main Merging existing requested variants '' into variants
31:debug:main new fully merged portvariants:
32:debug:main Changing to port directory: /opt/local/var/macports/sources/rsync.macports.org/macports/release/tarballs/ports/devel/gettext
33:debug:main OS darwin/21.4.0 (macOS 12.3.1) arch i386
34:debug:main Sourcing PortGroup compiler_blacklist_versions 1.0 from /opt/local/var/macports/sources/rsync.macports.org/macports/release/tarballs/ports/_resources/port1.0/group/compiler_blacklist_versions-1.0.tcl
35:debug:main Sourcing PortGroup muniversal 1.0 from /opt/local/var/macports/sources/rsync.macports.org/macports/release/tarballs/ports/_resources/port1.0/group/muniversal-1.0.tcl
36:debug:main Sourcing PortGroup clang_dependency 1.0 from /opt/local/var/macports/sources/rsync.macports.org/macports/release/tarballs/ports/_resources/port1.0/group/clang_dependency-1.0.tcl
37:debug:main compiler clang 1316.0.21.2.3 not blacklisted because it doesn't match {clang < 211.10.1}
38:debug:main muniversal: adding universal variant
39:debug:main Reading variant descriptions from /opt/local/var/macports/sources/rsync.macports.org/macports/release/tarballs/ports/_resources/port1.0/variant_descriptions.conf
40:debug:main Running callback portconfigure::add_automatic_compiler_dependencies
41:debug:main Finished running callback portconfigure::add_automatic_compiler_dependencies
42:debug:main Running callback portbuild::add_automatic_buildsystem_dependencies
43:debug:main Finished running callback portbuild::add_automatic_buildsystem_dependencies
44:debug:main Running callback portstartupitem::add_notes
45:debug:main Finished running callback portstartupitem::add_notes
46:debug:main No need to upgrade! gettext 0.21_0 >= gettext 0.21_0
47:debug:main epoch: in tree: 0 installed: 0
48:debug:main libiconv 1.16_1 exists in the ports tree
49:debug:main libiconv 1.16_1  is the latest installed
50:debug:main libiconv 1.16_1  is active
51:debug:main Merging existing requested variants '' into variants
52:debug:main new fully merged portvariants:
53:debug:main Changing to port directory: /opt/local/var/macports/sources/rsync.macports.org/macports/release/tarballs/ports/textproc/libiconv
54:debug:main OS darwin/21.4.0 (macOS 12.3.1) arch i386
55:debug:main Sourcing PortGroup muniversal 1.0 from /opt/local/var/macports/sources/rsync.macports.org/macports/release/tarballs/ports/_resources/port1.0/group/muniversal-1.0.tcl
56:debug:main Sourcing PortGroup clang_dependency 1.0 from /opt/local/var/macports/sources/rsync.macports.org/macports/release/tarballs/ports/_resources/port1.0/group/clang_dependency-1.0.tcl
57:debug:main Sourcing PortGroup xcodeversion 1.0 from /opt/local/var/macports/sources/rsync.macports.org/macports/release/tarballs/ports/_resources/port1.0/group/xcodeversion-1.0.tcl
58:debug:main muniversal: adding universal variant
59:debug:main Reading variant descriptions from /opt/local/var/macports/sources/rsync.macports.org/macports/release/tarballs/ports/_resources/port1.0/variant_descriptions.conf
60:debug:main Running callback portconfigure::add_automatic_compiler_dependencies
61:debug:main Finished running callback portconfigure::add_automatic_compiler_dependencies
62:debug:main Running callback portbuild::add_automatic_buildsystem_dependencies
63:debug:main Finished running callback portbuild::add_automatic_buildsystem_dependencies
64:debug:main Running callback portstartupitem::add_notes
65:debug:main Finished running callback portstartupitem::add_notes
66:debug:main Running callback xcodeversions_run_check
67:debug:main Finished running callback xcodeversions_run_check
68:debug:main No need to upgrade! libiconv 1.16_1 >= libiconv 1.16_1
69:debug:main epoch: in tree: 0 installed: 0
70:debug:main libtextstyle 0.21_0 exists in the ports tree
71:debug:main libtextstyle 0.21_0  is the latest installed
72:debug:main libtextstyle 0.21_0  is active
73:debug:main Merging existing requested variants '' into variants
74:debug:main new fully merged portvariants:
75:debug:main Changing to port directory: /opt/local/var/macports/sources/rsync.macports.org/macports/release/tarballs/ports/devel/gettext
76:debug:main OS darwin/21.4.0 (macOS 12.3.1) arch i386
77:debug:main Sourcing PortGroup compiler_blacklist_versions 1.0 from /opt/local/var/macports/sources/rsync.macports.org/macports/release/tarballs/ports/_resources/port1.0/group/compiler_blacklist_versions-1.0.tcl
78:debug:main Sourcing PortGroup muniversal 1.0 from /opt/local/var/macports/sources/rsync.macports.org/macports/release/tarballs/ports/_resources/port1.0/group/muniversal-1.0.tcl
79:debug:main Sourcing PortGroup clang_dependency 1.0 from /opt/local/var/macports/sources/rsync.macports.org/macports/release/tarballs/ports/_resources/port1.0/group/clang_dependency-1.0.tcl
80:debug:main compiler clang 1316.0.21.2.3 not blacklisted because it doesn't match {clang < 211.10.1}
81:debug:main muniversal: adding universal variant
82:debug:main Reading variant descriptions from /opt/local/var/macports/sources/rsync.macports.org/macports/release/tarballs/ports/_resources/port1.0/variant_descriptions.conf
83:debug:main Running callback portconfigure::add_automatic_compiler_dependencies
84:debug:main Finished running callback portconfigure::add_automatic_compiler_dependencies
85:debug:main Running callback portbuild::add_automatic_buildsystem_dependencies
86:debug:main Finished running callback portbuild::add_automatic_buildsystem_dependencies
87:debug:main Running callback portstartupitem::add_notes
88:debug:main Finished running callback portstartupitem::add_notes
89:debug:main No need to upgrade! libtextstyle 0.21_0 >= libtextstyle 0.21_0
90:debug:main epoch: in tree: 0 installed: 0
91:debug:main gettext-runtime 0.21_0 exists in the ports tree
92:debug:main gettext-runtime 0.21_0  is the latest installed
93:debug:main gettext-runtime 0.21_0  is active
94:debug:main Merging existing requested variants '' into variants
95:debug:main new fully merged portvariants:
96:debug:main Changing to port directory: /opt/local/var/macports/sources/rsync.macports.org/macports/release/tarballs/ports/devel/gettext
97:debug:main OS darwin/21.4.0 (macOS 12.3.1) arch i386
98:debug:main Sourcing PortGroup compiler_blacklist_versions 1.0 from /opt/local/var/macports/sources/rsync.macports.org/macports/release/tarballs/ports/_resources/port1.0/group/compiler_blacklist_versions-1.0.tcl
99:debug:main Sourcing PortGroup muniversal 1.0 from /opt/local/var/macports/sources/rsync.macports.org/macports/release/tarballs/ports/_resources/port1.0/group/muniversal-1.0.tcl
100:debug:main Sourcing PortGroup clang_dependency 1.0 from /opt/local/var/macports/sources/rsync.macports.org/macports/release/tarballs/ports/_resources/port1.0/group/clang_dependency-1.0.tcl
101:debug:main compiler clang 1316.0.21.2.3 not blacklisted because it doesn't match {clang < 211.10.1}
102:debug:main muniversal: adding universal variant
103:debug:main Reading variant descriptions from /opt/local/var/macports/sources/rsync.macports.org/macports/release/tarballs/ports/_resources/port1.0/variant_descriptions.conf
104:debug:main Running callback portconfigure::add_automatic_compiler_dependencies
105:debug:main Finished running callback portconfigure::add_automatic_compiler_dependencies
106:debug:main Running callback portbuild::add_automatic_buildsystem_dependencies
107:debug:main Finished running callback portbuild::add_automatic_buildsystem_dependencies
108:debug:main Running callback portstartupitem::add_notes
109:debug:main Finished running callback portstartupitem::add_notes
110:debug:main No need to upgrade! gettext-runtime 0.21_0 >= gettext-runtime 0.21_0
111:debug:main epoch: in tree: 0 installed: 0
112:debug:main gettext-tools-libs 0.21_0 exists in the ports tree
113:debug:main gettext-tools-libs 0.21_0  is the latest installed
114:debug:main gettext-tools-libs 0.21_0  is active
115:debug:main Merging existing requested variants '' into variants
116:debug:main new fully merged portvariants:
117:debug:main Changing to port directory: /opt/local/var/macports/sources/rsync.macports.org/macports/release/tarballs/ports/devel/gettext
118:debug:main OS darwin/21.4.0 (macOS 12.3.1) arch i386
119:debug:main Sourcing PortGroup compiler_blacklist_versions 1.0 from /opt/local/var/macports/sources/rsync.macports.org/macports/release/tarballs/ports/_resources/port1.0/group/compiler_blacklist_versions-1.0.tcl
120:debug:main Sourcing PortGroup muniversal 1.0 from /opt/local/var/macports/sources/rsync.macports.org/macports/release/tarballs/ports/_resources/port1.0/group/muniversal-1.0.tcl
121:debug:main Sourcing PortGroup clang_dependency 1.0 from /opt/local/var/macports/sources/rsync.macports.org/macports/release/tarballs/ports/_resources/port1.0/group/clang_dependency-1.0.tcl
122:debug:main compiler clang 1316.0.21.2.3 not blacklisted because it doesn't match {clang < 211.10.1}
123:debug:main muniversal: adding universal variant
124:debug:main Reading variant descriptions from /opt/local/var/macports/sources/rsync.macports.org/macports/release/tarballs/ports/_resources/port1.0/variant_descriptions.conf
125:debug:main Running callback portconfigure::add_automatic_compiler_dependencies
126:debug:main Finished running callback portconfigure::add_automatic_compiler_dependencies
127:debug:main Running callback portbuild::add_automatic_buildsystem_dependencies
128:debug:main Finished running callback portbuild::add_automatic_buildsystem_dependencies
129:debug:main Running callback portstartupitem::add_notes
130:debug:main Finished running callback portstartupitem::add_notes
131:debug:main No need to upgrade! gettext-tools-libs 0.21_0 >= gettext-tools-libs 0.21_0
132:debug:main epoch: in tree: 0 installed: 0
133:debug:main ruby25 2.5.9_4 exists in the ports tree
134:debug:main ruby25 2.5.9_4  is the latest installed
135:debug:main ruby25 2.5.9_4  is active
136:debug:main Merging existing requested variants '' into variants
137:debug:main new fully merged portvariants:
138:debug:main Changing to port directory: /opt/local/var/macports/sources/rsync.macports.org/macports/release/tarballs/ports/lang/ruby25
139:debug:main OS darwin/21.4.0 (macOS 12.3.1) arch i386
140:debug:main Sourcing PortGroup select 1.0 from /opt/local/var/macports/sources/rsync.macports.org/macports/release/tarballs/ports/_resources/port1.0/group/select-1.0.tcl
141:debug:main Sourcing PortGroup compiler_wrapper 1.0 from /opt/local/var/macports/sources/rsync.macports.org/macports/release/tarballs/ports/_resources/port1.0/group/compiler_wrapper-1.0.tcl
142:debug:main Sourcing PortGroup openssl 1.0 from /opt/local/var/macports/sources/rsync.macports.org/macports/release/tarballs/ports/_resources/port1.0/group/openssl-1.0.tcl
143:debug:main Sourcing PortGroup deprecated 1.0 from /opt/local/var/macports/sources/rsync.macports.org/macports/release/tarballs/ports/_resources/port1.0/group/deprecated-1.0.tcl
144:debug:main openssl: branch_proc set : Branch 1.1
145:debug:main openssl: Set OpenSSL Branch dependency 1.1
146:debug:main openssl: Configure Types 'env_vars pkgconfig build_flags' Branch 1.1
147:debug:main openssl: -> Setting openssl environment variable configuration
148:debug:main openssl:  -> Will append OPENSSLDIR=/opt/local/libexec/openssl11 to extract.env
149:debug:main openssl:  -> Will append OPENSSLDIR=/opt/local/libexec/openssl11 to configure.env
150:debug:main openssl:  -> Will append OPENSSLDIR=/opt/local/libexec/openssl11 to build.env
151:debug:main openssl:  -> Will append OPENSSLDIR=/opt/local/libexec/openssl11 to destroot.env
152:debug:main openssl:  -> Will append OPENSSLDIR=/opt/local/libexec/openssl11 to test.env
153:debug:main openssl:  -> Will append OPENSSL_DIR=/opt/local/libexec/openssl11 to extract.env
154:debug:main openssl:  -> Will append OPENSSL_DIR=/opt/local/libexec/openssl11 to configure.env
155:debug:main openssl:  -> Will append OPENSSL_DIR=/opt/local/libexec/openssl11 to build.env
156:debug:main openssl:  -> Will append OPENSSL_DIR=/opt/local/libexec/openssl11 to destroot.env
157:debug:main openssl:  -> Will append OPENSSL_DIR=/opt/local/libexec/openssl11 to test.env
158:debug:main openssl: -> Setting openssl pkgconfig configuration
159:debug:main openssl: -> Setting openssl build flags configuration
160:debug:main Reading variant descriptions from /opt/local/var/macports/sources/rsync.macports.org/macports/release/tarballs/ports/_resources/port1.0/variant_descriptions.conf
161:debug:main universal variant already exists, so not adding the default one
162:debug:main Running callback portconfigure::add_automatic_compiler_dependencies
163:debug:main Finished running callback portconfigure::add_automatic_compiler_dependencies
164:debug:main Running callback portbuild::add_automatic_buildsystem_dependencies
165:debug:main Finished running callback portbuild::add_automatic_buildsystem_dependencies
166:debug:main Running callback portstartupitem::add_notes
167:debug:main Finished running callback portstartupitem::add_notes
168:debug:main Running callback compwrap::configure_envs
169:debug:main Finished running callback compwrap::configure_envs
170:debug:main Running callback openssl::set_openssl_dependency
171:debug:main openssl: Set OpenSSL Branch dependency 1.1
172:debug:main Finished running callback openssl::set_openssl_dependency
173:debug:main Running callback openssl::check_for_cmake
174:debug:main Finished running callback openssl::check_for_cmake
175:debug:main Running callback openssl::configure_build
176:debug:main Finished running callback openssl::configure_build
177:debug:main Running callback deprecated.deprecate_port
178:debug:main Finished running callback deprecated.deprecate_port
179:debug:main No need to upgrade! ruby25 2.5.9_4 >= ruby25 2.5.9_4
180:debug:main epoch: in tree: 0 installed: 0
181:debug:main readline 8.1.2.000_0 exists in the ports tree
182:debug:main readline 8.1.2.000_0  is the latest installed
183:debug:main readline 8.1.2.000_0  is active
184:debug:main Merging existing requested variants '' into variants
185:debug:main new fully merged portvariants:
186:debug:main Changing to port directory: /opt/local/var/macports/sources/rsync.macports.org/macports/release/tarballs/ports/devel/readline
187:debug:main OS darwin/21.4.0 (macOS 12.3.1) arch i386
188:debug:main Sourcing PortGroup muniversal 1.0 from /opt/local/var/macports/sources/rsync.macports.org/macports/release/tarballs/ports/_resources/port1.0/group/muniversal-1.0.tcl
189:debug:main Sourcing PortGroup clang_dependency 1.0 from /opt/local/var/macports/sources/rsync.macports.org/macports/release/tarballs/ports/_resources/port1.0/group/clang_dependency-1.0.tcl
190:debug:main muniversal: adding universal variant
191:debug:main Reading variant descriptions from /opt/local/var/macports/sources/rsync.macports.org/macports/release/tarballs/ports/_resources/port1.0/variant_descriptions.conf
192:debug:main Running callback portconfigure::add_automatic_compiler_dependencies
193:debug:main Finished running callback portconfigure::add_automatic_compiler_dependencies
194:debug:main Running callback portbuild::add_automatic_buildsystem_dependencies
195:debug:main Finished running callback portbuild::add_automatic_buildsystem_dependencies
196:debug:main Running callback portstartupitem::add_notes
197:debug:main Finished running callback portstartupitem::add_notes
198:debug:main No need to upgrade! readline 8.1.2.000_0 >= readline 8.1.2.000_0
199:debug:main epoch: in tree: 0 installed: 0
200:debug:main zlib 1.2.12_1 exists in the ports tree
201:debug:main zlib 1.2.12_1  is the latest installed
202:debug:main zlib 1.2.12_1  is active
203:debug:main Merging existing requested variants '' into variants
204:debug:main new fully merged portvariants:
205:debug:main Changing to port directory: /opt/local/var/macports/sources/rsync.macports.org/macports/release/tarballs/ports/archivers/zlib
206:debug:main OS darwin/21.4.0 (macOS 12.3.1) arch i386
207:debug:main Sourcing PortGroup xcodeversion 1.0 from /opt/local/var/macports/sources/rsync.macports.org/macports/release/tarballs/ports/_resources/port1.0/group/xcodeversion-1.0.tcl
208:debug:main adding the default universal variant
209:debug:main Reading variant descriptions from /opt/local/var/macports/sources/rsync.macports.org/macports/release/tarballs/ports/_resources/port1.0/variant_descriptions.conf
210:debug:main Running callback portconfigure::add_automatic_compiler_dependencies
211:debug:main Finished running callback portconfigure::add_automatic_compiler_dependencies
212:debug:main Running callback portbuild::add_automatic_buildsystem_dependencies
213:debug:main Finished running callback portbuild::add_automatic_buildsystem_dependencies
214:debug:main Running callback portstartupitem::add_notes
215:debug:main Finished running callback portstartupitem::add_notes
216:debug:main Running callback xcodeversions_run_check
217:debug:main Finished running callback xcodeversions_run_check
218:debug:main No need to upgrade! zlib 1.2.12_1 >= zlib 1.2.12_1
219:debug:main epoch: in tree: 0 installed: 0
220:debug:main libyaml 0.2.5_0 exists in the ports tree
221:debug:main libyaml 0.2.5_0  is the latest installed
222:debug:main libyaml 0.2.5_0  is active
223:debug:main Merging existing requested variants '' into variants
224:debug:main new fully merged portvariants:
225:debug:main Changing to port directory: /opt/local/var/macports/sources/rsync.macports.org/macports/release/tarballs/ports/devel/libyaml
226:debug:main OS darwin/21.4.0 (macOS 12.3.1) arch i386
227:debug:main adding the default universal variant
228:debug:main Reading variant descriptions from /opt/local/var/macports/sources/rsync.macports.org/macports/release/tarballs/ports/_resources/port1.0/variant_descriptions.conf
229:debug:main Running callback portconfigure::add_automatic_compiler_dependencies
230:debug:main Finished running callback portconfigure::add_automatic_compiler_dependencies
231:debug:main Running callback portbuild::add_automatic_buildsystem_dependencies
232:debug:main Finished running callback portbuild::add_automatic_buildsystem_dependencies
233:debug:main Running callback portstartupitem::add_notes
234:debug:main Finished running callback portstartupitem::add_notes
235:debug:main No need to upgrade! libyaml 0.2.5_0 >= libyaml 0.2.5_0
236:debug:main epoch: in tree: 0 installed: 0
237:debug:main libffi 3.4.2_2 exists in the ports tree
238:debug:main libffi 3.4.2_2  is the latest installed
239:debug:main libffi 3.4.2_2  is active
240:debug:main Merging existing requested variants '' into variants
241:debug:main new fully merged portvariants:
242:debug:main Changing to port directory: /opt/local/var/macports/sources/rsync.macports.org/macports/release/tarballs/ports/devel/libffi
243:debug:main OS darwin/21.4.0 (macOS 12.3.1) arch i386
244:debug:main Sourcing PortGroup muniversal 1.0 from /opt/local/var/macports/sources/rsync.macports.org/macports/release/tarballs/ports/_resources/port1.0/group/muniversal-1.0.tcl
245:debug:main Sourcing PortGroup github 1.0 from /opt/local/var/macports/sources/rsync.macports.org/macports/release/tarballs/ports/_resources/port1.0/group/github-1.0.tcl
246:debug:main Re-registering default for livecheck.url
247:debug:main Re-registering default for livecheck.regex
248:debug:main muniversal: adding universal variant
249:debug:main Reading variant descriptions from /opt/local/var/macports/sources/rsync.macports.org/macports/release/tarballs/ports/_resources/port1.0/variant_descriptions.conf
250:debug:main Running callback portconfigure::add_automatic_compiler_dependencies
251:debug:main Finished running callback portconfigure::add_automatic_compiler_dependencies
252:debug:main Running callback portbuild::add_automatic_buildsystem_dependencies
253:debug:main Finished running callback portbuild::add_automatic_buildsystem_dependencies
254:debug:main Running callback portstartupitem::add_notes
255:debug:main Finished running callback portstartupitem::add_notes
256:debug:main No need to upgrade! libffi 3.4.2_2 >= libffi 3.4.2_2
257:debug:main epoch: in tree: 0 installed: 0
258:debug:main gdbm 1.23_0 exists in the ports tree
259:debug:main gdbm 1.23_0  is the latest installed
260:debug:main gdbm 1.23_0  is active
261:debug:main Merging existing requested variants '' into variants
262:debug:main new fully merged portvariants:
263:debug:main Changing to port directory: /opt/local/var/macports/sources/rsync.macports.org/macports/release/tarballs/ports/databases/gdbm
264:debug:main OS darwin/21.4.0 (macOS 12.3.1) arch i386
265:debug:main Sourcing PortGroup clang_dependency 1.0 from /opt/local/var/macports/sources/rsync.macports.org/macports/release/tarballs/ports/_resources/port1.0/group/clang_dependency-1.0.tcl
266:debug:main adding the default universal variant
267:debug:main Reading variant descriptions from /opt/local/var/macports/sources/rsync.macports.org/macports/release/tarballs/ports/_resources/port1.0/variant_descriptions.conf
268:debug:main Running callback portconfigure::add_automatic_compiler_dependencies
269:debug:main Finished running callback portconfigure::add_automatic_compiler_dependencies
270:debug:main Running callback portbuild::add_automatic_buildsystem_dependencies
271:debug:main Finished running callback portbuild::add_automatic_buildsystem_dependencies
272:debug:main Running callback portstartupitem::add_notes
273:debug:main Finished running callback portstartupitem::add_notes
274:debug:main No need to upgrade! gdbm 1.23_0 >= gdbm 1.23_0
275:debug:main epoch: in tree: 0 installed: 0
276:debug:main openssl11 1.1.1n_0 exists in the ports tree
277:debug:main openssl11 1.1.1n_0  is the latest installed
278:debug:main openssl11 1.1.1n_0  is active
279:debug:main Merging existing requested variants '' into variants
280:debug:main new fully merged portvariants:
281:debug:main Changing to port directory: /opt/local/var/macports/sources/rsync.macports.org/macports/release/tarballs/ports/devel/openssl11
282:debug:main OS darwin/21.4.0 (macOS 12.3.1) arch i386
283:debug:main Sourcing PortGroup muniversal 1.0 from /opt/local/var/macports/sources/rsync.macports.org/macports/release/tarballs/ports/_resources/port1.0/group/muniversal-1.0.tcl
284:debug:main muniversal: adding universal variant
285:debug:main Reading variant descriptions from /opt/local/var/macports/sources/rsync.macports.org/macports/release/tarballs/ports/_resources/port1.0/variant_descriptions.conf
286:debug:main Running callback portconfigure::add_automatic_compiler_dependencies
287:debug:main Finished running callback portconfigure::add_automatic_compiler_dependencies
288:debug:main Running callback portbuild::add_automatic_buildsystem_dependencies
289:debug:main Finished running callback portbuild::add_automatic_buildsystem_dependencies
290:debug:main Running callback portstartupitem::add_notes
291:debug:main Finished running callback portstartupitem::add_notes
292:debug:main No need to upgrade! openssl11 1.1.1n_0 >= openssl11 1.1.1n_0
293:debug:main epoch: in tree: 0 installed: 0
294:debug:main ruby_select 1.3_0 exists in the ports tree
295:debug:main ruby_select 1.3_0  is the latest installed
296:debug:main ruby_select 1.3_0  is active
297:debug:main Merging existing requested variants '' into variants
298:debug:main new fully merged portvariants:
299:debug:main Changing to port directory: /opt/local/var/macports/sources/rsync.macports.org/macports/release/tarballs/ports/sysutils/ruby_select
300:debug:main OS darwin/21.4.0 (macOS 12.3.1) arch i386
301:debug:main Sourcing PortGroup select 1.0 from /opt/local/var/macports/sources/rsync.macports.org/macports/release/tarballs/ports/_resources/port1.0/group/select-1.0.tcl
302:debug:main universal_variant is false, so not adding the default universal variant
303:debug:main Running callback portconfigure::add_automatic_compiler_dependencies
304:debug:main Finished running callback portconfigure::add_automatic_compiler_dependencies
305:debug:main Running callback portbuild::add_automatic_buildsystem_dependencies
306:debug:main Finished running callback portbuild::add_automatic_buildsystem_dependencies
307:debug:main Running callback portstartupitem::add_notes
308:debug:main Finished running callback portstartupitem::add_notes
309:debug:main No need to upgrade! ruby_select 1.3_0 >= ruby_select 1.3_0
310:msg:main --->  Computing dependencies for MacVim:info:main .:debug:main MacVim has no conflicts
311:debug:main Searching for dependency: ncurses
312:debug:main Found Dependency: receipt exists for ncurses
313:debug:main Searching for dependency: gettext
314:debug:main Found Dependency: receipt exists for gettext
315:debug:main Searching for dependency: libiconv
316:debug:main Found Dependency: receipt exists for libiconv
317:debug:main Searching for dependency: ruby25
318:debug:main Found Dependency: receipt exists for ruby25
319:debug:main Executing org.macports.main (MacVim)
320:debug:main dropping privileges: euid changed to 503, egid changed to 501.
321:debug:archivefetch archivefetch phase started at Fri May  6 16:46:11 CDT 2022
322:msg:archivefetch --->  Fetching archive for MacVim
323:debug:archivefetch Executing org.macports.archivefetch (MacVim)
324:debug:archivefetch euid/egid changed to: 0/0
325:debug:archivefetch chowned /opt/local/var/macports/incoming to macports
326:debug:archivefetch euid/egid changed to: 503/501
327:info:archivefetch --->  MacVim-8.2.snapshot171_2+cscope+huge+ruby25.darwin_21.x86_64.tbz2 doesn't seem to exist in /opt/local/var/macports/incoming/verified
328:msg:archivefetch --->  Attempting to fetch MacVim-8.2.snapshot171_2+cscope+huge+ruby25.darwin_21.x86_64.tbz2 from https://packages.macports.org/MacVim
329:debug:archivefetch Fetching archive failed: The requested URL returned error: 404
330:msg:archivefetch --->  Attempting to fetch MacVim-8.2.snapshot171_2+cscope+huge+ruby25.darwin_21.x86_64.tbz2 from https://ywg.ca.packages.macports.org/mirror/macports/packages/MacVim
331:debug:archivefetch Fetching archive failed: The requested URL returned error: 404
332:msg:archivefetch --->  Attempting to fetch MacVim-8.2.snapshot171_2+cscope+huge+ruby25.darwin_21.x86_64.tbz2 from https://mse.uk.packages.macports.org/MacVim
333:debug:archivefetch Fetching archive failed: The requested URL returned error: 404
334:debug:archivefetch Privilege de-escalation not attempted as not running as root.
335:debug:fetch fetch phase started at Fri May  6 16:46:13 CDT 2022
336:notice:fetch --->  Fetching distfiles for MacVim
337:debug:fetch Executing proc-pre-org.macports.fetch-fetch-0
338:debug:fetch Executing org.macports.fetch (MacVim)
339:debug:fetch Privilege de-escalation not attempted as not running as root.
340:debug:checksum checksum phase started at Fri May  6 16:46:13 CDT 2022
341:notice:checksum --->  Verifying checksums for MacVim
342:debug:checksum Executing org.macports.checksum (MacVim)
343:info:checksum --->  Checksumming macvim-171.tar.gz
344:debug:checksum Calculated (rmd160) is 884dc22e50e9ecf5acd8754d046674849b478e97
345:debug:checksum Correct (rmd160) checksum for macvim-171.tar.gz
346:debug:checksum Calculated (sha256) is 51ee54b7c3b2dd5ec6d9856117ca12e90dd7694f06c8d40ca2830f375a6f8f76
347:debug:checksum Correct (sha256) checksum for macvim-171.tar.gz
348:debug:checksum Calculated (size) is 22966978
349:debug:checksum Correct (size) checksum for macvim-171.tar.gz
350:debug:checksum Privilege de-escalation not attempted as not running as root.
351:debug:extract extract phase started at Fri May  6 16:46:13 CDT 2022
352:notice:extract --->  Extracting MacVim
353:debug:extract Executing org.macports.extract (MacVim)
354:info:extract --->  Extracting macvim-171.tar.gz
355:debug:extract setting option extract.args to '/opt/local/var/macports/distfiles/MacVim/macvim-171.tar.gz'
356:debug:extract Environment:
357:debug:extract CC_PRINT_OPTIONS='YES'
358:debug:extract CC_PRINT_OPTIONS_FILE='/opt/local/var/macports/build/_opt_local_var_macports_sources_rsync.macports.org_macports_release_tarballs_ports_editors_MacVim/MacVim/work/.CC_PRINT_OPTIONS'
359:debug:extract CPATH='/opt/local/include'
360:debug:extract DEVELOPER_DIR='/Applications/Xcode.app/Contents/Developer'
361:debug:extract LIBRARY_PATH='/opt/local/lib'
362:debug:extract MACOSX_DEPLOYMENT_TARGET='12.0'
363:debug:extract SDKROOT='/Applications/Xcode.app/Contents/Developer/Platforms/MacOSX.platform/Developer/SDKs/MacOSX12.3.sdk'
364:info:extract Executing:  cd "/opt/local/var/macports/build/_opt_local_var_macports_sources_rsync.macports.org_macports_release_tarballs_ports_editors_MacVim/MacVim/work" && /usr/bin/gzip -dc '/opt/local/var/macports/distfiles/MacVim/macvim-171.tar.gz' | /usr/bin/tar -xf -
365:debug:extract system:  cd "/opt/local/var/macports/build/_opt_local_var_macports_sources_rsync.macports.org_macports_release_tarballs_ports_editors_MacVim/MacVim/work" && /usr/bin/gzip -dc '/opt/local/var/macports/distfiles/MacVim/macvim-171.tar.gz' | /usr/bin/tar -xf -
366:debug:extract euid/egid changed to: 0/0
367:debug:extract chowned /opt/local/var/macports/build/_opt_local_var_macports_sources_rsync.macports.org_macports_release_tarballs_ports_editors_MacVim/MacVim/work to macports
368:debug:extract euid/egid changed to: 503/501
369:debug:extract Symlink: /opt/local/var/macports/build/_opt_local_var_macports_sources_rsync.macports.org_macports_release_tarballs_ports_editors_MacVim/MacVim/work/macvim-171 -> macvim-dev-macvim-e65c14c
370:debug:extract Executing proc-post-org.macports.extract-extract-0
371:debug:extract Executing proc-post-org.macports.extract-extract-1
372:debug:extract Privilege de-escalation not attempted as not running as root.
373:debug:patch patch phase started at Fri May  6 16:46:15 CDT 2022
374:debug:patch Executing org.macports.patch (MacVim)
375:notice:patch --->  Applying patches to MacVim
376:info:patch --->  Applying patch-remove-updater.diff
377:debug:patch Environment:
378:debug:patch CC_PRINT_OPTIONS='YES'
379:debug:patch CC_PRINT_OPTIONS_FILE='/opt/local/var/macports/build/_opt_local_var_macports_sources_rsync.macports.org_macports_release_tarballs_ports_editors_MacVim/MacVim/work/.CC_PRINT_OPTIONS'
380:debug:patch CPATH='/opt/local/include'
381:debug:patch DEVELOPER_DIR='/Applications/Xcode.app/Contents/Developer'
382:debug:patch LIBRARY_PATH='/opt/local/lib'
383:debug:patch MACOSX_DEPLOYMENT_TARGET='12.0'
384:debug:patch SDKROOT='/Applications/Xcode.app/Contents/Developer/Platforms/MacOSX.platform/Developer/SDKs/MacOSX12.3.sdk'
385:info:patch Executing:  cd "/opt/local/var/macports/build/_opt_local_var_macports_sources_rsync.macports.org_macports_release_tarballs_ports_editors_MacVim/MacVim/work/macvim-171" && /usr/bin/patch -p0 < '/opt/local/var/macports/sources/rsync.macports.org/macports/release/tarballs/ports/editors/MacVim/files/patch-remove-updater.diff'
386:debug:patch system:  cd "/opt/local/var/macports/build/_opt_local_var_macports_sources_rsync.macports.org_macports_release_tarballs_ports_editors_MacVim/MacVim/work/macvim-171" && /usr/bin/patch -p0 < '/opt/local/var/macports/sources/rsync.macports.org/macports/release/tarballs/ports/editors/MacVim/files/patch-remove-updater.diff'
387:info:patch patching file src/MacVim/Base.lproj/MainMenu.xib
388:info:patch patching file src/MacVim/Base.lproj/Preferences.xib
389:info:patch --->  Applying patch-remove-Homebrew-python.diff
390:debug:patch Environment:
391:debug:patch CC_PRINT_OPTIONS='YES'
392:debug:patch CC_PRINT_OPTIONS_FILE='/opt/local/var/macports/build/_opt_local_var_macports_sources_rsync.macports.org_macports_release_tarballs_ports_editors_MacVim/MacVim/work/.CC_PRINT_OPTIONS'
393:debug:patch CPATH='/opt/local/include'
394:debug:patch DEVELOPER_DIR='/Applications/Xcode.app/Contents/Developer'
395:debug:patch LIBRARY_PATH='/opt/local/lib'
396:debug:patch MACOSX_DEPLOYMENT_TARGET='12.0'
397:debug:patch SDKROOT='/Applications/Xcode.app/Contents/Developer/Platforms/MacOSX.platform/Developer/SDKs/MacOSX12.3.sdk'
398:info:patch Executing:  cd "/opt/local/var/macports/build/_opt_local_var_macports_sources_rsync.macports.org_macports_release_tarballs_ports_editors_MacVim/MacVim/work/macvim-171" && /usr/bin/patch -p0 < '/opt/local/var/macports/sources/rsync.macports.org/macports/release/tarballs/ports/editors/MacVim/files/patch-remove-Homebrew-python.diff'
399:debug:patch system:  cd "/opt/local/var/macports/build/_opt_local_var_macports_sources_rsync.macports.org_macports_release_tarballs_ports_editors_MacVim/MacVim/work/macvim-171" && /usr/bin/patch -p0 < '/opt/local/var/macports/sources/rsync.macports.org/macports/release/tarballs/ports/editors/MacVim/files/patch-remove-Homebrew-python.diff'
400:info:patch patching file src/MacVim/vimrc
401:debug:patch Privilege de-escalation not attempted as not running as root.
402:debug:configure configure phase started at Fri May  6 16:46:15 CDT 2022
403:notice:configure --->  Configuring MacVim
404:debug:configure Preferred compilers: clang macports-clang-14 macports-clang-13 macports-clang-12 macports-clang-11 macports-clang-10 macports-clang-9.0
405:debug:configure Using compiler 'Xcode Clang'
406:debug:configure Executing org.macports.configure (MacVim)
407:debug:configure Environment:
408:debug:configure CC='/usr/bin/clang'
409:debug:configure CC_PRINT_OPTIONS='YES'
410:debug:configure CC_PRINT_OPTIONS_FILE='/opt/local/var/macports/build/_opt_local_var_macports_sources_rsync.macports.org_macports_release_tarballs_ports_editors_MacVim/MacVim/work/.CC_PRINT_OPTIONS'
411:debug:configure CFLAGS='-pipe -Os -isysroot/Applications/Xcode.app/Contents/Developer/Platforms/MacOSX.platform/Developer/SDKs/MacOSX12.3.sdk -arch x86_64'
412:debug:configure CPATH='/opt/local/include'
413:debug:configure CPPFLAGS='-I/opt/local/include -isysroot/Applications/Xcode.app/Contents/Developer/Platforms/MacOSX.platform/Developer/SDKs/MacOSX12.3.sdk'
414:debug:configure CXX='/usr/bin/clang++'
415:debug:configure CXXFLAGS='-pipe -Os -stdlib=libc++ -isysroot/Applications/Xcode.app/Contents/Developer/Platforms/MacOSX.platform/Developer/SDKs/MacOSX12.3.sdk -arch x86_64'
416:debug:configure DEVELOPER_DIR='/Applications/Xcode.app/Contents/Developer'
417:debug:configure F90FLAGS='-pipe -Os -m64'
418:debug:configure FCFLAGS='-pipe -Os -m64'
419:debug:configure FFLAGS='-pipe -Os -m64'
420:debug:configure INSTALL='/usr/bin/install -c'
421:debug:configure LDFLAGS='-L/opt/local/lib -Wl,-headerpad_max_install_names -Wl,-syslibroot,/Applications/Xcode.app/Contents/Developer/Platforms/MacOSX.platform/Developer/SDKs/MacOSX12.3.sdk -arch x86_64'
422:debug:configure LIBRARY_PATH='/opt/local/lib'
423:debug:configure MACOSX_DEPLOYMENT_TARGET='12.0'
424:debug:configure OBJC='/usr/bin/clang'
425:debug:configure OBJCFLAGS='-pipe -Os -isysroot/Applications/Xcode.app/Contents/Developer/Platforms/MacOSX.platform/Developer/SDKs/MacOSX12.3.sdk -arch x86_64'
426:debug:configure OBJCXX='/usr/bin/clang++'
427:debug:configure OBJCXXFLAGS='-pipe -Os -stdlib=libc++ -isysroot/Applications/Xcode.app/Contents/Developer/Platforms/MacOSX.platform/Developer/SDKs/MacOSX12.3.sdk -arch x86_64'
428:debug:configure SDKROOT='/Applications/Xcode.app/Contents/Developer/Platforms/MacOSX.platform/Developer/SDKs/MacOSX12.3.sdk'
429:info:configure Executing:  cd "/opt/local/var/macports/build/_opt_local_var_macports_sources_rsync.macports.org_macports_release_tarballs_ports_editors_MacVim/MacVim/work/macvim-171" && ./configure --prefix=/opt/local --enable-gui=macvim --without-x --without-local-dir --disable-sparkle --disable-gpm --disable-canberra --with-tlib=ncurses --enable-multibyte --enable-fail-if-missing --with-compiledby="MacPorts" --with-features=huge --enable-rubyinterp --with-ruby-command=/opt/local/bin/ruby2.5 --enable-cscope
430:debug:configure system:  cd "/opt/local/var/macports/build/_opt_local_var_macports_sources_rsync.macports.org_macports_release_tarballs_ports_editors_MacVim/MacVim/work/macvim-171" && ./configure --prefix=/opt/local --enable-gui=macvim --without-x --without-local-dir --disable-sparkle --disable-gpm --disable-canberra --with-tlib=ncurses --enable-multibyte --enable-fail-if-missing --with-compiledby="MacPorts" --with-features=huge --enable-rubyinterp --with-ruby-command=/opt/local/bin/ruby2.5 --enable-cscope
431:info:configure configure: creating cache auto/config.cache
432:info:configure checking whether make sets $(MAKE)... yes
433:info:configure checking for gcc... /usr/bin/clang
434:info:configure checking whether the C compiler works... yes
435:info:configure checking for C compiler default output file name... a.out
436:info:configure checking for suffix of executables...
437:info:configure checking whether we are cross compiling... no
438:info:configure checking for suffix of object files... o
439:info:configure checking whether we are using the GNU C compiler... yes
440:info:configure checking whether /usr/bin/clang accepts -g... yes
441:info:configure checking for /usr/bin/clang option to accept ISO C89... none needed
442:info:configure checking for /usr/bin/clang option to accept ISO C99... none needed
443:info:configure checking how to run the C preprocessor... /usr/bin/clang -E
444:info:configure checking for grep that handles long lines and -e... /usr/bin/grep
445:info:configure checking for egrep... /usr/bin/grep -E
446:info:configure checking for fgrep... /usr/bin/grep -F
447:info:configure checking for library containing strerror... none required
448:info:configure checking for gawk... no
449:info:configure checking for mawk... no
450:info:configure checking for nawk... no
451:info:configure checking for awk... awk
452:info:configure checking for strip... strip
453:info:configure checking for ANSI C header files... yes
454:info:configure checking for sys/wait.h that is POSIX.1 compatible... yes
455:info:configure checking for unsigned long long int... yes
456:info:configure checking for long long int... yes
457:info:configure checking if the compiler supports trailing commas... yes
458:info:configure checking if the compiler supports C++ comments... yes
459:info:configure checking --enable-fail-if-missing argument... yes
460:info:configure checking for clang version... 1316000021
461:info:configure checking if clang supports -fno-strength-reduce... no
462:info:configure configure: checking for buggy tools...
463:info:configure - sh is 'GNU bash, version 3.2.57(1)-release (x86_64-apple-darwin21)
464:info:configure Copyright (C) 2007 Free Software Foundation, Inc.' - probably OK.
465:info:configure checking for Haiku... no
466:info:configure checking for QNX... no
467:info:configure checking for Darwin (Mac OS X)... yes
468:info:configure checking --disable-darwin argument... no
469:info:configure checking if Darwin files are there... yes
470:info:configure checking --disable-sparkle argument... yes
471:info:configure checking --with-developer-dir argument... not present
472:info:configure checking --with-macsdk argument... using default
473:info:configure checking --with-macarchs argument... defaulting to native arch
474:info:configure checking for sys/types.h... yes
475:info:configure checking for sys/stat.h... yes
476:info:configure checking for stdlib.h... yes
477:info:configure checking for string.h... yes
478:info:configure checking for memory.h... yes
479:info:configure checking for strings.h... yes
480:info:configure checking for inttypes.h... yes
481:info:configure checking for stdint.h... yes
482:info:configure checking for unistd.h... yes
483:info:configure checking Cocoa/Cocoa.h usability... yes
484:info:configure checking Cocoa/Cocoa.h presence... yes
485:info:configure checking for Cocoa/Cocoa.h... yes
486:info:configure checking AvailabilityMacros.h usability... yes
487:info:configure checking AvailabilityMacros.h presence... yes
488:info:configure checking for AvailabilityMacros.h... yes
489:info:configure checking --with-local-dir argument... no
490:info:configure checking --with-vim-name argument... Defaulting to vim
491:info:configure checking --with-ex-name argument... Defaulting to ex
492:info:configure checking --with-view-name argument... Defaulting to view
493:info:configure checking --with-global-runtime argument... no
494:info:configure checking --with-modified-by argument... no
495:info:configure checking if character set is EBCDIC... no
496:info:configure checking --disable-smack argument... no
497:info:configure checking linux/xattr.h usability... no
498:info:configure checking linux/xattr.h presence... no
499:info:configure checking for linux/xattr.h... no
500:info:configure checking --disable-selinux argument... no
501:info:configure checking for is_selinux_enabled in -lselinux... no
502:info:configure checking --with-features argument... huge
503:info:configure checking --with-compiledby argument... MacPorts
504:info:configure checking --disable-xsmp argument... no
505:info:configure checking --disable-xsmp-interact argument... no
506:info:configure checking --enable-luainterp argument... no
507:info:configure checking --enable-mzschemeinterp argument... no
508:info:configure checking --enable-perlinterp argument... no
509:info:configure checking --enable-pythoninterp argument... no
510:info:configure checking --enable-python3interp argument... no
511:info:configure checking --enable-tclinterp argument... no
512:info:configure checking --enable-rubyinterp argument... yes
513:info:configure checking --with-ruby-command argument... /opt/local/bin/ruby2.5
514:info:configure checking for /opt/local/bin/ruby2.5... /opt/local/bin/ruby2.5
515:info:configure checking Ruby version... OK
516:info:configure checking Ruby rbconfig... RbConfig
517:info:configure checking Ruby header files... /opt/local/include/ruby-2.5.0
518:info:configure checking --enable-cscope argument... yes
519:info:configure checking --disable-netbeans argument... no
520:info:configure checking --disable-channel argument... no
521:info:configure checking for socket in -lsocket... no
522:info:configure checking whether compiling with IPv6 networking is possible... yes
523:info:configure checking for inet_ntop... yes
524:info:configure checking --enable-terminal argument... defaulting to yes
525:info:configure checking --enable-autoservername argument... no
526:info:configure checking --enable-multibyte argument... yes
527:info:configure checking --disable-rightleft argument... no
528:info:configure checking --disable-arabic argument... no
529:info:configure checking --enable-xim argument... defaulting to auto
530:info:configure checking --enable-fontset argument... no
531:info:configure defaulting to: don't HAVE_X11
532:info:configure checking --enable-gui argument... MacVim GUI support
533:info:configure checking for MacVim GUI... yes
534:info:configure checking for pkg-config... /opt/local/bin/pkg-config
535:info:configure checking X11/SM/SMlib.h usability... yes
536:info:configure checking X11/SM/SMlib.h presence... yes
537:info:configure checking for X11/SM/SMlib.h... yes
538:info:configure checking for /proc link to executable... no
539:info:configure checking for CYGWIN or MSYS environment... no
540:info:configure checking whether toupper is broken... no
541:info:configure checking whether __DATE__ and __TIME__ work... yes
542:info:configure checking whether __attribute__((unused)) is allowed... yes
543:info:configure checking elf.h usability... no
544:info:configure checking elf.h presence... no
545:info:configure checking for elf.h... no
546:info:configure checking for dirent.h that defines DIR... yes
547:info:configure checking for library containing opendir... none required
548:info:configure checking for stdint.h... (cached) yes
549:info:configure checking for stdlib.h... (cached) yes
550:info:configure checking for string.h... (cached) yes
551:info:configure checking sys/select.h usability... yes
552:info:configure checking sys/select.h presence... yes
553:info:configure checking for sys/select.h... yes
554:info:configure checking sys/utsname.h usability... yes
555:info:configure checking sys/utsname.h presence... yes
556:info:configure checking for sys/utsname.h... yes
557:info:configure checking termcap.h usability... yes
558:info:configure checking termcap.h presence... yes
559:info:configure checking for termcap.h... yes
560:info:configure checking fcntl.h usability... yes
561:info:configure checking fcntl.h presence... yes
562:info:configure checking for fcntl.h... yes
563:info:configure checking sgtty.h usability... yes
564:info:configure checking sgtty.h presence... yes
565:info:configure checking for sgtty.h... yes
566:info:configure checking sys/ioctl.h usability... yes
567:info:configure checking sys/ioctl.h presence... yes
568:info:configure checking for sys/ioctl.h... yes
569:info:configure checking sys/time.h usability... yes
570:info:configure checking sys/time.h presence... yes
571:info:configure checking for sys/time.h... yes
572:info:configure checking for sys/types.h... (cached) yes
573:info:configure checking termio.h usability... no
574:info:configure checking termio.h presence... no
575:info:configure checking for termio.h... no
576:info:configure checking iconv.h usability... yes
577:info:configure checking iconv.h presence... yes
578:info:configure checking for iconv.h... yes
579:info:configure checking for inttypes.h... (cached) yes
580:info:configure checking langinfo.h usability... yes
581:info:configure checking langinfo.h presence... yes
582:info:configure checking for langinfo.h... yes
583:info:configure checking math.h usability... yes
584:info:configure checking math.h presence... yes
585:info:configure checking for math.h... yes
586:info:configure checking for unistd.h... (cached) yes
587:info:configure checking stropts.h usability... no
588:info:configure checking stropts.h presence... no
589:info:configure checking for stropts.h... no
590:info:configure checking errno.h usability... yes
591:info:configure checking errno.h presence... yes
592:info:configure checking for errno.h... yes
593:info:configure checking sys/resource.h usability... yes
594:info:configure checking sys/resource.h presence... yes
595:info:configure checking for sys/resource.h... yes
596:info:configure checking sys/systeminfo.h usability... no
597:info:configure checking sys/systeminfo.h presence... no
598:info:configure checking for sys/systeminfo.h... no
599:info:configure checking locale.h usability... yes
600:info:configure checking locale.h presence... yes
601:info:configure checking for locale.h... yes
602:info:configure checking sys/stream.h usability... no
603:info:configure checking sys/stream.h presence... no
604:info:configure checking for sys/stream.h... no
605:info:configure checking termios.h usability... yes
606:info:configure checking termios.h presence... yes
607:info:configure checking for termios.h... yes
608:info:configure checking libc.h usability... yes
609:info:configure checking libc.h presence... yes
610:info:configure checking for libc.h... yes
611:info:configure checking sys/statfs.h usability... no
612:info:configure checking sys/statfs.h presence... no
613:info:configure checking for sys/statfs.h... no
614:info:configure checking poll.h usability... yes
615:info:configure checking poll.h presence... yes
616:info:configure checking for poll.h... yes
617:info:configure checking sys/poll.h usability... yes
618:info:configure checking sys/poll.h presence... yes
619:info:configure checking for sys/poll.h... yes
620:info:configure checking pwd.h usability... yes
621:info:configure checking pwd.h presence... yes
622:info:configure checking for pwd.h... yes
623:info:configure checking utime.h usability... yes
624:info:configure checking utime.h presence... yes
625:info:configure checking for utime.h... yes
626:info:configure checking sys/param.h usability... yes
627:info:configure checking sys/param.h presence... yes
628:info:configure checking for sys/param.h... yes
629:info:configure checking sys/ptms.h usability... no
630:info:configure checking sys/ptms.h presence... no
631:info:configure checking for sys/ptms.h... no
632:info:configure checking libintl.h usability... yes
633:info:configure checking libintl.h presence... yes
634:info:configure checking for libintl.h... yes
635:info:configure checking libgen.h usability... yes
636:info:configure checking libgen.h presence... yes
637:info:configure checking for libgen.h... yes
638:info:configure checking util/debug.h usability... no
639:info:configure checking util/debug.h presence... no
640:info:configure checking for util/debug.h... no
641:info:configure checking util/msg18n.h usability... no
642:info:configure checking util/msg18n.h presence... no
643:info:configure checking for util/msg18n.h... no
644:info:configure checking frame.h usability... no
645:info:configure checking frame.h presence... no
646:info:configure checking for frame.h... no
647:info:configure checking sys/acl.h usability... yes
648:info:configure checking sys/acl.h presence... yes
649:info:configure checking for sys/acl.h... yes
650:info:configure checking sys/access.h usability... no
651:info:configure checking sys/access.h presence... no
652:info:configure checking for sys/access.h... no
653:info:configure checking sys/sysinfo.h usability... no
654:info:configure checking sys/sysinfo.h presence... no
655:info:configure checking for sys/sysinfo.h... no
656:info:configure checking wchar.h usability... yes
657:info:configure checking wchar.h presence... yes
658:info:configure checking for wchar.h... yes
659:info:configure checking wctype.h usability... yes
660:info:configure checking wctype.h presence... yes
661:info:configure checking for wctype.h... yes
662:info:configure checking for sys/ptem.h... no
663:info:configure checking for sys/sysctl.h... yes
664:info:configure checking for pthread_np.h... no
665:info:configure checking for strings.h... (cached) yes
666:info:configure checking whether /usr/bin/clang needs -traditional... no
667:info:configure checking for an ANSI C-conforming const... yes
668:info:configure checking for working volatile... yes
669:info:configure checking for mode_t... yes
670:info:configure checking for off_t... yes
671:info:configure checking for pid_t... yes
672:info:configure checking for size_t... yes
673:info:configure checking for uid_t in sys/types.h... yes
674:info:configure checking for uint32_t... yes
675:info:configure checking whether time.h and sys/time.h may both be included... yes
676:info:configure checking for ino_t... yes
677:info:configure checking for dev_t... yes
678:info:configure checking whether byte ordering is bigendian... no
679:info:configure checking for inline... inline
680:info:configure checking for rlim_t... yes
681:info:configure checking for stack_t... yes
682:info:configure checking whether stack_t has an ss_base field... no
683:info:configure checking --with-tlib argument... ncurses
684:info:configure checking for linking with ncurses library... OK
685:info:configure checking for tgetent()... yes
686:info:configure checking whether we talk terminfo... yes
687:info:configure checking what tgetent() returns for an unknown terminal... zero
688:info:configure checking whether termcap.h contains ospeed... yes
689:info:configure checking whether termcap.h contains UP, BC and PC... yes
690:info:configure checking whether tputs() uses outfuntype... no
691:info:configure checking whether sys/select.h and sys/time.h may both be included... yes
692:info:configure checking for /dev/ptc... no
693:info:configure checking for SVR4 ptys... yes
694:info:configure checking for ptyranges... pqrstuvw / 0123456789abcdef
695:info:configure checking return type of signal handlers... void
696:info:configure checking for struct sigcontext... yes
697:info:configure checking getcwd implementation is broken... no
698:info:configure checking for fchdir... yes
699:info:configure checking for fchown... yes
700:info:configure checking for fchmod... yes
701:info:configure checking for fsync... yes
702:info:configure checking for getcwd... yes
703:info:configure checking for getpseudotty... no
704:info:configure checking for getpwent... yes
705:info:configure checking for getpwnam... yes
706:info:configure checking for getpwuid... yes
707:info:configure checking for getrlimit... yes
708:info:configure checking for gettimeofday... yes
709:info:configure checking for localtime_r... yes
710:info:configure checking for lstat... yes
711:info:configure checking for memset... yes
712:info:configure checking for mkdtemp... yes
713:info:configure checking for nanosleep... yes
714:info:configure checking for opendir... yes
715:info:configure checking for putenv... yes
716:info:configure checking for qsort... yes
717:info:configure checking for readlink... yes
718:info:configure checking for select... yes
719:info:configure checking for setenv... yes
720:info:configure checking for getpgid... yes
721:info:configure checking for setpgid... yes
722:info:configure checking for setsid... yes
723:info:configure checking for sigaltstack... yes
724:info:configure checking for sigstack... no
725:info:configure checking for sigset... yes
726:info:configure checking for sigsetjmp... yes
727:info:configure checking for sigaction... yes
728:info:configure checking for sigprocmask... yes
729:info:configure checking for sigvec... yes
730:info:configure checking for strcasecmp... yes
731:info:configure checking for strcoll... yes
732:info:configure checking for strerror... yes
733:info:configure checking for strftime... yes
734:info:configure checking for stricmp... no
735:info:configure checking for strncasecmp... yes
736:info:configure checking for strnicmp... no
737:info:configure checking for strpbrk... yes
738:info:configure checking for strptime... yes
739:info:configure checking for strtol... yes
740:info:configure checking for tgetent... yes
741:info:configure checking for towlower... yes
742:info:configure checking for towupper... yes
743:info:configure checking for iswupper... yes
744:info:configure checking for tzset... yes
745:info:configure checking for usleep... yes
746:info:configure checking for utime... yes
747:info:configure checking for utimes... yes
748:info:configure checking for mblen... yes
749:info:configure checking for ftruncate... yes
750:info:configure checking for unsetenv... yes
751:info:configure checking for posix_openpt... yes
752:info:configure checking for sys/select.h... (cached) yes
753:info:configure checking sys/socket.h usability... yes
754:info:configure checking sys/socket.h presence... yes
755:info:configure checking for sys/socket.h... yes
756:info:configure checking types of arguments for select... int,fd_set *,struct timeval *
757:info:configure checking for _LARGEFILE_SOURCE value needed for large files... no
758:info:configure checking for special C compiler options needed for large files... no
759:info:configure checking for _FILE_OFFSET_BITS value needed for large files... no
760:info:configure checking --enable-canberra argument... no
761:info:configure checking for st_blksize... yes
762:info:configure checking whether stat() ignores a trailing slash... no
763:info:configure checking for iconv_open()... yes; with -liconv
764:info:configure checking for nl_langinfo(CODESET)... yes
765:info:configure checking for strtod in -lm... yes
766:info:configure checking for strtod() and other floating point functions... yes
767:info:configure checking for isinf()... yes
768:info:configure checking for isnan()... yes
769:info:configure checking --disable-acl argument... no
770:info:configure checking for acl_get_file in -lposix1e... no
771:info:configure checking for acl_get_file in -lacl... no
772:info:configure checking for POSIX ACL support... yes
773:info:configure checking for acl_get in -lsec... no
774:info:configure checking for Solaris ACL support... no
775:info:configure checking for AIX ACL support... no
776:info:configure checking --disable-gpm argument... yes
777:info:configure checking --disable-sysmouse argument... no
778:info:configure checking for sysmouse... no
779:info:configure checking for FD_CLOEXEC... yes
780:info:configure checking for rename... yes
781:info:configure checking for dirfd... yes
782:info:configure checking for flock... yes
783:info:configure checking for sysctl... yes
784:info:configure checking for sysinfo... not usable
785:info:configure checking for sysinfo.mem_unit... no
786:info:configure checking for sysinfo.uptime... no
787:info:configure checking for sysconf... yes
788:info:configure checking for _SC_SIGSTKSZ via sysconf()... not usable
789:info:configure checking size of int... 4
790:info:configure checking size of long... 8
791:info:configure checking size of time_t... 8
792:info:configure checking size of off_t... 8
793:info:configure checking uint32_t is 32 bits... ok
794:info:configure checking whether memmove handles overlaps... yes
795:info:configure checking for _xpg4_setrunelocale in -lxpg4... no
796:info:configure checking how to create tags... ctags -t
797:info:configure checking how to run man with a section nr... man -s
798:info:configure checking --disable-nls argument... no
799:info:configure checking for msgfmt... msgfmt
800:info:configure checking for NLS... gettext() works with -lintl
801:info:configure checking for bind_textdomain_codeset... yes
802:info:configure checking for _nl_msg_cat_cntr... yes
803:info:configure checking for libintl.a... libintl.a not found - keeping using -lintl
804:info:configure checking if msgfmt supports --desktop... yes
805:info:configure checking dlfcn.h usability... yes
806:info:configure checking dlfcn.h presence... yes
807:info:configure checking for dlfcn.h... yes
808:info:configure checking for dlopen()... yes
809:info:configure checking for dlsym()... yes
810:info:configure checking setjmp.h usability... yes
811:info:configure checking setjmp.h presence... yes
812:info:configure checking for setjmp.h... yes
813:info:configure checking whether we need macOS frameworks... yes, we need AppKit
814:info:configure checking --with-xcodecfg argument... using default
815:info:configure checking for GCC 3 or later... yes
816:info:configure checking whether we need -D_FORTIFY_SOURCE=1... yes
817:info:configure checking whether we need to force -D_FILE_OFFSET_BITS=64... no
818:info:configure checking linker --as-needed support... no
819:info:configure configure: updating cache auto/config.cache
820:info:configure configure: creating auto/config.status
821:info:configure config.status: creating auto/config.mk
822:info:configure config.status: creating auto/config.h
823:debug:configure Executing portconfigure::configure_finish
824:warn:configure Configuration logfiles contain indications of -Wimplicit-function-declaration; check that features were not accidentally disabled:
825:msg:configure   statacl: found in macvim-dev-macvim-e65c14c/src/auto/config.log
826:msg:configure   acl: found in macvim-dev-macvim-e65c14c/src/auto/config.log
827:debug:configure Privilege de-escalation not attempted as not running as root.
828:debug:build build phase started at Fri May  6 16:46:46 CDT 2022
829:notice:build --->  Building MacVim
830:debug:build Executing org.macports.build (MacVim)
831:debug:build Environment:
832:debug:build CC_PRINT_OPTIONS='YES'
833:debug:build CC_PRINT_OPTIONS_FILE='/opt/local/var/macports/build/_opt_local_var_macports_sources_rsync.macports.org_macports_release_tarballs_ports_editors_MacVim/MacVim/work/.CC_PRINT_OPTIONS'
834:debug:build CPATH='/opt/local/include'
835:debug:build DEVELOPER_DIR='/Applications/Xcode.app/Contents/Developer'
836:debug:build LIBRARY_PATH='/opt/local/lib'
837:debug:build MACOSX_DEPLOYMENT_TARGET='12.0'
838:debug:build SDKROOT='/Applications/Xcode.app/Contents/Developer/Platforms/MacOSX.platform/Developer/SDKs/MacOSX12.3.sdk'
839:info:build Executing:  cd "/opt/local/var/macports/build/_opt_local_var_macports_sources_rsync.macports.org_macports_release_tarballs_ports_editors_MacVim/MacVim/work/macvim-171" && /usr/bin/make -j12 -w all XCODEFLAGS="CACHE_ROOT=/opt/local/var/macports/build/_opt_local_var_macports_sources_rsync.macports.org_macports_release_tarballs_ports_editors_MacVim/MacVim/work/caches -UseNewBuildSystem=NO MACOSX_DEPLOYMENT_TARGET=12.0 ARCHS=x86_64"
840:debug:build system:  cd "/opt/local/var/macports/build/_opt_local_var_macports_sources_rsync.macports.org_macports_release_tarballs_ports_editors_MacVim/MacVim/work/macvim-171" && /usr/bin/make -j12 -w all XCODEFLAGS="CACHE_ROOT=/opt/local/var/macports/build/_opt_local_var_macports_sources_rsync.macports.org_macports_release_tarballs_ports_editors_MacVim/MacVim/work/caches -UseNewBuildSystem=NO MACOSX_DEPLOYMENT_TARGET=12.0 ARCHS=x86_64"
841:info:build make: Entering directory `/opt/local/var/macports/build/_opt_local_var_macports_sources_rsync.macports.org_macports_release_tarballs_ports_editors_MacVim/MacVim/work/macvim-dev-macvim-e65c14c'
842:info:build Starting make in the src directory.
843:info:build If there are problems, cd to the src directory and run make there
844:info:build cd src && /Applications/Xcode.app/Contents/Developer/usr/bin/make all
845:info:build make[1]: Entering directory `/opt/local/var/macports/build/_opt_local_var_macports_sources_rsync.macports.org_macports_release_tarballs_ports_editors_MacVim/MacVim/work/macvim-dev-macvim-e65c14c/src'
846:info:build /bin/sh install-sh -c -d objects
847:info:build CC="/usr/bin/clang -Iproto -DHAVE_CONFIG_H -DFEAT_GUI_MACVIM -Wall -Wno-unknown-pragmas -pipe  -I/opt/local/include -isysroot/Applications/Xcode.app/Contents/Developer/Platforms/MacOSX.platform/Developer/SDKs/MacOSX12.3.sdk -DMACOS_X -DMACOS_X_DARWIN    " srcdir=. sh ./osdef.sh
848:info:build creating auto/pathdef.c
849:info:build cd xxd; CC="/usr/bin/clang" CFLAGS="-I/opt/local/include -isysroot/Applications/Xcode.app/Contents/Developer/Platforms/MacOSX.platform/Developer/SDKs/MacOSX12.3.sdk -DMACOS_X -DMACOS_X_DARWIN -pipe -Os -isysroot/Applications/Xcode.app/Contents/Developer/Platforms/MacOSX.platform/Developer/SDKs/MacOSX12.3.sdk -arch x86_64 -U_FORTIFY_SOURCE -D_FORTIFY_SOURCE=1" LDFLAGS="-L. -L/opt/local/libexec/openssl11/lib -L/opt/local/lib -Wl,-headerpad_max_install_names -Wl,-syslibroot,/Library/Developer/CommandLineTools/SDKs/MacOSX.sdk -fstack-protector -L/opt/local/lib -L. -L/opt/local/libexec/openssl11/lib -L/opt/local/lib -Wl,-headerpad_max_install_names -Wl,-syslibroot,/Library/Developer/CommandLineTools/SDKs/MacOSX.sdk -fstack-protector -L/opt/local/lib -L/opt/local/lib -Wl,-headerpad_max_install_names -Wl,-syslibroot,/Applications/Xcode.app/Contents/Developer/Platforms/MacOSX.platform/Developer/SDKs/MacOSX12.3.sdk -arch x86_64" \
850:info:build             /Applications/Xcode.app/Contents/Developer/usr/bin/make -f Makefile
851:info:build make[2]: Entering directory `/opt/local/var/macports/build/_opt_local_var_macports_sources_rsync.macports.org_macports_release_tarballs_ports_editors_MacVim/MacVim/work/macvim-dev-macvim-e65c14c/src/xxd'
852:info:build /usr/bin/clang -I/opt/local/include -isysroot/Applications/Xcode.app/Contents/Developer/Platforms/MacOSX.platform/Developer/SDKs/MacOSX12.3.sdk -DMACOS_X -DMACOS_X_DARWIN -pipe -Os -isysroot/Applications/Xcode.app/Contents/Developer/Platforms/MacOSX.platform/Developer/SDKs/MacOSX12.3.sdk -arch x86_64 -U_FORTIFY_SOURCE -D_FORTIFY_SOURCE=1 -L. -L/opt/local/libexec/openssl11/lib -L/opt/local/lib -Wl,-headerpad_max_install_names -Wl,-syslibroot,/Library/Developer/CommandLineTools/SDKs/MacOSX.sdk -fstack-protector -L/opt/local/lib -L. -L/opt/local/libexec/openssl11/lib -L/opt/local/lib -Wl,-headerpad_max_install_names -Wl,-syslibroot,/Library/Developer/CommandLineTools/SDKs/MacOSX.sdk -fstack-protector -L/opt/local/lib -L/opt/local/lib -Wl,-headerpad_max_install_names -Wl,-syslibroot,/Applications/Xcode.app/Contents/Developer/Platforms/MacOSX.platform/Developer/SDKs/MacOSX12.3.sdk -arch x86_64 -DUNIX -o xxd xxd.c
853:info:build make[2]: Entering directory `/opt/local/var/macports/build/_opt_local_var_macports_sources_rsync.macports.org_macports_release_tarballs_ports_editors_MacVim/MacVim/work/macvim-dev-macvim-e65c14c/src/po'
854:info:build OLD_PO_FILE_INPUT=yes msgfmt -v -o af.mo af.po
855:info:build OLD_PO_FILE_INPUT=yes msgfmt -v -o ca.mo ca.po
856:info:build OLD_PO_FILE_INPUT=yes msgfmt -v -o cs.mo cs.po
857:info:build OLD_PO_FILE_INPUT=yes msgfmt -v -o da.mo da.po
858:info:build OLD_PO_FILE_INPUT=yes msgfmt -v -o de.mo de.po
859:info:build OLD_PO_FILE_INPUT=yes msgfmt -v -o en_GB.mo en_GB.po
860:info:build OLD_PO_FILE_INPUT=yes msgfmt -v -o eo.mo eo.po
861:info:build OLD_PO_FILE_INPUT=yes msgfmt -v -o es.mo es.po
862:info:build touch objects/.dirstamp
863:info:build OLD_PO_FILE_INPUT=yes msgfmt -v -o fi.mo fi.po
864:info:build 181 translated messages.
865:info:build OLD_PO_FILE_INPUT=yes msgfmt -v -o fr.mo fr.po
866:info:build 1272 translated messages.
867:info:build OLD_PO_FILE_INPUT=yes msgfmt -v -o ga.mo ga.po
868:info:build 1411 translated messages.
869:info:build OLD_PO_FILE_INPUT=yes msgfmt -v -o it.mo it.po
870:info:build 1961 translated messages.
871:info:build OLD_PO_FILE_INPUT=yes msgfmt -v -o ja.mo ja.po
872:info:build 1702 translated messages.
873:info:build 1928 translated messages.
874:info:build /usr/bin/clang -c -I. -Iproto -DHAVE_CONFIG_H -DFEAT_GUI_MACVIM -Wall -Wno-unknown-pragmas -pipe  -I/opt/local/include -isysroot/Applications/Xcode.app/Contents/Developer/Platforms/MacOSX.platform/Developer/SDKs/MacOSX12.3.sdk -DMACOS_X -DMACOS_X_DARWIN  -pipe -Os -isysroot/Applications/Xcode.app/Contents/Developer/Platforms/MacOSX.platform/Developer/SDKs/MacOSX12.3.sdk -arch x86_64 -U_FORTIFY_SOURCE -D_FORTIFY_SOURCE=1        -fobjc-exceptions -o objects/gui_macvim.o MacVim/gui_macvim.m
875:info:build OLD_PO_FILE_INPUT=yes msgfmt -v -o ko.UTF-8.mo ko.UTF-8.po
876:info:build 2165 translated messages.
877:info:build /usr/bin/clang -c -I. -Iproto -DHAVE_CONFIG_H -DFEAT_GUI_MACVIM -Wall -Wno-unknown-pragmas -pipe  -I/opt/local/include -isysroot/Applications/Xcode.app/Contents/Developer/Platforms/MacOSX.platform/Developer/SDKs/MacOSX12.3.sdk -DMACOS_X -DMACOS_X_DARWIN  -pipe -Os -isysroot/Applications/Xcode.app/Contents/Developer/Platforms/MacOSX.platform/Developer/SDKs/MacOSX12.3.sdk -arch x86_64 -U_FORTIFY_SOURCE -D_FORTIFY_SOURCE=1        -fobjc-exceptions -o objects/MMBackend.o MacVim/MMBackend.m
878:info:build 2651 translated messages.
879:info:build OLD_PO_FILE_INPUT=yes msgfmt -v -o ko.mo ko.po
880:info:build 1938 translated messages.
881:info:build /usr/bin/clang -c -I. -Iproto -DHAVE_CONFIG_H -DFEAT_GUI_MACVIM -Wall -Wno-unknown-pragmas -pipe  -I/opt/local/include -isysroot/Applications/Xcode.app/Contents/Developer/Platforms/MacOSX.platform/Developer/SDKs/MacOSX12.3.sdk -DMACOS_X -DMACOS_X_DARWIN  -pipe -Os -isysroot/Applications/Xcode.app/Contents/Developer/Platforms/MacOSX.platform/Developer/SDKs/MacOSX12.3.sdk -arch x86_64 -U_FORTIFY_SOURCE -D_FORTIFY_SOURCE=1        -o objects/MacVim.o MacVim/MacVim.m
882:info:build 2187 translated messages.
883:info:build /usr/bin/clang -c -I. -Ilibvterm/include -Iproto -DHAVE_CONFIG_H -DFEAT_GUI_MACVIM -Wall -Wno-unknown-pragmas -pipe  -I/opt/local/include -isysroot/Applications/Xcode.app/Contents/Developer/Platforms/MacOSX.platform/Developer/SDKs/MacOSX12.3.sdk -DMACOS_X -DMACOS_X_DARWIN  -pipe -Os -isysroot/Applications/Xcode.app/Contents/Developer/Platforms/MacOSX.platform/Developer/SDKs/MacOSX12.3.sdk -arch x86_64 -U_FORTIFY_SOURCE -D_FORTIFY_SOURCE=1        -DINLINE="" -DVSNPRINTF=vim_vsnprintf -DSNPRINTF=vim_snprintf -DIS_COMBINING_FUNCTION=utf_iscomposing_uint -DWCWIDTH_FUNCTION=utf_uint2cells -o objects/vterm_encoding.o libvterm/src/encoding.c
884:info:build 1928 translated messages.
885:info:build OLD_PO_FILE_INPUT=yes msgfmt -v -o lv.mo lv.po
886:info:build 2002 translated messages.
887:info:build OLD_PO_FILE_INPUT=yes msgfmt -v -o nb.mo nb.po
888:info:build 1867 translated messages.
889:info:build 2037 translated messages.
890:info:build OLD_PO_FILE_INPUT=yes msgfmt -v -o nl.mo nl.po
891:info:build /usr/bin/clang -c -I. -Ilibvterm/include -Iproto -DHAVE_CONFIG_H -DFEAT_GUI_MACVIM -Wall -Wno-unknown-pragmas -pipe  -I/opt/local/include -isysroot/Applications/Xcode.app/Contents/Developer/Platforms/MacOSX.platform/Developer/SDKs/MacOSX12.3.sdk -DMACOS_X -DMACOS_X_DARWIN  -pipe -Os -isysroot/Applications/Xcode.app/Contents/Developer/Platforms/MacOSX.platform/Developer/SDKs/MacOSX12.3.sdk -arch x86_64 -U_FORTIFY_SOURCE -D_FORTIFY_SOURCE=1        -DINLINE="" -DVSNPRINTF=vim_vsnprintf -DSNPRINTF=vim_snprintf -DIS_COMBINING_FUNCTION=utf_iscomposing_uint -DWCWIDTH_FUNCTION=utf_uint2cells -o objects/vterm_keyboard.o libvterm/src/keyboard.c
892:info:build 1867 translated messages.
893:info:build OLD_PO_FILE_INPUT=yes msgfmt -v -o no.mo no.po
894:info:build 78 translated messages.
895:info:build OLD_PO_FILE_INPUT=yes msgfmt -v -o pl.mo pl.po
896:info:build 1207 translated messages.
897:info:build /usr/bin/clang -c -I. -Ilibvterm/include -Iproto -DHAVE_CONFIG_H -DFEAT_GUI_MACVIM -Wall -Wno-unknown-pragmas -pipe  -I/opt/local/include -isysroot/Applications/Xcode.app/Contents/Developer/Platforms/MacOSX.platform/Developer/SDKs/MacOSX12.3.sdk -DMACOS_X -DMACOS_X_DARWIN  -pipe -Os -isysroot/Applications/Xcode.app/Contents/Developer/Platforms/MacOSX.platform/Developer/SDKs/MacOSX12.3.sdk -arch x86_64 -U_FORTIFY_SOURCE -D_FORTIFY_SOURCE=1        -DINLINE="" -DVSNPRINTF=vim_vsnprintf -DSNPRINTF=vim_snprintf -DIS_COMBINING_FUNCTION=utf_iscomposing_uint -DWCWIDTH_FUNCTION=utf_uint2cells -o objects/vterm_mouse.o libvterm/src/mouse.c
898:info:build 1655 translated messages.
899:info:build /usr/bin/clang -c -I. -Ilibvterm/include -Iproto -DHAVE_CONFIG_H -DFEAT_GUI_MACVIM -Wall -Wno-unknown-pragmas -pipe  -I/opt/local/include -isysroot/Applications/Xcode.app/Contents/Developer/Platforms/MacOSX.platform/Developer/SDKs/MacOSX12.3.sdk -DMACOS_X -DMACOS_X_DARWIN  -pipe -Os -isysroot/Applications/Xcode.app/Contents/Developer/Platforms/MacOSX.platform/Developer/SDKs/MacOSX12.3.sdk -arch x86_64 -U_FORTIFY_SOURCE -D_FORTIFY_SOURCE=1        -DINLINE="" -DVSNPRINTF=vim_vsnprintf -DSNPRINTF=vim_snprintf -DIS_COMBINING_FUNCTION=utf_iscomposing_uint -DWCWIDTH_FUNCTION=utf_uint2cells -o objects/vterm_parser.o libvterm/src/parser.c
900:info:build 1655 translated messages.
901:info:build OLD_PO_FILE_INPUT=yes msgfmt -v -o pt_BR.mo pt_BR.po
902:info:build 1858 translated messages.
903:info:build /usr/bin/clang -c -I. -Ilibvterm/include -Iproto -DHAVE_CONFIG_H -DFEAT_GUI_MACVIM -Wall -Wno-unknown-pragmas -pipe  -I/opt/local/include -isysroot/Applications/Xcode.app/Contents/Developer/Platforms/MacOSX.platform/Developer/SDKs/MacOSX12.3.sdk -DMACOS_X -DMACOS_X_DARWIN  -pipe -Os -isysroot/Applications/Xcode.app/Contents/Developer/Platforms/MacOSX.platform/Developer/SDKs/MacOSX12.3.sdk -arch x86_64 -U_FORTIFY_SOURCE -D_FORTIFY_SOURCE=1        -DINLINE="" -DVSNPRINTF=vim_vsnprintf -DSNPRINTF=vim_snprintf -DIS_COMBINING_FUNCTION=utf_iscomposing_uint -DWCWIDTH_FUNCTION=utf_uint2cells -o objects/vterm_pen.o libvterm/src/pen.c
904:info:build 1934 translated messages.
905:info:build OLD_PO_FILE_INPUT=yes msgfmt -v -o ru.mo ru.po
906:info:build OLD_PO_FILE_INPUT=yes msgfmt -v -o sk.mo sk.po
907:info:build 2038 translated messages.
908:info:build /usr/bin/clang -c -I. -Ilibvterm/include -Iproto -DHAVE_CONFIG_H -DFEAT_GUI_MACVIM -Wall -Wno-unknown-pragmas -pipe  -I/opt/local/include -isysroot/Applications/Xcode.app/Contents/Developer/Platforms/MacOSX.platform/Developer/SDKs/MacOSX12.3.sdk -DMACOS_X -DMACOS_X_DARWIN  -pipe -Os -isysroot/Applications/Xcode.app/Contents/Developer/Platforms/MacOSX.platform/Developer/SDKs/MacOSX12.3.sdk -arch x86_64 -U_FORTIFY_SOURCE -D_FORTIFY_SOURCE=1        -DINLINE="" -DVSNPRINTF=vim_vsnprintf -DSNPRINTF=vim_snprintf -DIS_COMBINING_FUNCTION=utf_iscomposing_uint -DWCWIDTH_FUNCTION=utf_uint2cells -o objects/vterm_screen.o libvterm/src/screen.c
909:info:build 1615 translated messages.
910:info:build OLD_PO_FILE_INPUT=yes msgfmt -v -o sr.mo sr.po
911:info:build OLD_PO_FILE_INPUT=yes msgfmt -v -o sv.mo sv.po
912:info:build OLD_PO_FILE_INPUT=yes msgfmt -v -o tr.mo tr.po
913:info:build OLD_PO_FILE_INPUT=yes msgfmt -v -o uk.mo uk.po
914:info:build 2676 translated messages.
915:info:build /usr/bin/clang -c -I. -Ilibvterm/include -Iproto -DHAVE_CONFIG_H -DFEAT_GUI_MACVIM -Wall -Wno-unknown-pragmas -pipe  -I/opt/local/include -isysroot/Applications/Xcode.app/Contents/Developer/Platforms/MacOSX.platform/Developer/SDKs/MacOSX12.3.sdk -DMACOS_X -DMACOS_X_DARWIN  -pipe -Os -isysroot/Applications/Xcode.app/Contents/Developer/Platforms/MacOSX.platform/Developer/SDKs/MacOSX12.3.sdk -arch x86_64 -U_FORTIFY_SOURCE -D_FORTIFY_SOURCE=1        -DINLINE="" -DVSNPRINTF=vim_vsnprintf -DSNPRINTF=vim_snprintf -DIS_COMBINING_FUNCTION=utf_iscomposing_uint -DWCWIDTH_FUNCTION=utf_uint2cells -o objects/vterm_state.o libvterm/src/state.c
916:info:build 1684 translated messages.
917:info:build /usr/bin/clang -c -I. -Ilibvterm/include -Iproto -DHAVE_CONFIG_H -DFEAT_GUI_MACVIM -Wall -Wno-unknown-pragmas -pipe  -I/opt/local/include -isysroot/Applications/Xcode.app/Contents/Developer/Platforms/MacOSX.platform/Developer/SDKs/MacOSX12.3.sdk -DMACOS_X -DMACOS_X_DARWIN  -pipe -Os -isysroot/Applications/Xcode.app/Contents/Developer/Platforms/MacOSX.platform/Developer/SDKs/MacOSX12.3.sdk -arch x86_64 -U_FORTIFY_SOURCE -D_FORTIFY_SOURCE=1        -DINLINE="" -DVSNPRINTF=vim_vsnprintf -DSNPRINTF=vim_snprintf -DIS_COMBINING_FUNCTION=utf_iscomposing_uint -DWCWIDTH_FUNCTION=utf_uint2cells -o objects/vterm_unicode.o libvterm/src/unicode.c
918:info:build 2651 translated messages.
919:info:build /usr/bin/clang -c -I. -Ilibvterm/include -Iproto -DHAVE_CONFIG_H -DFEAT_GUI_MACVIM -Wall -Wno-unknown-pragmas -pipe  -I/opt/local/include -isysroot/Applications/Xcode.app/Contents/Developer/Platforms/MacOSX.platform/Developer/SDKs/MacOSX12.3.sdk -DMACOS_X -DMACOS_X_DARWIN  -pipe -Os -isysroot/Applications/Xcode.app/Contents/Developer/Platforms/MacOSX.platform/Developer/SDKs/MacOSX12.3.sdk -arch x86_64 -U_FORTIFY_SOURCE -D_FORTIFY_SOURCE=1        -DINLINE="" -DVSNPRINTF=vim_vsnprintf -DSNPRINTF=vim_snprintf -DIS_COMBINING_FUNCTION=utf_iscomposing_uint -DWCWIDTH_FUNCTION=utf_uint2cells -o objects/vterm_vterm.o libvterm/src/vterm.c
920:info:build 1961 translated messages.
921:info:build OLD_PO_FILE_INPUT=yes msgfmt -v -o vi.mo vi.po
922:info:build OLD_PO_FILE_INPUT=yes msgfmt -v -o zh_CN.UTF-8.mo zh_CN.UTF-8.po
923:info:build 1410 translated messages.
924:info:build OLD_PO_FILE_INPUT=yes msgfmt -v -o zh_CN.mo zh_CN.po
925:info:build 1623 translated messages, 3 fuzzy translations.
926:info:build /usr/bin/clang -c -I. -Iproto -DHAVE_CONFIG_H -DFEAT_GUI_MACVIM -Wall -Wno-unknown-pragmas -pipe  -I/opt/local/include -isysroot/Applications/Xcode.app/Contents/Developer/Platforms/MacOSX.platform/Developer/SDKs/MacOSX12.3.sdk -DMACOS_X -DMACOS_X_DARWIN  -pipe -Os -isysroot/Applications/Xcode.app/Contents/Developer/Platforms/MacOSX.platform/Developer/SDKs/MacOSX12.3.sdk -arch x86_64 -U_FORTIFY_SOURCE -D_FORTIFY_SOURCE=1        -o objects/os_macosx.o os_macosx.m
927:info:build 1622 translated messages, 3 fuzzy translations.
928:info:build OLD_PO_FILE_INPUT=yes msgfmt -v -o zh_TW.UTF-8.mo zh_TW.UTF-8.po
929:info:build 1412 translated messages.
930:info:build OLD_PO_FILE_INPUT=yes msgfmt -v -o zh_TW.mo zh_TW.po
931:info:build OLD_PO_FILE_INPUT=yes msgfmt -v -o cs.cp1250.mo cs.cp1250.po
932:info:build 1272 translated messages.
933:info:build /usr/bin/clang -c -I. -Iproto -DHAVE_CONFIG_H -DFEAT_GUI_MACVIM -Wall -Wno-unknown-pragmas -pipe  -I/opt/local/include -isysroot/Applications/Xcode.app/Contents/Developer/Platforms/MacOSX.platform/Developer/SDKs/MacOSX12.3.sdk -DMACOS_X -DMACOS_X_DARWIN  -pipe -Os -isysroot/Applications/Xcode.app/Contents/Developer/Platforms/MacOSX.platform/Developer/SDKs/MacOSX12.3.sdk -arch x86_64 -U_FORTIFY_SOURCE -D_FORTIFY_SOURCE=1        -o objects/os_mac_conv.o os_mac_conv.c
934:info:build 1412 translated messages.
935:info:build OLD_PO_FILE_INPUT=yes msgfmt -v -o ja.euc-jp.mo ja.euc-jp.po
936:info:build OLD_PO_FILE_INPUT=yes msgfmt -v -o ja.sjis.mo ja.sjis.po
937:info:build 2037 translated messages.
938:info:build OLD_PO_FILE_INPUT=yes msgfmt -v -o pl.UTF-8.mo pl.UTF-8.po
939:info:build 2037 translated messages.
940:info:build OLD_PO_FILE_INPUT=yes msgfmt -v -o pl.cp1250.mo pl.cp1250.po
941:info:build 1858 translated messages.
942:info:build OLD_PO_FILE_INPUT=yes msgfmt -v -o ru.cp1251.mo ru.cp1251.po
943:info:build make[2]: Leaving directory `/opt/local/var/macports/build/_opt_local_var_macports_sources_rsync.macports.org_macports_release_tarballs_ports_editors_MacVim/MacVim/work/macvim-dev-macvim-e65c14c/src/xxd'
944:info:build OLD_PO_FILE_INPUT=yes msgfmt -v -o sk.cp1250.mo sk.cp1250.po
945:info:build OLD_PO_FILE_INPUT=yes msgfmt -v -o uk.cp1251.mo uk.cp1251.po
946:info:build 1858 translated messages.
947:info:build OLD_PO_FILE_INPUT=yes msgfmt -v -o zh_CN.cp936.mo zh_CN.cp936.po
948:info:build 1615 translated messages.
949:info:build echo af ca cs cs.cp1250 da de en_GB eo es fi fr ga it ja ja.euc-jp ja.sjis ko ko.UTF-8 lv nb nl no pl pl.UTF-8 pl.cp1250 pt_BR ru ru.cp1251 sk sk.cp1250 sr sv tr uk uk.cp1251 vi zh_CN zh_CN.UTF-8 zh_CN.cp936 zh_TW zh_TW.UTF-8  | tr " " "\n" |sed -e '/\./d' | sort > LINGUAS
950:info:build 2038 translated messages.
951:info:build echo af ca cs cs.cp1250 da de en_GB eo es fi fr ga it ja ja.euc-jp ja.sjis ko ko.UTF-8 lv nb nl no pl pl.UTF-8 pl.cp1250 pt_BR ru ru.cp1251 sk sk.cp1250 sr sv tr uk uk.cp1251 vi zh_CN zh_CN.UTF-8 zh_CN.cp936 zh_TW zh_TW.UTF-8  | tr " " "\n" |sed -e '/\./d' | sort > LINGUAS
952:info:build 1961 translated messages.
953:info:build msgfmt --desktop -d . --template gvim.desktop.in -o tmp_gvim.desktop
954:info:build 1623 translated messages, 3 fuzzy translations.
955:info:build msgfmt --desktop -d . --template vim.desktop.in -o tmp_vim.desktop
956:info:build rm -f LINGUAS
957:info:build if command -v desktop-file-validate; then desktop-file-validate tmp_vim.desktop; fi
958:info:build rm -f LINGUAS
959:info:build if command -v desktop-file-validate; then desktop-file-validate tmp_gvim.desktop; fi
960:info:build mv tmp_vim.desktop vim.desktop
961:info:build mv tmp_gvim.desktop gvim.desktop
962:info:build make[2]: Leaving directory `/opt/local/var/macports/build/_opt_local_var_macports_sources_rsync.macports.org_macports_release_tarballs_ports_editors_MacVim/MacVim/work/macvim-dev-macvim-e65c14c/src/po'
963:info:build make[2]: Entering directory `/opt/local/var/macports/build/_opt_local_var_macports_sources_rsync.macports.org_macports_release_tarballs_ports_editors_MacVim/MacVim/work/macvim-dev-macvim-e65c14c/src/po'
964:info:build make[2]: Nothing to be done for `converted'.
965:info:build make[2]: Leaving directory `/opt/local/var/macports/build/_opt_local_var_macports_sources_rsync.macports.org_macports_release_tarballs_ports_editors_MacVim/MacVim/work/macvim-dev-macvim-e65c14c/src/po'
966:info:build In file included from MacVim/MMBackend.m:30:
967:info:build MacVim/MMBackend.h:21:5: warning: 'NSConnection' is deprecated: first deprecated in macOS 10.13 - Use NSXPCConnection instead [-Wdeprecated-declarations]
968:info:build     NSConnection        *connection;
969:info:build     ^
970:info:build /Applications/Xcode.app/Contents/Developer/Platforms/MacOSX.platform/Developer/SDKs/MacOSX12.3.sdk/System/Library/Frameworks/Foundation.framework/Headers/NSConnection.h:18:12: note: 'NSConnection' has been explicitly marked deprecated here
971:info:build @interface NSConnection : NSObject {
972:info:build            ^
973:info:build In file included from MacVim/MMBackend.m:30:
974:info:build MacVim/MMBackend.h:22:5: warning: 'NSConnection' is deprecated: first deprecated in macOS 10.13 - Use NSXPCConnection instead [-Wdeprecated-declarations]
975:info:build     NSConnection        *vimServerConnection;
976:info:build     ^
977:info:build /Applications/Xcode.app/Contents/Developer/Platforms/MacOSX.platform/Developer/SDKs/MacOSX12.3.sdk/System/Library/Frameworks/Foundation.framework/Headers/NSConnection.h:18:12: note: 'NSConnection' has been explicitly marked deprecated here
978:info:build @interface NSConnection : NSObject {
979:info:build            ^
980:info:build In file included from MacVim/MMBackend.m:30:
981:info:build MacVim/MMBackend.h:66:4: warning: 'NSConnection' is deprecated: first deprecated in macOS 10.13 - Use NSXPCConnection instead [-Wdeprecated-declarations]
982:info:build - (NSConnection *)connection;
983:info:build    ^
984:info:build /Applications/Xcode.app/Contents/Developer/Platforms/MacOSX.platform/Developer/SDKs/MacOSX12.3.sdk/System/Library/Frameworks/Foundation.framework/Headers/NSConnection.h:18:12: note: 'NSConnection' has been explicitly marked deprecated here
985:info:build @interface NSConnection : NSObject {
986:info:build            ^
987:info:build In file included from MacVim/gui_macvim.m:16:
988:info:build MacVim/MMBackend.h:21:5: warning: 'NSConnection' is deprecated: first deprecated in macOS 10.13 - Use NSXPCConnection instead [-Wdeprecated-declarations]
989:info:build     NSConnection        *connection;
990:info:build     ^
991:info:build /Applications/Xcode.app/Contents/Developer/Platforms/MacOSX.platform/Developer/SDKs/MacOSX12.3.sdk/System/Library/Frameworks/Foundation.framework/Headers/NSConnection.h:18:12: note: 'NSConnection' has been explicitly marked deprecated here
992:info:build @interface NSConnection : NSObject {
993:info:build            ^
994:info:build In file included from MacVim/gui_macvim.m:16:
995:info:build MacVim/MMBackend.h:22:5: warning: 'NSConnection' is deprecated: first deprecated in macOS 10.13 - Use NSXPCConnection instead [-Wdeprecated-declarations]
996:info:build     NSConnection        *vimServerConnection;
997:info:build     ^
998:info:build /Applications/Xcode.app/Contents/Developer/Platforms/MacOSX.platform/Developer/SDKs/MacOSX12.3.sdk/System/Library/Frameworks/Foundation.framework/Headers/NSConnection.h:18:12: note: 'NSConnection' has been explicitly marked deprecated here
999:info:build @interface NSConnection : NSObject {
1000:info:build            ^
1001:info:build In file included from MacVim/gui_macvim.m:16:
1002:info:build MacVim/MMBackend.h:66:4: warning: 'NSConnection' is deprecated: first deprecated in macOS 10.13 - Use NSXPCConnection instead [-Wdeprecated-declarations]
1003:info:build - (NSConnection *)connection;
1004:info:build    ^
1005:info:build /Applications/Xcode.app/Contents/Developer/Platforms/MacOSX.platform/Developer/SDKs/MacOSX12.3.sdk/System/Library/Frameworks/Foundation.framework/Headers/NSConnection.h:18:12: note: 'NSConnection' has been explicitly marked deprecated here
1006:info:build @interface NSConnection : NSObject {
1007:info:build            ^
1008:info:build MacVim/MMBackend.m:208:4: warning: 'NSConnection' is deprecated: first deprecated in macOS 10.13 - Use NSXPCConnection instead [-Wdeprecated-declarations]
1009:info:build - (NSConnection *)connectionForServerName:(NSString *)name;
1010:info:build    ^
1011:info:build /Applications/Xcode.app/Contents/Developer/Platforms/MacOSX.platform/Developer/SDKs/MacOSX12.3.sdk/System/Library/Frameworks/Foundation.framework/Headers/NSConnection.h:18:12: note: 'NSConnection' has been explicitly marked deprecated here
1012:info:build @interface NSConnection : NSObject {
1013:info:build            ^
1014:info:build MacVim/MMBackend.m:209:4: warning: 'NSConnection' is deprecated: first deprecated in macOS 10.13 - Use NSXPCConnection instead [-Wdeprecated-declarations]
1015:info:build - (NSConnection *)connectionForServerPort:(int)port;
1016:info:build    ^
1017:info:build /Applications/Xcode.app/Contents/Developer/Platforms/MacOSX.platform/Developer/SDKs/MacOSX12.3.sdk/System/Library/Frameworks/Foundation.framework/Headers/NSConnection.h:18:12: note: 'NSConnection' has been explicitly marked deprecated here
1018:info:build @interface NSConnection : NSObject {
1019:info:build            ^
1020:info:build MacVim/MMBackend.m:211:20: warning: 'NSDistantObject' is deprecated: first deprecated in macOS 10.13 - Use NSXPCConnection instead [-Wdeprecated-declarations]
1021:info:build - (void)addClient:(NSDistantObject *)client;
1022:info:build                    ^
1023:info:build /Applications/Xcode.app/Contents/Developer/Platforms/MacOSX.platform/Developer/SDKs/MacOSX12.3.sdk/System/Library/Frameworks/Foundation.framework/Headers/NSDistantObject.h:13:12: note: 'NSDistantObject' has been explicitly marked deprecated here
1024:info:build @interface NSDistantObject : NSProxy <NSCoding> {
1025:info:build            ^
1026:info:build MacVim/MMBackend.m:315:4: warning: 'NSConnection' is deprecated: first deprecated in macOS 10.13 - Use NSXPCConnection instead [-Wdeprecated-declarations]
1027:info:build - (NSConnection *)connection
1028:info:build    ^
1029:info:build /Applications/Xcode.app/Contents/Developer/Platforms/MacOSX.platform/Developer/SDKs/MacOSX12.3.sdk/System/Library/Frameworks/Foundation.framework/Headers/NSConnection.h:18:12: note: 'NSConnection' has been explicitly marked deprecated here
1030:info:build @interface NSConnection : NSObject {
1031:info:build            ^
1032:info:build MacVim/MMBackend.m:323:36: warning: 'NSConnection' is deprecated: first deprecated in macOS 10.13 - Use NSXPCConnection instead [-Wdeprecated-declarations]
1033:info:build         connection = [NSConnection connectionWithRegisteredName:name host:nil];
1034:info:build                                    ^
1035:info:build /Applications/Xcode.app/Contents/Developer/Platforms/MacOSX.platform/Developer/SDKs/MacOSX12.3.sdk/System/Library/Frameworks/Foundation.framework/Headers/NSConnection.h:18:12: note: 'NSConnection' has been explicitly marked deprecated here
1036:info:build @interface NSConnection : NSObject {
1037:info:build            ^
1038:info:build MacVim/MMBackend.m:449:26: warning: 'NSConnectionDidDieNotification' is deprecated: first deprecated in macOS 10.13 - Use NSXPCConnection instead [-Wdeprecated-declarations]
1039:info:build                     name:NSConnectionDidDieNotification object:connection];
1040:info:build                          ^
1041:info:build /Applications/Xcode.app/Contents/Developer/Platforms/MacOSX.platform/Developer/SDKs/MacOSX12.3.sdk/System/Library/Frameworks/Foundation.framework/Headers/NSConnection.h:110:36: note: 'NSConnectionDidDieNotification' has been explicitly marked deprecated here
1042:info:build FOUNDATION_EXPORT NSString * const NSConnectionDidDieNotification NS_SWIFT_UNAVAILABLE("Use NSXPCConnection instead") API_DEPRECATED("Use NSXPCConnection instead", macosx(10.0, 10.13), ios(2.0,11.0), watchos(2.0,4.0), tvos(9.0,11.0));
1043:info:build                                    ^
1044:info:build MacVim/MMBackend.m:1155:28: warning: 'colorUsingColorSpaceName:' is deprecated: first deprecated in macOS 10.14 - Use -colorUsingType: or -colorUsingColorSpace: instead [-Wdeprecated-declarations]
1045:info:build                 col = [col colorUsingColorSpaceName:NSCalibratedRGBColorSpace];
1046:info:build                            ^
1047:info:build /Applications/Xcode.app/Contents/Developer/Platforms/MacOSX.platform/Developer/SDKs/MacOSX12.3.sdk/System/Library/Frameworks/AppKit.framework/Headers/NSColor.h:419:1: note: 'colorUsingColorSpaceName:' has been explicitly marked deprecated here
1048:info:build - (nullable NSColor *)colorUsingColorSpaceName:(NSColorSpaceName)name API_DEPRECATED("Use -colorUsingType: or -colorUsingColorSpace: instead", macos(10.0,10.14));
1049:info:build ^
1050:info:build MacVim/MMBackend.m:1410:51: warning: 'NSStringPboardType' is deprecated: first deprecated in macOS 10.14 [-Wdeprecated-declarations]
1051:info:build         NSArray *types = [NSArray arrayWithObject:NSStringPboardType];
1052:info:build                                                   ^~~~~~~~~~~~~~~~~~
1053:info:build                                                   NSPasteboardTypeString
1054:info:build /Applications/Xcode.app/Contents/Developer/Platforms/MacOSX.platform/Developer/SDKs/MacOSX12.3.sdk/System/Library/Frameworks/AppKit.framework/Headers/NSPasteboard.h:311:32: note: 'NSStringPboardType' has been explicitly marked deprecated here
1055:info:build APPKIT_EXTERN NSPasteboardType NSStringPboardType API_DEPRECATED_WITH_REPLACEMENT("NSPasteboardTypeString", macos(10.0,10.14));
1056:info:build                                ^
1057:info:build MacVim/MMBackend.m:1412:52: warning: 'NSStringPboardType' is deprecated: first deprecated in macOS 10.14 [-Wdeprecated-declarations]
1058:info:build         BOOL ok = [pboard setString:string forType:NSStringPboardType];
1059:info:build                                                    ^~~~~~~~~~~~~~~~~~
1060:info:build                                                    NSPasteboardTypeString
1061:info:build /Applications/Xcode.app/Contents/Developer/Platforms/MacOSX.platform/Developer/SDKs/MacOSX12.3.sdk/System/Library/Frameworks/AppKit.framework/Headers/NSPasteboard.h:311:32: note: 'NSStringPboardType' has been explicitly marked deprecated here
1062:info:build APPKIT_EXTERN NSPasteboardType NSStringPboardType API_DEPRECATED_WITH_REPLACEMENT("NSPasteboardTypeString", macos(10.0,10.14));
1063:info:build                                ^
1064:info:build MacVim/MMBackend.m:1431:5: warning: 'NSConnection' is deprecated: first deprecated in macOS 10.13 - Use NSXPCConnection instead [-Wdeprecated-declarations]
1065:info:build     NSConnection *conn = [(NSDistantObject*)server connectionForProxy];
1066:info:build     ^
1067:info:build /Applications/Xcode.app/Contents/Developer/Platforms/MacOSX.platform/Developer/SDKs/MacOSX12.3.sdk/System/Library/Frameworks/Foundation.framework/Headers/NSConnection.h:18:12: note: 'NSConnection' has been explicitly marked deprecated here
1068:info:build @interface NSConnection : NSObject {
1069:info:build            ^
1070:info:build MacVim/MMBackend.m:1431:28: warning: 'NSDistantObject' is deprecated: first deprecated in macOS 10.13 - Use NSXPCConnection instead [-Wdeprecated-declarations]
1071:info:build     NSConnection *conn = [(NSDistantObject*)server connectionForProxy];
1072:info:build                            ^
1073:info:build /Applications/Xcode.app/Contents/Developer/Platforms/MacOSX.platform/Developer/SDKs/MacOSX12.3.sdk/System/Library/Frameworks/Foundation.framework/Headers/NSDistantObject.h:13:12: note: 'NSDistantObject' has been explicitly marked deprecated here
1074:info:build @interface NSDistantObject : NSProxy <NSCoding> {
1075:info:build            ^
1076:info:build MacVim/MMBackend.m:1476:42: warning: 'NSConnection' is deprecated: first deprecated in macOS 10.13 - Use NSXPCConnection instead [-Wdeprecated-declarations]
1077:info:build     vimServerConnection = [[NSConnection alloc]
1078:info:build                                          ^
1079:info:build /Applications/Xcode.app/Contents/Developer/Platforms/MacOSX.platform/Developer/SDKs/MacOSX12.3.sdk/System/Library/Frameworks/Foundation.framework/Headers/NSConnection.h:18:12: note: 'NSConnection' has been explicitly marked deprecated here
1080:info:build @interface NSConnection : NSObject {
1081:info:build            ^
1082:info:build MacVim/MMBackend.m:1519:5: warning: 'NSConnection' is deprecated: first deprecated in macOS 10.13 - Use NSXPCConnection instead [-Wdeprecated-declarations]
1083:info:build     NSConnection *conn = [self connectionForServerName:name];
1084:info:build     ^
1085:info:build /Applications/Xcode.app/Contents/Developer/Platforms/MacOSX.platform/Developer/SDKs/MacOSX12.3.sdk/System/Library/Frameworks/Foundation.framework/Headers/NSConnection.h:18:12: note: 'NSConnection' has been explicitly marked deprecated here
1086:info:build @interface NSConnection : NSObject {
1087:info:build            ^
1088:info:build MacVim/MMBackend.m:1605:5: warning: 'NSConnection' is deprecated: first deprecated in macOS 10.13 - Use NSXPCConnection instead [-Wdeprecated-declarations]
1089:info:build     NSConnection *conn = [self connectionForServerPort:port];
1090:info:build     ^
1091:info:build /Applications/Xcode.app/Contents/Developer/Platforms/MacOSX.platform/Developer/SDKs/MacOSX12.3.sdk/System/Library/Frameworks/Foundation.framework/Headers/NSConnection.h:18:12: note: 'NSConnection' has been explicitly marked deprecated here
1092:info:build @interface NSConnection : NSObject {
1093:info:build            ^
1094:info:build MacVim/gui_macvim.m:1918:57: warning: 'NSFindPboard' is deprecated: first deprecated in macOS 10.13 [-Wdeprecated-declarations]
1095:info:build     NSPasteboard *pb = [NSPasteboard pasteboardWithName:NSFindPboard];
1096:info:build                                                         ^~~~~~~~~~~~
1097:info:build                                                         NSPasteboardNameFind
1098:info:build /Applications/Xcode.app/Contents/Developer/Platforms/MacOSX.platform/Developer/SDKs/MacOSX12.3.sdk/System/Library/Frameworks/AppKit.framework/Headers/NSPasteboard.h:337:32: note: 'NSFindPboard' has been explicitly marked deprecated here
1099:info:build APPKIT_EXTERN NSPasteboardName NSFindPboard API_DEPRECATED_WITH_REPLACEMENT("NSPasteboardNameFind", macos(10.0,10.13));
1100:info:build                                ^
1101:info:build MacVim/gui_macvim.m:1920:13: warning: 'NSStringPboardType' is deprecated: first deprecated in macOS 10.14 [-Wdeprecated-declarations]
1102:info:build             NSStringPboardType, nil];
1103:info:build             ^~~~~~~~~~~~~~~~~~
1104:info:build             NSPasteboardTypeString
1105:info:build /Applications/Xcode.app/Contents/Developer/Platforms/MacOSX.platform/Developer/SDKs/MacOSX12.3.sdk/System/Library/Frameworks/AppKit.framework/Headers/NSPasteboard.h:311:32: note: 'NSStringPboardType' has been explicitly marked deprecated here
1106:info:build APPKIT_EXTERN NSPasteboardType NSStringPboardType API_DEPRECATED_WITH_REPLACEMENT("NSPasteboardTypeString", macos(10.0,10.14));
1107:info:build                                ^
1108:info:build MacVim/gui_macvim.m:1929:60: warning: 'NSStringPboardType' is deprecated: first deprecated in macOS 10.14 [-Wdeprecated-declarations]
1109:info:build     [pb setString:[s stringByRemovingFindPatterns] forType:NSStringPboardType];
1110:info:build                                                            ^~~~~~~~~~~~~~~~~~
1111:info:build                                                            NSPasteboardTypeString
1112:info:build /Applications/Xcode.app/Contents/Developer/Platforms/MacOSX.platform/Developer/SDKs/MacOSX12.3.sdk/System/Library/Frameworks/AppKit.framework/Headers/NSPasteboard.h:311:32: note: 'NSStringPboardType' has been explicitly marked deprecated here
1113:info:build APPKIT_EXTERN NSPasteboardType NSStringPboardType API_DEPRECATED_WITH_REPLACEMENT("NSPasteboardTypeString", macos(10.0,10.14));
1114:info:build                                ^
1115:info:build MacVim/MMBackend.m:2418:14: warning: 'NSScrollerDecrementLine' is deprecated: first deprecated in macOS 10.14 - Scroller arrows are not used anymore. [-Wdeprecated-declarations]
1116:info:build         case NSScrollerDecrementLine:
1117:info:build              ^
1118:info:build /Applications/Xcode.app/Contents/Developer/Platforms/MacOSX.platform/Developer/SDKs/MacOSX12.3.sdk/System/Library/Frameworks/AppKit.framework/Headers/NSScroller.h:26:5: note: 'NSScrollerDecrementLine' has been explicitly marked deprecated here
1119:info:build     NSScrollerDecrementLine API_DEPRECATED("Scroller arrows are not used anymore.", macos(10.0,10.14)) = 4,
1120:info:build     ^
1121:info:build MacVim/MMBackend.m:2421:14: warning: 'NSScrollerIncrementLine' is deprecated: first deprecated in macOS 10.14 - Scroller arrows are not used anymore. [-Wdeprecated-declarations]
1122:info:build         case NSScrollerIncrementLine:
1123:info:build              ^
1124:info:build /Applications/Xcode.app/Contents/Developer/Platforms/MacOSX.platform/Developer/SDKs/MacOSX12.3.sdk/System/Library/Frameworks/AppKit.framework/Headers/NSScroller.h:27:5: note: 'NSScrollerIncrementLine' has been explicitly marked deprecated here
1125:info:build     NSScrollerIncrementLine API_DEPRECATED("Scroller arrows are not used anymore.", macos(10.0,10.14)) = 5,
1126:info:build     ^
1127:info:build MacVim/MMBackend.m:3401:4: warning: 'NSConnection' is deprecated: first deprecated in macOS 10.13 - Use NSXPCConnection instead [-Wdeprecated-declarations]
1128:info:build - (NSConnection *)connectionForServerName:(NSString *)name
1129:info:build    ^
1130:info:build /Applications/Xcode.app/Contents/Developer/Platforms/MacOSX.platform/Developer/SDKs/MacOSX12.3.sdk/System/Library/Frameworks/Foundation.framework/Headers/NSConnection.h:18:12: note: 'NSConnection' has been explicitly marked deprecated here
1131:info:build @interface NSConnection : NSObject {
1132:info:build            ^
1133:info:build MacVim/MMBackend.m:3453:4: warning: 'NSConnection' is deprecated: first deprecated in macOS 10.13 - Use NSXPCConnection instead [-Wdeprecated-declarations]
1134:info:build - (NSConnection *)connectionForServerPort:(int)port
1135:info:build    ^
1136:info:build /Applications/Xcode.app/Contents/Developer/Platforms/MacOSX.platform/Developer/SDKs/MacOSX12.3.sdk/System/Library/Frameworks/Foundation.framework/Headers/NSConnection.h:18:12: note: 'NSConnection' has been explicitly marked deprecated here
1137:info:build @interface NSConnection : NSObject {
1138:info:build            ^
1139:info:build MacVim/MMBackend.m:3490:20: warning: 'NSDistantObject' is deprecated: first deprecated in macOS 10.13 - Use NSXPCConnection instead [-Wdeprecated-declarations]
1140:info:build - (void)addClient:(NSDistantObject *)client
1141:info:build                    ^
1142:info:build /Applications/Xcode.app/Contents/Developer/Platforms/MacOSX.platform/Developer/SDKs/MacOSX12.3.sdk/System/Library/Frameworks/Foundation.framework/Headers/NSDistantObject.h:13:12: note: 'NSDistantObject' has been explicitly marked deprecated here
1143:info:build @interface NSDistantObject : NSProxy <NSCoding> {
1144:info:build            ^
1145:info:build MacVim/MMBackend.m:3405:5: warning: 'NSConnection' is deprecated: first deprecated in macOS 10.13 - Use NSXPCConnection instead [-Wdeprecated-declarations]
1146:info:build     NSConnection *svrConn = [connectionNameDict objectForKey:connName];
1147:info:build     ^
1148:info:build /Applications/Xcode.app/Contents/Developer/Platforms/MacOSX.platform/Developer/SDKs/MacOSX12.3.sdk/System/Library/Frameworks/Foundation.framework/Headers/NSConnection.h:18:12: note: 'NSConnection' has been explicitly marked deprecated here
1149:info:build @interface NSConnection : NSObject {
1150:info:build            ^
1151:info:build MacVim/MMBackend.m:3408:33: warning: 'NSConnection' is deprecated: first deprecated in macOS 10.13 - Use NSXPCConnection instead [-Wdeprecated-declarations]
1152:info:build         svrConn = [NSConnection connectionWithRegisteredName:connName
1153:info:build                                 ^
1154:info:build /Applications/Xcode.app/Contents/Developer/Platforms/MacOSX.platform/Developer/SDKs/MacOSX12.3.sdk/System/Library/Frameworks/Foundation.framework/Headers/NSConnection.h:18:12: note: 'NSConnection' has been explicitly marked deprecated here
1155:info:build @interface NSConnection : NSObject {
1156:info:build            ^
1157:info:build MacVim/MMBackend.m:3415:37: warning: 'NSConnection' is deprecated: first deprecated in macOS 10.13 - Use NSXPCConnection instead [-Wdeprecated-declarations]
1158:info:build             svrConn = [NSConnection connectionWithRegisteredName:connName
1159:info:build                                     ^
1160:info:build /Applications/Xcode.app/Contents/Developer/Platforms/MacOSX.platform/Developer/SDKs/MacOSX12.3.sdk/System/Library/Frameworks/Foundation.framework/Headers/NSConnection.h:18:12: note: 'NSConnection' has been explicitly marked deprecated here
1161:info:build @interface NSConnection : NSObject {
1162:info:build            ^
1163:info:build MacVim/MMBackend.m:3435:37: warning: 'NSConnection' is deprecated: first deprecated in macOS 10.13 - Use NSXPCConnection instead [-Wdeprecated-declarations]
1164:info:build             svrConn = [NSConnection connectionWithRegisteredName:connName
1165:info:build                                     ^
1166:info:build /Applications/Xcode.app/Contents/Developer/Platforms/MacOSX.platform/Developer/SDKs/MacOSX12.3.sdk/System/Library/Frameworks/Foundation.framework/Headers/NSConnection.h:18:12: note: 'NSConnection' has been explicitly marked deprecated here
1167:info:build @interface NSConnection : NSObject {
1168:info:build            ^
1169:info:build MacVim/MMBackend.m:3446:30: warning: 'NSConnectionDidDieNotification' is deprecated: first deprecated in macOS 10.13 - Use NSXPCConnection instead [-Wdeprecated-declarations]
1170:info:build                         name:NSConnectionDidDieNotification object:svrConn];
1171:info:build                              ^
1172:info:build /Applications/Xcode.app/Contents/Developer/Platforms/MacOSX.platform/Developer/SDKs/MacOSX12.3.sdk/System/Library/Frameworks/Foundation.framework/Headers/NSConnection.h:110:36: note: 'NSConnectionDidDieNotification' has been explicitly marked deprecated here
1173:info:build FOUNDATION_EXPORT NSString * const NSConnectionDidDieNotification NS_SWIFT_UNAVAILABLE("Use NSXPCConnection instead") API_DEPRECATED("Use NSXPCConnection instead", macosx(10.0, 10.13), ios(2.0,11.0), watchos(2.0,4.0), tvos(9.0,11.0));
1174:info:build                                    ^
1175:info:build MacVim/MMBackend.m:3455:5: warning: 'NSConnection' is deprecated: first deprecated in macOS 10.13 - Use NSXPCConnection instead [-Wdeprecated-declarations]
1176:info:build     NSConnection *conn;
1177:info:build     ^
1178:info:build /Applications/Xcode.app/Contents/Developer/Platforms/MacOSX.platform/Developer/SDKs/MacOSX12.3.sdk/System/Library/Frameworks/Foundation.framework/Headers/NSConnection.h:18:12: note: 'NSConnection' has been explicitly marked deprecated here
1179:info:build @interface NSConnection : NSObject {
1180:info:build            ^
1181:info:build MacVim/MMBackend.m:3471:5: warning: 'NSConnection' is deprecated: first deprecated in macOS 10.13 - Use NSXPCConnection instead [-Wdeprecated-declarations]
1182:info:build     NSConnection *svrConn = [notification object];
1183:info:build     ^
1184:info:build /Applications/Xcode.app/Contents/Developer/Platforms/MacOSX.platform/Developer/SDKs/MacOSX12.3.sdk/System/Library/Frameworks/Foundation.framework/Headers/NSConnection.h:18:12: note: 'NSConnection' has been explicitly marked deprecated here
1185:info:build @interface NSConnection : NSObject {
1186:info:build            ^
1187:info:build MacVim/MMBackend.m:3476:28: warning: 'NSConnectionDidDieNotification' is deprecated: first deprecated in macOS 10.13 - Use NSXPCConnection instead [-Wdeprecated-declarations]
1188:info:build                       name:NSConnectionDidDieNotification
1189:info:build                            ^
1190:info:build /Applications/Xcode.app/Contents/Developer/Platforms/MacOSX.platform/Developer/SDKs/MacOSX12.3.sdk/System/Library/Frameworks/Foundation.framework/Headers/NSConnection.h:110:36: note: 'NSConnectionDidDieNotification' has been explicitly marked deprecated here
1191:info:build FOUNDATION_EXPORT NSString * const NSConnectionDidDieNotification NS_SWIFT_UNAVAILABLE("Use NSXPCConnection instead") API_DEPRECATED("Use NSXPCConnection instead", macosx(10.0, 10.13), ios(2.0,11.0), watchos(2.0,4.0), tvos(9.0,11.0));
1192:info:build                                    ^
1193:info:build MacVim/MMBackend.m:3492:5: warning: 'NSConnection' is deprecated: first deprecated in macOS 10.13 - Use NSXPCConnection instead [-Wdeprecated-declarations]
1194:info:build     NSConnection *conn = [client connectionForProxy];
1195:info:build     ^
1196:info:build /Applications/Xcode.app/Contents/Developer/Platforms/MacOSX.platform/Developer/SDKs/MacOSX12.3.sdk/System/Library/Frameworks/Foundation.framework/Headers/NSConnection.h:18:12: note: 'NSConnection' has been explicitly marked deprecated here
1197:info:build @interface NSConnection : NSObject {
1198:info:build            ^
1199:info:build /usr/bin/clang -c -I. -Iproto -DHAVE_CONFIG_H -DFEAT_GUI_MACVIM -Wall -Wno-unknown-pragmas -pipe  -I/opt/local/include -isysroot/Applications/Xcode.app/Contents/Developer/Platforms/MacOSX.platform/Developer/SDKs/MacOSX12.3.sdk -DMACOS_X -DMACOS_X_DARWIN  -pipe -Os -isysroot/Applications/Xcode.app/Contents/Developer/Platforms/MacOSX.platform/Developer/SDKs/MacOSX12.3.sdk -arch x86_64 -U_FORTIFY_SOURCE -D_FORTIFY_SOURCE=1        -o objects/arabic.o arabic.c
1200:info:build /usr/bin/clang -c -I. -Iproto -DHAVE_CONFIG_H -DFEAT_GUI_MACVIM -Wall -Wno-unknown-pragmas -pipe  -I/opt/local/include -isysroot/Applications/Xcode.app/Contents/Developer/Platforms/MacOSX.platform/Developer/SDKs/MacOSX12.3.sdk -DMACOS_X -DMACOS_X_DARWIN  -pipe -Os -isysroot/Applications/Xcode.app/Contents/Developer/Platforms/MacOSX.platform/Developer/SDKs/MacOSX12.3.sdk -arch x86_64 -U_FORTIFY_SOURCE -D_FORTIFY_SOURCE=1        -o objects/arglist.o arglist.c
1201:info:build /usr/bin/clang -c -I. -Iproto -DHAVE_CONFIG_H -DFEAT_GUI_MACVIM -Wall -Wno-unknown-pragmas -pipe  -I/opt/local/include -isysroot/Applications/Xcode.app/Contents/Developer/Platforms/MacOSX.platform/Developer/SDKs/MacOSX12.3.sdk -DMACOS_X -DMACOS_X_DARWIN  -pipe -Os -isysroot/Applications/Xcode.app/Contents/Developer/Platforms/MacOSX.platform/Developer/SDKs/MacOSX12.3.sdk -arch x86_64 -U_FORTIFY_SOURCE -D_FORTIFY_SOURCE=1        -o objects/autocmd.o autocmd.c
1202:info:build /usr/bin/clang -c -I. -Iproto -DHAVE_CONFIG_H -DFEAT_GUI_MACVIM -Wall -Wno-unknown-pragmas -pipe  -I/opt/local/include -isysroot/Applications/Xcode.app/Contents/Developer/Platforms/MacOSX.platform/Developer/SDKs/MacOSX12.3.sdk -DMACOS_X -DMACOS_X_DARWIN  -pipe -Os -isysroot/Applications/Xcode.app/Contents/Developer/Platforms/MacOSX.platform/Developer/SDKs/MacOSX12.3.sdk -arch x86_64 -U_FORTIFY_SOURCE -D_FORTIFY_SOURCE=1        -o objects/beval.o beval.c
1203:info:build /usr/bin/clang -c -I. -Iproto -DHAVE_CONFIG_H -DFEAT_GUI_MACVIM -Wall -Wno-unknown-pragmas -pipe  -I/opt/local/include -isysroot/Applications/Xcode.app/Contents/Developer/Platforms/MacOSX.platform/Developer/SDKs/MacOSX12.3.sdk -DMACOS_X -DMACOS_X_DARWIN  -pipe -Os -isysroot/Applications/Xcode.app/Contents/Developer/Platforms/MacOSX.platform/Developer/SDKs/MacOSX12.3.sdk -arch x86_64 -U_FORTIFY_SOURCE -D_FORTIFY_SOURCE=1        -o objects/buffer.o buffer.c
1204:info:build /usr/bin/clang -c -I. -Iproto -DHAVE_CONFIG_H -DFEAT_GUI_MACVIM -Wall -Wno-unknown-pragmas -pipe  -I/opt/local/include -isysroot/Applications/Xcode.app/Contents/Developer/Platforms/MacOSX.platform/Developer/SDKs/MacOSX12.3.sdk -DMACOS_X -DMACOS_X_DARWIN  -pipe -Os -isysroot/Applications/Xcode.app/Contents/Developer/Platforms/MacOSX.platform/Developer/SDKs/MacOSX12.3.sdk -arch x86_64 -U_FORTIFY_SOURCE -D_FORTIFY_SOURCE=1        -o objects/change.o change.c
1205:info:build /usr/bin/clang -c -I. -Iproto -DHAVE_CONFIG_H -DFEAT_GUI_MACVIM -Wall -Wno-unknown-pragmas -pipe  -I/opt/local/include -isysroot/Applications/Xcode.app/Contents/Developer/Platforms/MacOSX.platform/Developer/SDKs/MacOSX12.3.sdk -DMACOS_X -DMACOS_X_DARWIN  -pipe -Os -isysroot/Applications/Xcode.app/Contents/Developer/Platforms/MacOSX.platform/Developer/SDKs/MacOSX12.3.sdk -arch x86_64 -U_FORTIFY_SOURCE -D_FORTIFY_SOURCE=1        -o objects/blob.o blob.c
1206:info:build /usr/bin/clang -c -I. -Iproto -DHAVE_CONFIG_H -DFEAT_GUI_MACVIM -Wall -Wno-unknown-pragmas -pipe  -I/opt/local/include -isysroot/Applications/Xcode.app/Contents/Developer/Platforms/MacOSX.platform/Developer/SDKs/MacOSX12.3.sdk -DMACOS_X -DMACOS_X_DARWIN  -pipe -Os -isysroot/Applications/Xcode.app/Contents/Developer/Platforms/MacOSX.platform/Developer/SDKs/MacOSX12.3.sdk -arch x86_64 -U_FORTIFY_SOURCE -D_FORTIFY_SOURCE=1        -o objects/blowfish.o blowfish.c
1207:info:build /usr/bin/clang -c -I. -Iproto -DHAVE_CONFIG_H -DFEAT_GUI_MACVIM -Wall -Wno-unknown-pragmas -pipe  -I/opt/local/include -isysroot/Applications/Xcode.app/Contents/Developer/Platforms/MacOSX.platform/Developer/SDKs/MacOSX12.3.sdk -DMACOS_X -DMACOS_X_DARWIN  -pipe -Os -isysroot/Applications/Xcode.app/Contents/Developer/Platforms/MacOSX.platform/Developer/SDKs/MacOSX12.3.sdk -arch x86_64 -U_FORTIFY_SOURCE -D_FORTIFY_SOURCE=1        -o objects/cindent.o cindent.c
1208:info:build /usr/bin/clang -c -I. -Iproto -DHAVE_CONFIG_H -DFEAT_GUI_MACVIM -Wall -Wno-unknown-pragmas -pipe  -I/opt/local/include -isysroot/Applications/Xcode.app/Contents/Developer/Platforms/MacOSX.platform/Developer/SDKs/MacOSX12.3.sdk -DMACOS_X -DMACOS_X_DARWIN  -pipe -Os -isysroot/Applications/Xcode.app/Contents/Developer/Platforms/MacOSX.platform/Developer/SDKs/MacOSX12.3.sdk -arch x86_64 -U_FORTIFY_SOURCE -D_FORTIFY_SOURCE=1        -o objects/clientserver.o clientserver.c
1209:info:build 6 warnings generated.
1210:info:build /usr/bin/clang -c -I. -Iproto -DHAVE_CONFIG_H -DFEAT_GUI_MACVIM -Wall -Wno-unknown-pragmas -pipe  -I/opt/local/include -isysroot/Applications/Xcode.app/Contents/Developer/Platforms/MacOSX.platform/Developer/SDKs/MacOSX12.3.sdk -DMACOS_X -DMACOS_X_DARWIN  -pipe -Os -isysroot/Applications/Xcode.app/Contents/Developer/Platforms/MacOSX.platform/Developer/SDKs/MacOSX12.3.sdk -arch x86_64 -U_FORTIFY_SOURCE -D_FORTIFY_SOURCE=1        -o objects/clipboard.o clipboard.c
1211:info:build clientserver.c:903:6: warning: variable 'timeout' set but not used [-Wunused-but-set-variable]
1212:info:build         int timeout = 0;
1213:info:build             ^
1214:info:build /usr/bin/clang -c -I. -Iproto -DHAVE_CONFIG_H -DFEAT_GUI_MACVIM -Wall -Wno-unknown-pragmas -pipe  -I/opt/local/include -isysroot/Applications/Xcode.app/Contents/Developer/Platforms/MacOSX.platform/Developer/SDKs/MacOSX12.3.sdk -DMACOS_X -DMACOS_X_DARWIN  -pipe -Os -isysroot/Applications/Xcode.app/Contents/Developer/Platforms/MacOSX.platform/Developer/SDKs/MacOSX12.3.sdk -arch x86_64 -U_FORTIFY_SOURCE -D_FORTIFY_SOURCE=1        -o objects/cmdexpand.o cmdexpand.c
1215:info:build /usr/bin/clang -c -I. -Iproto -DHAVE_CONFIG_H -DFEAT_GUI_MACVIM -Wall -Wno-unknown-pragmas -pipe  -I/opt/local/include -isysroot/Applications/Xcode.app/Contents/Developer/Platforms/MacOSX.platform/Developer/SDKs/MacOSX12.3.sdk -DMACOS_X -DMACOS_X_DARWIN  -pipe -Os -isysroot/Applications/Xcode.app/Contents/Developer/Platforms/MacOSX.platform/Developer/SDKs/MacOSX12.3.sdk -arch x86_64 -U_FORTIFY_SOURCE -D_FORTIFY_SOURCE=1        -o objects/cmdhist.o cmdhist.c
1216:info:build /usr/bin/clang -c -I. -Iproto -DHAVE_CONFIG_H -DFEAT_GUI_MACVIM -Wall -Wno-unknown-pragmas -pipe  -I/opt/local/include -isysroot/Applications/Xcode.app/Contents/Developer/Platforms/MacOSX.platform/Developer/SDKs/MacOSX12.3.sdk -DMACOS_X -DMACOS_X_DARWIN  -pipe -Os -isysroot/Applications/Xcode.app/Contents/Developer/Platforms/MacOSX.platform/Developer/SDKs/MacOSX12.3.sdk -arch x86_64 -U_FORTIFY_SOURCE -D_FORTIFY_SOURCE=1        -o objects/crypt.o crypt.c
1217:info:build /usr/bin/clang -c -I. -Iproto -DHAVE_CONFIG_H -DFEAT_GUI_MACVIM -Wall -Wno-unknown-pragmas -pipe  -I/opt/local/include -isysroot/Applications/Xcode.app/Contents/Developer/Platforms/MacOSX.platform/Developer/SDKs/MacOSX12.3.sdk -DMACOS_X -DMACOS_X_DARWIN  -pipe -Os -isysroot/Applications/Xcode.app/Contents/Developer/Platforms/MacOSX.platform/Developer/SDKs/MacOSX12.3.sdk -arch x86_64 -U_FORTIFY_SOURCE -D_FORTIFY_SOURCE=1        -o objects/crypt_zip.o crypt_zip.c
1218:info:build 1 warning generated.
1219:info:build /usr/bin/clang -c -I. -Iproto -DHAVE_CONFIG_H -DFEAT_GUI_MACVIM -Wall -Wno-unknown-pragmas -pipe  -I/opt/local/include -isysroot/Applications/Xcode.app/Contents/Developer/Platforms/MacOSX.platform/Developer/SDKs/MacOSX12.3.sdk -DMACOS_X -DMACOS_X_DARWIN  -pipe -Os -isysroot/Applications/Xcode.app/Contents/Developer/Platforms/MacOSX.platform/Developer/SDKs/MacOSX12.3.sdk -arch x86_64 -U_FORTIFY_SOURCE -D_FORTIFY_SOURCE=1        -o objects/debugger.o debugger.c
1220:info:build /usr/bin/clang -c -I. -Iproto -DHAVE_CONFIG_H -DFEAT_GUI_MACVIM -Wall -Wno-unknown-pragmas -pipe  -I/opt/local/include -isysroot/Applications/Xcode.app/Contents/Developer/Platforms/MacOSX.platform/Developer/SDKs/MacOSX12.3.sdk -DMACOS_X -DMACOS_X_DARWIN  -pipe -Os -isysroot/Applications/Xcode.app/Contents/Developer/Platforms/MacOSX.platform/Developer/SDKs/MacOSX12.3.sdk -arch x86_64 -U_FORTIFY_SOURCE -D_FORTIFY_SOURCE=1        -o objects/dict.o dict.c
1221:info:build /usr/bin/clang -c -I. -Iproto -DHAVE_CONFIG_H -DFEAT_GUI_MACVIM -Wall -Wno-unknown-pragmas -pipe  -I/opt/local/include -isysroot/Applications/Xcode.app/Contents/Developer/Platforms/MacOSX.platform/Developer/SDKs/MacOSX12.3.sdk -DMACOS_X -DMACOS_X_DARWIN  -pipe -Os -isysroot/Applications/Xcode.app/Contents/Developer/Platforms/MacOSX.platform/Developer/SDKs/MacOSX12.3.sdk -arch x86_64 -U_FORTIFY_SOURCE -D_FORTIFY_SOURCE=1        -o objects/diff.o diff.c
1222:info:build /usr/bin/clang -c -I. -Iproto -DHAVE_CONFIG_H -DFEAT_GUI_MACVIM -Wall -Wno-unknown-pragmas -pipe  -I/opt/local/include -isysroot/Applications/Xcode.app/Contents/Developer/Platforms/MacOSX.platform/Developer/SDKs/MacOSX12.3.sdk -DMACOS_X -DMACOS_X_DARWIN  -pipe -Os -isysroot/Applications/Xcode.app/Contents/Developer/Platforms/MacOSX.platform/Developer/SDKs/MacOSX12.3.sdk -arch x86_64 -U_FORTIFY_SOURCE -D_FORTIFY_SOURCE=1        -o objects/digraph.o digraph.c
1223:info:build /usr/bin/clang -c -I. -Iproto -DHAVE_CONFIG_H -DFEAT_GUI_MACVIM -Wall -Wno-unknown-pragmas -pipe  -I/opt/local/include -isysroot/Applications/Xcode.app/Contents/Developer/Platforms/MacOSX.platform/Developer/SDKs/MacOSX12.3.sdk -DMACOS_X -DMACOS_X_DARWIN  -pipe -Os -isysroot/Applications/Xcode.app/Contents/Developer/Platforms/MacOSX.platform/Developer/SDKs/MacOSX12.3.sdk -arch x86_64 -U_FORTIFY_SOURCE -D_FORTIFY_SOURCE=1        -o objects/drawline.o drawline.c
1224:info:build /usr/bin/clang -c -I. -Iproto -DHAVE_CONFIG_H -DFEAT_GUI_MACVIM -Wall -Wno-unknown-pragmas -pipe  -I/opt/local/include -isysroot/Applications/Xcode.app/Contents/Developer/Platforms/MacOSX.platform/Developer/SDKs/MacOSX12.3.sdk -DMACOS_X -DMACOS_X_DARWIN  -pipe -Os -isysroot/Applications/Xcode.app/Contents/Developer/Platforms/MacOSX.platform/Developer/SDKs/MacOSX12.3.sdk -arch x86_64 -U_FORTIFY_SOURCE -D_FORTIFY_SOURCE=1        -o objects/drawscreen.o drawscreen.c
1225:info:build 31 warnings generated.
1226:info:build /usr/bin/clang -c -I. -Iproto -DHAVE_CONFIG_H -DFEAT_GUI_MACVIM -Wall -Wno-unknown-pragmas -pipe  -I/opt/local/include -isysroot/Applications/Xcode.app/Contents/Developer/Platforms/MacOSX.platform/Developer/SDKs/MacOSX12.3.sdk -DMACOS_X -DMACOS_X_DARWIN  -pipe -Os -isysroot/Applications/Xcode.app/Contents/Developer/Platforms/MacOSX.platform/Developer/SDKs/MacOSX12.3.sdk -arch x86_64 -U_FORTIFY_SOURCE -D_FORTIFY_SOURCE=1        -o objects/edit.o edit.c
1227:info:build /usr/bin/clang -c -I. -Iproto -DHAVE_CONFIG_H -DFEAT_GUI_MACVIM -Wall -Wno-unknown-pragmas -pipe  -I/opt/local/include -isysroot/Applications/Xcode.app/Contents/Developer/Platforms/MacOSX.platform/Developer/SDKs/MacOSX12.3.sdk -DMACOS_X -DMACOS_X_DARWIN  -pipe -Os -isysroot/Applications/Xcode.app/Contents/Developer/Platforms/MacOSX.platform/Developer/SDKs/MacOSX12.3.sdk -arch x86_64 -U_FORTIFY_SOURCE -D_FORTIFY_SOURCE=1        -o objects/eval.o eval.c
1228:info:build /usr/bin/clang -c -I. -Iproto -DHAVE_CONFIG_H -DFEAT_GUI_MACVIM -Wall -Wno-unknown-pragmas -pipe  -I/opt/local/include -isysroot/Applications/Xcode.app/Contents/Developer/Platforms/MacOSX.platform/Developer/SDKs/MacOSX12.3.sdk -DMACOS_X -DMACOS_X_DARWIN  -pipe -Os -isysroot/Applications/Xcode.app/Contents/Developer/Platforms/MacOSX.platform/Developer/SDKs/MacOSX12.3.sdk -arch x86_64 -U_FORTIFY_SOURCE -D_FORTIFY_SOURCE=1        -o objects/evalbuffer.o evalbuffer.c
1229:info:build /usr/bin/clang -c -I. -Iproto -DHAVE_CONFIG_H -DFEAT_GUI_MACVIM -Wall -Wno-unknown-pragmas -pipe  -I/opt/local/include -isysroot/Applications/Xcode.app/Contents/Developer/Platforms/MacOSX.platform/Developer/SDKs/MacOSX12.3.sdk -DMACOS_X -DMACOS_X_DARWIN  -pipe -Os -isysroot/Applications/Xcode.app/Contents/Developer/Platforms/MacOSX.platform/Developer/SDKs/MacOSX12.3.sdk -arch x86_64 -U_FORTIFY_SOURCE -D_FORTIFY_SOURCE=1        -o objects/evalfunc.o evalfunc.c
1230:info:build /usr/bin/clang -c -I. -Iproto -DHAVE_CONFIG_H -DFEAT_GUI_MACVIM -Wall -Wno-unknown-pragmas -pipe  -I/opt/local/include -isysroot/Applications/Xcode.app/Contents/Developer/Platforms/MacOSX.platform/Developer/SDKs/MacOSX12.3.sdk -DMACOS_X -DMACOS_X_DARWIN  -pipe -Os -isysroot/Applications/Xcode.app/Contents/Developer/Platforms/MacOSX.platform/Developer/SDKs/MacOSX12.3.sdk -arch x86_64 -U_FORTIFY_SOURCE -D_FORTIFY_SOURCE=1        -o objects/evalvars.o evalvars.c
1231:info:build /usr/bin/clang -c -I. -Iproto -DHAVE_CONFIG_H -DFEAT_GUI_MACVIM -Wall -Wno-unknown-pragmas -pipe  -I/opt/local/include -isysroot/Applications/Xcode.app/Contents/Developer/Platforms/MacOSX.platform/Developer/SDKs/MacOSX12.3.sdk -DMACOS_X -DMACOS_X_DARWIN  -pipe -Os -isysroot/Applications/Xcode.app/Contents/Developer/Platforms/MacOSX.platform/Developer/SDKs/MacOSX12.3.sdk -arch x86_64 -U_FORTIFY_SOURCE -D_FORTIFY_SOURCE=1        -o objects/evalwindow.o evalwindow.c
1232:info:build /usr/bin/clang -c -I. -Iproto -DHAVE_CONFIG_H -DFEAT_GUI_MACVIM -Wall -Wno-unknown-pragmas -pipe  -I/opt/local/include -isysroot/Applications/Xcode.app/Contents/Developer/Platforms/MacOSX.platform/Developer/SDKs/MacOSX12.3.sdk -DMACOS_X -DMACOS_X_DARWIN  -pipe -Os -isysroot/Applications/Xcode.app/Contents/Developer/Platforms/MacOSX.platform/Developer/SDKs/MacOSX12.3.sdk -arch x86_64 -U_FORTIFY_SOURCE -D_FORTIFY_SOURCE=1        -o objects/ex_cmds.o ex_cmds.c
1233:info:build /usr/bin/clang -c -I. -Iproto -DHAVE_CONFIG_H -DFEAT_GUI_MACVIM -Wall -Wno-unknown-pragmas -pipe  -I/opt/local/include -isysroot/Applications/Xcode.app/Contents/Developer/Platforms/MacOSX.platform/Developer/SDKs/MacOSX12.3.sdk -DMACOS_X -DMACOS_X_DARWIN  -pipe -Os -isysroot/Applications/Xcode.app/Contents/Developer/Platforms/MacOSX.platform/Developer/SDKs/MacOSX12.3.sdk -arch x86_64 -U_FORTIFY_SOURCE -D_FORTIFY_SOURCE=1        -o objects/ex_cmds2.o ex_cmds2.c
1234:info:build /usr/bin/clang -c -I. -Iproto -DHAVE_CONFIG_H -DFEAT_GUI_MACVIM -Wall -Wno-unknown-pragmas -pipe  -I/opt/local/include -isysroot/Applications/Xcode.app/Contents/Developer/Platforms/MacOSX.platform/Developer/SDKs/MacOSX12.3.sdk -DMACOS_X -DMACOS_X_DARWIN  -pipe -Os -isysroot/Applications/Xcode.app/Contents/Developer/Platforms/MacOSX.platform/Developer/SDKs/MacOSX12.3.sdk -arch x86_64 -U_FORTIFY_SOURCE -D_FORTIFY_SOURCE=1        -o objects/ex_docmd.o ex_docmd.c
1235:info:build /usr/bin/clang -c -I. -Iproto -DHAVE_CONFIG_H -DFEAT_GUI_MACVIM -Wall -Wno-unknown-pragmas -pipe  -I/opt/local/include -isysroot/Applications/Xcode.app/Contents/Developer/Platforms/MacOSX.platform/Developer/SDKs/MacOSX12.3.sdk -DMACOS_X -DMACOS_X_DARWIN  -pipe -Os -isysroot/Applications/Xcode.app/Contents/Developer/Platforms/MacOSX.platform/Developer/SDKs/MacOSX12.3.sdk -arch x86_64 -U_FORTIFY_SOURCE -D_FORTIFY_SOURCE=1        -o objects/ex_eval.o ex_eval.c
1236:info:build /usr/bin/clang -c -I. -Iproto -DHAVE_CONFIG_H -DFEAT_GUI_MACVIM -Wall -Wno-unknown-pragmas -pipe  -I/opt/local/include -isysroot/Applications/Xcode.app/Contents/Developer/Platforms/MacOSX.platform/Developer/SDKs/MacOSX12.3.sdk -DMACOS_X -DMACOS_X_DARWIN  -pipe -Os -isysroot/Applications/Xcode.app/Contents/Developer/Platforms/MacOSX.platform/Developer/SDKs/MacOSX12.3.sdk -arch x86_64 -U_FORTIFY_SOURCE -D_FORTIFY_SOURCE=1        -o objects/ex_getln.o ex_getln.c
1237:info:build /usr/bin/clang -c -I. -Iproto -DHAVE_CONFIG_H -DFEAT_GUI_MACVIM -Wall -Wno-unknown-pragmas -pipe  -I/opt/local/include -isysroot/Applications/Xcode.app/Contents/Developer/Platforms/MacOSX.platform/Developer/SDKs/MacOSX12.3.sdk -DMACOS_X -DMACOS_X_DARWIN  -pipe -Os -isysroot/Applications/Xcode.app/Contents/Developer/Platforms/MacOSX.platform/Developer/SDKs/MacOSX12.3.sdk -arch x86_64 -U_FORTIFY_SOURCE -D_FORTIFY_SOURCE=1        -o objects/fileio.o fileio.c
1238:info:build /usr/bin/clang -c -I. -Iproto -DHAVE_CONFIG_H -DFEAT_GUI_MACVIM -Wall -Wno-unknown-pragmas -pipe  -I/opt/local/include -isysroot/Applications/Xcode.app/Contents/Developer/Platforms/MacOSX.platform/Developer/SDKs/MacOSX12.3.sdk -DMACOS_X -DMACOS_X_DARWIN  -pipe -Os -isysroot/Applications/Xcode.app/Contents/Developer/Platforms/MacOSX.platform/Developer/SDKs/MacOSX12.3.sdk -arch x86_64 -U_FORTIFY_SOURCE -D_FORTIFY_SOURCE=1        -o objects/filepath.o filepath.c
1239:info:build /usr/bin/clang -c -I. -Iproto -DHAVE_CONFIG_H -DFEAT_GUI_MACVIM -Wall -Wno-unknown-pragmas -pipe  -I/opt/local/include -isysroot/Applications/Xcode.app/Contents/Developer/Platforms/MacOSX.platform/Developer/SDKs/MacOSX12.3.sdk -DMACOS_X -DMACOS_X_DARWIN  -pipe -Os -isysroot/Applications/Xcode.app/Contents/Developer/Platforms/MacOSX.platform/Developer/SDKs/MacOSX12.3.sdk -arch x86_64 -U_FORTIFY_SOURCE -D_FORTIFY_SOURCE=1        -o objects/findfile.o findfile.c
1240:info:build /usr/bin/clang -c -I. -Iproto -DHAVE_CONFIG_H -DFEAT_GUI_MACVIM -Wall -Wno-unknown-pragmas -pipe  -I/opt/local/include -isysroot/Applications/Xcode.app/Contents/Developer/Platforms/MacOSX.platform/Developer/SDKs/MacOSX12.3.sdk -DMACOS_X -DMACOS_X_DARWIN  -pipe -Os -isysroot/Applications/Xcode.app/Contents/Developer/Platforms/MacOSX.platform/Developer/SDKs/MacOSX12.3.sdk -arch x86_64 -U_FORTIFY_SOURCE -D_FORTIFY_SOURCE=1        -o objects/fold.o fold.c
1241:info:build /usr/bin/clang -c -I. -Iproto -DHAVE_CONFIG_H -DFEAT_GUI_MACVIM -Wall -Wno-unknown-pragmas -pipe  -I/opt/local/include -isysroot/Applications/Xcode.app/Contents/Developer/Platforms/MacOSX.platform/Developer/SDKs/MacOSX12.3.sdk -DMACOS_X -DMACOS_X_DARWIN  -pipe -Os -isysroot/Applications/Xcode.app/Contents/Developer/Platforms/MacOSX.platform/Developer/SDKs/MacOSX12.3.sdk -arch x86_64 -U_FORTIFY_SOURCE -D_FORTIFY_SOURCE=1        -o objects/getchar.o getchar.c
1242:info:build /usr/bin/clang -c -I. -Iproto -DHAVE_CONFIG_H -DFEAT_GUI_MACVIM -Wall -Wno-unknown-pragmas -pipe  -I/opt/local/include -isysroot/Applications/Xcode.app/Contents/Developer/Platforms/MacOSX.platform/Developer/SDKs/MacOSX12.3.sdk -DMACOS_X -DMACOS_X_DARWIN  -pipe -Os -isysroot/Applications/Xcode.app/Contents/Developer/Platforms/MacOSX.platform/Developer/SDKs/MacOSX12.3.sdk -arch x86_64 -U_FORTIFY_SOURCE -D_FORTIFY_SOURCE=1        -o objects/gui_xim.o gui_xim.c
1243:info:build /usr/bin/clang -c -I. -Iproto -DHAVE_CONFIG_H -DFEAT_GUI_MACVIM -Wall -Wno-unknown-pragmas -pipe  -I/opt/local/include -isysroot/Applications/Xcode.app/Contents/Developer/Platforms/MacOSX.platform/Developer/SDKs/MacOSX12.3.sdk -DMACOS_X -DMACOS_X_DARWIN  -pipe -Os -isysroot/Applications/Xcode.app/Contents/Developer/Platforms/MacOSX.platform/Developer/SDKs/MacOSX12.3.sdk -arch x86_64 -U_FORTIFY_SOURCE -D_FORTIFY_SOURCE=1        -o objects/hardcopy.o hardcopy.c
1244:info:build /usr/bin/clang -c -I. -Iproto -DHAVE_CONFIG_H -DFEAT_GUI_MACVIM -Wall -Wno-unknown-pragmas -pipe  -I/opt/local/include -isysroot/Applications/Xcode.app/Contents/Developer/Platforms/MacOSX.platform/Developer/SDKs/MacOSX12.3.sdk -DMACOS_X -DMACOS_X_DARWIN  -pipe -Os -isysroot/Applications/Xcode.app/Contents/Developer/Platforms/MacOSX.platform/Developer/SDKs/MacOSX12.3.sdk -arch x86_64 -U_FORTIFY_SOURCE -D_FORTIFY_SOURCE=1        -o objects/hashtab.o hashtab.c
1245:info:build /usr/bin/clang -c -I. -Iproto -DHAVE_CONFIG_H -DFEAT_GUI_MACVIM -Wall -Wno-unknown-pragmas -pipe  -I/opt/local/include -isysroot/Applications/Xcode.app/Contents/Developer/Platforms/MacOSX.platform/Developer/SDKs/MacOSX12.3.sdk -DMACOS_X -DMACOS_X_DARWIN  -pipe -Os -isysroot/Applications/Xcode.app/Contents/Developer/Platforms/MacOSX.platform/Developer/SDKs/MacOSX12.3.sdk -arch x86_64 -U_FORTIFY_SOURCE -D_FORTIFY_SOURCE=1        -o objects/help.o help.c
1246:info:build /usr/bin/clang -c -I. -Iproto -DHAVE_CONFIG_H -DFEAT_GUI_MACVIM -Wall -Wno-unknown-pragmas -pipe  -I/opt/local/include -isysroot/Applications/Xcode.app/Contents/Developer/Platforms/MacOSX.platform/Developer/SDKs/MacOSX12.3.sdk -DMACOS_X -DMACOS_X_DARWIN  -pipe -Os -isysroot/Applications/Xcode.app/Contents/Developer/Platforms/MacOSX.platform/Developer/SDKs/MacOSX12.3.sdk -arch x86_64 -U_FORTIFY_SOURCE -D_FORTIFY_SOURCE=1        -o objects/highlight.o highlight.c
1247:info:build /usr/bin/clang -c -I. -Iproto -DHAVE_CONFIG_H -DFEAT_GUI_MACVIM -Wall -Wno-unknown-pragmas -pipe  -I/opt/local/include -isysroot/Applications/Xcode.app/Contents/Developer/Platforms/MacOSX.platform/Developer/SDKs/MacOSX12.3.sdk -DMACOS_X -DMACOS_X_DARWIN  -pipe -Os -isysroot/Applications/Xcode.app/Contents/Developer/Platforms/MacOSX.platform/Developer/SDKs/MacOSX12.3.sdk -arch x86_64 -U_FORTIFY_SOURCE -D_FORTIFY_SOURCE=1        -o objects/if_cscope.o if_cscope.c
1248:info:build /usr/bin/clang -c -I. -Iproto -DHAVE_CONFIG_H -DFEAT_GUI_MACVIM -Wall -Wno-unknown-pragmas -pipe  -I/opt/local/include -isysroot/Applications/Xcode.app/Contents/Developer/Platforms/MacOSX.platform/Developer/SDKs/MacOSX12.3.sdk -DMACOS_X -DMACOS_X_DARWIN  -pipe -Os -isysroot/Applications/Xcode.app/Contents/Developer/Platforms/MacOSX.platform/Developer/SDKs/MacOSX12.3.sdk -arch x86_64 -U_FORTIFY_SOURCE -D_FORTIFY_SOURCE=1        -o objects/if_xcmdsrv.o if_xcmdsrv.c
1249:info:build /usr/bin/clang -c -I. -Iproto -DHAVE_CONFIG_H -DFEAT_GUI_MACVIM -Wall -Wno-unknown-pragmas -pipe  -I/opt/local/include -isysroot/Applications/Xcode.app/Contents/Developer/Platforms/MacOSX.platform/Developer/SDKs/MacOSX12.3.sdk -DMACOS_X -DMACOS_X_DARWIN  -pipe -Os -isysroot/Applications/Xcode.app/Contents/Developer/Platforms/MacOSX.platform/Developer/SDKs/MacOSX12.3.sdk -arch x86_64 -U_FORTIFY_SOURCE -D_FORTIFY_SOURCE=1        -o objects/indent.o indent.c
1250:info:build /usr/bin/clang -c -I. -Iproto -DHAVE_CONFIG_H -DFEAT_GUI_MACVIM -Wall -Wno-unknown-pragmas -pipe  -I/opt/local/include -isysroot/Applications/Xcode.app/Contents/Developer/Platforms/MacOSX.platform/Developer/SDKs/MacOSX12.3.sdk -DMACOS_X -DMACOS_X_DARWIN  -pipe -Os -isysroot/Applications/Xcode.app/Contents/Developer/Platforms/MacOSX.platform/Developer/SDKs/MacOSX12.3.sdk -arch x86_64 -U_FORTIFY_SOURCE -D_FORTIFY_SOURCE=1        -o objects/insexpand.o insexpand.c
1251:info:build /usr/bin/clang -c -I. -Iproto -DHAVE_CONFIG_H -DFEAT_GUI_MACVIM -Wall -Wno-unknown-pragmas -pipe  -I/opt/local/include -isysroot/Applications/Xcode.app/Contents/Developer/Platforms/MacOSX.platform/Developer/SDKs/MacOSX12.3.sdk -DMACOS_X -DMACOS_X_DARWIN  -pipe -Os -isysroot/Applications/Xcode.app/Contents/Developer/Platforms/MacOSX.platform/Developer/SDKs/MacOSX12.3.sdk -arch x86_64 -U_FORTIFY_SOURCE -D_FORTIFY_SOURCE=1        -o objects/list.o list.c
1252:info:build /usr/bin/clang -c -I. -Iproto -DHAVE_CONFIG_H -DFEAT_GUI_MACVIM -Wall -Wno-unknown-pragmas -pipe  -I/opt/local/include -isysroot/Applications/Xcode.app/Contents/Developer/Platforms/MacOSX.platform/Developer/SDKs/MacOSX12.3.sdk -DMACOS_X -DMACOS_X_DARWIN  -pipe -Os -isysroot/Applications/Xcode.app/Contents/Developer/Platforms/MacOSX.platform/Developer/SDKs/MacOSX12.3.sdk -arch x86_64 -U_FORTIFY_SOURCE -D_FORTIFY_SOURCE=1        -o objects/locale.o locale.c
1253:info:build /usr/bin/clang -c -I. -Iproto -DHAVE_CONFIG_H -DFEAT_GUI_MACVIM -Wall -Wno-unknown-pragmas -pipe  -I/opt/local/include -isysroot/Applications/Xcode.app/Contents/Developer/Platforms/MacOSX.platform/Developer/SDKs/MacOSX12.3.sdk -DMACOS_X -DMACOS_X_DARWIN  -pipe -Os -isysroot/Applications/Xcode.app/Contents/Developer/Platforms/MacOSX.platform/Developer/SDKs/MacOSX12.3.sdk -arch x86_64 -U_FORTIFY_SOURCE -D_FORTIFY_SOURCE=1        -o objects/map.o map.c
1254:info:build /usr/bin/clang -c -I. -Iproto -DHAVE_CONFIG_H -DFEAT_GUI_MACVIM -Wall -Wno-unknown-pragmas -pipe  -I/opt/local/include -isysroot/Applications/Xcode.app/Contents/Developer/Platforms/MacOSX.platform/Developer/SDKs/MacOSX12.3.sdk -DMACOS_X -DMACOS_X_DARWIN  -pipe -Os -isysroot/Applications/Xcode.app/Contents/Developer/Platforms/MacOSX.platform/Developer/SDKs/MacOSX12.3.sdk -arch x86_64 -U_FORTIFY_SOURCE -D_FORTIFY_SOURCE=1        -o objects/mark.o mark.c
1255:info:build /usr/bin/clang -c -I. -Iproto -DHAVE_CONFIG_H -DFEAT_GUI_MACVIM -Wall -Wno-unknown-pragmas -pipe  -I/opt/local/include -isysroot/Applications/Xcode.app/Contents/Developer/Platforms/MacOSX.platform/Developer/SDKs/MacOSX12.3.sdk -DMACOS_X -DMACOS_X_DARWIN  -pipe -Os -isysroot/Applications/Xcode.app/Contents/Developer/Platforms/MacOSX.platform/Developer/SDKs/MacOSX12.3.sdk -arch x86_64 -U_FORTIFY_SOURCE -D_FORTIFY_SOURCE=1        -o objects/match.o match.c
1256:info:build /usr/bin/clang -c -I. -Iproto -DHAVE_CONFIG_H -DFEAT_GUI_MACVIM -Wall -Wno-unknown-pragmas -pipe  -I/opt/local/include -isysroot/Applications/Xcode.app/Contents/Developer/Platforms/MacOSX.platform/Developer/SDKs/MacOSX12.3.sdk -DMACOS_X -DMACOS_X_DARWIN  -pipe -Os -isysroot/Applications/Xcode.app/Contents/Developer/Platforms/MacOSX.platform/Developer/SDKs/MacOSX12.3.sdk -arch x86_64 -U_FORTIFY_SOURCE -D_FORTIFY_SOURCE=1        -o objects/mbyte.o mbyte.c
1257:info:build /usr/bin/clang -c -I. -Iproto -DHAVE_CONFIG_H -DFEAT_GUI_MACVIM -Wall -Wno-unknown-pragmas -pipe  -I/opt/local/include -isysroot/Applications/Xcode.app/Contents/Developer/Platforms/MacOSX.platform/Developer/SDKs/MacOSX12.3.sdk -DMACOS_X -DMACOS_X_DARWIN  -pipe -Os -isysroot/Applications/Xcode.app/Contents/Developer/Platforms/MacOSX.platform/Developer/SDKs/MacOSX12.3.sdk -arch x86_64 -U_FORTIFY_SOURCE -D_FORTIFY_SOURCE=1        -o objects/memline.o memline.c
1258:info:build /usr/bin/clang -c -I. -Iproto -DHAVE_CONFIG_H -DFEAT_GUI_MACVIM -Wall -Wno-unknown-pragmas -pipe  -I/opt/local/include -isysroot/Applications/Xcode.app/Contents/Developer/Platforms/MacOSX.platform/Developer/SDKs/MacOSX12.3.sdk -DMACOS_X -DMACOS_X_DARWIN  -pipe -Os -isysroot/Applications/Xcode.app/Contents/Developer/Platforms/MacOSX.platform/Developer/SDKs/MacOSX12.3.sdk -arch x86_64 -U_FORTIFY_SOURCE -D_FORTIFY_SOURCE=1        -o objects/menu.o menu.c
1259:info:build /usr/bin/clang -c -I. -Iproto -DHAVE_CONFIG_H -DFEAT_GUI_MACVIM -Wall -Wno-unknown-pragmas -pipe  -I/opt/local/include -isysroot/Applications/Xcode.app/Contents/Developer/Platforms/MacOSX.platform/Developer/SDKs/MacOSX12.3.sdk -DMACOS_X -DMACOS_X_DARWIN  -pipe -Os -isysroot/Applications/Xcode.app/Contents/Developer/Platforms/MacOSX.platform/Developer/SDKs/MacOSX12.3.sdk -arch x86_64 -U_FORTIFY_SOURCE -D_FORTIFY_SOURCE=1        -o objects/misc1.o misc1.c
1260:info:build /usr/bin/clang -c -I. -Iproto -DHAVE_CONFIG_H -DFEAT_GUI_MACVIM -Wall -Wno-unknown-pragmas -pipe  -I/opt/local/include -isysroot/Applications/Xcode.app/Contents/Developer/Platforms/MacOSX.platform/Developer/SDKs/MacOSX12.3.sdk -DMACOS_X -DMACOS_X_DARWIN  -pipe -Os -isysroot/Applications/Xcode.app/Contents/Developer/Platforms/MacOSX.platform/Developer/SDKs/MacOSX12.3.sdk -arch x86_64 -U_FORTIFY_SOURCE -D_FORTIFY_SOURCE=1        -o objects/misc2.o misc2.c
1261:info:build /usr/bin/clang -c -I. -Iproto -DHAVE_CONFIG_H -DFEAT_GUI_MACVIM -Wall -Wno-unknown-pragmas -pipe  -I/opt/local/include -isysroot/Applications/Xcode.app/Contents/Developer/Platforms/MacOSX.platform/Developer/SDKs/MacOSX12.3.sdk -DMACOS_X -DMACOS_X_DARWIN  -pipe -Os -isysroot/Applications/Xcode.app/Contents/Developer/Platforms/MacOSX.platform/Developer/SDKs/MacOSX12.3.sdk -arch x86_64 -U_FORTIFY_SOURCE -D_FORTIFY_SOURCE=1        -o objects/mouse.o mouse.c
1262:info:build /usr/bin/clang -c -I. -Iproto -DHAVE_CONFIG_H -DFEAT_GUI_MACVIM -Wall -Wno-unknown-pragmas -pipe  -I/opt/local/include -isysroot/Applications/Xcode.app/Contents/Developer/Platforms/MacOSX.platform/Developer/SDKs/MacOSX12.3.sdk -DMACOS_X -DMACOS_X_DARWIN  -pipe -Os -isysroot/Applications/Xcode.app/Contents/Developer/Platforms/MacOSX.platform/Developer/SDKs/MacOSX12.3.sdk -arch x86_64 -U_FORTIFY_SOURCE -D_FORTIFY_SOURCE=1        -o objects/move.o move.c
1263:info:build /usr/bin/clang -c -I. -Iproto -DHAVE_CONFIG_H -DFEAT_GUI_MACVIM -Wall -Wno-unknown-pragmas -pipe  -I/opt/local/include -isysroot/Applications/Xcode.app/Contents/Developer/Platforms/MacOSX.platform/Developer/SDKs/MacOSX12.3.sdk -DMACOS_X -DMACOS_X_DARWIN  -pipe -Os -isysroot/Applications/Xcode.app/Contents/Developer/Platforms/MacOSX.platform/Developer/SDKs/MacOSX12.3.sdk -arch x86_64 -U_FORTIFY_SOURCE -D_FORTIFY_SOURCE=1        -o objects/normal.o normal.c
1264:info:build /usr/bin/clang -c -I. -Iproto -DHAVE_CONFIG_H -DFEAT_GUI_MACVIM -Wall -Wno-unknown-pragmas -pipe  -I/opt/local/include -isysroot/Applications/Xcode.app/Contents/Developer/Platforms/MacOSX.platform/Developer/SDKs/MacOSX12.3.sdk -DMACOS_X -DMACOS_X_DARWIN  -pipe -Os -isysroot/Applications/Xcode.app/Contents/Developer/Platforms/MacOSX.platform/Developer/SDKs/MacOSX12.3.sdk -arch x86_64 -U_FORTIFY_SOURCE -D_FORTIFY_SOURCE=1        -o objects/ops.o ops.c
1265:info:build /usr/bin/clang -c -I.     -I/opt/local/include/ruby-2.5.0 -I/opt/local/include/ruby-2.5.0/x86_64-darwin21 -DRUBY_VERSION=25  -Iproto -DHAVE_CONFIG_H -DFEAT_GUI_MACVIM -Wall -Wno-unknown-pragmas -pipe  -I/opt/local/include -isysroot/Applications/Xcode.app/Contents/Developer/Platforms/MacOSX.platform/Developer/SDKs/MacOSX12.3.sdk -DMACOS_X -DMACOS_X_DARWIN  -pipe -Os -isysroot/Applications/Xcode.app/Contents/Developer/Platforms/MacOSX.platform/Developer/SDKs/MacOSX12.3.sdk -arch x86_64 -U_FORTIFY_SOURCE -D_FORTIFY_SOURCE=1        -o objects/option.o option.c
1266:info:build /usr/bin/clang -c -I.     -I/opt/local/include/ruby-2.5.0 -I/opt/local/include/ruby-2.5.0/x86_64-darwin21 -DRUBY_VERSION=25  -Iproto -DHAVE_CONFIG_H -DFEAT_GUI_MACVIM -Wall -Wno-unknown-pragmas -pipe  -I/opt/local/include -isysroot/Applications/Xcode.app/Contents/Developer/Platforms/MacOSX.platform/Developer/SDKs/MacOSX12.3.sdk -DMACOS_X -DMACOS_X_DARWIN  -pipe -Os -isysroot/Applications/Xcode.app/Contents/Developer/Platforms/MacOSX.platform/Developer/SDKs/MacOSX12.3.sdk -arch x86_64 -U_FORTIFY_SOURCE -D_FORTIFY_SOURCE=1        -o objects/optionstr.o optionstr.c
1267:info:build /usr/bin/clang -c -I. -Iproto -DHAVE_CONFIG_H -DFEAT_GUI_MACVIM -Wall -Wno-unknown-pragmas -pipe  -I/opt/local/include -isysroot/Applications/Xcode.app/Contents/Developer/Platforms/MacOSX.platform/Developer/SDKs/MacOSX12.3.sdk -DMACOS_X -DMACOS_X_DARWIN  -pipe -Os -isysroot/Applications/Xcode.app/Contents/Developer/Platforms/MacOSX.platform/Developer/SDKs/MacOSX12.3.sdk -arch x86_64 -U_FORTIFY_SOURCE -D_FORTIFY_SOURCE=1        -o objects/os_unix.o os_unix.c
1268:info:build /usr/bin/clang -c -I. -Iproto -DHAVE_CONFIG_H -DFEAT_GUI_MACVIM -Wall -Wno-unknown-pragmas -pipe  -I/opt/local/include -isysroot/Applications/Xcode.app/Contents/Developer/Platforms/MacOSX.platform/Developer/SDKs/MacOSX12.3.sdk -DMACOS_X -DMACOS_X_DARWIN  -pipe -Os -isysroot/Applications/Xcode.app/Contents/Developer/Platforms/MacOSX.platform/Developer/SDKs/MacOSX12.3.sdk -arch x86_64 -U_FORTIFY_SOURCE -D_FORTIFY_SOURCE=1        -o objects/pathdef.o auto/pathdef.c
1269:info:build /usr/bin/clang -c -I. -Iproto -DHAVE_CONFIG_H -DFEAT_GUI_MACVIM -Wall -Wno-unknown-pragmas -pipe  -I/opt/local/include -isysroot/Applications/Xcode.app/Contents/Developer/Platforms/MacOSX.platform/Developer/SDKs/MacOSX12.3.sdk -DMACOS_X -DMACOS_X_DARWIN  -pipe -Os -isysroot/Applications/Xcode.app/Contents/Developer/Platforms/MacOSX.platform/Developer/SDKs/MacOSX12.3.sdk -arch x86_64 -U_FORTIFY_SOURCE -D_FORTIFY_SOURCE=1        -o objects/popupmenu.o popupmenu.c
1270:info:build /usr/bin/clang -c -I. -Iproto -DHAVE_CONFIG_H -DFEAT_GUI_MACVIM -Wall -Wno-unknown-pragmas -pipe  -I/opt/local/include -isysroot/Applications/Xcode.app/Contents/Developer/Platforms/MacOSX.platform/Developer/SDKs/MacOSX12.3.sdk -DMACOS_X -DMACOS_X_DARWIN  -pipe -Os -isysroot/Applications/Xcode.app/Contents/Developer/Platforms/MacOSX.platform/Developer/SDKs/MacOSX12.3.sdk -arch x86_64 -U_FORTIFY_SOURCE -D_FORTIFY_SOURCE=1        -o objects/popupwin.o popupwin.c
1271:info:build /usr/bin/clang -c -I. -Iproto -DHAVE_CONFIG_H -DFEAT_GUI_MACVIM -Wall -Wno-unknown-pragmas -pipe  -I/opt/local/include -isysroot/Applications/Xcode.app/Contents/Developer/Platforms/MacOSX.platform/Developer/SDKs/MacOSX12.3.sdk -DMACOS_X -DMACOS_X_DARWIN  -pipe -Os -isysroot/Applications/Xcode.app/Contents/Developer/Platforms/MacOSX.platform/Developer/SDKs/MacOSX12.3.sdk -arch x86_64 -U_FORTIFY_SOURCE -D_FORTIFY_SOURCE=1        -o objects/profiler.o profiler.c
1272:info:build /usr/bin/clang -c -I. -Iproto -DHAVE_CONFIG_H -DFEAT_GUI_MACVIM -Wall -Wno-unknown-pragmas -pipe  -I/opt/local/include -isysroot/Applications/Xcode.app/Contents/Developer/Platforms/MacOSX.platform/Developer/SDKs/MacOSX12.3.sdk -DMACOS_X -DMACOS_X_DARWIN  -pipe -Os -isysroot/Applications/Xcode.app/Contents/Developer/Platforms/MacOSX.platform/Developer/SDKs/MacOSX12.3.sdk -arch x86_64 -U_FORTIFY_SOURCE -D_FORTIFY_SOURCE=1        -o objects/pty.o pty.c
1273:info:build /usr/bin/clang -c -I. -Iproto -DHAVE_CONFIG_H -DFEAT_GUI_MACVIM -Wall -Wno-unknown-pragmas -pipe  -I/opt/local/include -isysroot/Applications/Xcode.app/Contents/Developer/Platforms/MacOSX.platform/Developer/SDKs/MacOSX12.3.sdk -DMACOS_X -DMACOS_X_DARWIN  -pipe -Os -isysroot/Applications/Xcode.app/Contents/Developer/Platforms/MacOSX.platform/Developer/SDKs/MacOSX12.3.sdk -arch x86_64 -U_FORTIFY_SOURCE -D_FORTIFY_SOURCE=1        -o objects/quickfix.o quickfix.c
1274:info:build /usr/bin/clang -c -I. -Iproto -DHAVE_CONFIG_H -DFEAT_GUI_MACVIM -Wall -Wno-unknown-pragmas -pipe  -I/opt/local/include -isysroot/Applications/Xcode.app/Contents/Developer/Platforms/MacOSX.platform/Developer/SDKs/MacOSX12.3.sdk -DMACOS_X -DMACOS_X_DARWIN  -pipe -Os -isysroot/Applications/Xcode.app/Contents/Developer/Platforms/MacOSX.platform/Developer/SDKs/MacOSX12.3.sdk -arch x86_64 -U_FORTIFY_SOURCE -D_FORTIFY_SOURCE=1        -o objects/regexp.o regexp.c
1275:info:build /usr/bin/clang -c -I. -Iproto -DHAVE_CONFIG_H -DFEAT_GUI_MACVIM -Wall -Wno-unknown-pragmas -pipe  -I/opt/local/include -isysroot/Applications/Xcode.app/Contents/Developer/Platforms/MacOSX.platform/Developer/SDKs/MacOSX12.3.sdk -DMACOS_X -DMACOS_X_DARWIN  -pipe -Os -isysroot/Applications/Xcode.app/Contents/Developer/Platforms/MacOSX.platform/Developer/SDKs/MacOSX12.3.sdk -arch x86_64 -U_FORTIFY_SOURCE -D_FORTIFY_SOURCE=1        -o objects/register.o register.c
1276:info:build /usr/bin/clang -c -I. -Iproto -DHAVE_CONFIG_H -DFEAT_GUI_MACVIM -Wall -Wno-unknown-pragmas -pipe  -I/opt/local/include -isysroot/Applications/Xcode.app/Contents/Developer/Platforms/MacOSX.platform/Developer/SDKs/MacOSX12.3.sdk -DMACOS_X -DMACOS_X_DARWIN  -pipe -Os -isysroot/Applications/Xcode.app/Contents/Developer/Platforms/MacOSX.platform/Developer/SDKs/MacOSX12.3.sdk -arch x86_64 -U_FORTIFY_SOURCE -D_FORTIFY_SOURCE=1        -o objects/screen.o screen.c
1277:info:build /usr/bin/clang -c -I. -Iproto -DHAVE_CONFIG_H -DFEAT_GUI_MACVIM -Wall -Wno-unknown-pragmas -pipe  -I/opt/local/include -isysroot/Applications/Xcode.app/Contents/Developer/Platforms/MacOSX.platform/Developer/SDKs/MacOSX12.3.sdk -DMACOS_X -DMACOS_X_DARWIN  -pipe -Os -isysroot/Applications/Xcode.app/Contents/Developer/Platforms/MacOSX.platform/Developer/SDKs/MacOSX12.3.sdk -arch x86_64 -U_FORTIFY_SOURCE -D_FORTIFY_SOURCE=1        -o objects/scriptfile.o scriptfile.c
1278:info:build /usr/bin/clang -c -I. -Iproto -DHAVE_CONFIG_H -DFEAT_GUI_MACVIM -Wall -Wno-unknown-pragmas -pipe  -I/opt/local/include -isysroot/Applications/Xcode.app/Contents/Developer/Platforms/MacOSX.platform/Developer/SDKs/MacOSX12.3.sdk -DMACOS_X -DMACOS_X_DARWIN  -pipe -Os -isysroot/Applications/Xcode.app/Contents/Developer/Platforms/MacOSX.platform/Developer/SDKs/MacOSX12.3.sdk -arch x86_64 -U_FORTIFY_SOURCE -D_FORTIFY_SOURCE=1        -o objects/search.o search.c
1279:info:build /usr/bin/clang -c -I. -Iproto -DHAVE_CONFIG_H -DFEAT_GUI_MACVIM -Wall -Wno-unknown-pragmas -pipe  -I/opt/local/include -isysroot/Applications/Xcode.app/Contents/Developer/Platforms/MacOSX.platform/Developer/SDKs/MacOSX12.3.sdk -DMACOS_X -DMACOS_X_DARWIN  -pipe -Os -isysroot/Applications/Xcode.app/Contents/Developer/Platforms/MacOSX.platform/Developer/SDKs/MacOSX12.3.sdk -arch x86_64 -U_FORTIFY_SOURCE -D_FORTIFY_SOURCE=1        -o objects/session.o session.c
1280:info:build /usr/bin/clang -c -I. -Iproto -DHAVE_CONFIG_H -DFEAT_GUI_MACVIM -Wall -Wno-unknown-pragmas -pipe  -I/opt/local/include -isysroot/Applications/Xcode.app/Contents/Developer/Platforms/MacOSX.platform/Developer/SDKs/MacOSX12.3.sdk -DMACOS_X -DMACOS_X_DARWIN  -pipe -Os -isysroot/Applications/Xcode.app/Contents/Developer/Platforms/MacOSX.platform/Developer/SDKs/MacOSX12.3.sdk -arch x86_64 -U_FORTIFY_SOURCE -D_FORTIFY_SOURCE=1        -o objects/sha256.o sha256.c
1281:info:build /usr/bin/clang -c -I. -Iproto -DHAVE_CONFIG_H -DFEAT_GUI_MACVIM -Wall -Wno-unknown-pragmas -pipe  -I/opt/local/include -isysroot/Applications/Xcode.app/Contents/Developer/Platforms/MacOSX.platform/Developer/SDKs/MacOSX12.3.sdk -DMACOS_X -DMACOS_X_DARWIN  -pipe -Os -isysroot/Applications/Xcode.app/Contents/Developer/Platforms/MacOSX.platform/Developer/SDKs/MacOSX12.3.sdk -arch x86_64 -U_FORTIFY_SOURCE -D_FORTIFY_SOURCE=1        -o objects/sign.o sign.c
1282:info:build /usr/bin/clang -c -I. -Iproto -DHAVE_CONFIG_H -DFEAT_GUI_MACVIM -Wall -Wno-unknown-pragmas -pipe  -I/opt/local/include -isysroot/Applications/Xcode.app/Contents/Developer/Platforms/MacOSX.platform/Developer/SDKs/MacOSX12.3.sdk -DMACOS_X -DMACOS_X_DARWIN  -pipe -Os -isysroot/Applications/Xcode.app/Contents/Developer/Platforms/MacOSX.platform/Developer/SDKs/MacOSX12.3.sdk -arch x86_64 -U_FORTIFY_SOURCE -D_FORTIFY_SOURCE=1        -o objects/sound.o sound.c
1283:info:build /usr/bin/clang -c -I. -Iproto -DHAVE_CONFIG_H -DFEAT_GUI_MACVIM -Wall -Wno-unknown-pragmas -pipe  -I/opt/local/include -isysroot/Applications/Xcode.app/Contents/Developer/Platforms/MacOSX.platform/Developer/SDKs/MacOSX12.3.sdk -DMACOS_X -DMACOS_X_DARWIN  -pipe -Os -isysroot/Applications/Xcode.app/Contents/Developer/Platforms/MacOSX.platform/Developer/SDKs/MacOSX12.3.sdk -arch x86_64 -U_FORTIFY_SOURCE -D_FORTIFY_SOURCE=1        -o objects/spell.o spell.c
1284:info:build /usr/bin/clang -c -I. -Iproto -DHAVE_CONFIG_H -DFEAT_GUI_MACVIM -Wall -Wno-unknown-pragmas -pipe  -I/opt/local/include -isysroot/Applications/Xcode.app/Contents/Developer/Platforms/MacOSX.platform/Developer/SDKs/MacOSX12.3.sdk -DMACOS_X -DMACOS_X_DARWIN  -pipe -Os -isysroot/Applications/Xcode.app/Contents/Developer/Platforms/MacOSX.platform/Developer/SDKs/MacOSX12.3.sdk -arch x86_64 -U_FORTIFY_SOURCE -D_FORTIFY_SOURCE=1        -o objects/spellfile.o spellfile.c
1285:info:build /usr/bin/clang -c -I. -Iproto -DHAVE_CONFIG_H -DFEAT_GUI_MACVIM -Wall -Wno-unknown-pragmas -pipe  -I/opt/local/include -isysroot/Applications/Xcode.app/Contents/Developer/Platforms/MacOSX.platform/Developer/SDKs/MacOSX12.3.sdk -DMACOS_X -DMACOS_X_DARWIN  -pipe -Os -isysroot/Applications/Xcode.app/Contents/Developer/Platforms/MacOSX.platform/Developer/SDKs/MacOSX12.3.sdk -arch x86_64 -U_FORTIFY_SOURCE -D_FORTIFY_SOURCE=1        -o objects/spellsuggest.o spellsuggest.c
1286:info:build /usr/bin/clang -c -I. -Iproto -DHAVE_CONFIG_H -DFEAT_GUI_MACVIM -Wall -Wno-unknown-pragmas -pipe  -I/opt/local/include -isysroot/Applications/Xcode.app/Contents/Developer/Platforms/MacOSX.platform/Developer/SDKs/MacOSX12.3.sdk -DMACOS_X -DMACOS_X_DARWIN  -pipe -Os -isysroot/Applications/Xcode.app/Contents/Developer/Platforms/MacOSX.platform/Developer/SDKs/MacOSX12.3.sdk -arch x86_64 -U_FORTIFY_SOURCE -D_FORTIFY_SOURCE=1        -o objects/syntax.o syntax.c
1287:info:build /usr/bin/clang -c -I. -Iproto -DHAVE_CONFIG_H -DFEAT_GUI_MACVIM -Wall -Wno-unknown-pragmas -pipe  -I/opt/local/include -isysroot/Applications/Xcode.app/Contents/Developer/Platforms/MacOSX.platform/Developer/SDKs/MacOSX12.3.sdk -DMACOS_X -DMACOS_X_DARWIN  -pipe -Os -isysroot/Applications/Xcode.app/Contents/Developer/Platforms/MacOSX.platform/Developer/SDKs/MacOSX12.3.sdk -arch x86_64 -U_FORTIFY_SOURCE -D_FORTIFY_SOURCE=1        -o objects/tag.o tag.c
1288:info:build /usr/bin/clang -c -I. -Iproto -DHAVE_CONFIG_H -DFEAT_GUI_MACVIM -Wall -Wno-unknown-pragmas -pipe  -I/opt/local/include -isysroot/Applications/Xcode.app/Contents/Developer/Platforms/MacOSX.platform/Developer/SDKs/MacOSX12.3.sdk -DMACOS_X -DMACOS_X_DARWIN  -pipe -Os -isysroot/Applications/Xcode.app/Contents/Developer/Platforms/MacOSX.platform/Developer/SDKs/MacOSX12.3.sdk -arch x86_64 -U_FORTIFY_SOURCE -D_FORTIFY_SOURCE=1        -o objects/term.o term.c
1289:info:build spellfile.c:6577:12: warning: variable 'x' set but not used [-Wunused-but-set-variable]
1290:info:build     size_t      x = 1;  // collect return value of fwrite()
1291:info:build                 ^
1292:info:build /usr/bin/clang -c -I. -Iproto -DHAVE_CONFIG_H -DFEAT_GUI_MACVIM -Wall -Wno-unknown-pragmas -pipe  -I/opt/local/include -isysroot/Applications/Xcode.app/Contents/Developer/Platforms/MacOSX.platform/Developer/SDKs/MacOSX12.3.sdk -DMACOS_X -DMACOS_X_DARWIN  -pipe -Os -isysroot/Applications/Xcode.app/Contents/Developer/Platforms/MacOSX.platform/Developer/SDKs/MacOSX12.3.sdk -arch x86_64 -U_FORTIFY_SOURCE -D_FORTIFY_SOURCE=1        -o objects/terminal.o terminal.c
1293:info:build /usr/bin/clang -c -I. -Iproto -DHAVE_CONFIG_H -DFEAT_GUI_MACVIM -Wall -Wno-unknown-pragmas -pipe  -I/opt/local/include -isysroot/Applications/Xcode.app/Contents/Developer/Platforms/MacOSX.platform/Developer/SDKs/MacOSX12.3.sdk -DMACOS_X -DMACOS_X_DARWIN  -pipe -Os -isysroot/Applications/Xcode.app/Contents/Developer/Platforms/MacOSX.platform/Developer/SDKs/MacOSX12.3.sdk -arch x86_64 -U_FORTIFY_SOURCE -D_FORTIFY_SOURCE=1        -o objects/testing.o testing.c
1294:info:build /usr/bin/clang -c -I. -Iproto -DHAVE_CONFIG_H -DFEAT_GUI_MACVIM -Wall -Wno-unknown-pragmas -pipe  -I/opt/local/include -isysroot/Applications/Xcode.app/Contents/Developer/Platforms/MacOSX.platform/Developer/SDKs/MacOSX12.3.sdk -DMACOS_X -DMACOS_X_DARWIN  -pipe -Os -isysroot/Applications/Xcode.app/Contents/Developer/Platforms/MacOSX.platform/Developer/SDKs/MacOSX12.3.sdk -arch x86_64 -U_FORTIFY_SOURCE -D_FORTIFY_SOURCE=1        -o objects/textformat.o textformat.c
1295:info:build /usr/bin/clang -c -I. -Iproto -DHAVE_CONFIG_H -DFEAT_GUI_MACVIM -Wall -Wno-unknown-pragmas -pipe  -I/opt/local/include -isysroot/Applications/Xcode.app/Contents/Developer/Platforms/MacOSX.platform/Developer/SDKs/MacOSX12.3.sdk -DMACOS_X -DMACOS_X_DARWIN  -pipe -Os -isysroot/Applications/Xcode.app/Contents/Developer/Platforms/MacOSX.platform/Developer/SDKs/MacOSX12.3.sdk -arch x86_64 -U_FORTIFY_SOURCE -D_FORTIFY_SOURCE=1        -o objects/textobject.o textobject.c
1296:info:build /usr/bin/clang -c -I. -Iproto -DHAVE_CONFIG_H -DFEAT_GUI_MACVIM -Wall -Wno-unknown-pragmas -pipe  -I/opt/local/include -isysroot/Applications/Xcode.app/Contents/Developer/Platforms/MacOSX.platform/Developer/SDKs/MacOSX12.3.sdk -DMACOS_X -DMACOS_X_DARWIN  -pipe -Os -isysroot/Applications/Xcode.app/Contents/Developer/Platforms/MacOSX.platform/Developer/SDKs/MacOSX12.3.sdk -arch x86_64 -U_FORTIFY_SOURCE -D_FORTIFY_SOURCE=1        -o objects/textprop.o textprop.c
1297:info:build /usr/bin/clang -c -I. -Iproto -DHAVE_CONFIG_H -DFEAT_GUI_MACVIM -Wall -Wno-unknown-pragmas -pipe  -I/opt/local/include -isysroot/Applications/Xcode.app/Contents/Developer/Platforms/MacOSX.platform/Developer/SDKs/MacOSX12.3.sdk -DMACOS_X -DMACOS_X_DARWIN  -pipe -Os -isysroot/Applications/Xcode.app/Contents/Developer/Platforms/MacOSX.platform/Developer/SDKs/MacOSX12.3.sdk -arch x86_64 -U_FORTIFY_SOURCE -D_FORTIFY_SOURCE=1        -o objects/time.o time.c
1298:info:build /usr/bin/clang -c -I. -Iproto -DHAVE_CONFIG_H -DFEAT_GUI_MACVIM -Wall -Wno-unknown-pragmas -pipe  -I/opt/local/include -isysroot/Applications/Xcode.app/Contents/Developer/Platforms/MacOSX.platform/Developer/SDKs/MacOSX12.3.sdk -DMACOS_X -DMACOS_X_DARWIN  -pipe -Os -isysroot/Applications/Xcode.app/Contents/Developer/Platforms/MacOSX.platform/Developer/SDKs/MacOSX12.3.sdk -arch x86_64 -U_FORTIFY_SOURCE -D_FORTIFY_SOURCE=1        -o objects/typval.o typval.c
1299:info:build /usr/bin/clang -c -I. -Iproto -DHAVE_CONFIG_H -DFEAT_GUI_MACVIM -Wall -Wno-unknown-pragmas -pipe  -I/opt/local/include -isysroot/Applications/Xcode.app/Contents/Developer/Platforms/MacOSX.platform/Developer/SDKs/MacOSX12.3.sdk -DMACOS_X -DMACOS_X_DARWIN  -pipe -Os -isysroot/Applications/Xcode.app/Contents/Developer/Platforms/MacOSX.platform/Developer/SDKs/MacOSX12.3.sdk -arch x86_64 -U_FORTIFY_SOURCE -D_FORTIFY_SOURCE=1        -o objects/ui.o ui.c
1300:info:build /usr/bin/clang -c -I. -Iproto -DHAVE_CONFIG_H -DFEAT_GUI_MACVIM -Wall -Wno-unknown-pragmas -pipe  -I/opt/local/include -isysroot/Applications/Xcode.app/Contents/Developer/Platforms/MacOSX.platform/Developer/SDKs/MacOSX12.3.sdk -DMACOS_X -DMACOS_X_DARWIN  -pipe -Os -isysroot/Applications/Xcode.app/Contents/Developer/Platforms/MacOSX.platform/Developer/SDKs/MacOSX12.3.sdk -arch x86_64 -U_FORTIFY_SOURCE -D_FORTIFY_SOURCE=1        -o objects/undo.o undo.c
1301:info:build /usr/bin/clang -c -I. -Iproto -DHAVE_CONFIG_H -DFEAT_GUI_MACVIM -Wall -Wno-unknown-pragmas -pipe  -I/opt/local/include -isysroot/Applications/Xcode.app/Contents/Developer/Platforms/MacOSX.platform/Developer/SDKs/MacOSX12.3.sdk -DMACOS_X -DMACOS_X_DARWIN  -pipe -Os -isysroot/Applications/Xcode.app/Contents/Developer/Platforms/MacOSX.platform/Developer/SDKs/MacOSX12.3.sdk -arch x86_64 -U_FORTIFY_SOURCE -D_FORTIFY_SOURCE=1        -o objects/usercmd.o usercmd.c
1302:info:build /usr/bin/clang -c -I. -Iproto -DHAVE_CONFIG_H -DFEAT_GUI_MACVIM -Wall -Wno-unknown-pragmas -pipe  -I/opt/local/include -isysroot/Applications/Xcode.app/Contents/Developer/Platforms/MacOSX.platform/Developer/SDKs/MacOSX12.3.sdk -DMACOS_X -DMACOS_X_DARWIN  -pipe -Os -isysroot/Applications/Xcode.app/Contents/Developer/Platforms/MacOSX.platform/Developer/SDKs/MacOSX12.3.sdk -arch x86_64 -U_FORTIFY_SOURCE -D_FORTIFY_SOURCE=1        -o objects/userfunc.o userfunc.c
1303:info:build /usr/bin/clang -c -I. -Iproto -DHAVE_CONFIG_H -DFEAT_GUI_MACVIM -Wall -Wno-unknown-pragmas -pipe  -I/opt/local/include -isysroot/Applications/Xcode.app/Contents/Developer/Platforms/MacOSX.platform/Developer/SDKs/MacOSX12.3.sdk -DMACOS_X -DMACOS_X_DARWIN  -pipe -Os -isysroot/Applications/Xcode.app/Contents/Developer/Platforms/MacOSX.platform/Developer/SDKs/MacOSX12.3.sdk -arch x86_64 -U_FORTIFY_SOURCE -D_FORTIFY_SOURCE=1        -o objects/vim9compile.o vim9compile.c
1304:info:build /usr/bin/clang -c -I. -Iproto -DHAVE_CONFIG_H -DFEAT_GUI_MACVIM -Wall -Wno-unknown-pragmas -pipe  -I/opt/local/include -isysroot/Applications/Xcode.app/Contents/Developer/Platforms/MacOSX.platform/Developer/SDKs/MacOSX12.3.sdk -DMACOS_X -DMACOS_X_DARWIN  -pipe -Os -isysroot/Applications/Xcode.app/Contents/Developer/Platforms/MacOSX.platform/Developer/SDKs/MacOSX12.3.sdk -arch x86_64 -U_FORTIFY_SOURCE -D_FORTIFY_SOURCE=1        -o objects/vim9execute.o vim9execute.c
1305:info:build /usr/bin/clang -c -I. -Iproto -DHAVE_CONFIG_H -DFEAT_GUI_MACVIM -Wall -Wno-unknown-pragmas -pipe  -I/opt/local/include -isysroot/Applications/Xcode.app/Contents/Developer/Platforms/MacOSX.platform/Developer/SDKs/MacOSX12.3.sdk -DMACOS_X -DMACOS_X_DARWIN  -pipe -Os -isysroot/Applications/Xcode.app/Contents/Developer/Platforms/MacOSX.platform/Developer/SDKs/MacOSX12.3.sdk -arch x86_64 -U_FORTIFY_SOURCE -D_FORTIFY_SOURCE=1        -o objects/vim9script.o vim9script.c
1306:info:build /usr/bin/clang -c -I. -Iproto -DHAVE_CONFIG_H -DFEAT_GUI_MACVIM -Wall -Wno-unknown-pragmas -pipe  -I/opt/local/include -isysroot/Applications/Xcode.app/Contents/Developer/Platforms/MacOSX.platform/Developer/SDKs/MacOSX12.3.sdk -DMACOS_X -DMACOS_X_DARWIN  -pipe -Os -isysroot/Applications/Xcode.app/Contents/Developer/Platforms/MacOSX.platform/Developer/SDKs/MacOSX12.3.sdk -arch x86_64 -U_FORTIFY_SOURCE -D_FORTIFY_SOURCE=1        -o objects/vim9type.o vim9type.c
1307:info:build /usr/bin/clang -c -I. -Iproto -DHAVE_CONFIG_H -DFEAT_GUI_MACVIM -Wall -Wno-unknown-pragmas -pipe  -I/opt/local/include -isysroot/Applications/Xcode.app/Contents/Developer/Platforms/MacOSX.platform/Developer/SDKs/MacOSX12.3.sdk -DMACOS_X -DMACOS_X_DARWIN  -pipe -Os -isysroot/Applications/Xcode.app/Contents/Developer/Platforms/MacOSX.platform/Developer/SDKs/MacOSX12.3.sdk -arch x86_64 -U_FORTIFY_SOURCE -D_FORTIFY_SOURCE=1        -o objects/viminfo.o viminfo.c
1308:info:build /usr/bin/clang -c -I. -Iproto -DHAVE_CONFIG_H -DFEAT_GUI_MACVIM -Wall -Wno-unknown-pragmas -pipe  -I/opt/local/include -isysroot/Applications/Xcode.app/Contents/Developer/Platforms/MacOSX.platform/Developer/SDKs/MacOSX12.3.sdk -DMACOS_X -DMACOS_X_DARWIN  -pipe -Os -isysroot/Applications/Xcode.app/Contents/Developer/Platforms/MacOSX.platform/Developer/SDKs/MacOSX12.3.sdk -arch x86_64 -U_FORTIFY_SOURCE -D_FORTIFY_SOURCE=1        -o objects/window.o window.c
1309:info:build 1 warning generated.
1310:info:build /usr/bin/clang -c -I. -Iproto -DHAVE_CONFIG_H -DFEAT_GUI_MACVIM -Wall -Wno-unknown-pragmas -pipe  -I/opt/local/include -isysroot/Applications/Xcode.app/Contents/Developer/Platforms/MacOSX.platform/Developer/SDKs/MacOSX12.3.sdk -DMACOS_X -DMACOS_X_DARWIN  -pipe -Os -isysroot/Applications/Xcode.app/Contents/Developer/Platforms/MacOSX.platform/Developer/SDKs/MacOSX12.3.sdk -arch x86_64 -U_FORTIFY_SOURCE -D_FORTIFY_SOURCE=1        -o objects/bufwrite.o bufwrite.c
1311:info:build /usr/bin/clang -c -I. -Iproto -DHAVE_CONFIG_H -DFEAT_GUI_MACVIM -Wall -Wno-unknown-pragmas -pipe  -I/opt/local/include -isysroot/Applications/Xcode.app/Contents/Developer/Platforms/MacOSX.platform/Developer/SDKs/MacOSX12.3.sdk -DMACOS_X -DMACOS_X_DARWIN  -pipe -Os -isysroot/Applications/Xcode.app/Contents/Developer/Platforms/MacOSX.platform/Developer/SDKs/MacOSX12.3.sdk -arch x86_64 -U_FORTIFY_SOURCE -D_FORTIFY_SOURCE=1        -o objects/gui.o gui.c
1312:info:build /usr/bin/clang -c -I. -Iproto -DHAVE_CONFIG_H -DFEAT_GUI_MACVIM -Wall -Wno-unknown-pragmas -pipe  -I/opt/local/include -isysroot/Applications/Xcode.app/Contents/Developer/Platforms/MacOSX.platform/Developer/SDKs/MacOSX12.3.sdk -DMACOS_X -DMACOS_X_DARWIN  -pipe -Os -isysroot/Applications/Xcode.app/Contents/Developer/Platforms/MacOSX.platform/Developer/SDKs/MacOSX12.3.sdk -arch x86_64 -U_FORTIFY_SOURCE -D_FORTIFY_SOURCE=1        -o objects/gui_beval.o gui_beval.c
1313:info:build /usr/bin/clang -c -I. -I/opt/local/include/ruby-2.5.0 -I/opt/local/include/ruby-2.5.0/x86_64-darwin21 -DRUBY_VERSION=25 -Iproto -DHAVE_CONFIG_H -DFEAT_GUI_MACVIM -Wall -Wno-unknown-pragmas -pipe  -I/opt/local/include -isysroot/Applications/Xcode.app/Contents/Developer/Platforms/MacOSX.platform/Developer/SDKs/MacOSX12.3.sdk -DMACOS_X -DMACOS_X_DARWIN  -pipe -Os -isysroot/Applications/Xcode.app/Contents/Developer/Platforms/MacOSX.platform/Developer/SDKs/MacOSX12.3.sdk -arch x86_64 -U_FORTIFY_SOURCE -D_FORTIFY_SOURCE=1        -o objects/if_ruby.o if_ruby.c
1314:info:build /usr/bin/clang -c -I. -Iproto -DHAVE_CONFIG_H -DFEAT_GUI_MACVIM -Wall -Wno-unknown-pragmas -pipe  -I/opt/local/include -isysroot/Applications/Xcode.app/Contents/Developer/Platforms/MacOSX.platform/Developer/SDKs/MacOSX12.3.sdk -DMACOS_X -DMACOS_X_DARWIN  -pipe -Os -isysroot/Applications/Xcode.app/Contents/Developer/Platforms/MacOSX.platform/Developer/SDKs/MacOSX12.3.sdk -arch x86_64 -U_FORTIFY_SOURCE -D_FORTIFY_SOURCE=1        -o objects/netbeans.o netbeans.c
1315:info:build gui.c:2288:13: warning: variable 'wide_font' set but not used [-Wunused-but-set-variable]
1316:info:build     GuiFont     wide_font = NOFONT;
1317:info:build                 ^
1318:info:build gui.c:2301:10: warning: variable 'multi_sign' set but not used [-Wunused-but-set-variable]
1319:info:build     int         multi_sign = FALSE;
1320:info:build                 ^
1321:info:build /usr/bin/clang -c -I. -Iproto -DHAVE_CONFIG_H -DFEAT_GUI_MACVIM -Wall -Wno-unknown-pragmas -pipe  -I/opt/local/include -isysroot/Applications/Xcode.app/Contents/Developer/Platforms/MacOSX.platform/Developer/SDKs/MacOSX12.3.sdk -DMACOS_X -DMACOS_X_DARWIN  -pipe -Os -isysroot/Applications/Xcode.app/Contents/Developer/Platforms/MacOSX.platform/Developer/SDKs/MacOSX12.3.sdk -arch x86_64 -U_FORTIFY_SOURCE -D_FORTIFY_SOURCE=1        -o objects/job.o job.c
1322:info:build if_ruby.c:1118:30: warning: '(' and '{' tokens introducing statement expression appear in different macro expansion contexts [-Wcompound-token-split-by-macro]
1323:info:build             bt = rb_funcallv(error, rb_intern("backtrace"), 0, 0);
1324:info:build                                     ^~~~~~~~~~~~~~~~~~~~~~
1325:info:build /opt/local/include/ruby-2.5.0/ruby/ruby.h:1755:23: note: expanded from macro 'rb_intern'
1326:info:build         __extension__ (RUBY_CONST_ID_CACHE((ID), (str))) : \
1327:info:build                       ^
1328:info:build if_ruby.c:1118:30: note: '{' token is here
1329:info:build             bt = rb_funcallv(error, rb_intern("backtrace"), 0, 0);
1330:info:build                                     ^~~~~~~~~~~~~~~~~~~~~~
1331:info:build /opt/local/include/ruby-2.5.0/ruby/ruby.h:1755:24: note: expanded from macro 'rb_intern'
1332:info:build         __extension__ (RUBY_CONST_ID_CACHE((ID), (str))) : \
1333:info:build                        ^~~~~~~~~~~~~~~~~~~~~~~~~~~~~~~~
1334:info:build /opt/local/include/ruby-2.5.0/ruby/ruby.h:1740:5: note: expanded from macro 'RUBY_CONST_ID_CACHE'
1335:info:build     {                                                   \
1336:info:build     ^
1337:info:build if_ruby.c:1118:30: warning: '}' and ')' tokens terminating statement expression appear in different macro expansion contexts [-Wcompound-token-split-by-macro]
1338:info:build             bt = rb_funcallv(error, rb_intern("backtrace"), 0, 0);
1339:info:build                                     ^~~~~~~~~~~~~~~~~~~~~~
1340:info:build /opt/local/include/ruby-2.5.0/ruby/ruby.h:1755:24: note: expanded from macro 'rb_intern'
1341:info:build         __extension__ (RUBY_CONST_ID_CACHE((ID), (str))) : \
1342:info:build                        ^~~~~~~~~~~~~~~~~~~~~~~~~~~~~~~~
1343:info:build /opt/local/include/ruby-2.5.0/ruby/ruby.h:1745:5: note: expanded from macro 'RUBY_CONST_ID_CACHE'
1344:info:build     }
1345:info:build     ^
1346:info:build if_ruby.c:1118:30: note: ')' token is here
1347:info:build             bt = rb_funcallv(error, rb_intern("backtrace"), 0, 0);
1348:info:build                                     ^~~~~~~~~~~~~~~~~~~~~~
1349:info:build /opt/local/include/ruby-2.5.0/ruby/ruby.h:1755:56: note: expanded from macro 'rb_intern'
1350:info:build         __extension__ (RUBY_CONST_ID_CACHE((ID), (str))) : \
1351:info:build                                                        ^
1352:info:build /usr/bin/clang -c -I. -Iproto -DHAVE_CONFIG_H -DFEAT_GUI_MACVIM -Wall -Wno-unknown-pragmas -pipe  -I/opt/local/include -isysroot/Applications/Xcode.app/Contents/Developer/Platforms/MacOSX.platform/Developer/SDKs/MacOSX12.3.sdk -DMACOS_X -DMACOS_X_DARWIN  -pipe -Os -isysroot/Applications/Xcode.app/Contents/Developer/Platforms/MacOSX.platform/Developer/SDKs/MacOSX12.3.sdk -arch x86_64 -U_FORTIFY_SOURCE -D_FORTIFY_SOURCE=1        -o objects/channel.o channel.c
1353:info:build 2 warnings generated.
1354:info:build /usr/bin/clang -c -I. -Iproto -DHAVE_CONFIG_H -DFEAT_GUI_MACVIM -Wall -Wno-unknown-pragmas -pipe  -I/opt/local/include -isysroot/Applications/Xcode.app/Contents/Developer/Platforms/MacOSX.platform/Developer/SDKs/MacOSX12.3.sdk -DMACOS_X -DMACOS_X_DARWIN  -pipe -Os -isysroot/Applications/Xcode.app/Contents/Developer/Platforms/MacOSX.platform/Developer/SDKs/MacOSX12.3.sdk -arch x86_64 -U_FORTIFY_SOURCE -D_FORTIFY_SOURCE=1        -o objects/xdiffi.o xdiff/xdiffi.c
1355:info:build /usr/bin/clang -c -I. -Iproto -DHAVE_CONFIG_H -DFEAT_GUI_MACVIM -Wall -Wno-unknown-pragmas -pipe  -I/opt/local/include -isysroot/Applications/Xcode.app/Contents/Developer/Platforms/MacOSX.platform/Developer/SDKs/MacOSX12.3.sdk -DMACOS_X -DMACOS_X_DARWIN  -pipe -Os -isysroot/Applications/Xcode.app/Contents/Developer/Platforms/MacOSX.platform/Developer/SDKs/MacOSX12.3.sdk -arch x86_64 -U_FORTIFY_SOURCE -D_FORTIFY_SOURCE=1        -o objects/xemit.o xdiff/xemit.c
1356:info:build /usr/bin/clang -c -I. -Iproto -DHAVE_CONFIG_H -DFEAT_GUI_MACVIM -Wall -Wno-unknown-pragmas -pipe  -I/opt/local/include -isysroot/Applications/Xcode.app/Contents/Developer/Platforms/MacOSX.platform/Developer/SDKs/MacOSX12.3.sdk -DMACOS_X -DMACOS_X_DARWIN  -pipe -Os -isysroot/Applications/Xcode.app/Contents/Developer/Platforms/MacOSX.platform/Developer/SDKs/MacOSX12.3.sdk -arch x86_64 -U_FORTIFY_SOURCE -D_FORTIFY_SOURCE=1        -o objects/xprepare.o xdiff/xprepare.c
1357:info:build /usr/bin/clang -c -I. -Iproto -DHAVE_CONFIG_H -DFEAT_GUI_MACVIM -Wall -Wno-unknown-pragmas -pipe  -I/opt/local/include -isysroot/Applications/Xcode.app/Contents/Developer/Platforms/MacOSX.platform/Developer/SDKs/MacOSX12.3.sdk -DMACOS_X -DMACOS_X_DARWIN  -pipe -Os -isysroot/Applications/Xcode.app/Contents/Developer/Platforms/MacOSX.platform/Developer/SDKs/MacOSX12.3.sdk -arch x86_64 -U_FORTIFY_SOURCE -D_FORTIFY_SOURCE=1        -o objects/xutils.o xdiff/xutils.c
1358:info:build /usr/bin/clang -c -I. -Iproto -DHAVE_CONFIG_H -DFEAT_GUI_MACVIM -Wall -Wno-unknown-pragmas -pipe  -I/opt/local/include -isysroot/Applications/Xcode.app/Contents/Developer/Platforms/MacOSX.platform/Developer/SDKs/MacOSX12.3.sdk -DMACOS_X -DMACOS_X_DARWIN  -pipe -Os -isysroot/Applications/Xcode.app/Contents/Developer/Platforms/MacOSX.platform/Developer/SDKs/MacOSX12.3.sdk -arch x86_64 -U_FORTIFY_SOURCE -D_FORTIFY_SOURCE=1        -o objects/xhistogram.o xdiff/xhistogram.c
1359:info:build /usr/bin/clang -c -I. -Iproto -DHAVE_CONFIG_H -DFEAT_GUI_MACVIM -Wall -Wno-unknown-pragmas -pipe  -I/opt/local/include -isysroot/Applications/Xcode.app/Contents/Developer/Platforms/MacOSX.platform/Developer/SDKs/MacOSX12.3.sdk -DMACOS_X -DMACOS_X_DARWIN  -pipe -Os -isysroot/Applications/Xcode.app/Contents/Developer/Platforms/MacOSX.platform/Developer/SDKs/MacOSX12.3.sdk -arch x86_64 -U_FORTIFY_SOURCE -D_FORTIFY_SOURCE=1        -o objects/xpatience.o xdiff/xpatience.c
1360:info:build 2 warnings generated.
1361:info:build /usr/bin/clang -c -I. -Iproto -DHAVE_CONFIG_H -DFEAT_GUI_MACVIM -Wall -Wno-unknown-pragmas -pipe  -I/opt/local/include -isysroot/Applications/Xcode.app/Contents/Developer/Platforms/MacOSX.platform/Developer/SDKs/MacOSX12.3.sdk -DMACOS_X -DMACOS_X_DARWIN  -pipe -Os -isysroot/Applications/Xcode.app/Contents/Developer/Platforms/MacOSX.platform/Developer/SDKs/MacOSX12.3.sdk -arch x86_64 -U_FORTIFY_SOURCE -D_FORTIFY_SOURCE=1        -o objects/charset.o charset.c
1362:info:build /usr/bin/clang -c -I. -Iproto -DHAVE_CONFIG_H -DFEAT_GUI_MACVIM -Wall -Wno-unknown-pragmas -pipe  -I/opt/local/include -isysroot/Applications/Xcode.app/Contents/Developer/Platforms/MacOSX.platform/Developer/SDKs/MacOSX12.3.sdk -DMACOS_X -DMACOS_X_DARWIN  -pipe -Os -isysroot/Applications/Xcode.app/Contents/Developer/Platforms/MacOSX.platform/Developer/SDKs/MacOSX12.3.sdk -arch x86_64 -U_FORTIFY_SOURCE -D_FORTIFY_SOURCE=1        -o objects/json.o json.c
1363:info:build /usr/bin/clang -c -I. -Iproto -DHAVE_CONFIG_H -DFEAT_GUI_MACVIM -Wall -Wno-unknown-pragmas -pipe  -I/opt/local/include -isysroot/Applications/Xcode.app/Contents/Developer/Platforms/MacOSX.platform/Developer/SDKs/MacOSX12.3.sdk -DMACOS_X -DMACOS_X_DARWIN  -pipe -Os -isysroot/Applications/Xcode.app/Contents/Developer/Platforms/MacOSX.platform/Developer/SDKs/MacOSX12.3.sdk -arch x86_64 -U_FORTIFY_SOURCE -D_FORTIFY_SOURCE=1        -o objects/main.o main.c
1364:info:build /usr/bin/clang -c -I. -Iproto -DHAVE_CONFIG_H -DFEAT_GUI_MACVIM -Wall -Wno-unknown-pragmas -pipe  -I/opt/local/include -isysroot/Applications/Xcode.app/Contents/Developer/Platforms/MacOSX.platform/Developer/SDKs/MacOSX12.3.sdk -DMACOS_X -DMACOS_X_DARWIN  -pipe -Os -isysroot/Applications/Xcode.app/Contents/Developer/Platforms/MacOSX.platform/Developer/SDKs/MacOSX12.3.sdk -arch x86_64 -U_FORTIFY_SOURCE -D_FORTIFY_SOURCE=1        -o objects/memfile.o memfile.c
1365:info:build /usr/bin/clang -c -I. -Iproto -DHAVE_CONFIG_H -DFEAT_GUI_MACVIM -Wall -Wno-unknown-pragmas -pipe  -I/opt/local/include -isysroot/Applications/Xcode.app/Contents/Developer/Platforms/MacOSX.platform/Developer/SDKs/MacOSX12.3.sdk -DMACOS_X -DMACOS_X_DARWIN  -pipe -Os -isysroot/Applications/Xcode.app/Contents/Developer/Platforms/MacOSX.platform/Developer/SDKs/MacOSX12.3.sdk -arch x86_64 -U_FORTIFY_SOURCE -D_FORTIFY_SOURCE=1        -o objects/message.o message.c
1366:info:build /usr/bin/clang -c -I. -Iproto -DHAVE_CONFIG_H -DFEAT_GUI_MACVIM -Wall -Wno-unknown-pragmas -pipe  -I/opt/local/include -isysroot/Applications/Xcode.app/Contents/Developer/Platforms/MacOSX.platform/Developer/SDKs/MacOSX12.3.sdk -DMACOS_X -DMACOS_X_DARWIN  -pipe -Os -isysroot/Applications/Xcode.app/Contents/Developer/Platforms/MacOSX.platform/Developer/SDKs/MacOSX12.3.sdk -arch x86_64 -U_FORTIFY_SOURCE -D_FORTIFY_SOURCE=1        version.c -o objects/version.o
1367:info:build   /usr/bin/clang   -L. -L/opt/local/libexec/openssl11/lib -L/opt/local/lib -Wl,-headerpad_max_install_names -Wl,-syslibroot,/Library/Developer/CommandLineTools/SDKs/MacOSX.sdk -fstack-protector -L/opt/local/lib -L. -L/opt/local/libexec/openssl11/lib -L/opt/local/lib -Wl,-headerpad_max_install_names -Wl,-syslibroot,/Library/Developer/CommandLineTools/SDKs/MacOSX.sdk -fstack-protector -L/opt/local/lib -L/opt/local/lib -Wl,-headerpad_max_install_names -Wl,-syslibroot,/Applications/Xcode.app/Contents/Developer/Platforms/MacOSX.platform/Developer/SDKs/MacOSX12.3.sdk -arch x86_64        -o Vim objects/arabic.o objects/arglist.o objects/autocmd.o objects/beval.o objects/buffer.o objects/change.o objects/blob.o objects/blowfish.o objects/cindent.o objects/clientserver.o objects/clipboard.o objects/cmdexpand.o objects/cmdhist.o objects/crypt.o objects/crypt_zip.o objects/debugger.o objects/dict.o objects/diff.o objects/digraph.o objects/drawline.o objects/drawscreen.o objects/edit.o objects/eval.o objects/evalbuffer.o objects/evalfunc.o objects/evalvars.o objects/evalwindow.o objects/ex_cmds.o objects/ex_cmds2.o objects/ex_docmd.o objects/ex_eval.o objects/ex_getln.o objects/fileio.o objects/filepath.o objects/findfile.o objects/fold.o objects/getchar.o objects/gui_xim.o objects/hardcopy.o objects/hashtab.o objects/help.o objects/highlight.o objects/if_cscope.o objects/if_xcmdsrv.o objects/indent.o objects/insexpand.o objects/list.o objects/locale.o objects/map.o objects/mark.o objects/match.o objects/mbyte.o objects/memline.o objects/menu.o objects/misc1.o objects/misc2.o objects/mouse.o objects/move.o objects/normal.o objects/ops.o objects/option.o objects/optionstr.o objects/os_unix.o objects/pathdef.o objects/popupmenu.o objects/popupwin.o objects/profiler.o objects/pty.o objects/quickfix.o objects/regexp.o objects/register.o objects/screen.o objects/scriptfile.o objects/search.o objects/session.o objects/sha256.o objects/sign.o objects/sound.o objects/spell.o objects/spellfile.o objects/spellsuggest.o objects/syntax.o objects/tag.o objects/term.o objects/terminal.o objects/testing.o objects/textformat.o objects/textobject.o objects/textprop.o objects/time.o objects/typval.o objects/ui.o objects/undo.o objects/usercmd.o objects/userfunc.o objects/version.o objects/vim9compile.o objects/vim9execute.o objects/vim9script.o objects/vim9type.o objects/viminfo.o objects/window.o objects/bufwrite.o objects/gui.o objects/gui_beval.o objects/gui_macvim.o objects/MMBackend.o objects/MacVim.o objects/vterm_encoding.o objects/vterm_keyboard.o objects/vterm_mouse.o objects/vterm_parser.o objects/vterm_pen.o objects/vterm_screen.o objects/vterm_state.o objects/vterm_unicode.o objects/vterm_vterm.o       objects/if_ruby.o objects/os_macosx.o objects/os_mac_conv.o objects/netbeans.o objects/job.o objects/channel.o objects/xdiffi.o objects/xemit.o objects/xprepare.o objects/xutils.o objects/xhistogram.o objects/xpatience.o  objects/charset.o objects/json.o objects/main.o objects/memfile.o objects/message.o        -lm  -lncurses -liconv -lintl -framework AppKit       -lruby.2.5.9 -lpthread -ldl -lobjc -L/opt/local/lib   
1368:info:build link.sh: OK, linking works, let's try omitting a few libraries.
1369:info:build link.sh: See auto/link.log for details.
1370:info:build link.sh: Trying to omit the iconv library...
1371:info:build link.sh: Vim DOES need the iconv library.
1372:info:build link.sh: Trying to omit the dl library...
1373:info:build link.sh: Vim doesn't need the dl library!
1374:info:build link.sh: Trying to omit the pthread library...
1375:info:build link.sh: Vim doesn't need the pthread library!
1376:info:build make[2]: Entering directory `/opt/local/var/macports/build/_opt_local_var_macports_sources_rsync.macports.org_macports_release_tarballs_ports_editors_MacVim/MacVim/work/macvim-dev-macvim-e65c14c/src'
1377:info:build creating auto/pathdef.c
1378:info:build /usr/bin/clang -c -I. -Iproto -DHAVE_CONFIG_H -DFEAT_GUI_MACVIM -Wall -Wno-unknown-pragmas -pipe  -I/opt/local/include -isysroot/Applications/Xcode.app/Contents/Developer/Platforms/MacOSX.platform/Developer/SDKs/MacOSX12.3.sdk -DMACOS_X -DMACOS_X_DARWIN  -pipe -Os -isysroot/Applications/Xcode.app/Contents/Developer/Platforms/MacOSX.platform/Developer/SDKs/MacOSX12.3.sdk -arch x86_64 -U_FORTIFY_SOURCE -D_FORTIFY_SOURCE=1        -o objects/pathdef.o auto/pathdef.c
1379:info:build make[2]: Leaving directory `/opt/local/var/macports/build/_opt_local_var_macports_sources_rsync.macports.org_macports_release_tarballs_ports_editors_MacVim/MacVim/work/macvim-dev-macvim-e65c14c/src'
1380:info:build link.sh: Using auto/link.sed file to omit a few libraries
1381:info:build   /usr/bin/clang   -L. -L/opt/local/libexec/openssl11/lib -L/opt/local/lib -Wl,-headerpad_max_install_names -Wl,-syslibroot,/Library/Developer/CommandLineTools/SDKs/MacOSX.sdk -fstack-protector -L/opt/local/lib -L. -L/opt/local/libexec/openssl11/lib -L/opt/local/lib -Wl,-headerpad_max_install_names -Wl,-syslibroot,/Library/Developer/CommandLineTools/SDKs/MacOSX.sdk -fstack-protector -L/opt/local/lib -L/opt/local/lib -Wl,-headerpad_max_install_names -Wl,-syslibroot,/Applications/Xcode.app/Contents/Developer/Platforms/MacOSX.platform/Developer/SDKs/MacOSX12.3.sdk -arch x86_64        -o Vim objects/arabic.o objects/arglist.o objects/autocmd.o objects/beval.o objects/buffer.o objects/change.o objects/blob.o objects/blowfish.o objects/cindent.o objects/clientserver.o objects/clipboard.o objects/cmdexpand.o objects/cmdhist.o objects/crypt.o objects/crypt_zip.o objects/debugger.o objects/dict.o objects/diff.o objects/digraph.o objects/drawline.o objects/drawscreen.o objects/edit.o objects/eval.o objects/evalbuffer.o objects/evalfunc.o objects/evalvars.o objects/evalwindow.o objects/ex_cmds.o objects/ex_cmds2.o objects/ex_docmd.o objects/ex_eval.o objects/ex_getln.o objects/fileio.o objects/filepath.o objects/findfile.o objects/fold.o objects/getchar.o objects/gui_xim.o objects/hardcopy.o objects/hashtab.o objects/help.o objects/highlight.o objects/if_cscope.o objects/if_xcmdsrv.o objects/indent.o objects/insexpand.o objects/list.o objects/locale.o objects/map.o objects/mark.o objects/match.o objects/mbyte.o objects/memline.o objects/menu.o objects/misc1.o objects/misc2.o objects/mouse.o objects/move.o objects/normal.o objects/ops.o objects/option.o objects/optionstr.o objects/os_unix.o objects/pathdef.o objects/popupmenu.o objects/popupwin.o objects/profiler.o objects/pty.o objects/quickfix.o objects/regexp.o objects/register.o objects/screen.o objects/scriptfile.o objects/search.o objects/session.o objects/sha256.o objects/sign.o objects/sound.o objects/spell.o objects/spellfile.o objects/spellsuggest.o objects/syntax.o objects/tag.o objects/term.o objects/terminal.o objects/testing.o objects/textformat.o objects/textobject.o objects/textprop.o objects/time.o objects/typval.o objects/ui.o objects/undo.o objects/usercmd.o objects/userfunc.o objects/version.o objects/vim9compile.o objects/vim9execute.o objects/vim9script.o objects/vim9type.o objects/viminfo.o objects/window.o objects/bufwrite.o objects/gui.o objects/gui_beval.o objects/gui_macvim.o objects/MMBackend.o objects/MacVim.o objects/vterm_encoding.o objects/vterm_keyboard.o objects/vterm_mouse.o objects/vterm_parser.o objects/vterm_pen.o objects/vterm_screen.o objects/vterm_state.o objects/vterm_unicode.o objects/vterm_vterm.o       objects/if_ruby.o objects/os_macosx.o objects/os_mac_conv.o objects/netbeans.o objects/job.o objects/channel.o objects/xdiffi.o objects/xemit.o objects/xprepare.o objects/xutils.o objects/xhistogram.o objects/xpatience.o  objects/charset.o objects/json.o objects/main.o objects/memfile.o objects/message.o        -lm  -lncurses -liconv -lintl -framework AppKit       -lruby.2.5.9 -lobjc -L/opt/local/lib   
1382:info:build link.sh: Linked fine with a few libraries omitted
1383:info:build xcodebuild -project MacVim/MacVim.xcodeproj CACHE_ROOT=/opt/local/var/macports/build/_opt_local_var_macports_sources_rsync.macports.org_macports_release_tarballs_ports_editors_MacVim/MacVim/work/caches -UseNewBuildSystem=NO MACOSX_DEPLOYMENT_TARGET=12.0 ARCHS=x86_64
1384:info:build 2022-05-06 16:46:59.850 xcodebuild[17714:550158] Requested but did not find extension point with identifier Xcode.IDEKit.ExtensionSentinelHostApplications for extension Xcode.DebuggerFoundation.AppExtensionHosts.watchOS of plug-in com.apple.dt.IDEWatchSupportCore
1385:info:build 2022-05-06 16:46:59.851 xcodebuild[17714:550158] Requested but did not find extension point with identifier Xcode.IDEKit.ExtensionPointIdentifierToBundleIdentifier for extension Xcode.DebuggerFoundation.AppExtensionToBundleIdentifierMap.watchOS of plug-in com.apple.dt.IDEWatchSupportCore
1386:info:build Command line invocation:
1387:info:build     /Applications/Xcode.app/Contents/Developer/usr/bin/xcodebuild -project MacVim/MacVim.xcodeproj CACHE_ROOT=/opt/local/var/macports/build/_opt_local_var_macports_sources_rsync.macports.org_macports_release_tarballs_ports_editors_MacVim/MacVim/work/caches -UseNewBuildSystem=NO MACOSX_DEPLOYMENT_TARGET=12.0 ARCHS=x86_64
1388:info:build User defaults from command line:
1389:info:build     IDEPackageSupportUseBuiltinSCM = YES
1390:info:build     UseNewBuildSystem = NO
1391:info:build Build settings from command line:
1392:info:build     ARCHS = x86_64
1393:info:build     CACHE_ROOT = /opt/local/var/macports/build/_opt_local_var_macports_sources_rsync.macports.org_macports_release_tarballs_ports_editors_MacVim/MacVim/work/caches
1394:info:build     MACOSX_DEPLOYMENT_TARGET = 12.0
1395:info:build 2022-05-06 16:47:00.194 xcodebuild[17714:550159] Error Domain=com.apple.CoreSimulator.SimError Code=400 "Unable to determine SimDeviceSet, set_path=(null)" UserInfo={NSLocalizedDescription=Unable to determine SimDeviceSet, set_path=(null), NSUnderlyingError=0x6000038f3e40 {Error Domain=NSPOSIXErrorDomain Code=12 "Cannot allocate memory" UserInfo={NSLocalizedFailureReason=Allocation or initialization failed., NSLocalizedDescription=Failed to initialize simulator device set.}}}
1396:info:build 2022-05-06 16:47:00.195 xcodebuild[17714:550159]  iOSSimulator: [SimServiceContext defaultDeviceSetWithError:] returned nil (Error Domain=com.apple.CoreSimulator.SimError Code=400 "Failed to initialize simulator device set." UserInfo={NSLocalizedFailureReason=Failed to subscribe to notifications from CoreSimulatorService., NSLocalizedDescription=Failed to initialize simulator device set., NSUnderlyingError=0x6000038f3ed0 {Error Domain=com.apple.CoreSimulator.SimError Code=400 "Unable to determine SimDeviceSet, set_path=(null)" UserInfo={NSLocalizedDescription=Unable to determine SimDeviceSet, set_path=(null), NSUnderlyingError=0x6000038f3e40 {Error Domain=NSPOSIXErrorDomain Code=12 "Cannot allocate memory" UserInfo={NSLocalizedFailureReason=Allocation or initialization failed., NSLocalizedDescription=Failed to initialize simulator device set.}}}}}). Simulator device support disabled.
1397:info:build 2022-05-06 16:47:00.234 xcodebuild[17714:550158] [MT] IDELogStore: Failed to open log store at /opt/local/var/macports/home/Library/Developer/Xcode/DerivedData/MacVim-hirxhaymuxqztehdqsktqackpvpt/Logs/Build
1398:info:build 2022-05-06 16:47:00.234 xcodebuild[17714:550158] [MT] IDELogStore: Failed to open Build log store: Error Domain=IDEFoundationErrorDomain Code=1 "Unable to create log store directory at '/opt/local/var/macports/home/Library/Developer/Xcode/DerivedData/MacVim-hirxhaymuxqztehdqsktqackpvpt/Logs/Build': (513) You don’t have permission to save the file “Build” in the folder “Logs”." UserInfo={NSLocalizedDescription=Unable to create log store directory at '/opt/local/var/macports/home/Library/Developer/Xcode/DerivedData/MacVim-hirxhaymuxqztehdqsktqackpvpt/Logs/Build': (513) You don’t have permission to save the file “Build” in the folder “Logs”.}. User info: {
1399:info:build     NSLocalizedDescription = "Unable to create log store directory at '/opt/local/var/macports/home/Library/Developer/Xcode/DerivedData/MacVim-hirxhaymuxqztehdqsktqackpvpt/Logs/Build': (513) You don\U2019t have permission to save the file \U201cBuild\U201d in the folder \U201cLogs\U201d.";
1400:info:build }.
1401:info:build 2022-05-06 16:47:00.241 xcodebuild[17714:550158] [MT] IDELogStore: Failed to open log store at /opt/local/var/macports/home/Library/Developer/Xcode/DerivedData/MacVim-hirxhaymuxqztehdqsktqackpvpt/Logs/Localization
1402:info:build 2022-05-06 16:47:00.241 xcodebuild[17714:550158] [MT] IDELogStore: Failed to open Localization log store: Error Domain=IDEFoundationErrorDomain Code=1 "Unable to create log store directory at '/opt/local/var/macports/home/Library/Developer/Xcode/DerivedData/MacVim-hirxhaymuxqztehdqsktqackpvpt/Logs/Localization': (513) You don’t have permission to save the file “Localization” in the folder “Logs”." UserInfo={NSLocalizedDescription=Unable to create log store directory at '/opt/local/var/macports/home/Library/Developer/Xcode/DerivedData/MacVim-hirxhaymuxqztehdqsktqackpvpt/Logs/Localization': (513) You don’t have permission to save the file “Localization” in the folder “Logs”.}. User info: {
1403:info:build     NSLocalizedDescription = "Unable to create log store directory at '/opt/local/var/macports/home/Library/Developer/Xcode/DerivedData/MacVim-hirxhaymuxqztehdqsktqackpvpt/Logs/Localization': (513) You don\U2019t have permission to save the file \U201cLocalization\U201d in the folder \U201cLogs\U201d.";
1404:info:build }.
1405:info:build 2022-05-06 16:47:00.242 xcodebuild[17714:550158] [MT] IDELogStore: Failed to open log store at /opt/local/var/macports/home/Library/Developer/Xcode/DerivedData/MacVim-hirxhaymuxqztehdqsktqackpvpt/Logs/Package
1406:info:build 2022-05-06 16:47:00.242 xcodebuild[17714:550158] [MT] IDELogStore: Failed to open Package log store: Error Domain=IDEFoundationErrorDomain Code=1 "Unable to create log store directory at '/opt/local/var/macports/home/Library/Developer/Xcode/DerivedData/MacVim-hirxhaymuxqztehdqsktqackpvpt/Logs/Package': (513) You don’t have permission to save the file “Package” in the folder “Logs”." UserInfo={NSLocalizedDescription=Unable to create log store directory at '/opt/local/var/macports/home/Library/Developer/Xcode/DerivedData/MacVim-hirxhaymuxqztehdqsktqackpvpt/Logs/Package': (513) You don’t have permission to save the file “Package” in the folder “Logs”.}. User info: {
1407:info:build     NSLocalizedDescription = "Unable to create log store directory at '/opt/local/var/macports/home/Library/Developer/Xcode/DerivedData/MacVim-hirxhaymuxqztehdqsktqackpvpt/Logs/Package': (513) You don\U2019t have permission to save the file \U201cPackage\U201d in the folder \U201cLogs\U201d.";
1408:info:build }.
1409:info:build 2022-05-06 16:47:00.246 xcodebuild[17714:550158] [MT] IDELogStore: Failed to open log store at /opt/local/var/macports/home/Library/Developer/Xcode/DerivedData/MacVim-hirxhaymuxqztehdqsktqackpvpt/Logs/Test
1410:info:build 2022-05-06 16:47:00.246 xcodebuild[17714:550158] [MT] IDELogStore: Failed to open Test log store: Error Domain=IDEFoundationErrorDomain Code=1 "Unable to create log store directory at '/opt/local/var/macports/home/Library/Developer/Xcode/DerivedData/MacVim-hirxhaymuxqztehdqsktqackpvpt/Logs/Test': (513) You don’t have permission to save the file “Test” in the folder “Logs”." UserInfo={NSLocalizedDescription=Unable to create log store directory at '/opt/local/var/macports/home/Library/Developer/Xcode/DerivedData/MacVim-hirxhaymuxqztehdqsktqackpvpt/Logs/Test': (513) You don’t have permission to save the file “Test” in the folder “Logs”.}. User info: {
1411:info:build     NSLocalizedDescription = "Unable to create log store directory at '/opt/local/var/macports/home/Library/Developer/Xcode/DerivedData/MacVim-hirxhaymuxqztehdqsktqackpvpt/Logs/Test': (513) You don\U2019t have permission to save the file \U201cTest\U201d in the folder \U201cLogs\U201d.";
1412:info:build }.
1413:info:build 2022-05-06 16:47:00.250 xcodebuild[17714:550158] Couldn't create intermediates directory: You don’t have permission to save the file “MacVim-hirxhaymuxqztehdqsktqackpvpt” in the folder “DerivedData”.
1414:info:build 2022-05-06 16:47:00.669 xcodebuild[17714:550158] [MT] DVTAssertions: Warning in /Library/Caches/com.apple.xbs/Sources/IDEFrameworks/IDEFrameworks-20103/IDEFoundation/Buildables/IDEWorkspaceArena.m:1134
1415:info:build Details:  Failed to create workspace arena at <DVTFilePath:0x60000061a910:'/opt/local/var/macports/home/Library/Developer/Xcode/DerivedData/MacVim-hirxhaymuxqztehdqsktqackpvpt'>: Error Domain=NSCocoaErrorDomain Code=513 "You don’t have permission to save the file “MacVim-hirxhaymuxqztehdqsktqackpvpt” in the folder “DerivedData”." UserInfo={NSFilePath=/opt/local/var/macports/home/Library/Developer/Xcode/DerivedData/MacVim-hirxhaymuxqztehdqsktqackpvpt, NSUnderlyingError=0x60000393ea60 {Error Domain=NSPOSIXErrorDomain Code=1 "Operation not permitted"}}
1416:info:build Object:   <IDEWorkspaceArena: 0x600001a1ab00>
1417:info:build Method:   -createWorkspaceArenaFolderIfNecessary
1418:info:build Thread:   <_NSMainThread: 0x60000211c380>{number = 1, name = main}
1419:info:build Please file a bug at https://feedbackassistant.apple.com with this warning message and any useful information you can provide.
1420:info:build note: Using new build system
1421:info:build error: Build service could not create build operation: unknown error while handling message: fopen(/opt/local/var/macports/home/Library/Developer/Xcode/DerivedData/MacVim-hirxhaymuxqztehdqsktqackpvpt/XCBuildData/PIFCache/WORKSPACE@v11_hash=(null)_subobjects=dbea6aa6c9117cb834b322d1e4e14844-Workspace.lock, wb): No such file or directory (2)
1422:info:build ** BUILD FAILED **
1423:info:build Couldn't set atribute on intermediates directory: setxattr(/opt/local/var/macports/home/Library/Developer/Xcode/DerivedData/MacVim-hirxhaymuxqztehdqsktqackpvpt, com.apple.xcode.CreatedByBuildSystem, true): No such file or directory (2)
1424:info:build Couldn't set atribute on intermediates directory: setxattr(/opt/local/var/macports/home/Library/Developer/Xcode/DerivedData/MacVim-hirxhaymuxqztehdqsktqackpvpt, com.apple.xcode.CreatedByBuildSystem, true): No such file or directory (2)
1425:info:build Couldn't set atribute on intermediates directory: setxattr(/opt/local/var/macports/home/Library/Developer/Xcode/DerivedData/MacVim-hirxhaymuxqztehdqsktqackpvpt, com.apple.xcode.CreatedByBuildSystem, true): No such file or directory (2)
1426:info:build Couldn't set atribute on intermediates directory: setxattr(/opt/local/var/macports/home/Library/Developer/Xcode/DerivedData/MacVim-hirxhaymuxqztehdqsktqackpvpt, com.apple.xcode.CreatedByBuildSystem, true): No such file or directory (2)
1427:info:build make[1]: *** [macvim] Error 65
1428:info:build make[1]: Leaving directory `/opt/local/var/macports/build/_opt_local_var_macports_sources_rsync.macports.org_macports_release_tarballs_ports_editors_MacVim/MacVim/work/macvim-dev-macvim-e65c14c/src'
1429:info:build make: *** [all] Error 2
1430:info:build make: Leaving directory `/opt/local/var/macports/build/_opt_local_var_macports_sources_rsync.macports.org_macports_release_tarballs_ports_editors_MacVim/MacVim/work/macvim-dev-macvim-e65c14c'
1431:info:build Command failed:  cd "/opt/local/var/macports/build/_opt_local_var_macports_sources_rsync.macports.org_macports_release_tarballs_ports_editors_MacVim/MacVim/work/macvim-171" && /usr/bin/make -j12 -w all XCODEFLAGS="CACHE_ROOT=/opt/local/var/macports/build/_opt_local_var_macports_sources_rsync.macports.org_macports_release_tarballs_ports_editors_MacVim/MacVim/work/caches -UseNewBuildSystem=NO MACOSX_DEPLOYMENT_TARGET=12.0 ARCHS=x86_64"
1432:info:build Exit code: 2
1433:error:build Failed to build MacVim: command execution failed
1434:debug:build Error code: CHILDSTATUS 17081 2
1435:debug:build Backtrace: command execution failed
1436:debug:build     while executing
1437:debug:build "system {*}$notty {*}$callback {*}$nice $fullcmdstring"
1438:debug:build     invoked from within
1439:debug:build "command_exec -callback portprogress::target_progress_callback build"
1440:debug:build     (procedure "portbuild::build_main" line 8)
1441:debug:build     invoked from within
1442:debug:build "$procedure $targetname"
1443:error:build See /opt/local/var/macports/logs/_opt_local_var_macports_sources_rsync.macports.org_macports_release_tarballs_ports_editors_MacVim/MacVim/main.log for details.