Ticket #65121: main.log

File main.log, 161.0 KB (added by vidakris, 9 months ago)
Line 
1version:1
2:debug:clean Starting logging for MacVim @8.2.snapshot171_2+huge+xim
3:debug:sysinfo macOS 12.3.1 (darwin/21.4.0) arch arm
4:debug:sysinfo MacPorts 2.7.2
5:debug:sysinfo Xcode 13.3.1
6:debug:sysinfo SDK 12
7:debug:sysinfo MACOSX_DEPLOYMENT_TARGET: 12.0
8:debug:clean epoch: in tree: 0 installed: 0
9:debug:clean ncurses 6.3_0 exists in the ports tree
10:debug:clean ncurses 6.3_0  is the latest installed
11:debug:clean ncurses 6.3_0 +universal is active
12:debug:clean Merging existing requested variants '+universal' into variants
13:debug:clean new fully merged portvariants: universal +
14:debug:clean Changing to port directory: /opt/local/var/macports/sources/rsync.macports.org/macports/release/tarballs/ports/devel/ncurses
15:debug:clean OS darwin/21.4.0 (macOS 12.3.1) arch arm
16:debug:clean Sourcing PortGroup clang_dependency 1.0 from /opt/local/var/macports/sources/rsync.macports.org/macports/release/tarballs/ports/_resources/port1.0/group/clang_dependency-1.0.tcl
17:debug:clean adding the default universal variant
18:debug:clean Reading variant descriptions from /opt/local/var/macports/sources/rsync.macports.org/macports/release/tarballs/ports/_resources/port1.0/variant_descriptions.conf
19:debug:clean Executing variant universal provides universal
20:debug:clean Running callback portconfigure::add_automatic_compiler_dependencies
21:debug:clean Finished running callback portconfigure::add_automatic_compiler_dependencies
22:debug:clean Running callback portbuild::add_automatic_buildsystem_dependencies
23:debug:clean Finished running callback portbuild::add_automatic_buildsystem_dependencies
24:debug:clean Running callback portstartupitem::add_notes
25:debug:clean Finished running callback portstartupitem::add_notes
26:debug:clean No need to upgrade! ncurses 6.3_0 >= ncurses 6.3_0
27:debug:clean epoch: in tree: 2 installed: 2
28:debug:clean gettext 0.21_0 exists in the ports tree
29:debug:clean gettext 0.21_0  is the latest installed
30:debug:clean gettext 0.21_0 +universal is active
31:debug:clean Merging existing requested variants '+universal' into variants
32:debug:clean new fully merged portvariants: universal +
33:debug:clean Changing to port directory: /opt/local/var/macports/sources/rsync.macports.org/macports/release/tarballs/ports/devel/gettext
34:debug:clean OS darwin/21.4.0 (macOS 12.3.1) arch arm
35:debug:clean Sourcing PortGroup compiler_blacklist_versions 1.0 from /opt/local/var/macports/sources/rsync.macports.org/macports/release/tarballs/ports/_resources/port1.0/group/compiler_blacklist_versions-1.0.tcl
36:debug:clean Sourcing PortGroup muniversal 1.0 from /opt/local/var/macports/sources/rsync.macports.org/macports/release/tarballs/ports/_resources/port1.0/group/muniversal-1.0.tcl
37:debug:clean Sourcing PortGroup clang_dependency 1.0 from /opt/local/var/macports/sources/rsync.macports.org/macports/release/tarballs/ports/_resources/port1.0/group/clang_dependency-1.0.tcl
38:debug:clean compiler clang 1316.0.21.2.3 not blacklisted because it doesn't match {clang < 211.10.1}
39:debug:clean muniversal: adding universal variant
40:debug:clean Reading variant descriptions from /opt/local/var/macports/sources/rsync.macports.org/macports/release/tarballs/ports/_resources/port1.0/variant_descriptions.conf
41:debug:clean Executing variant universal provides universal
42:debug:clean Running callback portconfigure::add_automatic_compiler_dependencies
43:debug:clean Finished running callback portconfigure::add_automatic_compiler_dependencies
44:debug:clean Running callback portbuild::add_automatic_buildsystem_dependencies
45:debug:clean Finished running callback portbuild::add_automatic_buildsystem_dependencies
46:debug:clean Running callback portstartupitem::add_notes
47:debug:clean Finished running callback portstartupitem::add_notes
48:debug:clean No need to upgrade! gettext 0.21_0 >= gettext 0.21_0
49:debug:clean epoch: in tree: 0 installed: 0
50:debug:clean libiconv 1.16_1 exists in the ports tree
51:debug:clean libiconv 1.16_1  is the latest installed
52:debug:clean libiconv 1.16_1 +universal is active
53:debug:clean Merging existing requested variants '+universal' into variants
54:debug:clean new fully merged portvariants: universal +
55:debug:clean Changing to port directory: /opt/local/var/macports/sources/rsync.macports.org/macports/release/tarballs/ports/textproc/libiconv
56:debug:clean OS darwin/21.4.0 (macOS 12.3.1) arch arm
57:debug:clean Sourcing PortGroup muniversal 1.0 from /opt/local/var/macports/sources/rsync.macports.org/macports/release/tarballs/ports/_resources/port1.0/group/muniversal-1.0.tcl
58:debug:clean Sourcing PortGroup clang_dependency 1.0 from /opt/local/var/macports/sources/rsync.macports.org/macports/release/tarballs/ports/_resources/port1.0/group/clang_dependency-1.0.tcl
59:debug:clean Sourcing PortGroup xcodeversion 1.0 from /opt/local/var/macports/sources/rsync.macports.org/macports/release/tarballs/ports/_resources/port1.0/group/xcodeversion-1.0.tcl
60:debug:clean muniversal: adding universal variant
61:debug:clean Reading variant descriptions from /opt/local/var/macports/sources/rsync.macports.org/macports/release/tarballs/ports/_resources/port1.0/variant_descriptions.conf
62:debug:clean Executing variant universal provides universal
63:debug:clean Running callback portconfigure::add_automatic_compiler_dependencies
64:debug:clean Finished running callback portconfigure::add_automatic_compiler_dependencies
65:debug:clean Running callback portbuild::add_automatic_buildsystem_dependencies
66:debug:clean Finished running callback portbuild::add_automatic_buildsystem_dependencies
67:debug:clean Running callback portstartupitem::add_notes
68:debug:clean Finished running callback portstartupitem::add_notes
69:debug:clean Running callback xcodeversions_run_check
70:debug:clean Finished running callback xcodeversions_run_check
71:debug:clean No need to upgrade! libiconv 1.16_1 >= libiconv 1.16_1
72:debug:clean epoch: in tree: 0 installed: 0
73:debug:clean libtextstyle 0.21_0 exists in the ports tree
74:debug:clean libtextstyle 0.21_0  is the latest installed
75:debug:clean libtextstyle 0.21_0 +universal is active
76:debug:clean Merging existing requested variants '+universal' into variants
77:debug:clean new fully merged portvariants: universal +
78:debug:clean Changing to port directory: /opt/local/var/macports/sources/rsync.macports.org/macports/release/tarballs/ports/devel/gettext
79:debug:clean OS darwin/21.4.0 (macOS 12.3.1) arch arm
80:debug:clean Sourcing PortGroup compiler_blacklist_versions 1.0 from /opt/local/var/macports/sources/rsync.macports.org/macports/release/tarballs/ports/_resources/port1.0/group/compiler_blacklist_versions-1.0.tcl
81:debug:clean Sourcing PortGroup muniversal 1.0 from /opt/local/var/macports/sources/rsync.macports.org/macports/release/tarballs/ports/_resources/port1.0/group/muniversal-1.0.tcl
82:debug:clean Sourcing PortGroup clang_dependency 1.0 from /opt/local/var/macports/sources/rsync.macports.org/macports/release/tarballs/ports/_resources/port1.0/group/clang_dependency-1.0.tcl
83:debug:clean compiler clang 1316.0.21.2.3 not blacklisted because it doesn't match {clang < 211.10.1}
84:debug:clean muniversal: adding universal variant
85:debug:clean Reading variant descriptions from /opt/local/var/macports/sources/rsync.macports.org/macports/release/tarballs/ports/_resources/port1.0/variant_descriptions.conf
86:debug:clean Executing variant universal provides universal
87:debug:clean Running callback portconfigure::add_automatic_compiler_dependencies
88:debug:clean Finished running callback portconfigure::add_automatic_compiler_dependencies
89:debug:clean Running callback portbuild::add_automatic_buildsystem_dependencies
90:debug:clean Finished running callback portbuild::add_automatic_buildsystem_dependencies
91:debug:clean Running callback portstartupitem::add_notes
92:debug:clean Finished running callback portstartupitem::add_notes
93:debug:clean No need to upgrade! libtextstyle 0.21_0 >= libtextstyle 0.21_0
94:debug:clean epoch: in tree: 0 installed: 0
95:debug:clean gettext-runtime 0.21_0 exists in the ports tree
96:debug:clean gettext-runtime 0.21_0  is the latest installed
97:debug:clean gettext-runtime 0.21_0 +universal is active
98:debug:clean Merging existing requested variants '+universal' into variants
99:debug:clean new fully merged portvariants: universal +
100:debug:clean Changing to port directory: /opt/local/var/macports/sources/rsync.macports.org/macports/release/tarballs/ports/devel/gettext
101:debug:clean OS darwin/21.4.0 (macOS 12.3.1) arch arm
102:debug:clean Sourcing PortGroup compiler_blacklist_versions 1.0 from /opt/local/var/macports/sources/rsync.macports.org/macports/release/tarballs/ports/_resources/port1.0/group/compiler_blacklist_versions-1.0.tcl
103:debug:clean Sourcing PortGroup muniversal 1.0 from /opt/local/var/macports/sources/rsync.macports.org/macports/release/tarballs/ports/_resources/port1.0/group/muniversal-1.0.tcl
104:debug:clean Sourcing PortGroup clang_dependency 1.0 from /opt/local/var/macports/sources/rsync.macports.org/macports/release/tarballs/ports/_resources/port1.0/group/clang_dependency-1.0.tcl
105:debug:clean compiler clang 1316.0.21.2.3 not blacklisted because it doesn't match {clang < 211.10.1}
106:debug:clean muniversal: adding universal variant
107:debug:clean Reading variant descriptions from /opt/local/var/macports/sources/rsync.macports.org/macports/release/tarballs/ports/_resources/port1.0/variant_descriptions.conf
108:debug:clean Executing variant universal provides universal
109:debug:clean Running callback portconfigure::add_automatic_compiler_dependencies
110:debug:clean Finished running callback portconfigure::add_automatic_compiler_dependencies
111:debug:clean Running callback portbuild::add_automatic_buildsystem_dependencies
112:debug:clean Finished running callback portbuild::add_automatic_buildsystem_dependencies
113:debug:clean Running callback portstartupitem::add_notes
114:debug:clean Finished running callback portstartupitem::add_notes
115:debug:clean No need to upgrade! gettext-runtime 0.21_0 >= gettext-runtime 0.21_0
116:debug:clean epoch: in tree: 0 installed: 0
117:debug:clean gettext-tools-libs 0.21_0 exists in the ports tree
118:debug:clean gettext-tools-libs 0.21_0  is the latest installed
119:debug:clean gettext-tools-libs 0.21_0 +universal is active
120:debug:clean Merging existing requested variants '+universal' into variants
121:debug:clean new fully merged portvariants: universal +
122:debug:clean Changing to port directory: /opt/local/var/macports/sources/rsync.macports.org/macports/release/tarballs/ports/devel/gettext
123:debug:clean OS darwin/21.4.0 (macOS 12.3.1) arch arm
124:debug:clean Sourcing PortGroup compiler_blacklist_versions 1.0 from /opt/local/var/macports/sources/rsync.macports.org/macports/release/tarballs/ports/_resources/port1.0/group/compiler_blacklist_versions-1.0.tcl
125:debug:clean Sourcing PortGroup muniversal 1.0 from /opt/local/var/macports/sources/rsync.macports.org/macports/release/tarballs/ports/_resources/port1.0/group/muniversal-1.0.tcl
126:debug:clean Sourcing PortGroup clang_dependency 1.0 from /opt/local/var/macports/sources/rsync.macports.org/macports/release/tarballs/ports/_resources/port1.0/group/clang_dependency-1.0.tcl
127:debug:clean compiler clang 1316.0.21.2.3 not blacklisted because it doesn't match {clang < 211.10.1}
128:debug:clean muniversal: adding universal variant
129:debug:clean Reading variant descriptions from /opt/local/var/macports/sources/rsync.macports.org/macports/release/tarballs/ports/_resources/port1.0/variant_descriptions.conf
130:debug:clean Executing variant universal provides universal
131:debug:clean Running callback portconfigure::add_automatic_compiler_dependencies
132:debug:clean Finished running callback portconfigure::add_automatic_compiler_dependencies
133:debug:clean Running callback portbuild::add_automatic_buildsystem_dependencies
134:debug:clean Finished running callback portbuild::add_automatic_buildsystem_dependencies
135:debug:clean Running callback portstartupitem::add_notes
136:debug:clean Finished running callback portstartupitem::add_notes
137:debug:clean No need to upgrade! gettext-tools-libs 0.21_0 >= gettext-tools-libs 0.21_0
138:msg:clean --->  Computing dependencies for MacVim:info:clean .:debug:clean MacVim has no conflicts
139:debug:clean Searching for dependency: ncurses
140:debug:clean Found Dependency: receipt exists for ncurses
141:debug:clean Searching for dependency: gettext
142:debug:clean Found Dependency: receipt exists for gettext
143:debug:clean Searching for dependency: libiconv
144:debug:clean Found Dependency: receipt exists for libiconv
145:debug:main Executing org.macports.main (MacVim)
146:debug:main dropping privileges: euid changed to 502, egid changed to 501.
147:debug:archivefetch archivefetch phase started at Thu May  5 12:02:49 CEST 2022
148:msg:archivefetch --->  Fetching archive for MacVim
149:debug:archivefetch Executing org.macports.archivefetch (MacVim)
150:debug:archivefetch euid/egid changed to: 0/0
151:debug:archivefetch chowned /opt/local/var/macports/incoming to macports
152:debug:archivefetch euid/egid changed to: 502/501
153:info:archivefetch --->  MacVim-8.2.snapshot171_2+huge+xim.darwin_21.x86_64.tbz2 doesn't seem to exist in /opt/local/var/macports/incoming/verified
154:msg:archivefetch --->  Attempting to fetch MacVim-8.2.snapshot171_2+huge+xim.darwin_21.x86_64.tbz2 from https://packages.macports.org/MacVim
155:debug:archivefetch Fetching archive failed: The requested URL returned error: 404
156:msg:archivefetch --->  Attempting to fetch MacVim-8.2.snapshot171_2+huge+xim.darwin_21.x86_64.tbz2 from https://nue.de.packages.macports.org/MacVim
157:debug:archivefetch Fetching archive failed: The requested URL returned error: 404
158:msg:archivefetch --->  Attempting to fetch MacVim-8.2.snapshot171_2+huge+xim.darwin_21.x86_64.tbz2 from https://cph.dk.packages.macports.org/MacVim
159:debug:archivefetch Fetching archive failed: The requested URL returned error: 404
160:debug:archivefetch Privilege de-escalation not attempted as not running as root.
161:debug:fetch fetch phase started at Thu May  5 12:02:50 CEST 2022
162:notice:fetch --->  Fetching distfiles for MacVim
163:debug:fetch Executing proc-pre-org.macports.fetch-fetch-0
164:debug:fetch Executing org.macports.fetch (MacVim)
165:debug:fetch Privilege de-escalation not attempted as not running as root.
166:debug:checksum checksum phase started at Thu May  5 12:02:50 CEST 2022
167:notice:checksum --->  Verifying checksums for MacVim
168:debug:checksum Executing org.macports.checksum (MacVim)
169:info:checksum --->  Checksumming macvim-171.tar.gz
170:debug:checksum Calculated (rmd160) is 884dc22e50e9ecf5acd8754d046674849b478e97
171:debug:checksum Correct (rmd160) checksum for macvim-171.tar.gz
172:debug:checksum Calculated (sha256) is 51ee54b7c3b2dd5ec6d9856117ca12e90dd7694f06c8d40ca2830f375a6f8f76
173:debug:checksum Correct (sha256) checksum for macvim-171.tar.gz
174:debug:checksum Calculated (size) is 22966978
175:debug:checksum Correct (size) checksum for macvim-171.tar.gz
176:debug:checksum Privilege de-escalation not attempted as not running as root.
177:debug:extract extract phase started at Thu May  5 12:02:50 CEST 2022
178:notice:extract --->  Extracting MacVim
179:debug:extract Executing org.macports.extract (MacVim)
180:info:extract --->  Extracting macvim-171.tar.gz
181:debug:extract setting option extract.args to '/opt/local/var/macports/distfiles/MacVim/macvim-171.tar.gz'
182:debug:extract Environment:
183:debug:extract CC_PRINT_OPTIONS='YES'
184:debug:extract CC_PRINT_OPTIONS_FILE='/opt/local/var/macports/build/_opt_local_var_macports_sources_rsync.macports.org_macports_release_tarballs_ports_editors_MacVim/MacVim/work/.CC_PRINT_OPTIONS'
185:debug:extract CPATH='/opt/local/include'
186:debug:extract DEVELOPER_DIR='/Applications/Xcode.app/Contents/Developer'
187:debug:extract LIBRARY_PATH='/opt/local/lib'
188:debug:extract MACOSX_DEPLOYMENT_TARGET='12.0'
189:debug:extract SDKROOT='/Applications/Xcode.app/Contents/Developer/Platforms/MacOSX.platform/Developer/SDKs/MacOSX12.3.sdk'
190:info:extract Executing:  cd "/opt/local/var/macports/build/_opt_local_var_macports_sources_rsync.macports.org_macports_release_tarballs_ports_editors_MacVim/MacVim/work" && /usr/bin/gzip -dc '/opt/local/var/macports/distfiles/MacVim/macvim-171.tar.gz' | /usr/bin/tar -xf -
191:debug:extract system:  cd "/opt/local/var/macports/build/_opt_local_var_macports_sources_rsync.macports.org_macports_release_tarballs_ports_editors_MacVim/MacVim/work" && /usr/bin/gzip -dc '/opt/local/var/macports/distfiles/MacVim/macvim-171.tar.gz' | /usr/bin/tar -xf -
192:debug:extract euid/egid changed to: 0/0
193:debug:extract chowned /opt/local/var/macports/build/_opt_local_var_macports_sources_rsync.macports.org_macports_release_tarballs_ports_editors_MacVim/MacVim/work to macports
194:debug:extract euid/egid changed to: 502/501
195:debug:extract Symlink: /opt/local/var/macports/build/_opt_local_var_macports_sources_rsync.macports.org_macports_release_tarballs_ports_editors_MacVim/MacVim/work/macvim-171 -> macvim-dev-macvim-e65c14c
196:debug:extract Executing proc-post-org.macports.extract-extract-0
197:debug:extract Executing proc-post-org.macports.extract-extract-1
198:debug:extract Privilege de-escalation not attempted as not running as root.
199:debug:patch patch phase started at Thu May  5 12:02:51 CEST 2022
200:debug:patch Executing org.macports.patch (MacVim)
201:notice:patch --->  Applying patches to MacVim
202:info:patch --->  Applying patch-remove-updater.diff
203:debug:patch Environment:
204:debug:patch CC_PRINT_OPTIONS='YES'
205:debug:patch CC_PRINT_OPTIONS_FILE='/opt/local/var/macports/build/_opt_local_var_macports_sources_rsync.macports.org_macports_release_tarballs_ports_editors_MacVim/MacVim/work/.CC_PRINT_OPTIONS'
206:debug:patch CPATH='/opt/local/include'
207:debug:patch DEVELOPER_DIR='/Applications/Xcode.app/Contents/Developer'
208:debug:patch LIBRARY_PATH='/opt/local/lib'
209:debug:patch MACOSX_DEPLOYMENT_TARGET='12.0'
210:debug:patch SDKROOT='/Applications/Xcode.app/Contents/Developer/Platforms/MacOSX.platform/Developer/SDKs/MacOSX12.3.sdk'
211:info:patch Executing:  cd "/opt/local/var/macports/build/_opt_local_var_macports_sources_rsync.macports.org_macports_release_tarballs_ports_editors_MacVim/MacVim/work/macvim-171" && /usr/bin/patch -p0 < '/opt/local/var/macports/sources/rsync.macports.org/macports/release/tarballs/ports/editors/MacVim/files/patch-remove-updater.diff'
212:debug:patch system:  cd "/opt/local/var/macports/build/_opt_local_var_macports_sources_rsync.macports.org_macports_release_tarballs_ports_editors_MacVim/MacVim/work/macvim-171" && /usr/bin/patch -p0 < '/opt/local/var/macports/sources/rsync.macports.org/macports/release/tarballs/ports/editors/MacVim/files/patch-remove-updater.diff'
213:info:patch patching file src/MacVim/Base.lproj/MainMenu.xib
214:info:patch patching file src/MacVim/Base.lproj/Preferences.xib
215:info:patch --->  Applying patch-remove-Homebrew-python.diff
216:debug:patch Environment:
217:debug:patch CC_PRINT_OPTIONS='YES'
218:debug:patch CC_PRINT_OPTIONS_FILE='/opt/local/var/macports/build/_opt_local_var_macports_sources_rsync.macports.org_macports_release_tarballs_ports_editors_MacVim/MacVim/work/.CC_PRINT_OPTIONS'
219:debug:patch CPATH='/opt/local/include'
220:debug:patch DEVELOPER_DIR='/Applications/Xcode.app/Contents/Developer'
221:debug:patch LIBRARY_PATH='/opt/local/lib'
222:debug:patch MACOSX_DEPLOYMENT_TARGET='12.0'
223:debug:patch SDKROOT='/Applications/Xcode.app/Contents/Developer/Platforms/MacOSX.platform/Developer/SDKs/MacOSX12.3.sdk'
224:info:patch Executing:  cd "/opt/local/var/macports/build/_opt_local_var_macports_sources_rsync.macports.org_macports_release_tarballs_ports_editors_MacVim/MacVim/work/macvim-171" && /usr/bin/patch -p0 < '/opt/local/var/macports/sources/rsync.macports.org/macports/release/tarballs/ports/editors/MacVim/files/patch-remove-Homebrew-python.diff'
225:debug:patch system:  cd "/opt/local/var/macports/build/_opt_local_var_macports_sources_rsync.macports.org_macports_release_tarballs_ports_editors_MacVim/MacVim/work/macvim-171" && /usr/bin/patch -p0 < '/opt/local/var/macports/sources/rsync.macports.org/macports/release/tarballs/ports/editors/MacVim/files/patch-remove-Homebrew-python.diff'
226:info:patch patching file src/MacVim/vimrc
227:debug:patch Privilege de-escalation not attempted as not running as root.
228:debug:configure configure phase started at Thu May  5 12:02:51 CEST 2022
229:notice:configure --->  Configuring MacVim
230:debug:configure Preferred compilers: clang macports-clang-14 macports-clang-13 macports-clang-12 macports-clang-11
231:debug:configure Using compiler 'Xcode Clang'
232:debug:configure Executing org.macports.configure (MacVim)
233:debug:configure Environment:
234:debug:configure CC='/usr/bin/clang'
235:debug:configure CC_PRINT_OPTIONS='YES'
236:debug:configure CC_PRINT_OPTIONS_FILE='/opt/local/var/macports/build/_opt_local_var_macports_sources_rsync.macports.org_macports_release_tarballs_ports_editors_MacVim/MacVim/work/.CC_PRINT_OPTIONS'
237:debug:configure CFLAGS='-pipe -Os -isysroot/Applications/Xcode.app/Contents/Developer/Platforms/MacOSX.platform/Developer/SDKs/MacOSX12.3.sdk -arch x86_64'
238:debug:configure CPATH='/opt/local/include'
239:debug:configure CPPFLAGS='-I/opt/local/include -isysroot/Applications/Xcode.app/Contents/Developer/Platforms/MacOSX.platform/Developer/SDKs/MacOSX12.3.sdk'
240:debug:configure CXX='/usr/bin/clang++'
241:debug:configure CXXFLAGS='-pipe -Os -stdlib=libc++ -isysroot/Applications/Xcode.app/Contents/Developer/Platforms/MacOSX.platform/Developer/SDKs/MacOSX12.3.sdk -arch x86_64'
242:debug:configure DEVELOPER_DIR='/Applications/Xcode.app/Contents/Developer'
243:debug:configure F90FLAGS='-pipe -Os -m64'
244:debug:configure FCFLAGS='-pipe -Os -m64'
245:debug:configure FFLAGS='-pipe -Os -m64'
246:debug:configure INSTALL='/usr/bin/install -c'
247:debug:configure LDFLAGS='-L/opt/local/lib -Wl,-headerpad_max_install_names -Wl,-syslibroot,/Applications/Xcode.app/Contents/Developer/Platforms/MacOSX.platform/Developer/SDKs/MacOSX12.3.sdk -arch x86_64'
248:debug:configure LIBRARY_PATH='/opt/local/lib'
249:debug:configure MACOSX_DEPLOYMENT_TARGET='12.0'
250:debug:configure OBJC='/usr/bin/clang'
251:debug:configure OBJCFLAGS='-pipe -Os -isysroot/Applications/Xcode.app/Contents/Developer/Platforms/MacOSX.platform/Developer/SDKs/MacOSX12.3.sdk -arch x86_64'
252:debug:configure OBJCXX='/usr/bin/clang++'
253:debug:configure OBJCXXFLAGS='-pipe -Os -stdlib=libc++ -isysroot/Applications/Xcode.app/Contents/Developer/Platforms/MacOSX.platform/Developer/SDKs/MacOSX12.3.sdk -arch x86_64'
254:debug:configure SDKROOT='/Applications/Xcode.app/Contents/Developer/Platforms/MacOSX.platform/Developer/SDKs/MacOSX12.3.sdk'
255:info:configure Executing:  cd "/opt/local/var/macports/build/_opt_local_var_macports_sources_rsync.macports.org_macports_release_tarballs_ports_editors_MacVim/MacVim/work/macvim-171" && ./configure --prefix=/opt/local --enable-gui=macvim --without-x --without-local-dir --disable-sparkle --disable-gpm --disable-canberra --with-tlib=ncurses --enable-multibyte --enable-fail-if-missing --with-compiledby="MacPorts" --with-features=huge --enable-xim
256:debug:configure system:  cd "/opt/local/var/macports/build/_opt_local_var_macports_sources_rsync.macports.org_macports_release_tarballs_ports_editors_MacVim/MacVim/work/macvim-171" && ./configure --prefix=/opt/local --enable-gui=macvim --without-x --without-local-dir --disable-sparkle --disable-gpm --disable-canberra --with-tlib=ncurses --enable-multibyte --enable-fail-if-missing --with-compiledby="MacPorts" --with-features=huge --enable-xim
257:info:configure configure: creating cache auto/config.cache
258:info:configure checking whether make sets $(MAKE)... yes
259:info:configure checking for gcc... /usr/bin/clang
260:info:configure checking whether the C compiler works... yes
261:info:configure checking for C compiler default output file name... a.out
262:info:configure checking for suffix of executables...
263:info:configure checking whether we are cross compiling... no
264:info:configure checking for suffix of object files... o
265:info:configure checking whether we are using the GNU C compiler... yes
266:info:configure checking whether /usr/bin/clang accepts -g... yes
267:info:configure checking for /usr/bin/clang option to accept ISO C89... none needed
268:info:configure checking for /usr/bin/clang option to accept ISO C99... none needed
269:info:configure checking how to run the C preprocessor... /usr/bin/clang -E
270:info:configure checking for grep that handles long lines and -e... /usr/bin/grep
271:info:configure checking for egrep... /usr/bin/grep -E
272:info:configure checking for fgrep... /usr/bin/grep -F
273:info:configure checking for library containing strerror... none required
274:info:configure checking for gawk... no
275:info:configure checking for mawk... no
276:info:configure checking for nawk... no
277:info:configure checking for awk... awk
278:info:configure checking for strip... strip
279:info:configure checking for ANSI C header files... yes
280:info:configure checking for sys/wait.h that is POSIX.1 compatible... yes
281:info:configure checking for unsigned long long int... yes
282:info:configure checking for long long int... yes
283:info:configure checking if the compiler supports trailing commas... yes
284:info:configure checking if the compiler supports C++ comments... yes
285:info:configure checking --enable-fail-if-missing argument... yes
286:info:configure checking for clang version... 1316000021
287:info:configure checking if clang supports -fno-strength-reduce... no
288:info:configure configure: checking for buggy tools...
289:info:configure - sh is 'GNU bash, version 3.2.57(1)-release (arm64-apple-darwin21)
290:info:configure Copyright (C) 2007 Free Software Foundation, Inc.' - probably OK.
291:info:configure checking for Haiku... no
292:info:configure checking for QNX... no
293:info:configure checking for Darwin (Mac OS X)... yes
294:info:configure checking --disable-darwin argument... no
295:info:configure checking if Darwin files are there... yes
296:info:configure checking --disable-sparkle argument... yes
297:info:configure checking --with-developer-dir argument... not present
298:info:configure checking --with-macsdk argument... using default
299:info:configure checking --with-macarchs argument... defaulting to native arch
300:info:configure checking for sys/types.h... yes
301:info:configure checking for sys/stat.h... yes
302:info:configure checking for stdlib.h... yes
303:info:configure checking for string.h... yes
304:info:configure checking for memory.h... yes
305:info:configure checking for strings.h... yes
306:info:configure checking for inttypes.h... yes
307:info:configure checking for stdint.h... yes
308:info:configure checking for unistd.h... yes
309:info:configure checking Cocoa/Cocoa.h usability... yes
310:info:configure checking Cocoa/Cocoa.h presence... yes
311:info:configure checking for Cocoa/Cocoa.h... yes
312:info:configure checking AvailabilityMacros.h usability... yes
313:info:configure checking AvailabilityMacros.h presence... yes
314:info:configure checking for AvailabilityMacros.h... yes
315:info:configure checking --with-local-dir argument... no
316:info:configure checking --with-vim-name argument... Defaulting to vim
317:info:configure checking --with-ex-name argument... Defaulting to ex
318:info:configure checking --with-view-name argument... Defaulting to view
319:info:configure checking --with-global-runtime argument... no
320:info:configure checking --with-modified-by argument... no
321:info:configure checking if character set is EBCDIC... no
322:info:configure checking --disable-smack argument... no
323:info:configure checking linux/xattr.h usability... no
324:info:configure checking linux/xattr.h presence... no
325:info:configure checking for linux/xattr.h... no
326:info:configure checking --disable-selinux argument... no
327:info:configure checking for is_selinux_enabled in -lselinux... no
328:info:configure checking --with-features argument... huge
329:info:configure checking --with-compiledby argument... MacPorts
330:info:configure checking --disable-xsmp argument... no
331:info:configure checking --disable-xsmp-interact argument... no
332:info:configure checking --enable-luainterp argument... no
333:info:configure checking --enable-mzschemeinterp argument... no
334:info:configure checking --enable-perlinterp argument... no
335:info:configure checking --enable-pythoninterp argument... no
336:info:configure checking --enable-python3interp argument... no
337:info:configure checking --enable-tclinterp argument... no
338:info:configure checking --enable-rubyinterp argument... no
339:info:configure checking --enable-cscope argument... no
340:info:configure checking --disable-netbeans argument... no
341:info:configure checking --disable-channel argument... no
342:info:configure checking for socket in -lsocket... no
343:info:configure checking whether compiling with IPv6 networking is possible... yes
344:info:configure checking for inet_ntop... yes
345:info:configure checking --enable-terminal argument... defaulting to yes
346:info:configure checking --enable-autoservername argument... no
347:info:configure checking --enable-multibyte argument... yes
348:info:configure checking --disable-rightleft argument... no
349:info:configure checking --disable-arabic argument... no
350:info:configure checking --enable-xim argument... yes
351:info:configure checking --enable-fontset argument... no
352:info:configure defaulting to: don't HAVE_X11
353:info:configure checking --enable-gui argument... MacVim GUI support
354:info:configure checking for MacVim GUI... yes
355:info:configure checking for pkg-config... /opt/local/bin/pkg-config
356:info:configure checking X11/SM/SMlib.h usability... yes
357:info:configure checking X11/SM/SMlib.h presence... yes
358:info:configure checking for X11/SM/SMlib.h... yes
359:info:configure checking for /proc link to executable... no
360:info:configure checking for CYGWIN or MSYS environment... no
361:info:configure checking whether toupper is broken... no
362:info:configure checking whether __DATE__ and __TIME__ work... yes
363:info:configure checking whether __attribute__((unused)) is allowed... yes
364:info:configure checking elf.h usability... no
365:info:configure checking elf.h presence... no
366:info:configure checking for elf.h... no
367:info:configure checking for dirent.h that defines DIR... yes
368:info:configure checking for library containing opendir... none required
369:info:configure checking for stdint.h... (cached) yes
370:info:configure checking for stdlib.h... (cached) yes
371:info:configure checking for string.h... (cached) yes
372:info:configure checking sys/select.h usability... yes
373:info:configure checking sys/select.h presence... yes
374:info:configure checking for sys/select.h... yes
375:info:configure checking sys/utsname.h usability... yes
376:info:configure checking sys/utsname.h presence... yes
377:info:configure checking for sys/utsname.h... yes
378:info:configure checking termcap.h usability... yes
379:info:configure checking termcap.h presence... yes
380:info:configure checking for termcap.h... yes
381:info:configure checking fcntl.h usability... yes
382:info:configure checking fcntl.h presence... yes
383:info:configure checking for fcntl.h... yes
384:info:configure checking sgtty.h usability... yes
385:info:configure checking sgtty.h presence... yes
386:info:configure checking for sgtty.h... yes
387:info:configure checking sys/ioctl.h usability... yes
388:info:configure checking sys/ioctl.h presence... yes
389:info:configure checking for sys/ioctl.h... yes
390:info:configure checking sys/time.h usability... yes
391:info:configure checking sys/time.h presence... yes
392:info:configure checking for sys/time.h... yes
393:info:configure checking for sys/types.h... (cached) yes
394:info:configure checking termio.h usability... no
395:info:configure checking termio.h presence... no
396:info:configure checking for termio.h... no
397:info:configure checking iconv.h usability... yes
398:info:configure checking iconv.h presence... yes
399:info:configure checking for iconv.h... yes
400:info:configure checking for inttypes.h... (cached) yes
401:info:configure checking langinfo.h usability... yes
402:info:configure checking langinfo.h presence... yes
403:info:configure checking for langinfo.h... yes
404:info:configure checking math.h usability... yes
405:info:configure checking math.h presence... yes
406:info:configure checking for math.h... yes
407:info:configure checking for unistd.h... (cached) yes
408:info:configure checking stropts.h usability... no
409:info:configure checking stropts.h presence... no
410:info:configure checking for stropts.h... no
411:info:configure checking errno.h usability... yes
412:info:configure checking errno.h presence... yes
413:info:configure checking for errno.h... yes
414:info:configure checking sys/resource.h usability... yes
415:info:configure checking sys/resource.h presence... yes
416:info:configure checking for sys/resource.h... yes
417:info:configure checking sys/systeminfo.h usability... no
418:info:configure checking sys/systeminfo.h presence... no
419:info:configure checking for sys/systeminfo.h... no
420:info:configure checking locale.h usability... yes
421:info:configure checking locale.h presence... yes
422:info:configure checking for locale.h... yes
423:info:configure checking sys/stream.h usability... no
424:info:configure checking sys/stream.h presence... no
425:info:configure checking for sys/stream.h... no
426:info:configure checking termios.h usability... yes
427:info:configure checking termios.h presence... yes
428:info:configure checking for termios.h... yes
429:info:configure checking libc.h usability... yes
430:info:configure checking libc.h presence... yes
431:info:configure checking for libc.h... yes
432:info:configure checking sys/statfs.h usability... no
433:info:configure checking sys/statfs.h presence... no
434:info:configure checking for sys/statfs.h... no
435:info:configure checking poll.h usability... yes
436:info:configure checking poll.h presence... yes
437:info:configure checking for poll.h... yes
438:info:configure checking sys/poll.h usability... yes
439:info:configure checking sys/poll.h presence... yes
440:info:configure checking for sys/poll.h... yes
441:info:configure checking pwd.h usability... yes
442:info:configure checking pwd.h presence... yes
443:info:configure checking for pwd.h... yes
444:info:configure checking utime.h usability... yes
445:info:configure checking utime.h presence... yes
446:info:configure checking for utime.h... yes
447:info:configure checking sys/param.h usability... yes
448:info:configure checking sys/param.h presence... yes
449:info:configure checking for sys/param.h... yes
450:info:configure checking sys/ptms.h usability... no
451:info:configure checking sys/ptms.h presence... no
452:info:configure checking for sys/ptms.h... no
453:info:configure checking libintl.h usability... yes
454:info:configure checking libintl.h presence... yes
455:info:configure checking for libintl.h... yes
456:info:configure checking libgen.h usability... yes
457:info:configure checking libgen.h presence... yes
458:info:configure checking for libgen.h... yes
459:info:configure checking util/debug.h usability... no
460:info:configure checking util/debug.h presence... no
461:info:configure checking for util/debug.h... no
462:info:configure checking util/msg18n.h usability... no
463:info:configure checking util/msg18n.h presence... no
464:info:configure checking for util/msg18n.h... no
465:info:configure checking frame.h usability... no
466:info:configure checking frame.h presence... no
467:info:configure checking for frame.h... no
468:info:configure checking sys/acl.h usability... yes
469:info:configure checking sys/acl.h presence... yes
470:info:configure checking for sys/acl.h... yes
471:info:configure checking sys/access.h usability... no
472:info:configure checking sys/access.h presence... no
473:info:configure checking for sys/access.h... no
474:info:configure checking sys/sysinfo.h usability... no
475:info:configure checking sys/sysinfo.h presence... no
476:info:configure checking for sys/sysinfo.h... no
477:info:configure checking wchar.h usability... yes
478:info:configure checking wchar.h presence... yes
479:info:configure checking for wchar.h... yes
480:info:configure checking wctype.h usability... yes
481:info:configure checking wctype.h presence... yes
482:info:configure checking for wctype.h... yes
483:info:configure checking for sys/ptem.h... no
484:info:configure checking for sys/sysctl.h... yes
485:info:configure checking for pthread_np.h... no
486:info:configure checking for strings.h... (cached) yes
487:info:configure checking whether /usr/bin/clang needs -traditional... no
488:info:configure checking for an ANSI C-conforming const... yes
489:info:configure checking for working volatile... yes
490:info:configure checking for mode_t... yes
491:info:configure checking for off_t... yes
492:info:configure checking for pid_t... yes
493:info:configure checking for size_t... yes
494:info:configure checking for uid_t in sys/types.h... yes
495:info:configure checking for uint32_t... yes
496:info:configure checking whether time.h and sys/time.h may both be included... yes
497:info:configure checking for ino_t... yes
498:info:configure checking for dev_t... yes
499:info:configure checking whether byte ordering is bigendian... no
500:info:configure checking for inline... inline
501:info:configure checking for rlim_t... yes
502:info:configure checking for stack_t... yes
503:info:configure checking whether stack_t has an ss_base field... no
504:info:configure checking --with-tlib argument... ncurses
505:info:configure checking for linking with ncurses library... OK
506:info:configure checking for tgetent()... yes
507:info:configure checking whether we talk terminfo... yes
508:info:configure checking what tgetent() returns for an unknown terminal... zero
509:info:configure checking whether termcap.h contains ospeed... yes
510:info:configure checking whether termcap.h contains UP, BC and PC... yes
511:info:configure checking whether tputs() uses outfuntype... no
512:info:configure checking whether sys/select.h and sys/time.h may both be included... yes
513:info:configure checking for /dev/ptc... no
514:info:configure checking for SVR4 ptys... yes
515:info:configure checking for ptyranges... pqrstuvw / 0123456789abcdef
516:info:configure checking return type of signal handlers... void
517:info:configure checking for struct sigcontext... yes
518:info:configure checking getcwd implementation is broken... no
519:info:configure checking for fchdir... yes
520:info:configure checking for fchown... yes
521:info:configure checking for fchmod... yes
522:info:configure checking for fsync... yes
523:info:configure checking for getcwd... yes
524:info:configure checking for getpseudotty... no
525:info:configure checking for getpwent... yes
526:info:configure checking for getpwnam... yes
527:info:configure checking for getpwuid... yes
528:info:configure checking for getrlimit... yes
529:info:configure checking for gettimeofday... yes
530:info:configure checking for localtime_r... yes
531:info:configure checking for lstat... yes
532:info:configure checking for memset... yes
533:info:configure checking for mkdtemp... yes
534:info:configure checking for nanosleep... yes
535:info:configure checking for opendir... yes
536:info:configure checking for putenv... yes
537:info:configure checking for qsort... yes
538:info:configure checking for readlink... yes
539:info:configure checking for select... yes
540:info:configure checking for setenv... yes
541:info:configure checking for getpgid... yes
542:info:configure checking for setpgid... yes
543:info:configure checking for setsid... yes
544:info:configure checking for sigaltstack... yes
545:info:configure checking for sigstack... no
546:info:configure checking for sigset... yes
547:info:configure checking for sigsetjmp... yes
548:info:configure checking for sigaction... yes
549:info:configure checking for sigprocmask... yes
550:info:configure checking for sigvec... yes
551:info:configure checking for strcasecmp... yes
552:info:configure checking for strcoll... yes
553:info:configure checking for strerror... yes
554:info:configure checking for strftime... yes
555:info:configure checking for stricmp... no
556:info:configure checking for strncasecmp... yes
557:info:configure checking for strnicmp... no
558:info:configure checking for strpbrk... yes
559:info:configure checking for strptime... yes
560:info:configure checking for strtol... yes
561:info:configure checking for tgetent... yes
562:info:configure checking for towlower... yes
563:info:configure checking for towupper... yes
564:info:configure checking for iswupper... yes
565:info:configure checking for tzset... yes
566:info:configure checking for usleep... yes
567:info:configure checking for utime... yes
568:info:configure checking for utimes... yes
569:info:configure checking for mblen... yes
570:info:configure checking for ftruncate... yes
571:info:configure checking for unsetenv... yes
572:info:configure checking for posix_openpt... yes
573:info:configure checking for sys/select.h... (cached) yes
574:info:configure checking sys/socket.h usability... yes
575:info:configure checking sys/socket.h presence... yes
576:info:configure checking for sys/socket.h... yes
577:info:configure checking types of arguments for select... int,fd_set *,struct timeval *
578:info:configure checking for _LARGEFILE_SOURCE value needed for large files... no
579:info:configure checking for special C compiler options needed for large files... no
580:info:configure checking for _FILE_OFFSET_BITS value needed for large files... no
581:info:configure checking --enable-canberra argument... no
582:info:configure checking for st_blksize... yes
583:info:configure checking whether stat() ignores a trailing slash... no
584:info:configure checking for iconv_open()... yes; with -liconv
585:info:configure checking for nl_langinfo(CODESET)... yes
586:info:configure checking for strtod in -lm... yes
587:info:configure checking for strtod() and other floating point functions... yes
588:info:configure checking for isinf()... yes
589:info:configure checking for isnan()... yes
590:info:configure checking --disable-acl argument... no
591:info:configure checking for acl_get_file in -lposix1e... no
592:info:configure checking for acl_get_file in -lacl... no
593:info:configure checking for POSIX ACL support... yes
594:info:configure checking for acl_get in -lsec... no
595:info:configure checking for Solaris ACL support... no
596:info:configure checking for AIX ACL support... no
597:info:configure checking --disable-gpm argument... yes
598:info:configure checking --disable-sysmouse argument... no
599:info:configure checking for sysmouse... no
600:info:configure checking for FD_CLOEXEC... yes
601:info:configure checking for rename... yes
602:info:configure checking for dirfd... yes
603:info:configure checking for flock... yes
604:info:configure checking for sysctl... yes
605:info:configure checking for sysinfo... not usable
606:info:configure checking for sysinfo.mem_unit... no
607:info:configure checking for sysinfo.uptime... no
608:info:configure checking for sysconf... yes
609:info:configure checking for _SC_SIGSTKSZ via sysconf()... not usable
610:info:configure checking size of int... 4
611:info:configure checking size of long... 8
612:info:configure checking size of time_t... 8
613:info:configure checking size of off_t... 8
614:info:configure checking uint32_t is 32 bits... ok
615:info:configure checking whether memmove handles overlaps... yes
616:info:configure checking for _xpg4_setrunelocale in -lxpg4... no
617:info:configure checking how to create tags... ctags -t
618:info:configure checking how to run man with a section nr... man -s
619:info:configure checking --disable-nls argument... no
620:info:configure checking for msgfmt... msgfmt
621:info:configure checking for NLS... gettext() works with -lintl
622:info:configure checking for bind_textdomain_codeset... yes
623:info:configure checking for _nl_msg_cat_cntr... yes
624:info:configure checking for libintl.a... libintl.a not found - keeping using -lintl
625:info:configure checking if msgfmt supports --desktop... yes
626:info:configure checking dlfcn.h usability... yes
627:info:configure checking dlfcn.h presence... yes
628:info:configure checking for dlfcn.h... yes
629:info:configure checking for dlopen()... yes
630:info:configure checking for dlsym()... yes
631:info:configure checking setjmp.h usability... yes
632:info:configure checking setjmp.h presence... yes
633:info:configure checking for setjmp.h... yes
634:info:configure checking whether we need macOS frameworks... yes, we need AppKit
635:info:configure checking --with-xcodecfg argument... using default
636:info:configure checking for GCC 3 or later... yes
637:info:configure checking whether we need -D_FORTIFY_SOURCE=1... yes
638:info:configure checking whether we need to force -D_FILE_OFFSET_BITS=64... no
639:info:configure checking linker --as-needed support... no
640:info:configure configure: updating cache auto/config.cache
641:info:configure configure: creating auto/config.status
642:info:configure config.status: creating auto/config.mk
643:info:configure config.status: creating auto/config.h
644:debug:configure Executing portconfigure::configure_finish
645:warn:configure Configuration logfiles contain indications of -Wimplicit-function-declaration; check that features were not accidentally disabled:
646:msg:configure   statacl: found in macvim-dev-macvim-e65c14c/src/auto/config.log
647:msg:configure   acl: found in macvim-dev-macvim-e65c14c/src/auto/config.log
648:debug:configure Privilege de-escalation not attempted as not running as root.
649:debug:build build phase started at Thu May  5 12:03:06 CEST 2022
650:notice:build --->  Building MacVim
651:debug:build Executing org.macports.build (MacVim)
652:debug:build Environment:
653:debug:build CC_PRINT_OPTIONS='YES'
654:debug:build CC_PRINT_OPTIONS_FILE='/opt/local/var/macports/build/_opt_local_var_macports_sources_rsync.macports.org_macports_release_tarballs_ports_editors_MacVim/MacVim/work/.CC_PRINT_OPTIONS'
655:debug:build CPATH='/opt/local/include'
656:debug:build DEVELOPER_DIR='/Applications/Xcode.app/Contents/Developer'
657:debug:build LIBRARY_PATH='/opt/local/lib'
658:debug:build MACOSX_DEPLOYMENT_TARGET='12.0'
659:debug:build SDKROOT='/Applications/Xcode.app/Contents/Developer/Platforms/MacOSX.platform/Developer/SDKs/MacOSX12.3.sdk'
660:info:build Executing:  cd "/opt/local/var/macports/build/_opt_local_var_macports_sources_rsync.macports.org_macports_release_tarballs_ports_editors_MacVim/MacVim/work/macvim-171" && /usr/bin/make -j8 -w all XCODEFLAGS="CACHE_ROOT=/opt/local/var/macports/build/_opt_local_var_macports_sources_rsync.macports.org_macports_release_tarballs_ports_editors_MacVim/MacVim/work/caches -UseNewBuildSystem=NO MACOSX_DEPLOYMENT_TARGET=12.0 ARCHS=x86_64"
661:debug:build system:  cd "/opt/local/var/macports/build/_opt_local_var_macports_sources_rsync.macports.org_macports_release_tarballs_ports_editors_MacVim/MacVim/work/macvim-171" && /usr/bin/make -j8 -w all XCODEFLAGS="CACHE_ROOT=/opt/local/var/macports/build/_opt_local_var_macports_sources_rsync.macports.org_macports_release_tarballs_ports_editors_MacVim/MacVim/work/caches -UseNewBuildSystem=NO MACOSX_DEPLOYMENT_TARGET=12.0 ARCHS=x86_64"
662:info:build make: Entering directory `/opt/local/var/macports/build/_opt_local_var_macports_sources_rsync.macports.org_macports_release_tarballs_ports_editors_MacVim/MacVim/work/macvim-dev-macvim-e65c14c'
663:info:build Starting make in the src directory.
664:info:build If there are problems, cd to the src directory and run make there
665:info:build cd src && /Applications/Xcode.app/Contents/Developer/usr/bin/make all
666:info:build make[1]: Entering directory `/opt/local/var/macports/build/_opt_local_var_macports_sources_rsync.macports.org_macports_release_tarballs_ports_editors_MacVim/MacVim/work/macvim-dev-macvim-e65c14c/src'
667:info:build /bin/sh install-sh -c -d objects
668:info:build CC="/usr/bin/clang -Iproto -DHAVE_CONFIG_H -DFEAT_GUI_MACVIM -Wall -Wno-unknown-pragmas -pipe  -I/opt/local/include -isysroot/Applications/Xcode.app/Contents/Developer/Platforms/MacOSX.platform/Developer/SDKs/MacOSX12.3.sdk -DMACOS_X -DMACOS_X_DARWIN    " srcdir=. sh ./osdef.sh
669:info:build creating auto/pathdef.c
670:info:build cd xxd; CC="/usr/bin/clang" CFLAGS="-I/opt/local/include -isysroot/Applications/Xcode.app/Contents/Developer/Platforms/MacOSX.platform/Developer/SDKs/MacOSX12.3.sdk -DMACOS_X -DMACOS_X_DARWIN -pipe -Os -isysroot/Applications/Xcode.app/Contents/Developer/Platforms/MacOSX.platform/Developer/SDKs/MacOSX12.3.sdk -arch x86_64 -U_FORTIFY_SOURCE -D_FORTIFY_SOURCE=1" LDFLAGS="-L/opt/local/lib -Wl,-headerpad_max_install_names -Wl,-syslibroot,/Applications/Xcode.app/Contents/Developer/Platforms/MacOSX.platform/Developer/SDKs/MacOSX12.3.sdk -arch x86_64" \
671:info:build             /Applications/Xcode.app/Contents/Developer/usr/bin/make -f Makefile
672:info:build make[2]: Entering directory `/opt/local/var/macports/build/_opt_local_var_macports_sources_rsync.macports.org_macports_release_tarballs_ports_editors_MacVim/MacVim/work/macvim-dev-macvim-e65c14c/src/xxd'
673:info:build /usr/bin/clang -I/opt/local/include -isysroot/Applications/Xcode.app/Contents/Developer/Platforms/MacOSX.platform/Developer/SDKs/MacOSX12.3.sdk -DMACOS_X -DMACOS_X_DARWIN -pipe -Os -isysroot/Applications/Xcode.app/Contents/Developer/Platforms/MacOSX.platform/Developer/SDKs/MacOSX12.3.sdk -arch x86_64 -U_FORTIFY_SOURCE -D_FORTIFY_SOURCE=1 -L/opt/local/lib -Wl,-headerpad_max_install_names -Wl,-syslibroot,/Applications/Xcode.app/Contents/Developer/Platforms/MacOSX.platform/Developer/SDKs/MacOSX12.3.sdk -arch x86_64 -DUNIX -o xxd xxd.c
674:info:build make[2]: Entering directory `/opt/local/var/macports/build/_opt_local_var_macports_sources_rsync.macports.org_macports_release_tarballs_ports_editors_MacVim/MacVim/work/macvim-dev-macvim-e65c14c/src/po'
675:info:build OLD_PO_FILE_INPUT=yes msgfmt -v -o af.mo af.po
676:info:build OLD_PO_FILE_INPUT=yes msgfmt -v -o ca.mo ca.po
677:info:build OLD_PO_FILE_INPUT=yes msgfmt -v -o cs.mo cs.po
678:info:build OLD_PO_FILE_INPUT=yes msgfmt -v -o da.mo da.po
679:info:build touch objects/.dirstamp
680:info:build 1272 translated messages.
681:info:build OLD_PO_FILE_INPUT=yes msgfmt -v -o de.mo de.po
682:info:build 1961 translated messages.
683:info:build 1411 translated messages.
684:info:build OLD_PO_FILE_INPUT=yes msgfmt -v -o en_GB.mo en_GB.po
685:info:build OLD_PO_FILE_INPUT=yes msgfmt -v -o eo.mo eo.po
686:info:build 1928 translated messages.
687:info:build OLD_PO_FILE_INPUT=yes msgfmt -v -o es.mo es.po
688:info:build OLD_PO_FILE_INPUT=yes msgfmt -v -o fi.mo fi.po
689:info:build 181 translated messages.
690:info:build 2165 translated messages.
691:info:build /usr/bin/clang -c -I. -Iproto -DHAVE_CONFIG_H -DFEAT_GUI_MACVIM -Wall -Wno-unknown-pragmas -pipe  -I/opt/local/include -isysroot/Applications/Xcode.app/Contents/Developer/Platforms/MacOSX.platform/Developer/SDKs/MacOSX12.3.sdk -DMACOS_X -DMACOS_X_DARWIN  -pipe -Os -isysroot/Applications/Xcode.app/Contents/Developer/Platforms/MacOSX.platform/Developer/SDKs/MacOSX12.3.sdk -arch x86_64 -U_FORTIFY_SOURCE -D_FORTIFY_SOURCE=1        -fobjc-exceptions -o objects/gui_macvim.o MacVim/gui_macvim.m
692:info:build OLD_PO_FILE_INPUT=yes msgfmt -v -o fr.mo fr.po
693:info:build 2651 translated messages.
694:info:build OLD_PO_FILE_INPUT=yes msgfmt -v -o ga.mo ga.po
695:info:build 1702 translated messages.
696:info:build OLD_PO_FILE_INPUT=yes msgfmt -v -o it.mo it.po
697:info:build 1938 translated messages.
698:info:build OLD_PO_FILE_INPUT=yes msgfmt -v -o ja.mo ja.po
699:info:build 2187 translated messages.
700:info:build OLD_PO_FILE_INPUT=yes msgfmt -v -o ko.UTF-8.mo ko.UTF-8.po
701:info:build 2002 translated messages.
702:info:build OLD_PO_FILE_INPUT=yes msgfmt -v -o ko.mo ko.po
703:info:build 1928 translated messages.
704:info:build OLD_PO_FILE_INPUT=yes msgfmt -v -o lv.mo lv.po
705:info:build 2037 translated messages.
706:info:build OLD_PO_FILE_INPUT=yes msgfmt -v -o nb.mo nb.po
707:info:build 1867 translated messages.
708:info:build OLD_PO_FILE_INPUT=yes msgfmt -v -o nl.mo nl.po
709:info:build 78 translated messages.
710:info:build /usr/bin/clang -c -I. -Iproto -DHAVE_CONFIG_H -DFEAT_GUI_MACVIM -Wall -Wno-unknown-pragmas -pipe  -I/opt/local/include -isysroot/Applications/Xcode.app/Contents/Developer/Platforms/MacOSX.platform/Developer/SDKs/MacOSX12.3.sdk -DMACOS_X -DMACOS_X_DARWIN  -pipe -Os -isysroot/Applications/Xcode.app/Contents/Developer/Platforms/MacOSX.platform/Developer/SDKs/MacOSX12.3.sdk -arch x86_64 -U_FORTIFY_SOURCE -D_FORTIFY_SOURCE=1        -fobjc-exceptions -o objects/MMBackend.o MacVim/MMBackend.m
711:info:build 1867 translated messages.
712:info:build OLD_PO_FILE_INPUT=yes msgfmt -v -o no.mo no.po
713:info:build 1655 translated messages.
714:info:build /usr/bin/clang -c -I. -Iproto -DHAVE_CONFIG_H -DFEAT_GUI_MACVIM -Wall -Wno-unknown-pragmas -pipe  -I/opt/local/include -isysroot/Applications/Xcode.app/Contents/Developer/Platforms/MacOSX.platform/Developer/SDKs/MacOSX12.3.sdk -DMACOS_X -DMACOS_X_DARWIN  -pipe -Os -isysroot/Applications/Xcode.app/Contents/Developer/Platforms/MacOSX.platform/Developer/SDKs/MacOSX12.3.sdk -arch x86_64 -U_FORTIFY_SOURCE -D_FORTIFY_SOURCE=1        -o objects/MacVim.o MacVim/MacVim.m
715:info:build 1207 translated messages.
716:info:build OLD_PO_FILE_INPUT=yes msgfmt -v -o pl.mo pl.po
717:info:build 1655 translated messages.
718:info:build OLD_PO_FILE_INPUT=yes msgfmt -v -o pt_BR.mo pt_BR.po
719:info:build 1858 translated messages.
720:info:build OLD_PO_FILE_INPUT=yes msgfmt -v -o ru.mo ru.po
721:info:build 1934 translated messages.
722:info:build /usr/bin/clang -c -I. -Ilibvterm/include -Iproto -DHAVE_CONFIG_H -DFEAT_GUI_MACVIM -Wall -Wno-unknown-pragmas -pipe  -I/opt/local/include -isysroot/Applications/Xcode.app/Contents/Developer/Platforms/MacOSX.platform/Developer/SDKs/MacOSX12.3.sdk -DMACOS_X -DMACOS_X_DARWIN  -pipe -Os -isysroot/Applications/Xcode.app/Contents/Developer/Platforms/MacOSX.platform/Developer/SDKs/MacOSX12.3.sdk -arch x86_64 -U_FORTIFY_SOURCE -D_FORTIFY_SOURCE=1        -DINLINE="" -DVSNPRINTF=vim_vsnprintf -DSNPRINTF=vim_snprintf -DIS_COMBINING_FUNCTION=utf_iscomposing_uint -DWCWIDTH_FUNCTION=utf_uint2cells -o objects/vterm_encoding.o libvterm/src/encoding.c
723:info:build /usr/bin/clang -c -I. -Ilibvterm/include -Iproto -DHAVE_CONFIG_H -DFEAT_GUI_MACVIM -Wall -Wno-unknown-pragmas -pipe  -I/opt/local/include -isysroot/Applications/Xcode.app/Contents/Developer/Platforms/MacOSX.platform/Developer/SDKs/MacOSX12.3.sdk -DMACOS_X -DMACOS_X_DARWIN  -pipe -Os -isysroot/Applications/Xcode.app/Contents/Developer/Platforms/MacOSX.platform/Developer/SDKs/MacOSX12.3.sdk -arch x86_64 -U_FORTIFY_SOURCE -D_FORTIFY_SOURCE=1        -DINLINE="" -DVSNPRINTF=vim_vsnprintf -DSNPRINTF=vim_snprintf -DIS_COMBINING_FUNCTION=utf_iscomposing_uint -DWCWIDTH_FUNCTION=utf_uint2cells -o objects/vterm_keyboard.o libvterm/src/keyboard.c
724:info:build 2038 translated messages.
725:info:build OLD_PO_FILE_INPUT=yes msgfmt -v -o sk.mo sk.po
726:info:build 1615 translated messages.
727:info:build OLD_PO_FILE_INPUT=yes msgfmt -v -o sr.mo sr.po
728:info:build OLD_PO_FILE_INPUT=yes msgfmt -v -o sv.mo sv.po
729:info:build 2676 translated messages.
730:info:build 1684 translated messages.
731:info:build /usr/bin/clang -c -I. -Ilibvterm/include -Iproto -DHAVE_CONFIG_H -DFEAT_GUI_MACVIM -Wall -Wno-unknown-pragmas -pipe  -I/opt/local/include -isysroot/Applications/Xcode.app/Contents/Developer/Platforms/MacOSX.platform/Developer/SDKs/MacOSX12.3.sdk -DMACOS_X -DMACOS_X_DARWIN  -pipe -Os -isysroot/Applications/Xcode.app/Contents/Developer/Platforms/MacOSX.platform/Developer/SDKs/MacOSX12.3.sdk -arch x86_64 -U_FORTIFY_SOURCE -D_FORTIFY_SOURCE=1        -DINLINE="" -DVSNPRINTF=vim_vsnprintf -DSNPRINTF=vim_snprintf -DIS_COMBINING_FUNCTION=utf_iscomposing_uint -DWCWIDTH_FUNCTION=utf_uint2cells -o objects/vterm_mouse.o libvterm/src/mouse.c
732:info:build OLD_PO_FILE_INPUT=yes msgfmt -v -o tr.mo tr.po
733:info:build /usr/bin/clang -c -I. -Ilibvterm/include -Iproto -DHAVE_CONFIG_H -DFEAT_GUI_MACVIM -Wall -Wno-unknown-pragmas -pipe  -I/opt/local/include -isysroot/Applications/Xcode.app/Contents/Developer/Platforms/MacOSX.platform/Developer/SDKs/MacOSX12.3.sdk -DMACOS_X -DMACOS_X_DARWIN  -pipe -Os -isysroot/Applications/Xcode.app/Contents/Developer/Platforms/MacOSX.platform/Developer/SDKs/MacOSX12.3.sdk -arch x86_64 -U_FORTIFY_SOURCE -D_FORTIFY_SOURCE=1        -DINLINE="" -DVSNPRINTF=vim_vsnprintf -DSNPRINTF=vim_snprintf -DIS_COMBINING_FUNCTION=utf_iscomposing_uint -DWCWIDTH_FUNCTION=utf_uint2cells -o objects/vterm_parser.o libvterm/src/parser.c
734:info:build make[2]: Leaving directory `/opt/local/var/macports/build/_opt_local_var_macports_sources_rsync.macports.org_macports_release_tarballs_ports_editors_MacVim/MacVim/work/macvim-dev-macvim-e65c14c/src/xxd'
735:info:build /usr/bin/clang -c -I. -Ilibvterm/include -Iproto -DHAVE_CONFIG_H -DFEAT_GUI_MACVIM -Wall -Wno-unknown-pragmas -pipe  -I/opt/local/include -isysroot/Applications/Xcode.app/Contents/Developer/Platforms/MacOSX.platform/Developer/SDKs/MacOSX12.3.sdk -DMACOS_X -DMACOS_X_DARWIN  -pipe -Os -isysroot/Applications/Xcode.app/Contents/Developer/Platforms/MacOSX.platform/Developer/SDKs/MacOSX12.3.sdk -arch x86_64 -U_FORTIFY_SOURCE -D_FORTIFY_SOURCE=1        -DINLINE="" -DVSNPRINTF=vim_vsnprintf -DSNPRINTF=vim_snprintf -DIS_COMBINING_FUNCTION=utf_iscomposing_uint -DWCWIDTH_FUNCTION=utf_uint2cells -o objects/vterm_pen.o libvterm/src/pen.c
736:info:build 2651 translated messages.
737:info:build OLD_PO_FILE_INPUT=yes msgfmt -v -o uk.mo uk.po
738:info:build 1961 translated messages.
739:info:build OLD_PO_FILE_INPUT=yes msgfmt -v -o vi.mo vi.po
740:info:build 1410 translated messages.
741:info:build OLD_PO_FILE_INPUT=yes msgfmt -v -o zh_CN.UTF-8.mo zh_CN.UTF-8.po
742:info:build /usr/bin/clang -c -I. -Ilibvterm/include -Iproto -DHAVE_CONFIG_H -DFEAT_GUI_MACVIM -Wall -Wno-unknown-pragmas -pipe  -I/opt/local/include -isysroot/Applications/Xcode.app/Contents/Developer/Platforms/MacOSX.platform/Developer/SDKs/MacOSX12.3.sdk -DMACOS_X -DMACOS_X_DARWIN  -pipe -Os -isysroot/Applications/Xcode.app/Contents/Developer/Platforms/MacOSX.platform/Developer/SDKs/MacOSX12.3.sdk -arch x86_64 -U_FORTIFY_SOURCE -D_FORTIFY_SOURCE=1        -DINLINE="" -DVSNPRINTF=vim_vsnprintf -DSNPRINTF=vim_snprintf -DIS_COMBINING_FUNCTION=utf_iscomposing_uint -DWCWIDTH_FUNCTION=utf_uint2cells -o objects/vterm_screen.o libvterm/src/screen.c
743:info:build 1623 translated messages, 3 fuzzy translations.
744:info:build OLD_PO_FILE_INPUT=yes msgfmt -v -o zh_CN.mo zh_CN.po
745:info:build /usr/bin/clang -c -I. -Ilibvterm/include -Iproto -DHAVE_CONFIG_H -DFEAT_GUI_MACVIM -Wall -Wno-unknown-pragmas -pipe  -I/opt/local/include -isysroot/Applications/Xcode.app/Contents/Developer/Platforms/MacOSX.platform/Developer/SDKs/MacOSX12.3.sdk -DMACOS_X -DMACOS_X_DARWIN  -pipe -Os -isysroot/Applications/Xcode.app/Contents/Developer/Platforms/MacOSX.platform/Developer/SDKs/MacOSX12.3.sdk -arch x86_64 -U_FORTIFY_SOURCE -D_FORTIFY_SOURCE=1        -DINLINE="" -DVSNPRINTF=vim_vsnprintf -DSNPRINTF=vim_snprintf -DIS_COMBINING_FUNCTION=utf_iscomposing_uint -DWCWIDTH_FUNCTION=utf_uint2cells -o objects/vterm_state.o libvterm/src/state.c
746:info:build 1622 translated messages, 3 fuzzy translations.
747:info:build OLD_PO_FILE_INPUT=yes msgfmt -v -o zh_TW.UTF-8.mo zh_TW.UTF-8.po
748:info:build 1412 translated messages.
749:info:build OLD_PO_FILE_INPUT=yes msgfmt -v -o zh_TW.mo zh_TW.po
750:info:build 1412 translated messages.
751:info:build OLD_PO_FILE_INPUT=yes msgfmt -v -o cs.cp1250.mo cs.cp1250.po
752:info:build 1272 translated messages.
753:info:build OLD_PO_FILE_INPUT=yes msgfmt -v -o ja.euc-jp.mo ja.euc-jp.po
754:info:build 2037 translated messages.
755:info:build OLD_PO_FILE_INPUT=yes msgfmt -v -o ja.sjis.mo ja.sjis.po
756:info:build /usr/bin/clang -c -I. -Ilibvterm/include -Iproto -DHAVE_CONFIG_H -DFEAT_GUI_MACVIM -Wall -Wno-unknown-pragmas -pipe  -I/opt/local/include -isysroot/Applications/Xcode.app/Contents/Developer/Platforms/MacOSX.platform/Developer/SDKs/MacOSX12.3.sdk -DMACOS_X -DMACOS_X_DARWIN  -pipe -Os -isysroot/Applications/Xcode.app/Contents/Developer/Platforms/MacOSX.platform/Developer/SDKs/MacOSX12.3.sdk -arch x86_64 -U_FORTIFY_SOURCE -D_FORTIFY_SOURCE=1        -DINLINE="" -DVSNPRINTF=vim_vsnprintf -DSNPRINTF=vim_snprintf -DIS_COMBINING_FUNCTION=utf_iscomposing_uint -DWCWIDTH_FUNCTION=utf_uint2cells -o objects/vterm_unicode.o libvterm/src/unicode.c
757:info:build 2037 translated messages.
758:info:build OLD_PO_FILE_INPUT=yes msgfmt -v -o pl.UTF-8.mo pl.UTF-8.po
759:info:build 1858 translated messages.
760:info:build OLD_PO_FILE_INPUT=yes msgfmt -v -o pl.cp1250.mo pl.cp1250.po
761:info:build /usr/bin/clang -c -I. -Ilibvterm/include -Iproto -DHAVE_CONFIG_H -DFEAT_GUI_MACVIM -Wall -Wno-unknown-pragmas -pipe  -I/opt/local/include -isysroot/Applications/Xcode.app/Contents/Developer/Platforms/MacOSX.platform/Developer/SDKs/MacOSX12.3.sdk -DMACOS_X -DMACOS_X_DARWIN  -pipe -Os -isysroot/Applications/Xcode.app/Contents/Developer/Platforms/MacOSX.platform/Developer/SDKs/MacOSX12.3.sdk -arch x86_64 -U_FORTIFY_SOURCE -D_FORTIFY_SOURCE=1        -DINLINE="" -DVSNPRINTF=vim_vsnprintf -DSNPRINTF=vim_snprintf -DIS_COMBINING_FUNCTION=utf_iscomposing_uint -DWCWIDTH_FUNCTION=utf_uint2cells -o objects/vterm_vterm.o libvterm/src/vterm.c
762:info:build 1858 translated messages.
763:info:build OLD_PO_FILE_INPUT=yes msgfmt -v -o ru.cp1251.mo ru.cp1251.po
764:info:build 2038 translated messages.
765:info:build OLD_PO_FILE_INPUT=yes msgfmt -v -o sk.cp1250.mo sk.cp1250.po
766:info:build 1615 translated messages.
767:info:build OLD_PO_FILE_INPUT=yes msgfmt -v -o uk.cp1251.mo uk.cp1251.po
768:info:build /usr/bin/clang -c -I. -Iproto -DHAVE_CONFIG_H -DFEAT_GUI_MACVIM -Wall -Wno-unknown-pragmas -pipe  -I/opt/local/include -isysroot/Applications/Xcode.app/Contents/Developer/Platforms/MacOSX.platform/Developer/SDKs/MacOSX12.3.sdk -DMACOS_X -DMACOS_X_DARWIN  -pipe -Os -isysroot/Applications/Xcode.app/Contents/Developer/Platforms/MacOSX.platform/Developer/SDKs/MacOSX12.3.sdk -arch x86_64 -U_FORTIFY_SOURCE -D_FORTIFY_SOURCE=1        -o objects/os_macosx.o os_macosx.m
769:info:build 1961 translated messages.
770:info:build OLD_PO_FILE_INPUT=yes msgfmt -v -o zh_CN.cp936.mo zh_CN.cp936.po
771:info:build 1623 translated messages, 3 fuzzy translations.
772:info:build echo af ca cs cs.cp1250 da de en_GB eo es fi fr ga it ja ja.euc-jp ja.sjis ko ko.UTF-8 lv nb nl no pl pl.UTF-8 pl.cp1250 pt_BR ru ru.cp1251 sk sk.cp1250 sr sv tr uk uk.cp1251 vi zh_CN zh_CN.UTF-8 zh_CN.cp936 zh_TW zh_TW.UTF-8  | tr " " "\n" |sed -e '/\./d' | sort > LINGUAS
773:info:build /usr/bin/clang -c -I. -Iproto -DHAVE_CONFIG_H -DFEAT_GUI_MACVIM -Wall -Wno-unknown-pragmas -pipe  -I/opt/local/include -isysroot/Applications/Xcode.app/Contents/Developer/Platforms/MacOSX.platform/Developer/SDKs/MacOSX12.3.sdk -DMACOS_X -DMACOS_X_DARWIN  -pipe -Os -isysroot/Applications/Xcode.app/Contents/Developer/Platforms/MacOSX.platform/Developer/SDKs/MacOSX12.3.sdk -arch x86_64 -U_FORTIFY_SOURCE -D_FORTIFY_SOURCE=1        -o objects/os_mac_conv.o os_mac_conv.c
774:info:build msgfmt --desktop -d . --template gvim.desktop.in -o tmp_gvim.desktop
775:info:build echo af ca cs cs.cp1250 da de en_GB eo es fi fr ga it ja ja.euc-jp ja.sjis ko ko.UTF-8 lv nb nl no pl pl.UTF-8 pl.cp1250 pt_BR ru ru.cp1251 sk sk.cp1250 sr sv tr uk uk.cp1251 vi zh_CN zh_CN.UTF-8 zh_CN.cp936 zh_TW zh_TW.UTF-8  | tr " " "\n" |sed -e '/\./d' | sort > LINGUAS
776:info:build msgfmt --desktop -d . --template vim.desktop.in -o tmp_vim.desktop
777:info:build In file included from MacVim/gui_macvim.m:16:
778:info:build MacVim/MMBackend.h:21:5: warning: 'NSConnection' is deprecated: first deprecated in macOS 10.13 - Use NSXPCConnection instead [-Wdeprecated-declarations]
779:info:build     NSConnection        *connection;
780:info:build     ^
781:info:build /Applications/Xcode.app/Contents/Developer/Platforms/MacOSX.platform/Developer/SDKs/MacOSX12.3.sdk/System/Library/Frameworks/Foundation.framework/Headers/NSConnection.h:18:12: note: 'NSConnection' has been explicitly marked deprecated here
782:info:build @interface NSConnection : NSObject {
783:info:build            ^
784:info:build In file included from MacVim/gui_macvim.m:16:
785:info:build MacVim/MMBackend.h:22:5: warning: 'NSConnection' is deprecated: first deprecated in macOS 10.13 - Use NSXPCConnection instead [-Wdeprecated-declarations]
786:info:build     NSConnection        *vimServerConnection;
787:info:build     ^
788:info:build /Applications/Xcode.app/Contents/Developer/Platforms/MacOSX.platform/Developer/SDKs/MacOSX12.3.sdk/System/Library/Frameworks/Foundation.framework/Headers/NSConnection.h:18:12: note: 'NSConnection' has been explicitly marked deprecated here
789:info:build @interface NSConnection : NSObject {
790:info:build            ^
791:info:build In file included from MacVim/gui_macvim.m:16:
792:info:build MacVim/MMBackend.h:66:4: warning: 'NSConnection' is deprecated: first deprecated in macOS 10.13 - Use NSXPCConnection instead [-Wdeprecated-declarations]
793:info:build - (NSConnection *)connection;
794:info:build    ^
795:info:build /Applications/Xcode.app/Contents/Developer/Platforms/MacOSX.platform/Developer/SDKs/MacOSX12.3.sdk/System/Library/Frameworks/Foundation.framework/Headers/NSConnection.h:18:12: note: 'NSConnection' has been explicitly marked deprecated here
796:info:build @interface NSConnection : NSObject {
797:info:build            ^
798:info:build MacVim/gui_macvim.m:1918:57: warning: 'NSFindPboard' is deprecated: first deprecated in macOS 10.13 [-Wdeprecated-declarations]
799:info:build     NSPasteboard *pb = [NSPasteboard pasteboardWithName:NSFindPboard];
800:info:build                                                         ^~~~~~~~~~~~
801:info:build                                                         NSPasteboardNameFind
802:info:build /Applications/Xcode.app/Contents/Developer/Platforms/MacOSX.platform/Developer/SDKs/MacOSX12.3.sdk/System/Library/Frameworks/AppKit.framework/Headers/NSPasteboard.h:337:32: note: 'NSFindPboard' has been explicitly marked deprecated here
803:info:build APPKIT_EXTERN NSPasteboardName NSFindPboard API_DEPRECATED_WITH_REPLACEMENT("NSPasteboardNameFind", macos(10.0,10.13));
804:info:build                                ^
805:info:build MacVim/gui_macvim.m:1920:13: warning: 'NSStringPboardType' is deprecated: first deprecated in macOS 10.14 [-Wdeprecated-declarations]
806:info:build             NSStringPboardType, nil];
807:info:build             ^~~~~~~~~~~~~~~~~~
808:info:build             NSPasteboardTypeString
809:info:build /Applications/Xcode.app/Contents/Developer/Platforms/MacOSX.platform/Developer/SDKs/MacOSX12.3.sdk/System/Library/Frameworks/AppKit.framework/Headers/NSPasteboard.h:311:32: note: 'NSStringPboardType' has been explicitly marked deprecated here
810:info:build APPKIT_EXTERN NSPasteboardType NSStringPboardType API_DEPRECATED_WITH_REPLACEMENT("NSPasteboardTypeString", macos(10.0,10.14));
811:info:build                                ^
812:info:build MacVim/gui_macvim.m:1929:60: warning: 'NSStringPboardType' is deprecated: first deprecated in macOS 10.14 [-Wdeprecated-declarations]
813:info:build     [pb setString:[s stringByRemovingFindPatterns] forType:NSStringPboardType];
814:info:build                                                            ^~~~~~~~~~~~~~~~~~
815:info:build                                                            NSPasteboardTypeString
816:info:build /Applications/Xcode.app/Contents/Developer/Platforms/MacOSX.platform/Developer/SDKs/MacOSX12.3.sdk/System/Library/Frameworks/AppKit.framework/Headers/NSPasteboard.h:311:32: note: 'NSStringPboardType' has been explicitly marked deprecated here
817:info:build APPKIT_EXTERN NSPasteboardType NSStringPboardType API_DEPRECATED_WITH_REPLACEMENT("NSPasteboardTypeString", macos(10.0,10.14));
818:info:build                                ^
819:info:build In file included from MacVim/MMBackend.m:30:
820:info:build MacVim/MMBackend.h:21:5: warning: 'NSConnection' is deprecated: first deprecated in macOS 10.13 - Use NSXPCConnection instead [-Wdeprecated-declarations]
821:info:build     NSConnection        *connection;
822:info:build     ^
823:info:build /Applications/Xcode.app/Contents/Developer/Platforms/MacOSX.platform/Developer/SDKs/MacOSX12.3.sdk/System/Library/Frameworks/Foundation.framework/Headers/NSConnection.h:18:12: note: 'NSConnection' has been explicitly marked deprecated here
824:info:build @interface NSConnection : NSObject {
825:info:build            ^
826:info:build In file included from MacVim/MMBackend.m:30:
827:info:build MacVim/MMBackend.h:22:5: warning: 'NSConnection' is deprecated: first deprecated in macOS 10.13 - Use NSXPCConnection instead [-Wdeprecated-declarations]
828:info:build     NSConnection        *vimServerConnection;
829:info:build     ^
830:info:build /Applications/Xcode.app/Contents/Developer/Platforms/MacOSX.platform/Developer/SDKs/MacOSX12.3.sdk/System/Library/Frameworks/Foundation.framework/Headers/NSConnection.h:18:12: note: 'NSConnection' has been explicitly marked deprecated here
831:info:build @interface NSConnection : NSObject {
832:info:build            ^
833:info:build In file included from MacVim/MMBackend.m:30:
834:info:build MacVim/MMBackend.h:66:4: warning: 'NSConnection' is deprecated: first deprecated in macOS 10.13 - Use NSXPCConnection instead [-Wdeprecated-declarations]
835:info:build - (NSConnection *)connection;
836:info:build    ^
837:info:build /Applications/Xcode.app/Contents/Developer/Platforms/MacOSX.platform/Developer/SDKs/MacOSX12.3.sdk/System/Library/Frameworks/Foundation.framework/Headers/NSConnection.h:18:12: note: 'NSConnection' has been explicitly marked deprecated here
838:info:build @interface NSConnection : NSObject {
839:info:build            ^
840:info:build MacVim/MMBackend.m:208:4: warning: 'NSConnection' is deprecated: first deprecated in macOS 10.13 - Use NSXPCConnection instead [-Wdeprecated-declarations]
841:info:build - (NSConnection *)connectionForServerName:(NSString *)name;
842:info:build    ^
843:info:build /Applications/Xcode.app/Contents/Developer/Platforms/MacOSX.platform/Developer/SDKs/MacOSX12.3.sdk/System/Library/Frameworks/Foundation.framework/Headers/NSConnection.h:18:12: note: 'NSConnection' has been explicitly marked deprecated here
844:info:build @interface NSConnection : NSObject {
845:info:build            ^
846:info:build MacVim/MMBackend.m:209:4: warning: 'NSConnection' is deprecated: first deprecated in macOS 10.13 - Use NSXPCConnection instead [-Wdeprecated-declarations]
847:info:build - (NSConnection *)connectionForServerPort:(int)port;
848:info:build    ^
849:info:build /Applications/Xcode.app/Contents/Developer/Platforms/MacOSX.platform/Developer/SDKs/MacOSX12.3.sdk/System/Library/Frameworks/Foundation.framework/Headers/NSConnection.h:18:12: note: 'NSConnection' has been explicitly marked deprecated here
850:info:build @interface NSConnection : NSObject {
851:info:build            ^
852:info:build MacVim/MMBackend.m:211:20: warning: 'NSDistantObject' is deprecated: first deprecated in macOS 10.13 - Use NSXPCConnection instead [-Wdeprecated-declarations]
853:info:build - (void)addClient:(NSDistantObject *)client;
854:info:build                    ^
855:info:build /Applications/Xcode.app/Contents/Developer/Platforms/MacOSX.platform/Developer/SDKs/MacOSX12.3.sdk/System/Library/Frameworks/Foundation.framework/Headers/NSDistantObject.h:13:12: note: 'NSDistantObject' has been explicitly marked deprecated here
856:info:build @interface NSDistantObject : NSProxy <NSCoding> {
857:info:build            ^
858:info:build MacVim/MMBackend.m:315:4: warning: 'NSConnection' is deprecated: first deprecated in macOS 10.13 - Use NSXPCConnection instead [-Wdeprecated-declarations]
859:info:build - (NSConnection *)connection
860:info:build    ^
861:info:build /Applications/Xcode.app/Contents/Developer/Platforms/MacOSX.platform/Developer/SDKs/MacOSX12.3.sdk/System/Library/Frameworks/Foundation.framework/Headers/NSConnection.h:18:12: note: 'NSConnection' has been explicitly marked deprecated here
862:info:build @interface NSConnection : NSObject {
863:info:build            ^
864:info:build MacVim/MMBackend.m:323:36: warning: 'NSConnection' is deprecated: first deprecated in macOS 10.13 - Use NSXPCConnection instead [-Wdeprecated-declarations]
865:info:build         connection = [NSConnection connectionWithRegisteredName:name host:nil];
866:info:build                                    ^
867:info:build /Applications/Xcode.app/Contents/Developer/Platforms/MacOSX.platform/Developer/SDKs/MacOSX12.3.sdk/System/Library/Frameworks/Foundation.framework/Headers/NSConnection.h:18:12: note: 'NSConnection' has been explicitly marked deprecated here
868:info:build @interface NSConnection : NSObject {
869:info:build            ^
870:info:build MacVim/MMBackend.m:449:26: warning: 'NSConnectionDidDieNotification' is deprecated: first deprecated in macOS 10.13 - Use NSXPCConnection instead [-Wdeprecated-declarations]
871:info:build                     name:NSConnectionDidDieNotification object:connection];
872:info:build                          ^
873:info:build /Applications/Xcode.app/Contents/Developer/Platforms/MacOSX.platform/Developer/SDKs/MacOSX12.3.sdk/System/Library/Frameworks/Foundation.framework/Headers/NSConnection.h:110:36: note: 'NSConnectionDidDieNotification' has been explicitly marked deprecated here
874:info:build FOUNDATION_EXPORT NSString * const NSConnectionDidDieNotification NS_SWIFT_UNAVAILABLE("Use NSXPCConnection instead") API_DEPRECATED("Use NSXPCConnection instead", macosx(10.0, 10.13), ios(2.0,11.0), watchos(2.0,4.0), tvos(9.0,11.0));
875:info:build                                    ^
876:info:build MacVim/MMBackend.m:1155:28: warning: 'colorUsingColorSpaceName:' is deprecated: first deprecated in macOS 10.14 - Use -colorUsingType: or -colorUsingColorSpace: instead [-Wdeprecated-declarations]
877:info:build                 col = [col colorUsingColorSpaceName:NSCalibratedRGBColorSpace];
878:info:build                            ^
879:info:build /Applications/Xcode.app/Contents/Developer/Platforms/MacOSX.platform/Developer/SDKs/MacOSX12.3.sdk/System/Library/Frameworks/AppKit.framework/Headers/NSColor.h:419:1: note: 'colorUsingColorSpaceName:' has been explicitly marked deprecated here
880:info:build - (nullable NSColor *)colorUsingColorSpaceName:(NSColorSpaceName)name API_DEPRECATED("Use -colorUsingType: or -colorUsingColorSpace: instead", macos(10.0,10.14));
881:info:build ^
882:info:build MacVim/MMBackend.m:1410:51: warning: 'NSStringPboardType' is deprecated: first deprecated in macOS 10.14 [-Wdeprecated-declarations]
883:info:build         NSArray *types = [NSArray arrayWithObject:NSStringPboardType];
884:info:build                                                   ^~~~~~~~~~~~~~~~~~
885:info:build                                                   NSPasteboardTypeString
886:info:build /Applications/Xcode.app/Contents/Developer/Platforms/MacOSX.platform/Developer/SDKs/MacOSX12.3.sdk/System/Library/Frameworks/AppKit.framework/Headers/NSPasteboard.h:311:32: note: 'NSStringPboardType' has been explicitly marked deprecated here
887:info:build APPKIT_EXTERN NSPasteboardType NSStringPboardType API_DEPRECATED_WITH_REPLACEMENT("NSPasteboardTypeString", macos(10.0,10.14));
888:info:build                                ^
889:info:build MacVim/MMBackend.m:1412:52: warning: 'NSStringPboardType' is deprecated: first deprecated in macOS 10.14 [-Wdeprecated-declarations]
890:info:build         BOOL ok = [pboard setString:string forType:NSStringPboardType];
891:info:build                                                    ^~~~~~~~~~~~~~~~~~
892:info:build                                                    NSPasteboardTypeString
893:info:build /Applications/Xcode.app/Contents/Developer/Platforms/MacOSX.platform/Developer/SDKs/MacOSX12.3.sdk/System/Library/Frameworks/AppKit.framework/Headers/NSPasteboard.h:311:32: note: 'NSStringPboardType' has been explicitly marked deprecated here
894:info:build APPKIT_EXTERN NSPasteboardType NSStringPboardType API_DEPRECATED_WITH_REPLACEMENT("NSPasteboardTypeString", macos(10.0,10.14));
895:info:build                                ^
896:info:build MacVim/MMBackend.m:1431:5: warning: 'NSConnection' is deprecated: first deprecated in macOS 10.13 - Use NSXPCConnection instead [-Wdeprecated-declarations]
897:info:build     NSConnection *conn = [(NSDistantObject*)server connectionForProxy];
898:info:build     ^
899:info:build /Applications/Xcode.app/Contents/Developer/Platforms/MacOSX.platform/Developer/SDKs/MacOSX12.3.sdk/System/Library/Frameworks/Foundation.framework/Headers/NSConnection.h:18:12: note: 'NSConnection' has been explicitly marked deprecated here
900:info:build @interface NSConnection : NSObject {
901:info:build            ^
902:info:build MacVim/MMBackend.m:1431:28: warning: 'NSDistantObject' is deprecated: first deprecated in macOS 10.13 - Use NSXPCConnection instead [-Wdeprecated-declarations]
903:info:build     NSConnection *conn = [(NSDistantObject*)server connectionForProxy];
904:info:build                            ^
905:info:build /Applications/Xcode.app/Contents/Developer/Platforms/MacOSX.platform/Developer/SDKs/MacOSX12.3.sdk/System/Library/Frameworks/Foundation.framework/Headers/NSDistantObject.h:13:12: note: 'NSDistantObject' has been explicitly marked deprecated here
906:info:build @interface NSDistantObject : NSProxy <NSCoding> {
907:info:build            ^
908:info:build MacVim/MMBackend.m:1476:42: warning: 'NSConnection' is deprecated: first deprecated in macOS 10.13 - Use NSXPCConnection instead [-Wdeprecated-declarations]
909:info:build     vimServerConnection = [[NSConnection alloc]
910:info:build                                          ^
911:info:build /Applications/Xcode.app/Contents/Developer/Platforms/MacOSX.platform/Developer/SDKs/MacOSX12.3.sdk/System/Library/Frameworks/Foundation.framework/Headers/NSConnection.h:18:12: note: 'NSConnection' has been explicitly marked deprecated here
912:info:build @interface NSConnection : NSObject {
913:info:build            ^
914:info:build MacVim/MMBackend.m:1519:5: warning: 'NSConnection' is deprecated: first deprecated in macOS 10.13 - Use NSXPCConnection instead [-Wdeprecated-declarations]
915:info:build     NSConnection *conn = [self connectionForServerName:name];
916:info:build     ^
917:info:build /Applications/Xcode.app/Contents/Developer/Platforms/MacOSX.platform/Developer/SDKs/MacOSX12.3.sdk/System/Library/Frameworks/Foundation.framework/Headers/NSConnection.h:18:12: note: 'NSConnection' has been explicitly marked deprecated here
918:info:build @interface NSConnection : NSObject {
919:info:build            ^
920:info:build MacVim/MMBackend.m:1605:5: warning: 'NSConnection' is deprecated: first deprecated in macOS 10.13 - Use NSXPCConnection instead [-Wdeprecated-declarations]
921:info:build     NSConnection *conn = [self connectionForServerPort:port];
922:info:build     ^
923:info:build /Applications/Xcode.app/Contents/Developer/Platforms/MacOSX.platform/Developer/SDKs/MacOSX12.3.sdk/System/Library/Frameworks/Foundation.framework/Headers/NSConnection.h:18:12: note: 'NSConnection' has been explicitly marked deprecated here
924:info:build @interface NSConnection : NSObject {
925:info:build            ^
926:info:build MacVim/MMBackend.m:2418:14: warning: 'NSScrollerDecrementLine' is deprecated: first deprecated in macOS 10.14 - Scroller arrows are not used anymore. [-Wdeprecated-declarations]
927:info:build         case NSScrollerDecrementLine:
928:info:build              ^
929:info:build /Applications/Xcode.app/Contents/Developer/Platforms/MacOSX.platform/Developer/SDKs/MacOSX12.3.sdk/System/Library/Frameworks/AppKit.framework/Headers/NSScroller.h:26:5: note: 'NSScrollerDecrementLine' has been explicitly marked deprecated here
930:info:build     NSScrollerDecrementLine API_DEPRECATED("Scroller arrows are not used anymore.", macos(10.0,10.14)) = 4,
931:info:build     ^
932:info:build MacVim/MMBackend.m:2421:14: warning: 'NSScrollerIncrementLine' is deprecated: first deprecated in macOS 10.14 - Scroller arrows are not used anymore. [-Wdeprecated-declarations]
933:info:build         case NSScrollerIncrementLine:
934:info:build              ^
935:info:build /Applications/Xcode.app/Contents/Developer/Platforms/MacOSX.platform/Developer/SDKs/MacOSX12.3.sdk/System/Library/Frameworks/AppKit.framework/Headers/NSScroller.h:27:5: note: 'NSScrollerIncrementLine' has been explicitly marked deprecated here
936:info:build     NSScrollerIncrementLine API_DEPRECATED("Scroller arrows are not used anymore.", macos(10.0,10.14)) = 5,
937:info:build     ^
938:info:build MacVim/MMBackend.m:3401:4: warning: 'NSConnection' is deprecated: first deprecated in macOS 10.13 - Use NSXPCConnection instead [-Wdeprecated-declarations]
939:info:build - (NSConnection *)connectionForServerName:(NSString *)name
940:info:build    ^
941:info:build /Applications/Xcode.app/Contents/Developer/Platforms/MacOSX.platform/Developer/SDKs/MacOSX12.3.sdk/System/Library/Frameworks/Foundation.framework/Headers/NSConnection.h:18:12: note: 'NSConnection' has been explicitly marked deprecated here
942:info:build @interface NSConnection : NSObject {
943:info:build            ^
944:info:build MacVim/MMBackend.m:3453:4: warning: 'NSConnection' is deprecated: first deprecated in macOS 10.13 - Use NSXPCConnection instead [-Wdeprecated-declarations]
945:info:build - (NSConnection *)connectionForServerPort:(int)port
946:info:build    ^
947:info:build /Applications/Xcode.app/Contents/Developer/Platforms/MacOSX.platform/Developer/SDKs/MacOSX12.3.sdk/System/Library/Frameworks/Foundation.framework/Headers/NSConnection.h:18:12: note: 'NSConnection' has been explicitly marked deprecated here
948:info:build @interface NSConnection : NSObject {
949:info:build            ^
950:info:build MacVim/MMBackend.m:3490:20: warning: 'NSDistantObject' is deprecated: first deprecated in macOS 10.13 - Use NSXPCConnection instead [-Wdeprecated-declarations]
951:info:build - (void)addClient:(NSDistantObject *)client
952:info:build                    ^
953:info:build /Applications/Xcode.app/Contents/Developer/Platforms/MacOSX.platform/Developer/SDKs/MacOSX12.3.sdk/System/Library/Frameworks/Foundation.framework/Headers/NSDistantObject.h:13:12: note: 'NSDistantObject' has been explicitly marked deprecated here
954:info:build @interface NSDistantObject : NSProxy <NSCoding> {
955:info:build            ^
956:info:build MacVim/MMBackend.m:3405:5: warning: 'NSConnection' is deprecated: first deprecated in macOS 10.13 - Use NSXPCConnection instead [-Wdeprecated-declarations]
957:info:build     NSConnection *svrConn = [connectionNameDict objectForKey:connName];
958:info:build     ^
959:info:build /Applications/Xcode.app/Contents/Developer/Platforms/MacOSX.platform/Developer/SDKs/MacOSX12.3.sdk/System/Library/Frameworks/Foundation.framework/Headers/NSConnection.h:18:12: note: 'NSConnection' has been explicitly marked deprecated here
960:info:build @interface NSConnection : NSObject {
961:info:build            ^
962:info:build MacVim/MMBackend.m:3408:33: warning: 'NSConnection' is deprecated: first deprecated in macOS 10.13 - Use NSXPCConnection instead [-Wdeprecated-declarations]
963:info:build         svrConn = [NSConnection connectionWithRegisteredName:connName
964:info:build                                 ^
965:info:build /Applications/Xcode.app/Contents/Developer/Platforms/MacOSX.platform/Developer/SDKs/MacOSX12.3.sdk/System/Library/Frameworks/Foundation.framework/Headers/NSConnection.h:18:12: note: 'NSConnection' has been explicitly marked deprecated here
966:info:build @interface NSConnection : NSObject {
967:info:build            ^
968:info:build MacVim/MMBackend.m:3415:37: warning: 'NSConnection' is deprecated: first deprecated in macOS 10.13 - Use NSXPCConnection instead [-Wdeprecated-declarations]
969:info:build             svrConn = [NSConnection connectionWithRegisteredName:connName
970:info:build                                     ^
971:info:build /Applications/Xcode.app/Contents/Developer/Platforms/MacOSX.platform/Developer/SDKs/MacOSX12.3.sdk/System/Library/Frameworks/Foundation.framework/Headers/NSConnection.h:18:12: note: 'NSConnection' has been explicitly marked deprecated here
972:info:build @interface NSConnection : NSObject {
973:info:build            ^
974:info:build MacVim/MMBackend.m:3435:37: warning: 'NSConnection' is deprecated: first deprecated in macOS 10.13 - Use NSXPCConnection instead [-Wdeprecated-declarations]
975:info:build             svrConn = [NSConnection connectionWithRegisteredName:connName
976:info:build                                     ^
977:info:build /Applications/Xcode.app/Contents/Developer/Platforms/MacOSX.platform/Developer/SDKs/MacOSX12.3.sdk/System/Library/Frameworks/Foundation.framework/Headers/NSConnection.h:18:12: note: 'NSConnection' has been explicitly marked deprecated here
978:info:build @interface NSConnection : NSObject {
979:info:build            ^
980:info:build MacVim/MMBackend.m:3446:30: warning: 'NSConnectionDidDieNotification' is deprecated: first deprecated in macOS 10.13 - Use NSXPCConnection instead [-Wdeprecated-declarations]
981:info:build                         name:NSConnectionDidDieNotification object:svrConn];
982:info:build                              ^
983:info:build /Applications/Xcode.app/Contents/Developer/Platforms/MacOSX.platform/Developer/SDKs/MacOSX12.3.sdk/System/Library/Frameworks/Foundation.framework/Headers/NSConnection.h:110:36: note: 'NSConnectionDidDieNotification' has been explicitly marked deprecated here
984:info:build FOUNDATION_EXPORT NSString * const NSConnectionDidDieNotification NS_SWIFT_UNAVAILABLE("Use NSXPCConnection instead") API_DEPRECATED("Use NSXPCConnection instead", macosx(10.0, 10.13), ios(2.0,11.0), watchos(2.0,4.0), tvos(9.0,11.0));
985:info:build                                    ^
986:info:build MacVim/MMBackend.m:3455:5: warning: 'NSConnection' is deprecated: first deprecated in macOS 10.13 - Use NSXPCConnection instead [-Wdeprecated-declarations]
987:info:build     NSConnection *conn;
988:info:build     ^
989:info:build /Applications/Xcode.app/Contents/Developer/Platforms/MacOSX.platform/Developer/SDKs/MacOSX12.3.sdk/System/Library/Frameworks/Foundation.framework/Headers/NSConnection.h:18:12: note: 'NSConnection' has been explicitly marked deprecated here
990:info:build @interface NSConnection : NSObject {
991:info:build            ^
992:info:build MacVim/MMBackend.m:3471:5: warning: 'NSConnection' is deprecated: first deprecated in macOS 10.13 - Use NSXPCConnection instead [-Wdeprecated-declarations]
993:info:build     NSConnection *svrConn = [notification object];
994:info:build     ^
995:info:build /Applications/Xcode.app/Contents/Developer/Platforms/MacOSX.platform/Developer/SDKs/MacOSX12.3.sdk/System/Library/Frameworks/Foundation.framework/Headers/NSConnection.h:18:12: note: 'NSConnection' has been explicitly marked deprecated here
996:info:build @interface NSConnection : NSObject {
997:info:build            ^
998:info:build MacVim/MMBackend.m:3476:28: warning: 'NSConnectionDidDieNotification' is deprecated: first deprecated in macOS 10.13 - Use NSXPCConnection instead [-Wdeprecated-declarations]
999:info:build                       name:NSConnectionDidDieNotification
1000:info:build                            ^
1001:info:build /Applications/Xcode.app/Contents/Developer/Platforms/MacOSX.platform/Developer/SDKs/MacOSX12.3.sdk/System/Library/Frameworks/Foundation.framework/Headers/NSConnection.h:110:36: note: 'NSConnectionDidDieNotification' has been explicitly marked deprecated here
1002:info:build FOUNDATION_EXPORT NSString * const NSConnectionDidDieNotification NS_SWIFT_UNAVAILABLE("Use NSXPCConnection instead") API_DEPRECATED("Use NSXPCConnection instead", macosx(10.0, 10.13), ios(2.0,11.0), watchos(2.0,4.0), tvos(9.0,11.0));
1003:info:build                                    ^
1004:info:build MacVim/MMBackend.m:3492:5: warning: 'NSConnection' is deprecated: first deprecated in macOS 10.13 - Use NSXPCConnection instead [-Wdeprecated-declarations]
1005:info:build     NSConnection *conn = [client connectionForProxy];
1006:info:build     ^
1007:info:build /Applications/Xcode.app/Contents/Developer/Platforms/MacOSX.platform/Developer/SDKs/MacOSX12.3.sdk/System/Library/Frameworks/Foundation.framework/Headers/NSConnection.h:18:12: note: 'NSConnection' has been explicitly marked deprecated here
1008:info:build @interface NSConnection : NSObject {
1009:info:build            ^
1010:info:build rm -f LINGUAS
1011:info:build if command -v desktop-file-validate; then desktop-file-validate tmp_gvim.desktop; fi
1012:info:build mv tmp_gvim.desktop gvim.desktop
1013:info:build 6 warnings generated.
1014:info:build rm -f LINGUAS
1015:info:build if command -v desktop-file-validate; then desktop-file-validate tmp_vim.desktop; fi
1016:info:build mv tmp_vim.desktop vim.desktop
1017:info:build make[2]: Leaving directory `/opt/local/var/macports/build/_opt_local_var_macports_sources_rsync.macports.org_macports_release_tarballs_ports_editors_MacVim/MacVim/work/macvim-dev-macvim-e65c14c/src/po'
1018:info:build make[2]: Entering directory `/opt/local/var/macports/build/_opt_local_var_macports_sources_rsync.macports.org_macports_release_tarballs_ports_editors_MacVim/MacVim/work/macvim-dev-macvim-e65c14c/src/po'
1019:info:build make[2]: Nothing to be done for `converted'.
1020:info:build make[2]: Leaving directory `/opt/local/var/macports/build/_opt_local_var_macports_sources_rsync.macports.org_macports_release_tarballs_ports_editors_MacVim/MacVim/work/macvim-dev-macvim-e65c14c/src/po'
1021:info:build /usr/bin/clang -c -I. -Iproto -DHAVE_CONFIG_H -DFEAT_GUI_MACVIM -Wall -Wno-unknown-pragmas -pipe  -I/opt/local/include -isysroot/Applications/Xcode.app/Contents/Developer/Platforms/MacOSX.platform/Developer/SDKs/MacOSX12.3.sdk -DMACOS_X -DMACOS_X_DARWIN  -pipe -Os -isysroot/Applications/Xcode.app/Contents/Developer/Platforms/MacOSX.platform/Developer/SDKs/MacOSX12.3.sdk -arch x86_64 -U_FORTIFY_SOURCE -D_FORTIFY_SOURCE=1        -o objects/arabic.o arabic.c
1022:info:build /usr/bin/clang -c -I. -Iproto -DHAVE_CONFIG_H -DFEAT_GUI_MACVIM -Wall -Wno-unknown-pragmas -pipe  -I/opt/local/include -isysroot/Applications/Xcode.app/Contents/Developer/Platforms/MacOSX.platform/Developer/SDKs/MacOSX12.3.sdk -DMACOS_X -DMACOS_X_DARWIN  -pipe -Os -isysroot/Applications/Xcode.app/Contents/Developer/Platforms/MacOSX.platform/Developer/SDKs/MacOSX12.3.sdk -arch x86_64 -U_FORTIFY_SOURCE -D_FORTIFY_SOURCE=1        -o objects/arglist.o arglist.c
1023:info:build /usr/bin/clang -c -I. -Iproto -DHAVE_CONFIG_H -DFEAT_GUI_MACVIM -Wall -Wno-unknown-pragmas -pipe  -I/opt/local/include -isysroot/Applications/Xcode.app/Contents/Developer/Platforms/MacOSX.platform/Developer/SDKs/MacOSX12.3.sdk -DMACOS_X -DMACOS_X_DARWIN  -pipe -Os -isysroot/Applications/Xcode.app/Contents/Developer/Platforms/MacOSX.platform/Developer/SDKs/MacOSX12.3.sdk -arch x86_64 -U_FORTIFY_SOURCE -D_FORTIFY_SOURCE=1        -o objects/autocmd.o autocmd.c
1024:info:build /usr/bin/clang -c -I. -Iproto -DHAVE_CONFIG_H -DFEAT_GUI_MACVIM -Wall -Wno-unknown-pragmas -pipe  -I/opt/local/include -isysroot/Applications/Xcode.app/Contents/Developer/Platforms/MacOSX.platform/Developer/SDKs/MacOSX12.3.sdk -DMACOS_X -DMACOS_X_DARWIN  -pipe -Os -isysroot/Applications/Xcode.app/Contents/Developer/Platforms/MacOSX.platform/Developer/SDKs/MacOSX12.3.sdk -arch x86_64 -U_FORTIFY_SOURCE -D_FORTIFY_SOURCE=1        -o objects/beval.o beval.c
1025:info:build /usr/bin/clang -c -I. -Iproto -DHAVE_CONFIG_H -DFEAT_GUI_MACVIM -Wall -Wno-unknown-pragmas -pipe  -I/opt/local/include -isysroot/Applications/Xcode.app/Contents/Developer/Platforms/MacOSX.platform/Developer/SDKs/MacOSX12.3.sdk -DMACOS_X -DMACOS_X_DARWIN  -pipe -Os -isysroot/Applications/Xcode.app/Contents/Developer/Platforms/MacOSX.platform/Developer/SDKs/MacOSX12.3.sdk -arch x86_64 -U_FORTIFY_SOURCE -D_FORTIFY_SOURCE=1        -o objects/buffer.o buffer.c
1026:info:build /usr/bin/clang -c -I. -Iproto -DHAVE_CONFIG_H -DFEAT_GUI_MACVIM -Wall -Wno-unknown-pragmas -pipe  -I/opt/local/include -isysroot/Applications/Xcode.app/Contents/Developer/Platforms/MacOSX.platform/Developer/SDKs/MacOSX12.3.sdk -DMACOS_X -DMACOS_X_DARWIN  -pipe -Os -isysroot/Applications/Xcode.app/Contents/Developer/Platforms/MacOSX.platform/Developer/SDKs/MacOSX12.3.sdk -arch x86_64 -U_FORTIFY_SOURCE -D_FORTIFY_SOURCE=1        -o objects/change.o change.c
1027:info:build /usr/bin/clang -c -I. -Iproto -DHAVE_CONFIG_H -DFEAT_GUI_MACVIM -Wall -Wno-unknown-pragmas -pipe  -I/opt/local/include -isysroot/Applications/Xcode.app/Contents/Developer/Platforms/MacOSX.platform/Developer/SDKs/MacOSX12.3.sdk -DMACOS_X -DMACOS_X_DARWIN  -pipe -Os -isysroot/Applications/Xcode.app/Contents/Developer/Platforms/MacOSX.platform/Developer/SDKs/MacOSX12.3.sdk -arch x86_64 -U_FORTIFY_SOURCE -D_FORTIFY_SOURCE=1        -o objects/blob.o blob.c
1028:info:build /usr/bin/clang -c -I. -Iproto -DHAVE_CONFIG_H -DFEAT_GUI_MACVIM -Wall -Wno-unknown-pragmas -pipe  -I/opt/local/include -isysroot/Applications/Xcode.app/Contents/Developer/Platforms/MacOSX.platform/Developer/SDKs/MacOSX12.3.sdk -DMACOS_X -DMACOS_X_DARWIN  -pipe -Os -isysroot/Applications/Xcode.app/Contents/Developer/Platforms/MacOSX.platform/Developer/SDKs/MacOSX12.3.sdk -arch x86_64 -U_FORTIFY_SOURCE -D_FORTIFY_SOURCE=1        -o objects/blowfish.o blowfish.c
1029:info:build 31 warnings generated.
1030:info:build /usr/bin/clang -c -I. -Iproto -DHAVE_CONFIG_H -DFEAT_GUI_MACVIM -Wall -Wno-unknown-pragmas -pipe  -I/opt/local/include -isysroot/Applications/Xcode.app/Contents/Developer/Platforms/MacOSX.platform/Developer/SDKs/MacOSX12.3.sdk -DMACOS_X -DMACOS_X_DARWIN  -pipe -Os -isysroot/Applications/Xcode.app/Contents/Developer/Platforms/MacOSX.platform/Developer/SDKs/MacOSX12.3.sdk -arch x86_64 -U_FORTIFY_SOURCE -D_FORTIFY_SOURCE=1        -o objects/cindent.o cindent.c
1031:info:build /usr/bin/clang -c -I. -Iproto -DHAVE_CONFIG_H -DFEAT_GUI_MACVIM -Wall -Wno-unknown-pragmas -pipe  -I/opt/local/include -isysroot/Applications/Xcode.app/Contents/Developer/Platforms/MacOSX.platform/Developer/SDKs/MacOSX12.3.sdk -DMACOS_X -DMACOS_X_DARWIN  -pipe -Os -isysroot/Applications/Xcode.app/Contents/Developer/Platforms/MacOSX.platform/Developer/SDKs/MacOSX12.3.sdk -arch x86_64 -U_FORTIFY_SOURCE -D_FORTIFY_SOURCE=1        -o objects/clientserver.o clientserver.c
1032:info:build /usr/bin/clang -c -I. -Iproto -DHAVE_CONFIG_H -DFEAT_GUI_MACVIM -Wall -Wno-unknown-pragmas -pipe  -I/opt/local/include -isysroot/Applications/Xcode.app/Contents/Developer/Platforms/MacOSX.platform/Developer/SDKs/MacOSX12.3.sdk -DMACOS_X -DMACOS_X_DARWIN  -pipe -Os -isysroot/Applications/Xcode.app/Contents/Developer/Platforms/MacOSX.platform/Developer/SDKs/MacOSX12.3.sdk -arch x86_64 -U_FORTIFY_SOURCE -D_FORTIFY_SOURCE=1        -o objects/clipboard.o clipboard.c
1033:info:build clientserver.c:903:6: warning: variable 'timeout' set but not used [-Wunused-but-set-variable]
1034:info:build         int timeout = 0;
1035:info:build             ^
1036:info:build /usr/bin/clang -c -I. -Iproto -DHAVE_CONFIG_H -DFEAT_GUI_MACVIM -Wall -Wno-unknown-pragmas -pipe  -I/opt/local/include -isysroot/Applications/Xcode.app/Contents/Developer/Platforms/MacOSX.platform/Developer/SDKs/MacOSX12.3.sdk -DMACOS_X -DMACOS_X_DARWIN  -pipe -Os -isysroot/Applications/Xcode.app/Contents/Developer/Platforms/MacOSX.platform/Developer/SDKs/MacOSX12.3.sdk -arch x86_64 -U_FORTIFY_SOURCE -D_FORTIFY_SOURCE=1        -o objects/cmdexpand.o cmdexpand.c
1037:info:build /usr/bin/clang -c -I. -Iproto -DHAVE_CONFIG_H -DFEAT_GUI_MACVIM -Wall -Wno-unknown-pragmas -pipe  -I/opt/local/include -isysroot/Applications/Xcode.app/Contents/Developer/Platforms/MacOSX.platform/Developer/SDKs/MacOSX12.3.sdk -DMACOS_X -DMACOS_X_DARWIN  -pipe -Os -isysroot/Applications/Xcode.app/Contents/Developer/Platforms/MacOSX.platform/Developer/SDKs/MacOSX12.3.sdk -arch x86_64 -U_FORTIFY_SOURCE -D_FORTIFY_SOURCE=1        -o objects/cmdhist.o cmdhist.c
1038:info:build /usr/bin/clang -c -I. -Iproto -DHAVE_CONFIG_H -DFEAT_GUI_MACVIM -Wall -Wno-unknown-pragmas -pipe  -I/opt/local/include -isysroot/Applications/Xcode.app/Contents/Developer/Platforms/MacOSX.platform/Developer/SDKs/MacOSX12.3.sdk -DMACOS_X -DMACOS_X_DARWIN  -pipe -Os -isysroot/Applications/Xcode.app/Contents/Developer/Platforms/MacOSX.platform/Developer/SDKs/MacOSX12.3.sdk -arch x86_64 -U_FORTIFY_SOURCE -D_FORTIFY_SOURCE=1        -o objects/crypt.o crypt.c
1039:info:build 1 warning generated.
1040:info:build /usr/bin/clang -c -I. -Iproto -DHAVE_CONFIG_H -DFEAT_GUI_MACVIM -Wall -Wno-unknown-pragmas -pipe  -I/opt/local/include -isysroot/Applications/Xcode.app/Contents/Developer/Platforms/MacOSX.platform/Developer/SDKs/MacOSX12.3.sdk -DMACOS_X -DMACOS_X_DARWIN  -pipe -Os -isysroot/Applications/Xcode.app/Contents/Developer/Platforms/MacOSX.platform/Developer/SDKs/MacOSX12.3.sdk -arch x86_64 -U_FORTIFY_SOURCE -D_FORTIFY_SOURCE=1        -o objects/crypt_zip.o crypt_zip.c
1041:info:build /usr/bin/clang -c -I. -Iproto -DHAVE_CONFIG_H -DFEAT_GUI_MACVIM -Wall -Wno-unknown-pragmas -pipe  -I/opt/local/include -isysroot/Applications/Xcode.app/Contents/Developer/Platforms/MacOSX.platform/Developer/SDKs/MacOSX12.3.sdk -DMACOS_X -DMACOS_X_DARWIN  -pipe -Os -isysroot/Applications/Xcode.app/Contents/Developer/Platforms/MacOSX.platform/Developer/SDKs/MacOSX12.3.sdk -arch x86_64 -U_FORTIFY_SOURCE -D_FORTIFY_SOURCE=1        -o objects/debugger.o debugger.c
1042:info:build /usr/bin/clang -c -I. -Iproto -DHAVE_CONFIG_H -DFEAT_GUI_MACVIM -Wall -Wno-unknown-pragmas -pipe  -I/opt/local/include -isysroot/Applications/Xcode.app/Contents/Developer/Platforms/MacOSX.platform/Developer/SDKs/MacOSX12.3.sdk -DMACOS_X -DMACOS_X_DARWIN  -pipe -Os -isysroot/Applications/Xcode.app/Contents/Developer/Platforms/MacOSX.platform/Developer/SDKs/MacOSX12.3.sdk -arch x86_64 -U_FORTIFY_SOURCE -D_FORTIFY_SOURCE=1        -o objects/dict.o dict.c
1043:info:build /usr/bin/clang -c -I. -Iproto -DHAVE_CONFIG_H -DFEAT_GUI_MACVIM -Wall -Wno-unknown-pragmas -pipe  -I/opt/local/include -isysroot/Applications/Xcode.app/Contents/Developer/Platforms/MacOSX.platform/Developer/SDKs/MacOSX12.3.sdk -DMACOS_X -DMACOS_X_DARWIN  -pipe -Os -isysroot/Applications/Xcode.app/Contents/Developer/Platforms/MacOSX.platform/Developer/SDKs/MacOSX12.3.sdk -arch x86_64 -U_FORTIFY_SOURCE -D_FORTIFY_SOURCE=1        -o objects/diff.o diff.c
1044:info:build /usr/bin/clang -c -I. -Iproto -DHAVE_CONFIG_H -DFEAT_GUI_MACVIM -Wall -Wno-unknown-pragmas -pipe  -I/opt/local/include -isysroot/Applications/Xcode.app/Contents/Developer/Platforms/MacOSX.platform/Developer/SDKs/MacOSX12.3.sdk -DMACOS_X -DMACOS_X_DARWIN  -pipe -Os -isysroot/Applications/Xcode.app/Contents/Developer/Platforms/MacOSX.platform/Developer/SDKs/MacOSX12.3.sdk -arch x86_64 -U_FORTIFY_SOURCE -D_FORTIFY_SOURCE=1        -o objects/digraph.o digraph.c
1045:info:build /usr/bin/clang -c -I. -Iproto -DHAVE_CONFIG_H -DFEAT_GUI_MACVIM -Wall -Wno-unknown-pragmas -pipe  -I/opt/local/include -isysroot/Applications/Xcode.app/Contents/Developer/Platforms/MacOSX.platform/Developer/SDKs/MacOSX12.3.sdk -DMACOS_X -DMACOS_X_DARWIN  -pipe -Os -isysroot/Applications/Xcode.app/Contents/Developer/Platforms/MacOSX.platform/Developer/SDKs/MacOSX12.3.sdk -arch x86_64 -U_FORTIFY_SOURCE -D_FORTIFY_SOURCE=1        -o objects/drawline.o drawline.c
1046:info:build /usr/bin/clang -c -I. -Iproto -DHAVE_CONFIG_H -DFEAT_GUI_MACVIM -Wall -Wno-unknown-pragmas -pipe  -I/opt/local/include -isysroot/Applications/Xcode.app/Contents/Developer/Platforms/MacOSX.platform/Developer/SDKs/MacOSX12.3.sdk -DMACOS_X -DMACOS_X_DARWIN  -pipe -Os -isysroot/Applications/Xcode.app/Contents/Developer/Platforms/MacOSX.platform/Developer/SDKs/MacOSX12.3.sdk -arch x86_64 -U_FORTIFY_SOURCE -D_FORTIFY_SOURCE=1        -o objects/drawscreen.o drawscreen.c
1047:info:build /usr/bin/clang -c -I. -Iproto -DHAVE_CONFIG_H -DFEAT_GUI_MACVIM -Wall -Wno-unknown-pragmas -pipe  -I/opt/local/include -isysroot/Applications/Xcode.app/Contents/Developer/Platforms/MacOSX.platform/Developer/SDKs/MacOSX12.3.sdk -DMACOS_X -DMACOS_X_DARWIN  -pipe -Os -isysroot/Applications/Xcode.app/Contents/Developer/Platforms/MacOSX.platform/Developer/SDKs/MacOSX12.3.sdk -arch x86_64 -U_FORTIFY_SOURCE -D_FORTIFY_SOURCE=1        -o objects/edit.o edit.c
1048:info:build /usr/bin/clang -c -I. -Iproto -DHAVE_CONFIG_H -DFEAT_GUI_MACVIM -Wall -Wno-unknown-pragmas -pipe  -I/opt/local/include -isysroot/Applications/Xcode.app/Contents/Developer/Platforms/MacOSX.platform/Developer/SDKs/MacOSX12.3.sdk -DMACOS_X -DMACOS_X_DARWIN  -pipe -Os -isysroot/Applications/Xcode.app/Contents/Developer/Platforms/MacOSX.platform/Developer/SDKs/MacOSX12.3.sdk -arch x86_64 -U_FORTIFY_SOURCE -D_FORTIFY_SOURCE=1        -o objects/eval.o eval.c
1049:info:build /usr/bin/clang -c -I. -Iproto -DHAVE_CONFIG_H -DFEAT_GUI_MACVIM -Wall -Wno-unknown-pragmas -pipe  -I/opt/local/include -isysroot/Applications/Xcode.app/Contents/Developer/Platforms/MacOSX.platform/Developer/SDKs/MacOSX12.3.sdk -DMACOS_X -DMACOS_X_DARWIN  -pipe -Os -isysroot/Applications/Xcode.app/Contents/Developer/Platforms/MacOSX.platform/Developer/SDKs/MacOSX12.3.sdk -arch x86_64 -U_FORTIFY_SOURCE -D_FORTIFY_SOURCE=1        -o objects/evalbuffer.o evalbuffer.c
1050:info:build /usr/bin/clang -c -I. -Iproto -DHAVE_CONFIG_H -DFEAT_GUI_MACVIM -Wall -Wno-unknown-pragmas -pipe  -I/opt/local/include -isysroot/Applications/Xcode.app/Contents/Developer/Platforms/MacOSX.platform/Developer/SDKs/MacOSX12.3.sdk -DMACOS_X -DMACOS_X_DARWIN  -pipe -Os -isysroot/Applications/Xcode.app/Contents/Developer/Platforms/MacOSX.platform/Developer/SDKs/MacOSX12.3.sdk -arch x86_64 -U_FORTIFY_SOURCE -D_FORTIFY_SOURCE=1        -o objects/evalfunc.o evalfunc.c
1051:info:build /usr/bin/clang -c -I. -Iproto -DHAVE_CONFIG_H -DFEAT_GUI_MACVIM -Wall -Wno-unknown-pragmas -pipe  -I/opt/local/include -isysroot/Applications/Xcode.app/Contents/Developer/Platforms/MacOSX.platform/Developer/SDKs/MacOSX12.3.sdk -DMACOS_X -DMACOS_X_DARWIN  -pipe -Os -isysroot/Applications/Xcode.app/Contents/Developer/Platforms/MacOSX.platform/Developer/SDKs/MacOSX12.3.sdk -arch x86_64 -U_FORTIFY_SOURCE -D_FORTIFY_SOURCE=1        -o objects/evalvars.o evalvars.c
1052:info:build /usr/bin/clang -c -I. -Iproto -DHAVE_CONFIG_H -DFEAT_GUI_MACVIM -Wall -Wno-unknown-pragmas -pipe  -I/opt/local/include -isysroot/Applications/Xcode.app/Contents/Developer/Platforms/MacOSX.platform/Developer/SDKs/MacOSX12.3.sdk -DMACOS_X -DMACOS_X_DARWIN  -pipe -Os -isysroot/Applications/Xcode.app/Contents/Developer/Platforms/MacOSX.platform/Developer/SDKs/MacOSX12.3.sdk -arch x86_64 -U_FORTIFY_SOURCE -D_FORTIFY_SOURCE=1        -o objects/evalwindow.o evalwindow.c
1053:info:build /usr/bin/clang -c -I. -Iproto -DHAVE_CONFIG_H -DFEAT_GUI_MACVIM -Wall -Wno-unknown-pragmas -pipe  -I/opt/local/include -isysroot/Applications/Xcode.app/Contents/Developer/Platforms/MacOSX.platform/Developer/SDKs/MacOSX12.3.sdk -DMACOS_X -DMACOS_X_DARWIN  -pipe -Os -isysroot/Applications/Xcode.app/Contents/Developer/Platforms/MacOSX.platform/Developer/SDKs/MacOSX12.3.sdk -arch x86_64 -U_FORTIFY_SOURCE -D_FORTIFY_SOURCE=1        -o objects/ex_cmds.o ex_cmds.c
1054:info:build /usr/bin/clang -c -I. -Iproto -DHAVE_CONFIG_H -DFEAT_GUI_MACVIM -Wall -Wno-unknown-pragmas -pipe  -I/opt/local/include -isysroot/Applications/Xcode.app/Contents/Developer/Platforms/MacOSX.platform/Developer/SDKs/MacOSX12.3.sdk -DMACOS_X -DMACOS_X_DARWIN  -pipe -Os -isysroot/Applications/Xcode.app/Contents/Developer/Platforms/MacOSX.platform/Developer/SDKs/MacOSX12.3.sdk -arch x86_64 -U_FORTIFY_SOURCE -D_FORTIFY_SOURCE=1        -o objects/ex_cmds2.o ex_cmds2.c
1055:info:build /usr/bin/clang -c -I. -Iproto -DHAVE_CONFIG_H -DFEAT_GUI_MACVIM -Wall -Wno-unknown-pragmas -pipe  -I/opt/local/include -isysroot/Applications/Xcode.app/Contents/Developer/Platforms/MacOSX.platform/Developer/SDKs/MacOSX12.3.sdk -DMACOS_X -DMACOS_X_DARWIN  -pipe -Os -isysroot/Applications/Xcode.app/Contents/Developer/Platforms/MacOSX.platform/Developer/SDKs/MacOSX12.3.sdk -arch x86_64 -U_FORTIFY_SOURCE -D_FORTIFY_SOURCE=1        -o objects/ex_docmd.o ex_docmd.c
1056:info:build /usr/bin/clang -c -I. -Iproto -DHAVE_CONFIG_H -DFEAT_GUI_MACVIM -Wall -Wno-unknown-pragmas -pipe  -I/opt/local/include -isysroot/Applications/Xcode.app/Contents/Developer/Platforms/MacOSX.platform/Developer/SDKs/MacOSX12.3.sdk -DMACOS_X -DMACOS_X_DARWIN  -pipe -Os -isysroot/Applications/Xcode.app/Contents/Developer/Platforms/MacOSX.platform/Developer/SDKs/MacOSX12.3.sdk -arch x86_64 -U_FORTIFY_SOURCE -D_FORTIFY_SOURCE=1        -o objects/ex_eval.o ex_eval.c
1057:info:build /usr/bin/clang -c -I. -Iproto -DHAVE_CONFIG_H -DFEAT_GUI_MACVIM -Wall -Wno-unknown-pragmas -pipe  -I/opt/local/include -isysroot/Applications/Xcode.app/Contents/Developer/Platforms/MacOSX.platform/Developer/SDKs/MacOSX12.3.sdk -DMACOS_X -DMACOS_X_DARWIN  -pipe -Os -isysroot/Applications/Xcode.app/Contents/Developer/Platforms/MacOSX.platform/Developer/SDKs/MacOSX12.3.sdk -arch x86_64 -U_FORTIFY_SOURCE -D_FORTIFY_SOURCE=1        -o objects/ex_getln.o ex_getln.c
1058:info:build /usr/bin/clang -c -I. -Iproto -DHAVE_CONFIG_H -DFEAT_GUI_MACVIM -Wall -Wno-unknown-pragmas -pipe  -I/opt/local/include -isysroot/Applications/Xcode.app/Contents/Developer/Platforms/MacOSX.platform/Developer/SDKs/MacOSX12.3.sdk -DMACOS_X -DMACOS_X_DARWIN  -pipe -Os -isysroot/Applications/Xcode.app/Contents/Developer/Platforms/MacOSX.platform/Developer/SDKs/MacOSX12.3.sdk -arch x86_64 -U_FORTIFY_SOURCE -D_FORTIFY_SOURCE=1        -o objects/fileio.o fileio.c
1059:info:build /usr/bin/clang -c -I. -Iproto -DHAVE_CONFIG_H -DFEAT_GUI_MACVIM -Wall -Wno-unknown-pragmas -pipe  -I/opt/local/include -isysroot/Applications/Xcode.app/Contents/Developer/Platforms/MacOSX.platform/Developer/SDKs/MacOSX12.3.sdk -DMACOS_X -DMACOS_X_DARWIN  -pipe -Os -isysroot/Applications/Xcode.app/Contents/Developer/Platforms/MacOSX.platform/Developer/SDKs/MacOSX12.3.sdk -arch x86_64 -U_FORTIFY_SOURCE -D_FORTIFY_SOURCE=1        -o objects/filepath.o filepath.c
1060:info:build /usr/bin/clang -c -I. -Iproto -DHAVE_CONFIG_H -DFEAT_GUI_MACVIM -Wall -Wno-unknown-pragmas -pipe  -I/opt/local/include -isysroot/Applications/Xcode.app/Contents/Developer/Platforms/MacOSX.platform/Developer/SDKs/MacOSX12.3.sdk -DMACOS_X -DMACOS_X_DARWIN  -pipe -Os -isysroot/Applications/Xcode.app/Contents/Developer/Platforms/MacOSX.platform/Developer/SDKs/MacOSX12.3.sdk -arch x86_64 -U_FORTIFY_SOURCE -D_FORTIFY_SOURCE=1        -o objects/findfile.o findfile.c
1061:info:build /usr/bin/clang -c -I. -Iproto -DHAVE_CONFIG_H -DFEAT_GUI_MACVIM -Wall -Wno-unknown-pragmas -pipe  -I/opt/local/include -isysroot/Applications/Xcode.app/Contents/Developer/Platforms/MacOSX.platform/Developer/SDKs/MacOSX12.3.sdk -DMACOS_X -DMACOS_X_DARWIN  -pipe -Os -isysroot/Applications/Xcode.app/Contents/Developer/Platforms/MacOSX.platform/Developer/SDKs/MacOSX12.3.sdk -arch x86_64 -U_FORTIFY_SOURCE -D_FORTIFY_SOURCE=1        -o objects/fold.o fold.c
1062:info:build /usr/bin/clang -c -I. -Iproto -DHAVE_CONFIG_H -DFEAT_GUI_MACVIM -Wall -Wno-unknown-pragmas -pipe  -I/opt/local/include -isysroot/Applications/Xcode.app/Contents/Developer/Platforms/MacOSX.platform/Developer/SDKs/MacOSX12.3.sdk -DMACOS_X -DMACOS_X_DARWIN  -pipe -Os -isysroot/Applications/Xcode.app/Contents/Developer/Platforms/MacOSX.platform/Developer/SDKs/MacOSX12.3.sdk -arch x86_64 -U_FORTIFY_SOURCE -D_FORTIFY_SOURCE=1        -o objects/getchar.o getchar.c
1063:info:build /usr/bin/clang -c -I. -Iproto -DHAVE_CONFIG_H -DFEAT_GUI_MACVIM -Wall -Wno-unknown-pragmas -pipe  -I/opt/local/include -isysroot/Applications/Xcode.app/Contents/Developer/Platforms/MacOSX.platform/Developer/SDKs/MacOSX12.3.sdk -DMACOS_X -DMACOS_X_DARWIN  -pipe -Os -isysroot/Applications/Xcode.app/Contents/Developer/Platforms/MacOSX.platform/Developer/SDKs/MacOSX12.3.sdk -arch x86_64 -U_FORTIFY_SOURCE -D_FORTIFY_SOURCE=1        -o objects/gui_xim.o gui_xim.c
1064:info:build /usr/bin/clang -c -I. -Iproto -DHAVE_CONFIG_H -DFEAT_GUI_MACVIM -Wall -Wno-unknown-pragmas -pipe  -I/opt/local/include -isysroot/Applications/Xcode.app/Contents/Developer/Platforms/MacOSX.platform/Developer/SDKs/MacOSX12.3.sdk -DMACOS_X -DMACOS_X_DARWIN  -pipe -Os -isysroot/Applications/Xcode.app/Contents/Developer/Platforms/MacOSX.platform/Developer/SDKs/MacOSX12.3.sdk -arch x86_64 -U_FORTIFY_SOURCE -D_FORTIFY_SOURCE=1        -o objects/hardcopy.o hardcopy.c
1065:info:build /usr/bin/clang -c -I. -Iproto -DHAVE_CONFIG_H -DFEAT_GUI_MACVIM -Wall -Wno-unknown-pragmas -pipe  -I/opt/local/include -isysroot/Applications/Xcode.app/Contents/Developer/Platforms/MacOSX.platform/Developer/SDKs/MacOSX12.3.sdk -DMACOS_X -DMACOS_X_DARWIN  -pipe -Os -isysroot/Applications/Xcode.app/Contents/Developer/Platforms/MacOSX.platform/Developer/SDKs/MacOSX12.3.sdk -arch x86_64 -U_FORTIFY_SOURCE -D_FORTIFY_SOURCE=1        -o objects/hashtab.o hashtab.c
1066:info:build /usr/bin/clang -c -I. -Iproto -DHAVE_CONFIG_H -DFEAT_GUI_MACVIM -Wall -Wno-unknown-pragmas -pipe  -I/opt/local/include -isysroot/Applications/Xcode.app/Contents/Developer/Platforms/MacOSX.platform/Developer/SDKs/MacOSX12.3.sdk -DMACOS_X -DMACOS_X_DARWIN  -pipe -Os -isysroot/Applications/Xcode.app/Contents/Developer/Platforms/MacOSX.platform/Developer/SDKs/MacOSX12.3.sdk -arch x86_64 -U_FORTIFY_SOURCE -D_FORTIFY_SOURCE=1        -o objects/help.o help.c
1067:info:build /usr/bin/clang -c -I. -Iproto -DHAVE_CONFIG_H -DFEAT_GUI_MACVIM -Wall -Wno-unknown-pragmas -pipe  -I/opt/local/include -isysroot/Applications/Xcode.app/Contents/Developer/Platforms/MacOSX.platform/Developer/SDKs/MacOSX12.3.sdk -DMACOS_X -DMACOS_X_DARWIN  -pipe -Os -isysroot/Applications/Xcode.app/Contents/Developer/Platforms/MacOSX.platform/Developer/SDKs/MacOSX12.3.sdk -arch x86_64 -U_FORTIFY_SOURCE -D_FORTIFY_SOURCE=1        -o objects/highlight.o highlight.c
1068:info:build /usr/bin/clang -c -I. -Iproto -DHAVE_CONFIG_H -DFEAT_GUI_MACVIM -Wall -Wno-unknown-pragmas -pipe  -I/opt/local/include -isysroot/Applications/Xcode.app/Contents/Developer/Platforms/MacOSX.platform/Developer/SDKs/MacOSX12.3.sdk -DMACOS_X -DMACOS_X_DARWIN  -pipe -Os -isysroot/Applications/Xcode.app/Contents/Developer/Platforms/MacOSX.platform/Developer/SDKs/MacOSX12.3.sdk -arch x86_64 -U_FORTIFY_SOURCE -D_FORTIFY_SOURCE=1        -o objects/if_cscope.o if_cscope.c
1069:info:build /usr/bin/clang -c -I. -Iproto -DHAVE_CONFIG_H -DFEAT_GUI_MACVIM -Wall -Wno-unknown-pragmas -pipe  -I/opt/local/include -isysroot/Applications/Xcode.app/Contents/Developer/Platforms/MacOSX.platform/Developer/SDKs/MacOSX12.3.sdk -DMACOS_X -DMACOS_X_DARWIN  -pipe -Os -isysroot/Applications/Xcode.app/Contents/Developer/Platforms/MacOSX.platform/Developer/SDKs/MacOSX12.3.sdk -arch x86_64 -U_FORTIFY_SOURCE -D_FORTIFY_SOURCE=1        -o objects/if_xcmdsrv.o if_xcmdsrv.c
1070:info:build /usr/bin/clang -c -I. -Iproto -DHAVE_CONFIG_H -DFEAT_GUI_MACVIM -Wall -Wno-unknown-pragmas -pipe  -I/opt/local/include -isysroot/Applications/Xcode.app/Contents/Developer/Platforms/MacOSX.platform/Developer/SDKs/MacOSX12.3.sdk -DMACOS_X -DMACOS_X_DARWIN  -pipe -Os -isysroot/Applications/Xcode.app/Contents/Developer/Platforms/MacOSX.platform/Developer/SDKs/MacOSX12.3.sdk -arch x86_64 -U_FORTIFY_SOURCE -D_FORTIFY_SOURCE=1        -o objects/indent.o indent.c
1071:info:build /usr/bin/clang -c -I. -Iproto -DHAVE_CONFIG_H -DFEAT_GUI_MACVIM -Wall -Wno-unknown-pragmas -pipe  -I/opt/local/include -isysroot/Applications/Xcode.app/Contents/Developer/Platforms/MacOSX.platform/Developer/SDKs/MacOSX12.3.sdk -DMACOS_X -DMACOS_X_DARWIN  -pipe -Os -isysroot/Applications/Xcode.app/Contents/Developer/Platforms/MacOSX.platform/Developer/SDKs/MacOSX12.3.sdk -arch x86_64 -U_FORTIFY_SOURCE -D_FORTIFY_SOURCE=1        -o objects/insexpand.o insexpand.c
1072:info:build /usr/bin/clang -c -I. -Iproto -DHAVE_CONFIG_H -DFEAT_GUI_MACVIM -Wall -Wno-unknown-pragmas -pipe  -I/opt/local/include -isysroot/Applications/Xcode.app/Contents/Developer/Platforms/MacOSX.platform/Developer/SDKs/MacOSX12.3.sdk -DMACOS_X -DMACOS_X_DARWIN  -pipe -Os -isysroot/Applications/Xcode.app/Contents/Developer/Platforms/MacOSX.platform/Developer/SDKs/MacOSX12.3.sdk -arch x86_64 -U_FORTIFY_SOURCE -D_FORTIFY_SOURCE=1        -o objects/list.o list.c
1073:info:build /usr/bin/clang -c -I. -Iproto -DHAVE_CONFIG_H -DFEAT_GUI_MACVIM -Wall -Wno-unknown-pragmas -pipe  -I/opt/local/include -isysroot/Applications/Xcode.app/Contents/Developer/Platforms/MacOSX.platform/Developer/SDKs/MacOSX12.3.sdk -DMACOS_X -DMACOS_X_DARWIN  -pipe -Os -isysroot/Applications/Xcode.app/Contents/Developer/Platforms/MacOSX.platform/Developer/SDKs/MacOSX12.3.sdk -arch x86_64 -U_FORTIFY_SOURCE -D_FORTIFY_SOURCE=1        -o objects/locale.o locale.c
1074:info:build /usr/bin/clang -c -I. -Iproto -DHAVE_CONFIG_H -DFEAT_GUI_MACVIM -Wall -Wno-unknown-pragmas -pipe  -I/opt/local/include -isysroot/Applications/Xcode.app/Contents/Developer/Platforms/MacOSX.platform/Developer/SDKs/MacOSX12.3.sdk -DMACOS_X -DMACOS_X_DARWIN  -pipe -Os -isysroot/Applications/Xcode.app/Contents/Developer/Platforms/MacOSX.platform/Developer/SDKs/MacOSX12.3.sdk -arch x86_64 -U_FORTIFY_SOURCE -D_FORTIFY_SOURCE=1        -o objects/map.o map.c
1075:info:build /usr/bin/clang -c -I. -Iproto -DHAVE_CONFIG_H -DFEAT_GUI_MACVIM -Wall -Wno-unknown-pragmas -pipe  -I/opt/local/include -isysroot/Applications/Xcode.app/Contents/Developer/Platforms/MacOSX.platform/Developer/SDKs/MacOSX12.3.sdk -DMACOS_X -DMACOS_X_DARWIN  -pipe -Os -isysroot/Applications/Xcode.app/Contents/Developer/Platforms/MacOSX.platform/Developer/SDKs/MacOSX12.3.sdk -arch x86_64 -U_FORTIFY_SOURCE -D_FORTIFY_SOURCE=1        -o objects/mark.o mark.c
1076:info:build /usr/bin/clang -c -I. -Iproto -DHAVE_CONFIG_H -DFEAT_GUI_MACVIM -Wall -Wno-unknown-pragmas -pipe  -I/opt/local/include -isysroot/Applications/Xcode.app/Contents/Developer/Platforms/MacOSX.platform/Developer/SDKs/MacOSX12.3.sdk -DMACOS_X -DMACOS_X_DARWIN  -pipe -Os -isysroot/Applications/Xcode.app/Contents/Developer/Platforms/MacOSX.platform/Developer/SDKs/MacOSX12.3.sdk -arch x86_64 -U_FORTIFY_SOURCE -D_FORTIFY_SOURCE=1        -o objects/match.o match.c
1077:info:build /usr/bin/clang -c -I. -Iproto -DHAVE_CONFIG_H -DFEAT_GUI_MACVIM -Wall -Wno-unknown-pragmas -pipe  -I/opt/local/include -isysroot/Applications/Xcode.app/Contents/Developer/Platforms/MacOSX.platform/Developer/SDKs/MacOSX12.3.sdk -DMACOS_X -DMACOS_X_DARWIN  -pipe -Os -isysroot/Applications/Xcode.app/Contents/Developer/Platforms/MacOSX.platform/Developer/SDKs/MacOSX12.3.sdk -arch x86_64 -U_FORTIFY_SOURCE -D_FORTIFY_SOURCE=1        -o objects/mbyte.o mbyte.c
1078:info:build /usr/bin/clang -c -I. -Iproto -DHAVE_CONFIG_H -DFEAT_GUI_MACVIM -Wall -Wno-unknown-pragmas -pipe  -I/opt/local/include -isysroot/Applications/Xcode.app/Contents/Developer/Platforms/MacOSX.platform/Developer/SDKs/MacOSX12.3.sdk -DMACOS_X -DMACOS_X_DARWIN  -pipe -Os -isysroot/Applications/Xcode.app/Contents/Developer/Platforms/MacOSX.platform/Developer/SDKs/MacOSX12.3.sdk -arch x86_64 -U_FORTIFY_SOURCE -D_FORTIFY_SOURCE=1        -o objects/memline.o memline.c
1079:info:build /usr/bin/clang -c -I. -Iproto -DHAVE_CONFIG_H -DFEAT_GUI_MACVIM -Wall -Wno-unknown-pragmas -pipe  -I/opt/local/include -isysroot/Applications/Xcode.app/Contents/Developer/Platforms/MacOSX.platform/Developer/SDKs/MacOSX12.3.sdk -DMACOS_X -DMACOS_X_DARWIN  -pipe -Os -isysroot/Applications/Xcode.app/Contents/Developer/Platforms/MacOSX.platform/Developer/SDKs/MacOSX12.3.sdk -arch x86_64 -U_FORTIFY_SOURCE -D_FORTIFY_SOURCE=1        -o objects/menu.o menu.c
1080:info:build /usr/bin/clang -c -I. -Iproto -DHAVE_CONFIG_H -DFEAT_GUI_MACVIM -Wall -Wno-unknown-pragmas -pipe  -I/opt/local/include -isysroot/Applications/Xcode.app/Contents/Developer/Platforms/MacOSX.platform/Developer/SDKs/MacOSX12.3.sdk -DMACOS_X -DMACOS_X_DARWIN  -pipe -Os -isysroot/Applications/Xcode.app/Contents/Developer/Platforms/MacOSX.platform/Developer/SDKs/MacOSX12.3.sdk -arch x86_64 -U_FORTIFY_SOURCE -D_FORTIFY_SOURCE=1        -o objects/misc1.o misc1.c
1081:info:build /usr/bin/clang -c -I. -Iproto -DHAVE_CONFIG_H -DFEAT_GUI_MACVIM -Wall -Wno-unknown-pragmas -pipe  -I/opt/local/include -isysroot/Applications/Xcode.app/Contents/Developer/Platforms/MacOSX.platform/Developer/SDKs/MacOSX12.3.sdk -DMACOS_X -DMACOS_X_DARWIN  -pipe -Os -isysroot/Applications/Xcode.app/Contents/Developer/Platforms/MacOSX.platform/Developer/SDKs/MacOSX12.3.sdk -arch x86_64 -U_FORTIFY_SOURCE -D_FORTIFY_SOURCE=1        -o objects/misc2.o misc2.c
1082:info:build /usr/bin/clang -c -I. -Iproto -DHAVE_CONFIG_H -DFEAT_GUI_MACVIM -Wall -Wno-unknown-pragmas -pipe  -I/opt/local/include -isysroot/Applications/Xcode.app/Contents/Developer/Platforms/MacOSX.platform/Developer/SDKs/MacOSX12.3.sdk -DMACOS_X -DMACOS_X_DARWIN  -pipe -Os -isysroot/Applications/Xcode.app/Contents/Developer/Platforms/MacOSX.platform/Developer/SDKs/MacOSX12.3.sdk -arch x86_64 -U_FORTIFY_SOURCE -D_FORTIFY_SOURCE=1        -o objects/mouse.o mouse.c
1083:info:build /usr/bin/clang -c -I. -Iproto -DHAVE_CONFIG_H -DFEAT_GUI_MACVIM -Wall -Wno-unknown-pragmas -pipe  -I/opt/local/include -isysroot/Applications/Xcode.app/Contents/Developer/Platforms/MacOSX.platform/Developer/SDKs/MacOSX12.3.sdk -DMACOS_X -DMACOS_X_DARWIN  -pipe -Os -isysroot/Applications/Xcode.app/Contents/Developer/Platforms/MacOSX.platform/Developer/SDKs/MacOSX12.3.sdk -arch x86_64 -U_FORTIFY_SOURCE -D_FORTIFY_SOURCE=1        -o objects/move.o move.c
1084:info:build /usr/bin/clang -c -I. -Iproto -DHAVE_CONFIG_H -DFEAT_GUI_MACVIM -Wall -Wno-unknown-pragmas -pipe  -I/opt/local/include -isysroot/Applications/Xcode.app/Contents/Developer/Platforms/MacOSX.platform/Developer/SDKs/MacOSX12.3.sdk -DMACOS_X -DMACOS_X_DARWIN  -pipe -Os -isysroot/Applications/Xcode.app/Contents/Developer/Platforms/MacOSX.platform/Developer/SDKs/MacOSX12.3.sdk -arch x86_64 -U_FORTIFY_SOURCE -D_FORTIFY_SOURCE=1        -o objects/normal.o normal.c
1085:info:build /usr/bin/clang -c -I. -Iproto -DHAVE_CONFIG_H -DFEAT_GUI_MACVIM -Wall -Wno-unknown-pragmas -pipe  -I/opt/local/include -isysroot/Applications/Xcode.app/Contents/Developer/Platforms/MacOSX.platform/Developer/SDKs/MacOSX12.3.sdk -DMACOS_X -DMACOS_X_DARWIN  -pipe -Os -isysroot/Applications/Xcode.app/Contents/Developer/Platforms/MacOSX.platform/Developer/SDKs/MacOSX12.3.sdk -arch x86_64 -U_FORTIFY_SOURCE -D_FORTIFY_SOURCE=1        -o objects/ops.o ops.c
1086:info:build /usr/bin/clang -c -I.       -Iproto -DHAVE_CONFIG_H -DFEAT_GUI_MACVIM -Wall -Wno-unknown-pragmas -pipe  -I/opt/local/include -isysroot/Applications/Xcode.app/Contents/Developer/Platforms/MacOSX.platform/Developer/SDKs/MacOSX12.3.sdk -DMACOS_X -DMACOS_X_DARWIN  -pipe -Os -isysroot/Applications/Xcode.app/Contents/Developer/Platforms/MacOSX.platform/Developer/SDKs/MacOSX12.3.sdk -arch x86_64 -U_FORTIFY_SOURCE -D_FORTIFY_SOURCE=1        -o objects/option.o option.c
1087:info:build /usr/bin/clang -c -I.       -Iproto -DHAVE_CONFIG_H -DFEAT_GUI_MACVIM -Wall -Wno-unknown-pragmas -pipe  -I/opt/local/include -isysroot/Applications/Xcode.app/Contents/Developer/Platforms/MacOSX.platform/Developer/SDKs/MacOSX12.3.sdk -DMACOS_X -DMACOS_X_DARWIN  -pipe -Os -isysroot/Applications/Xcode.app/Contents/Developer/Platforms/MacOSX.platform/Developer/SDKs/MacOSX12.3.sdk -arch x86_64 -U_FORTIFY_SOURCE -D_FORTIFY_SOURCE=1        -o objects/optionstr.o optionstr.c
1088:info:build /usr/bin/clang -c -I. -Iproto -DHAVE_CONFIG_H -DFEAT_GUI_MACVIM -Wall -Wno-unknown-pragmas -pipe  -I/opt/local/include -isysroot/Applications/Xcode.app/Contents/Developer/Platforms/MacOSX.platform/Developer/SDKs/MacOSX12.3.sdk -DMACOS_X -DMACOS_X_DARWIN  -pipe -Os -isysroot/Applications/Xcode.app/Contents/Developer/Platforms/MacOSX.platform/Developer/SDKs/MacOSX12.3.sdk -arch x86_64 -U_FORTIFY_SOURCE -D_FORTIFY_SOURCE=1        -o objects/os_unix.o os_unix.c
1089:info:build /usr/bin/clang -c -I. -Iproto -DHAVE_CONFIG_H -DFEAT_GUI_MACVIM -Wall -Wno-unknown-pragmas -pipe  -I/opt/local/include -isysroot/Applications/Xcode.app/Contents/Developer/Platforms/MacOSX.platform/Developer/SDKs/MacOSX12.3.sdk -DMACOS_X -DMACOS_X_DARWIN  -pipe -Os -isysroot/Applications/Xcode.app/Contents/Developer/Platforms/MacOSX.platform/Developer/SDKs/MacOSX12.3.sdk -arch x86_64 -U_FORTIFY_SOURCE -D_FORTIFY_SOURCE=1        -o objects/pathdef.o auto/pathdef.c
1090:info:build /usr/bin/clang -c -I. -Iproto -DHAVE_CONFIG_H -DFEAT_GUI_MACVIM -Wall -Wno-unknown-pragmas -pipe  -I/opt/local/include -isysroot/Applications/Xcode.app/Contents/Developer/Platforms/MacOSX.platform/Developer/SDKs/MacOSX12.3.sdk -DMACOS_X -DMACOS_X_DARWIN  -pipe -Os -isysroot/Applications/Xcode.app/Contents/Developer/Platforms/MacOSX.platform/Developer/SDKs/MacOSX12.3.sdk -arch x86_64 -U_FORTIFY_SOURCE -D_FORTIFY_SOURCE=1        -o objects/popupmenu.o popupmenu.c
1091:info:build /usr/bin/clang -c -I. -Iproto -DHAVE_CONFIG_H -DFEAT_GUI_MACVIM -Wall -Wno-unknown-pragmas -pipe  -I/opt/local/include -isysroot/Applications/Xcode.app/Contents/Developer/Platforms/MacOSX.platform/Developer/SDKs/MacOSX12.3.sdk -DMACOS_X -DMACOS_X_DARWIN  -pipe -Os -isysroot/Applications/Xcode.app/Contents/Developer/Platforms/MacOSX.platform/Developer/SDKs/MacOSX12.3.sdk -arch x86_64 -U_FORTIFY_SOURCE -D_FORTIFY_SOURCE=1        -o objects/popupwin.o popupwin.c
1092:info:build /usr/bin/clang -c -I. -Iproto -DHAVE_CONFIG_H -DFEAT_GUI_MACVIM -Wall -Wno-unknown-pragmas -pipe  -I/opt/local/include -isysroot/Applications/Xcode.app/Contents/Developer/Platforms/MacOSX.platform/Developer/SDKs/MacOSX12.3.sdk -DMACOS_X -DMACOS_X_DARWIN  -pipe -Os -isysroot/Applications/Xcode.app/Contents/Developer/Platforms/MacOSX.platform/Developer/SDKs/MacOSX12.3.sdk -arch x86_64 -U_FORTIFY_SOURCE -D_FORTIFY_SOURCE=1        -o objects/profiler.o profiler.c
1093:info:build /usr/bin/clang -c -I. -Iproto -DHAVE_CONFIG_H -DFEAT_GUI_MACVIM -Wall -Wno-unknown-pragmas -pipe  -I/opt/local/include -isysroot/Applications/Xcode.app/Contents/Developer/Platforms/MacOSX.platform/Developer/SDKs/MacOSX12.3.sdk -DMACOS_X -DMACOS_X_DARWIN  -pipe -Os -isysroot/Applications/Xcode.app/Contents/Developer/Platforms/MacOSX.platform/Developer/SDKs/MacOSX12.3.sdk -arch x86_64 -U_FORTIFY_SOURCE -D_FORTIFY_SOURCE=1        -o objects/pty.o pty.c
1094:info:build /usr/bin/clang -c -I. -Iproto -DHAVE_CONFIG_H -DFEAT_GUI_MACVIM -Wall -Wno-unknown-pragmas -pipe  -I/opt/local/include -isysroot/Applications/Xcode.app/Contents/Developer/Platforms/MacOSX.platform/Developer/SDKs/MacOSX12.3.sdk -DMACOS_X -DMACOS_X_DARWIN  -pipe -Os -isysroot/Applications/Xcode.app/Contents/Developer/Platforms/MacOSX.platform/Developer/SDKs/MacOSX12.3.sdk -arch x86_64 -U_FORTIFY_SOURCE -D_FORTIFY_SOURCE=1        -o objects/quickfix.o quickfix.c
1095:info:build /usr/bin/clang -c -I. -Iproto -DHAVE_CONFIG_H -DFEAT_GUI_MACVIM -Wall -Wno-unknown-pragmas -pipe  -I/opt/local/include -isysroot/Applications/Xcode.app/Contents/Developer/Platforms/MacOSX.platform/Developer/SDKs/MacOSX12.3.sdk -DMACOS_X -DMACOS_X_DARWIN  -pipe -Os -isysroot/Applications/Xcode.app/Contents/Developer/Platforms/MacOSX.platform/Developer/SDKs/MacOSX12.3.sdk -arch x86_64 -U_FORTIFY_SOURCE -D_FORTIFY_SOURCE=1        -o objects/regexp.o regexp.c
1096:info:build /usr/bin/clang -c -I. -Iproto -DHAVE_CONFIG_H -DFEAT_GUI_MACVIM -Wall -Wno-unknown-pragmas -pipe  -I/opt/local/include -isysroot/Applications/Xcode.app/Contents/Developer/Platforms/MacOSX.platform/Developer/SDKs/MacOSX12.3.sdk -DMACOS_X -DMACOS_X_DARWIN  -pipe -Os -isysroot/Applications/Xcode.app/Contents/Developer/Platforms/MacOSX.platform/Developer/SDKs/MacOSX12.3.sdk -arch x86_64 -U_FORTIFY_SOURCE -D_FORTIFY_SOURCE=1        -o objects/register.o register.c
1097:info:build /usr/bin/clang -c -I. -Iproto -DHAVE_CONFIG_H -DFEAT_GUI_MACVIM -Wall -Wno-unknown-pragmas -pipe  -I/opt/local/include -isysroot/Applications/Xcode.app/Contents/Developer/Platforms/MacOSX.platform/Developer/SDKs/MacOSX12.3.sdk -DMACOS_X -DMACOS_X_DARWIN  -pipe -Os -isysroot/Applications/Xcode.app/Contents/Developer/Platforms/MacOSX.platform/Developer/SDKs/MacOSX12.3.sdk -arch x86_64 -U_FORTIFY_SOURCE -D_FORTIFY_SOURCE=1        -o objects/screen.o screen.c
1098:info:build /usr/bin/clang -c -I. -Iproto -DHAVE_CONFIG_H -DFEAT_GUI_MACVIM -Wall -Wno-unknown-pragmas -pipe  -I/opt/local/include -isysroot/Applications/Xcode.app/Contents/Developer/Platforms/MacOSX.platform/Developer/SDKs/MacOSX12.3.sdk -DMACOS_X -DMACOS_X_DARWIN  -pipe -Os -isysroot/Applications/Xcode.app/Contents/Developer/Platforms/MacOSX.platform/Developer/SDKs/MacOSX12.3.sdk -arch x86_64 -U_FORTIFY_SOURCE -D_FORTIFY_SOURCE=1        -o objects/scriptfile.o scriptfile.c
1099:info:build /usr/bin/clang -c -I. -Iproto -DHAVE_CONFIG_H -DFEAT_GUI_MACVIM -Wall -Wno-unknown-pragmas -pipe  -I/opt/local/include -isysroot/Applications/Xcode.app/Contents/Developer/Platforms/MacOSX.platform/Developer/SDKs/MacOSX12.3.sdk -DMACOS_X -DMACOS_X_DARWIN  -pipe -Os -isysroot/Applications/Xcode.app/Contents/Developer/Platforms/MacOSX.platform/Developer/SDKs/MacOSX12.3.sdk -arch x86_64 -U_FORTIFY_SOURCE -D_FORTIFY_SOURCE=1        -o objects/search.o search.c
1100:info:build /usr/bin/clang -c -I. -Iproto -DHAVE_CONFIG_H -DFEAT_GUI_MACVIM -Wall -Wno-unknown-pragmas -pipe  -I/opt/local/include -isysroot/Applications/Xcode.app/Contents/Developer/Platforms/MacOSX.platform/Developer/SDKs/MacOSX12.3.sdk -DMACOS_X -DMACOS_X_DARWIN  -pipe -Os -isysroot/Applications/Xcode.app/Contents/Developer/Platforms/MacOSX.platform/Developer/SDKs/MacOSX12.3.sdk -arch x86_64 -U_FORTIFY_SOURCE -D_FORTIFY_SOURCE=1        -o objects/session.o session.c
1101:info:build /usr/bin/clang -c -I. -Iproto -DHAVE_CONFIG_H -DFEAT_GUI_MACVIM -Wall -Wno-unknown-pragmas -pipe  -I/opt/local/include -isysroot/Applications/Xcode.app/Contents/Developer/Platforms/MacOSX.platform/Developer/SDKs/MacOSX12.3.sdk -DMACOS_X -DMACOS_X_DARWIN  -pipe -Os -isysroot/Applications/Xcode.app/Contents/Developer/Platforms/MacOSX.platform/Developer/SDKs/MacOSX12.3.sdk -arch x86_64 -U_FORTIFY_SOURCE -D_FORTIFY_SOURCE=1        -o objects/sha256.o sha256.c
1102:info:build /usr/bin/clang -c -I. -Iproto -DHAVE_CONFIG_H -DFEAT_GUI_MACVIM -Wall -Wno-unknown-pragmas -pipe  -I/opt/local/include -isysroot/Applications/Xcode.app/Contents/Developer/Platforms/MacOSX.platform/Developer/SDKs/MacOSX12.3.sdk -DMACOS_X -DMACOS_X_DARWIN  -pipe -Os -isysroot/Applications/Xcode.app/Contents/Developer/Platforms/MacOSX.platform/Developer/SDKs/MacOSX12.3.sdk -arch x86_64 -U_FORTIFY_SOURCE -D_FORTIFY_SOURCE=1        -o objects/sign.o sign.c
1103:info:build /usr/bin/clang -c -I. -Iproto -DHAVE_CONFIG_H -DFEAT_GUI_MACVIM -Wall -Wno-unknown-pragmas -pipe  -I/opt/local/include -isysroot/Applications/Xcode.app/Contents/Developer/Platforms/MacOSX.platform/Developer/SDKs/MacOSX12.3.sdk -DMACOS_X -DMACOS_X_DARWIN  -pipe -Os -isysroot/Applications/Xcode.app/Contents/Developer/Platforms/MacOSX.platform/Developer/SDKs/MacOSX12.3.sdk -arch x86_64 -U_FORTIFY_SOURCE -D_FORTIFY_SOURCE=1        -o objects/sound.o sound.c
1104:info:build /usr/bin/clang -c -I. -Iproto -DHAVE_CONFIG_H -DFEAT_GUI_MACVIM -Wall -Wno-unknown-pragmas -pipe  -I/opt/local/include -isysroot/Applications/Xcode.app/Contents/Developer/Platforms/MacOSX.platform/Developer/SDKs/MacOSX12.3.sdk -DMACOS_X -DMACOS_X_DARWIN  -pipe -Os -isysroot/Applications/Xcode.app/Contents/Developer/Platforms/MacOSX.platform/Developer/SDKs/MacOSX12.3.sdk -arch x86_64 -U_FORTIFY_SOURCE -D_FORTIFY_SOURCE=1        -o objects/spell.o spell.c
1105:info:build /usr/bin/clang -c -I. -Iproto -DHAVE_CONFIG_H -DFEAT_GUI_MACVIM -Wall -Wno-unknown-pragmas -pipe  -I/opt/local/include -isysroot/Applications/Xcode.app/Contents/Developer/Platforms/MacOSX.platform/Developer/SDKs/MacOSX12.3.sdk -DMACOS_X -DMACOS_X_DARWIN  -pipe -Os -isysroot/Applications/Xcode.app/Contents/Developer/Platforms/MacOSX.platform/Developer/SDKs/MacOSX12.3.sdk -arch x86_64 -U_FORTIFY_SOURCE -D_FORTIFY_SOURCE=1        -o objects/spellfile.o spellfile.c
1106:info:build /usr/bin/clang -c -I. -Iproto -DHAVE_CONFIG_H -DFEAT_GUI_MACVIM -Wall -Wno-unknown-pragmas -pipe  -I/opt/local/include -isysroot/Applications/Xcode.app/Contents/Developer/Platforms/MacOSX.platform/Developer/SDKs/MacOSX12.3.sdk -DMACOS_X -DMACOS_X_DARWIN  -pipe -Os -isysroot/Applications/Xcode.app/Contents/Developer/Platforms/MacOSX.platform/Developer/SDKs/MacOSX12.3.sdk -arch x86_64 -U_FORTIFY_SOURCE -D_FORTIFY_SOURCE=1        -o objects/spellsuggest.o spellsuggest.c
1107:info:build /usr/bin/clang -c -I. -Iproto -DHAVE_CONFIG_H -DFEAT_GUI_MACVIM -Wall -Wno-unknown-pragmas -pipe  -I/opt/local/include -isysroot/Applications/Xcode.app/Contents/Developer/Platforms/MacOSX.platform/Developer/SDKs/MacOSX12.3.sdk -DMACOS_X -DMACOS_X_DARWIN  -pipe -Os -isysroot/Applications/Xcode.app/Contents/Developer/Platforms/MacOSX.platform/Developer/SDKs/MacOSX12.3.sdk -arch x86_64 -U_FORTIFY_SOURCE -D_FORTIFY_SOURCE=1        -o objects/syntax.o syntax.c
1108:info:build /usr/bin/clang -c -I. -Iproto -DHAVE_CONFIG_H -DFEAT_GUI_MACVIM -Wall -Wno-unknown-pragmas -pipe  -I/opt/local/include -isysroot/Applications/Xcode.app/Contents/Developer/Platforms/MacOSX.platform/Developer/SDKs/MacOSX12.3.sdk -DMACOS_X -DMACOS_X_DARWIN  -pipe -Os -isysroot/Applications/Xcode.app/Contents/Developer/Platforms/MacOSX.platform/Developer/SDKs/MacOSX12.3.sdk -arch x86_64 -U_FORTIFY_SOURCE -D_FORTIFY_SOURCE=1        -o objects/tag.o tag.c
1109:info:build spellfile.c:6577:12: warning: variable 'x' set but not used [-Wunused-but-set-variable]
1110:info:build     size_t      x = 1;  // collect return value of fwrite()
1111:info:build                 ^
1112:info:build /usr/bin/clang -c -I. -Iproto -DHAVE_CONFIG_H -DFEAT_GUI_MACVIM -Wall -Wno-unknown-pragmas -pipe  -I/opt/local/include -isysroot/Applications/Xcode.app/Contents/Developer/Platforms/MacOSX.platform/Developer/SDKs/MacOSX12.3.sdk -DMACOS_X -DMACOS_X_DARWIN  -pipe -Os -isysroot/Applications/Xcode.app/Contents/Developer/Platforms/MacOSX.platform/Developer/SDKs/MacOSX12.3.sdk -arch x86_64 -U_FORTIFY_SOURCE -D_FORTIFY_SOURCE=1        -o objects/term.o term.c
1113:info:build /usr/bin/clang -c -I. -Iproto -DHAVE_CONFIG_H -DFEAT_GUI_MACVIM -Wall -Wno-unknown-pragmas -pipe  -I/opt/local/include -isysroot/Applications/Xcode.app/Contents/Developer/Platforms/MacOSX.platform/Developer/SDKs/MacOSX12.3.sdk -DMACOS_X -DMACOS_X_DARWIN  -pipe -Os -isysroot/Applications/Xcode.app/Contents/Developer/Platforms/MacOSX.platform/Developer/SDKs/MacOSX12.3.sdk -arch x86_64 -U_FORTIFY_SOURCE -D_FORTIFY_SOURCE=1        -o objects/terminal.o terminal.c
1114:info:build /usr/bin/clang -c -I. -Iproto -DHAVE_CONFIG_H -DFEAT_GUI_MACVIM -Wall -Wno-unknown-pragmas -pipe  -I/opt/local/include -isysroot/Applications/Xcode.app/Contents/Developer/Platforms/MacOSX.platform/Developer/SDKs/MacOSX12.3.sdk -DMACOS_X -DMACOS_X_DARWIN  -pipe -Os -isysroot/Applications/Xcode.app/Contents/Developer/Platforms/MacOSX.platform/Developer/SDKs/MacOSX12.3.sdk -arch x86_64 -U_FORTIFY_SOURCE -D_FORTIFY_SOURCE=1        -o objects/testing.o testing.c
1115:info:build /usr/bin/clang -c -I. -Iproto -DHAVE_CONFIG_H -DFEAT_GUI_MACVIM -Wall -Wno-unknown-pragmas -pipe  -I/opt/local/include -isysroot/Applications/Xcode.app/Contents/Developer/Platforms/MacOSX.platform/Developer/SDKs/MacOSX12.3.sdk -DMACOS_X -DMACOS_X_DARWIN  -pipe -Os -isysroot/Applications/Xcode.app/Contents/Developer/Platforms/MacOSX.platform/Developer/SDKs/MacOSX12.3.sdk -arch x86_64 -U_FORTIFY_SOURCE -D_FORTIFY_SOURCE=1        -o objects/textformat.o textformat.c
1116:info:build /usr/bin/clang -c -I. -Iproto -DHAVE_CONFIG_H -DFEAT_GUI_MACVIM -Wall -Wno-unknown-pragmas -pipe  -I/opt/local/include -isysroot/Applications/Xcode.app/Contents/Developer/Platforms/MacOSX.platform/Developer/SDKs/MacOSX12.3.sdk -DMACOS_X -DMACOS_X_DARWIN  -pipe -Os -isysroot/Applications/Xcode.app/Contents/Developer/Platforms/MacOSX.platform/Developer/SDKs/MacOSX12.3.sdk -arch x86_64 -U_FORTIFY_SOURCE -D_FORTIFY_SOURCE=1        -o objects/textobject.o textobject.c
1117:info:build /usr/bin/clang -c -I. -Iproto -DHAVE_CONFIG_H -DFEAT_GUI_MACVIM -Wall -Wno-unknown-pragmas -pipe  -I/opt/local/include -isysroot/Applications/Xcode.app/Contents/Developer/Platforms/MacOSX.platform/Developer/SDKs/MacOSX12.3.sdk -DMACOS_X -DMACOS_X_DARWIN  -pipe -Os -isysroot/Applications/Xcode.app/Contents/Developer/Platforms/MacOSX.platform/Developer/SDKs/MacOSX12.3.sdk -arch x86_64 -U_FORTIFY_SOURCE -D_FORTIFY_SOURCE=1        -o objects/textprop.o textprop.c
1118:info:build /usr/bin/clang -c -I. -Iproto -DHAVE_CONFIG_H -DFEAT_GUI_MACVIM -Wall -Wno-unknown-pragmas -pipe  -I/opt/local/include -isysroot/Applications/Xcode.app/Contents/Developer/Platforms/MacOSX.platform/Developer/SDKs/MacOSX12.3.sdk -DMACOS_X -DMACOS_X_DARWIN  -pipe -Os -isysroot/Applications/Xcode.app/Contents/Developer/Platforms/MacOSX.platform/Developer/SDKs/MacOSX12.3.sdk -arch x86_64 -U_FORTIFY_SOURCE -D_FORTIFY_SOURCE=1        -o objects/time.o time.c
1119:info:build /usr/bin/clang -c -I. -Iproto -DHAVE_CONFIG_H -DFEAT_GUI_MACVIM -Wall -Wno-unknown-pragmas -pipe  -I/opt/local/include -isysroot/Applications/Xcode.app/Contents/Developer/Platforms/MacOSX.platform/Developer/SDKs/MacOSX12.3.sdk -DMACOS_X -DMACOS_X_DARWIN  -pipe -Os -isysroot/Applications/Xcode.app/Contents/Developer/Platforms/MacOSX.platform/Developer/SDKs/MacOSX12.3.sdk -arch x86_64 -U_FORTIFY_SOURCE -D_FORTIFY_SOURCE=1        -o objects/typval.o typval.c
1120:info:build 1 warning generated.
1121:info:build /usr/bin/clang -c -I. -Iproto -DHAVE_CONFIG_H -DFEAT_GUI_MACVIM -Wall -Wno-unknown-pragmas -pipe  -I/opt/local/include -isysroot/Applications/Xcode.app/Contents/Developer/Platforms/MacOSX.platform/Developer/SDKs/MacOSX12.3.sdk -DMACOS_X -DMACOS_X_DARWIN  -pipe -Os -isysroot/Applications/Xcode.app/Contents/Developer/Platforms/MacOSX.platform/Developer/SDKs/MacOSX12.3.sdk -arch x86_64 -U_FORTIFY_SOURCE -D_FORTIFY_SOURCE=1        -o objects/ui.o ui.c
1122:info:build /usr/bin/clang -c -I. -Iproto -DHAVE_CONFIG_H -DFEAT_GUI_MACVIM -Wall -Wno-unknown-pragmas -pipe  -I/opt/local/include -isysroot/Applications/Xcode.app/Contents/Developer/Platforms/MacOSX.platform/Developer/SDKs/MacOSX12.3.sdk -DMACOS_X -DMACOS_X_DARWIN  -pipe -Os -isysroot/Applications/Xcode.app/Contents/Developer/Platforms/MacOSX.platform/Developer/SDKs/MacOSX12.3.sdk -arch x86_64 -U_FORTIFY_SOURCE -D_FORTIFY_SOURCE=1        -o objects/undo.o undo.c
1123:info:build /usr/bin/clang -c -I. -Iproto -DHAVE_CONFIG_H -DFEAT_GUI_MACVIM -Wall -Wno-unknown-pragmas -pipe  -I/opt/local/include -isysroot/Applications/Xcode.app/Contents/Developer/Platforms/MacOSX.platform/Developer/SDKs/MacOSX12.3.sdk -DMACOS_X -DMACOS_X_DARWIN  -pipe -Os -isysroot/Applications/Xcode.app/Contents/Developer/Platforms/MacOSX.platform/Developer/SDKs/MacOSX12.3.sdk -arch x86_64 -U_FORTIFY_SOURCE -D_FORTIFY_SOURCE=1        -o objects/usercmd.o usercmd.c
1124:info:build /usr/bin/clang -c -I. -Iproto -DHAVE_CONFIG_H -DFEAT_GUI_MACVIM -Wall -Wno-unknown-pragmas -pipe  -I/opt/local/include -isysroot/Applications/Xcode.app/Contents/Developer/Platforms/MacOSX.platform/Developer/SDKs/MacOSX12.3.sdk -DMACOS_X -DMACOS_X_DARWIN  -pipe -Os -isysroot/Applications/Xcode.app/Contents/Developer/Platforms/MacOSX.platform/Developer/SDKs/MacOSX12.3.sdk -arch x86_64 -U_FORTIFY_SOURCE -D_FORTIFY_SOURCE=1        -o objects/userfunc.o userfunc.c
1125:info:build /usr/bin/clang -c -I. -Iproto -DHAVE_CONFIG_H -DFEAT_GUI_MACVIM -Wall -Wno-unknown-pragmas -pipe  -I/opt/local/include -isysroot/Applications/Xcode.app/Contents/Developer/Platforms/MacOSX.platform/Developer/SDKs/MacOSX12.3.sdk -DMACOS_X -DMACOS_X_DARWIN  -pipe -Os -isysroot/Applications/Xcode.app/Contents/Developer/Platforms/MacOSX.platform/Developer/SDKs/MacOSX12.3.sdk -arch x86_64 -U_FORTIFY_SOURCE -D_FORTIFY_SOURCE=1        -o objects/vim9compile.o vim9compile.c
1126:info:build /usr/bin/clang -c -I. -Iproto -DHAVE_CONFIG_H -DFEAT_GUI_MACVIM -Wall -Wno-unknown-pragmas -pipe  -I/opt/local/include -isysroot/Applications/Xcode.app/Contents/Developer/Platforms/MacOSX.platform/Developer/SDKs/MacOSX12.3.sdk -DMACOS_X -DMACOS_X_DARWIN  -pipe -Os -isysroot/Applications/Xcode.app/Contents/Developer/Platforms/MacOSX.platform/Developer/SDKs/MacOSX12.3.sdk -arch x86_64 -U_FORTIFY_SOURCE -D_FORTIFY_SOURCE=1        -o objects/vim9execute.o vim9execute.c
1127:info:build /usr/bin/clang -c -I. -Iproto -DHAVE_CONFIG_H -DFEAT_GUI_MACVIM -Wall -Wno-unknown-pragmas -pipe  -I/opt/local/include -isysroot/Applications/Xcode.app/Contents/Developer/Platforms/MacOSX.platform/Developer/SDKs/MacOSX12.3.sdk -DMACOS_X -DMACOS_X_DARWIN  -pipe -Os -isysroot/Applications/Xcode.app/Contents/Developer/Platforms/MacOSX.platform/Developer/SDKs/MacOSX12.3.sdk -arch x86_64 -U_FORTIFY_SOURCE -D_FORTIFY_SOURCE=1        -o objects/vim9script.o vim9script.c
1128:info:build /usr/bin/clang -c -I. -Iproto -DHAVE_CONFIG_H -DFEAT_GUI_MACVIM -Wall -Wno-unknown-pragmas -pipe  -I/opt/local/include -isysroot/Applications/Xcode.app/Contents/Developer/Platforms/MacOSX.platform/Developer/SDKs/MacOSX12.3.sdk -DMACOS_X -DMACOS_X_DARWIN  -pipe -Os -isysroot/Applications/Xcode.app/Contents/Developer/Platforms/MacOSX.platform/Developer/SDKs/MacOSX12.3.sdk -arch x86_64 -U_FORTIFY_SOURCE -D_FORTIFY_SOURCE=1        -o objects/vim9type.o vim9type.c
1129:info:build /usr/bin/clang -c -I. -Iproto -DHAVE_CONFIG_H -DFEAT_GUI_MACVIM -Wall -Wno-unknown-pragmas -pipe  -I/opt/local/include -isysroot/Applications/Xcode.app/Contents/Developer/Platforms/MacOSX.platform/Developer/SDKs/MacOSX12.3.sdk -DMACOS_X -DMACOS_X_DARWIN  -pipe -Os -isysroot/Applications/Xcode.app/Contents/Developer/Platforms/MacOSX.platform/Developer/SDKs/MacOSX12.3.sdk -arch x86_64 -U_FORTIFY_SOURCE -D_FORTIFY_SOURCE=1        -o objects/viminfo.o viminfo.c
1130:info:build /usr/bin/clang -c -I. -Iproto -DHAVE_CONFIG_H -DFEAT_GUI_MACVIM -Wall -Wno-unknown-pragmas -pipe  -I/opt/local/include -isysroot/Applications/Xcode.app/Contents/Developer/Platforms/MacOSX.platform/Developer/SDKs/MacOSX12.3.sdk -DMACOS_X -DMACOS_X_DARWIN  -pipe -Os -isysroot/Applications/Xcode.app/Contents/Developer/Platforms/MacOSX.platform/Developer/SDKs/MacOSX12.3.sdk -arch x86_64 -U_FORTIFY_SOURCE -D_FORTIFY_SOURCE=1        -o objects/window.o window.c
1131:info:build /usr/bin/clang -c -I. -Iproto -DHAVE_CONFIG_H -DFEAT_GUI_MACVIM -Wall -Wno-unknown-pragmas -pipe  -I/opt/local/include -isysroot/Applications/Xcode.app/Contents/Developer/Platforms/MacOSX.platform/Developer/SDKs/MacOSX12.3.sdk -DMACOS_X -DMACOS_X_DARWIN  -pipe -Os -isysroot/Applications/Xcode.app/Contents/Developer/Platforms/MacOSX.platform/Developer/SDKs/MacOSX12.3.sdk -arch x86_64 -U_FORTIFY_SOURCE -D_FORTIFY_SOURCE=1        -o objects/bufwrite.o bufwrite.c
1132:info:build /usr/bin/clang -c -I. -Iproto -DHAVE_CONFIG_H -DFEAT_GUI_MACVIM -Wall -Wno-unknown-pragmas -pipe  -I/opt/local/include -isysroot/Applications/Xcode.app/Contents/Developer/Platforms/MacOSX.platform/Developer/SDKs/MacOSX12.3.sdk -DMACOS_X -DMACOS_X_DARWIN  -pipe -Os -isysroot/Applications/Xcode.app/Contents/Developer/Platforms/MacOSX.platform/Developer/SDKs/MacOSX12.3.sdk -arch x86_64 -U_FORTIFY_SOURCE -D_FORTIFY_SOURCE=1        -o objects/gui.o gui.c
1133:info:build /usr/bin/clang -c -I. -Iproto -DHAVE_CONFIG_H -DFEAT_GUI_MACVIM -Wall -Wno-unknown-pragmas -pipe  -I/opt/local/include -isysroot/Applications/Xcode.app/Contents/Developer/Platforms/MacOSX.platform/Developer/SDKs/MacOSX12.3.sdk -DMACOS_X -DMACOS_X_DARWIN  -pipe -Os -isysroot/Applications/Xcode.app/Contents/Developer/Platforms/MacOSX.platform/Developer/SDKs/MacOSX12.3.sdk -arch x86_64 -U_FORTIFY_SOURCE -D_FORTIFY_SOURCE=1        -o objects/gui_beval.o gui_beval.c
1134:info:build gui.c:2288:13: warning: variable 'wide_font' set but not used [-Wunused-but-set-variable]
1135:info:build     GuiFont     wide_font = NOFONT;
1136:info:build                 ^
1137:info:build gui.c:2301:10: warning: variable 'multi_sign' set but not used [-Wunused-but-set-variable]
1138:info:build     int         multi_sign = FALSE;
1139:info:build                 ^
1140:info:build /usr/bin/clang -c -I. -Iproto -DHAVE_CONFIG_H -DFEAT_GUI_MACVIM -Wall -Wno-unknown-pragmas -pipe  -I/opt/local/include -isysroot/Applications/Xcode.app/Contents/Developer/Platforms/MacOSX.platform/Developer/SDKs/MacOSX12.3.sdk -DMACOS_X -DMACOS_X_DARWIN  -pipe -Os -isysroot/Applications/Xcode.app/Contents/Developer/Platforms/MacOSX.platform/Developer/SDKs/MacOSX12.3.sdk -arch x86_64 -U_FORTIFY_SOURCE -D_FORTIFY_SOURCE=1        -o objects/netbeans.o netbeans.c
1141:info:build /usr/bin/clang -c -I. -Iproto -DHAVE_CONFIG_H -DFEAT_GUI_MACVIM -Wall -Wno-unknown-pragmas -pipe  -I/opt/local/include -isysroot/Applications/Xcode.app/Contents/Developer/Platforms/MacOSX.platform/Developer/SDKs/MacOSX12.3.sdk -DMACOS_X -DMACOS_X_DARWIN  -pipe -Os -isysroot/Applications/Xcode.app/Contents/Developer/Platforms/MacOSX.platform/Developer/SDKs/MacOSX12.3.sdk -arch x86_64 -U_FORTIFY_SOURCE -D_FORTIFY_SOURCE=1        -o objects/job.o job.c
1142:info:build /usr/bin/clang -c -I. -Iproto -DHAVE_CONFIG_H -DFEAT_GUI_MACVIM -Wall -Wno-unknown-pragmas -pipe  -I/opt/local/include -isysroot/Applications/Xcode.app/Contents/Developer/Platforms/MacOSX.platform/Developer/SDKs/MacOSX12.3.sdk -DMACOS_X -DMACOS_X_DARWIN  -pipe -Os -isysroot/Applications/Xcode.app/Contents/Developer/Platforms/MacOSX.platform/Developer/SDKs/MacOSX12.3.sdk -arch x86_64 -U_FORTIFY_SOURCE -D_FORTIFY_SOURCE=1        -o objects/channel.o channel.c
1143:info:build /usr/bin/clang -c -I. -Iproto -DHAVE_CONFIG_H -DFEAT_GUI_MACVIM -Wall -Wno-unknown-pragmas -pipe  -I/opt/local/include -isysroot/Applications/Xcode.app/Contents/Developer/Platforms/MacOSX.platform/Developer/SDKs/MacOSX12.3.sdk -DMACOS_X -DMACOS_X_DARWIN  -pipe -Os -isysroot/Applications/Xcode.app/Contents/Developer/Platforms/MacOSX.platform/Developer/SDKs/MacOSX12.3.sdk -arch x86_64 -U_FORTIFY_SOURCE -D_FORTIFY_SOURCE=1        -o objects/xdiffi.o xdiff/xdiffi.c
1144:info:build 2 warnings generated.
1145:info:build /usr/bin/clang -c -I. -Iproto -DHAVE_CONFIG_H -DFEAT_GUI_MACVIM -Wall -Wno-unknown-pragmas -pipe  -I/opt/local/include -isysroot/Applications/Xcode.app/Contents/Developer/Platforms/MacOSX.platform/Developer/SDKs/MacOSX12.3.sdk -DMACOS_X -DMACOS_X_DARWIN  -pipe -Os -isysroot/Applications/Xcode.app/Contents/Developer/Platforms/MacOSX.platform/Developer/SDKs/MacOSX12.3.sdk -arch x86_64 -U_FORTIFY_SOURCE -D_FORTIFY_SOURCE=1        -o objects/xemit.o xdiff/xemit.c
1146:info:build /usr/bin/clang -c -I. -Iproto -DHAVE_CONFIG_H -DFEAT_GUI_MACVIM -Wall -Wno-unknown-pragmas -pipe  -I/opt/local/include -isysroot/Applications/Xcode.app/Contents/Developer/Platforms/MacOSX.platform/Developer/SDKs/MacOSX12.3.sdk -DMACOS_X -DMACOS_X_DARWIN  -pipe -Os -isysroot/Applications/Xcode.app/Contents/Developer/Platforms/MacOSX.platform/Developer/SDKs/MacOSX12.3.sdk -arch x86_64 -U_FORTIFY_SOURCE -D_FORTIFY_SOURCE=1        -o objects/xprepare.o xdiff/xprepare.c
1147:info:build /usr/bin/clang -c -I. -Iproto -DHAVE_CONFIG_H -DFEAT_GUI_MACVIM -Wall -Wno-unknown-pragmas -pipe  -I/opt/local/include -isysroot/Applications/Xcode.app/Contents/Developer/Platforms/MacOSX.platform/Developer/SDKs/MacOSX12.3.sdk -DMACOS_X -DMACOS_X_DARWIN  -pipe -Os -isysroot/Applications/Xcode.app/Contents/Developer/Platforms/MacOSX.platform/Developer/SDKs/MacOSX12.3.sdk -arch x86_64 -U_FORTIFY_SOURCE -D_FORTIFY_SOURCE=1        -o objects/xutils.o xdiff/xutils.c
1148:info:build /usr/bin/clang -c -I. -Iproto -DHAVE_CONFIG_H -DFEAT_GUI_MACVIM -Wall -Wno-unknown-pragmas -pipe  -I/opt/local/include -isysroot/Applications/Xcode.app/Contents/Developer/Platforms/MacOSX.platform/Developer/SDKs/MacOSX12.3.sdk -DMACOS_X -DMACOS_X_DARWIN  -pipe -Os -isysroot/Applications/Xcode.app/Contents/Developer/Platforms/MacOSX.platform/Developer/SDKs/MacOSX12.3.sdk -arch x86_64 -U_FORTIFY_SOURCE -D_FORTIFY_SOURCE=1        -o objects/xhistogram.o xdiff/xhistogram.c
1149:info:build /usr/bin/clang -c -I. -Iproto -DHAVE_CONFIG_H -DFEAT_GUI_MACVIM -Wall -Wno-unknown-pragmas -pipe  -I/opt/local/include -isysroot/Applications/Xcode.app/Contents/Developer/Platforms/MacOSX.platform/Developer/SDKs/MacOSX12.3.sdk -DMACOS_X -DMACOS_X_DARWIN  -pipe -Os -isysroot/Applications/Xcode.app/Contents/Developer/Platforms/MacOSX.platform/Developer/SDKs/MacOSX12.3.sdk -arch x86_64 -U_FORTIFY_SOURCE -D_FORTIFY_SOURCE=1        -o objects/xpatience.o xdiff/xpatience.c
1150:info:build /usr/bin/clang -c -I. -Iproto -DHAVE_CONFIG_H -DFEAT_GUI_MACVIM -Wall -Wno-unknown-pragmas -pipe  -I/opt/local/include -isysroot/Applications/Xcode.app/Contents/Developer/Platforms/MacOSX.platform/Developer/SDKs/MacOSX12.3.sdk -DMACOS_X -DMACOS_X_DARWIN  -pipe -Os -isysroot/Applications/Xcode.app/Contents/Developer/Platforms/MacOSX.platform/Developer/SDKs/MacOSX12.3.sdk -arch x86_64 -U_FORTIFY_SOURCE -D_FORTIFY_SOURCE=1        -o objects/charset.o charset.c
1151:info:build /usr/bin/clang -c -I. -Iproto -DHAVE_CONFIG_H -DFEAT_GUI_MACVIM -Wall -Wno-unknown-pragmas -pipe  -I/opt/local/include -isysroot/Applications/Xcode.app/Contents/Developer/Platforms/MacOSX.platform/Developer/SDKs/MacOSX12.3.sdk -DMACOS_X -DMACOS_X_DARWIN  -pipe -Os -isysroot/Applications/Xcode.app/Contents/Developer/Platforms/MacOSX.platform/Developer/SDKs/MacOSX12.3.sdk -arch x86_64 -U_FORTIFY_SOURCE -D_FORTIFY_SOURCE=1        -o objects/json.o json.c
1152:info:build /usr/bin/clang -c -I. -Iproto -DHAVE_CONFIG_H -DFEAT_GUI_MACVIM -Wall -Wno-unknown-pragmas -pipe  -I/opt/local/include -isysroot/Applications/Xcode.app/Contents/Developer/Platforms/MacOSX.platform/Developer/SDKs/MacOSX12.3.sdk -DMACOS_X -DMACOS_X_DARWIN  -pipe -Os -isysroot/Applications/Xcode.app/Contents/Developer/Platforms/MacOSX.platform/Developer/SDKs/MacOSX12.3.sdk -arch x86_64 -U_FORTIFY_SOURCE -D_FORTIFY_SOURCE=1        -o objects/main.o main.c
1153:info:build /usr/bin/clang -c -I. -Iproto -DHAVE_CONFIG_H -DFEAT_GUI_MACVIM -Wall -Wno-unknown-pragmas -pipe  -I/opt/local/include -isysroot/Applications/Xcode.app/Contents/Developer/Platforms/MacOSX.platform/Developer/SDKs/MacOSX12.3.sdk -DMACOS_X -DMACOS_X_DARWIN  -pipe -Os -isysroot/Applications/Xcode.app/Contents/Developer/Platforms/MacOSX.platform/Developer/SDKs/MacOSX12.3.sdk -arch x86_64 -U_FORTIFY_SOURCE -D_FORTIFY_SOURCE=1        -o objects/memfile.o memfile.c
1154:info:build /usr/bin/clang -c -I. -Iproto -DHAVE_CONFIG_H -DFEAT_GUI_MACVIM -Wall -Wno-unknown-pragmas -pipe  -I/opt/local/include -isysroot/Applications/Xcode.app/Contents/Developer/Platforms/MacOSX.platform/Developer/SDKs/MacOSX12.3.sdk -DMACOS_X -DMACOS_X_DARWIN  -pipe -Os -isysroot/Applications/Xcode.app/Contents/Developer/Platforms/MacOSX.platform/Developer/SDKs/MacOSX12.3.sdk -arch x86_64 -U_FORTIFY_SOURCE -D_FORTIFY_SOURCE=1        -o objects/message.o message.c
1155:info:build /usr/bin/clang -c -I. -Iproto -DHAVE_CONFIG_H -DFEAT_GUI_MACVIM -Wall -Wno-unknown-pragmas -pipe  -I/opt/local/include -isysroot/Applications/Xcode.app/Contents/Developer/Platforms/MacOSX.platform/Developer/SDKs/MacOSX12.3.sdk -DMACOS_X -DMACOS_X_DARWIN  -pipe -Os -isysroot/Applications/Xcode.app/Contents/Developer/Platforms/MacOSX.platform/Developer/SDKs/MacOSX12.3.sdk -arch x86_64 -U_FORTIFY_SOURCE -D_FORTIFY_SOURCE=1        version.c -o objects/version.o
1156:info:build   /usr/bin/clang   -L/opt/local/lib -Wl,-headerpad_max_install_names -Wl,-syslibroot,/Applications/Xcode.app/Contents/Developer/Platforms/MacOSX.platform/Developer/SDKs/MacOSX12.3.sdk -arch x86_64        -o Vim objects/arabic.o objects/arglist.o objects/autocmd.o objects/beval.o objects/buffer.o objects/change.o objects/blob.o objects/blowfish.o objects/cindent.o objects/clientserver.o objects/clipboard.o objects/cmdexpand.o objects/cmdhist.o objects/crypt.o objects/crypt_zip.o objects/debugger.o objects/dict.o objects/diff.o objects/digraph.o objects/drawline.o objects/drawscreen.o objects/edit.o objects/eval.o objects/evalbuffer.o objects/evalfunc.o objects/evalvars.o objects/evalwindow.o objects/ex_cmds.o objects/ex_cmds2.o objects/ex_docmd.o objects/ex_eval.o objects/ex_getln.o objects/fileio.o objects/filepath.o objects/findfile.o objects/fold.o objects/getchar.o objects/gui_xim.o objects/hardcopy.o objects/hashtab.o objects/help.o objects/highlight.o objects/if_cscope.o objects/if_xcmdsrv.o objects/indent.o objects/insexpand.o objects/list.o objects/locale.o objects/map.o objects/mark.o objects/match.o objects/mbyte.o objects/memline.o objects/menu.o objects/misc1.o objects/misc2.o objects/mouse.o objects/move.o objects/normal.o objects/ops.o objects/option.o objects/optionstr.o objects/os_unix.o objects/pathdef.o objects/popupmenu.o objects/popupwin.o objects/profiler.o objects/pty.o objects/quickfix.o objects/regexp.o objects/register.o objects/screen.o objects/scriptfile.o objects/search.o objects/session.o objects/sha256.o objects/sign.o objects/sound.o objects/spell.o objects/spellfile.o objects/spellsuggest.o objects/syntax.o objects/tag.o objects/term.o objects/terminal.o objects/testing.o objects/textformat.o objects/textobject.o objects/textprop.o objects/time.o objects/typval.o objects/ui.o objects/undo.o objects/usercmd.o objects/userfunc.o objects/version.o objects/vim9compile.o objects/vim9execute.o objects/vim9script.o objects/vim9type.o objects/viminfo.o objects/window.o objects/bufwrite.o objects/gui.o objects/gui_beval.o objects/gui_macvim.o objects/MMBackend.o objects/MacVim.o objects/vterm_encoding.o objects/vterm_keyboard.o objects/vterm_mouse.o objects/vterm_parser.o objects/vterm_pen.o objects/vterm_screen.o objects/vterm_state.o objects/vterm_unicode.o objects/vterm_vterm.o        objects/os_macosx.o objects/os_mac_conv.o objects/netbeans.o objects/job.o objects/channel.o objects/xdiffi.o objects/xemit.o objects/xprepare.o objects/xutils.o objects/xhistogram.o objects/xpatience.o  objects/charset.o objects/json.o objects/main.o objects/memfile.o objects/message.o        -lm  -lncurses -liconv -lintl -framework AppKit           
1157:info:build link.sh: OK, linking works, let's try omitting a few libraries.
1158:info:build link.sh: See auto/link.log for details.
1159:info:build link.sh: Trying to omit the iconv library...
1160:info:build link.sh: Vim DOES need the iconv library.
1161:info:build link.sh: Using unmodified link command
1162:info:build   /usr/bin/clang   -L/opt/local/lib -Wl,-headerpad_max_install_names -Wl,-syslibroot,/Applications/Xcode.app/Contents/Developer/Platforms/MacOSX.platform/Developer/SDKs/MacOSX12.3.sdk -arch x86_64        -o Vim objects/arabic.o objects/arglist.o objects/autocmd.o objects/beval.o objects/buffer.o objects/change.o objects/blob.o objects/blowfish.o objects/cindent.o objects/clientserver.o objects/clipboard.o objects/cmdexpand.o objects/cmdhist.o objects/crypt.o objects/crypt_zip.o objects/debugger.o objects/dict.o objects/diff.o objects/digraph.o objects/drawline.o objects/drawscreen.o objects/edit.o objects/eval.o objects/evalbuffer.o objects/evalfunc.o objects/evalvars.o objects/evalwindow.o objects/ex_cmds.o objects/ex_cmds2.o objects/ex_docmd.o objects/ex_eval.o objects/ex_getln.o objects/fileio.o objects/filepath.o objects/findfile.o objects/fold.o objects/getchar.o objects/gui_xim.o objects/hardcopy.o objects/hashtab.o objects/help.o objects/highlight.o objects/if_cscope.o objects/if_xcmdsrv.o objects/indent.o objects/insexpand.o objects/list.o objects/locale.o objects/map.o objects/mark.o objects/match.o objects/mbyte.o objects/memline.o objects/menu.o objects/misc1.o objects/misc2.o objects/mouse.o objects/move.o objects/normal.o objects/ops.o objects/option.o objects/optionstr.o objects/os_unix.o objects/pathdef.o objects/popupmenu.o objects/popupwin.o objects/profiler.o objects/pty.o objects/quickfix.o objects/regexp.o objects/register.o objects/screen.o objects/scriptfile.o objects/search.o objects/session.o objects/sha256.o objects/sign.o objects/sound.o objects/spell.o objects/spellfile.o objects/spellsuggest.o objects/syntax.o objects/tag.o objects/term.o objects/terminal.o objects/testing.o objects/textformat.o objects/textobject.o objects/textprop.o objects/time.o objects/typval.o objects/ui.o objects/undo.o objects/usercmd.o objects/userfunc.o objects/version.o objects/vim9compile.o objects/vim9execute.o objects/vim9script.o objects/vim9type.o objects/viminfo.o objects/window.o objects/bufwrite.o objects/gui.o objects/gui_beval.o objects/gui_macvim.o objects/MMBackend.o objects/MacVim.o objects/vterm_encoding.o objects/vterm_keyboard.o objects/vterm_mouse.o objects/vterm_parser.o objects/vterm_pen.o objects/vterm_screen.o objects/vterm_state.o objects/vterm_unicode.o objects/vterm_vterm.o        objects/os_macosx.o objects/os_mac_conv.o objects/netbeans.o objects/job.o objects/channel.o objects/xdiffi.o objects/xemit.o objects/xprepare.o objects/xutils.o objects/xhistogram.o objects/xpatience.o  objects/charset.o objects/json.o objects/main.o objects/memfile.o objects/message.o        -lm  -lncurses -liconv -lintl -framework AppKit           
1163:info:build link.sh: Linked OK
1164:info:build xcodebuild -project MacVim/MacVim.xcodeproj CACHE_ROOT=/opt/local/var/macports/build/_opt_local_var_macports_sources_rsync.macports.org_macports_release_tarballs_ports_editors_MacVim/MacVim/work/caches -UseNewBuildSystem=NO MACOSX_DEPLOYMENT_TARGET=12.0 ARCHS=x86_64
1165:info:build objc[92002]: Class AppleTypeCRetimerRestoreInfoHelper is implemented in both /usr/lib/libauthinstall.dylib (0x212cc1eb0) and /Library/Apple/System/Library/PrivateFrameworks/MobileDevice.framework/Versions/A/MobileDevice (0x107c184f8). One of the two will be used. Which one is undefined.
1166:info:build objc[92002]: Class AppleTypeCRetimerFirmwareAggregateRequestCreator is implemented in both /usr/lib/libauthinstall.dylib (0x212cc1f00) and /Library/Apple/System/Library/PrivateFrameworks/MobileDevice.framework/Versions/A/MobileDevice (0x107c18548). One of the two will be used. Which one is undefined.
1167:info:build objc[92002]: Class AppleTypeCRetimerFirmwareRequestCreator is implemented in both /usr/lib/libauthinstall.dylib (0x212cc1f50) and /Library/Apple/System/Library/PrivateFrameworks/MobileDevice.framework/Versions/A/MobileDevice (0x107c18598). One of the two will be used. Which one is undefined.
1168:info:build objc[92002]: Class ATCRTRestoreInfoFTABFile is implemented in both /usr/lib/libauthinstall.dylib (0x212cc1fa0) and /Library/Apple/System/Library/PrivateFrameworks/MobileDevice.framework/Versions/A/MobileDevice (0x107c185e8). One of the two will be used. Which one is undefined.
1169:info:build objc[92002]: Class AppleTypeCRetimerFirmwareCopier is implemented in both /usr/lib/libauthinstall.dylib (0x212cc1ff0) and /Library/Apple/System/Library/PrivateFrameworks/MobileDevice.framework/Versions/A/MobileDevice (0x107c18638). One of the two will be used. Which one is undefined.
1170:info:build objc[92002]: Class ATCRTRestoreInfoFTABSubfile is implemented in both /usr/lib/libauthinstall.dylib (0x212cc2040) and /Library/Apple/System/Library/PrivateFrameworks/MobileDevice.framework/Versions/A/MobileDevice (0x107c18688). One of the two will be used. Which one is undefined.
1171:info:build 2022-05-05 12:03:13.838 xcodebuild[92002:2074566] Requested but did not find extension point with identifier Xcode.IDEKit.ExtensionSentinelHostApplications for extension Xcode.DebuggerFoundation.AppExtensionHosts.watchOS of plug-in com.apple.dt.IDEWatchSupportCore
1172:info:build 2022-05-05 12:03:13.838 xcodebuild[92002:2074566] Requested but did not find extension point with identifier Xcode.IDEKit.ExtensionPointIdentifierToBundleIdentifier for extension Xcode.DebuggerFoundation.AppExtensionToBundleIdentifierMap.watchOS of plug-in com.apple.dt.IDEWatchSupportCore
1173:info:build Command line invocation:
1174:info:build     /Applications/Xcode.app/Contents/Developer/usr/bin/xcodebuild -project MacVim/MacVim.xcodeproj CACHE_ROOT=/opt/local/var/macports/build/_opt_local_var_macports_sources_rsync.macports.org_macports_release_tarballs_ports_editors_MacVim/MacVim/work/caches -UseNewBuildSystem=NO MACOSX_DEPLOYMENT_TARGET=12.0 ARCHS=x86_64
1175:info:build User defaults from command line:
1176:info:build     IDEPackageSupportUseBuiltinSCM = YES
1177:info:build     UseNewBuildSystem = NO
1178:info:build Build settings from command line:
1179:info:build     ARCHS = x86_64
1180:info:build     CACHE_ROOT = /opt/local/var/macports/build/_opt_local_var_macports_sources_rsync.macports.org_macports_release_tarballs_ports_editors_MacVim/MacVim/work/caches
1181:info:build     MACOSX_DEPLOYMENT_TARGET = 12.0
1182:info:build 2022-05-05 12:03:14.524 xcodebuild[92002:2074573]  DVTErrorPresenter: Unable to load simulator devices.
1183:info:build Domain: DVTCoreSimulatorAdditionsErrorDomain
1184:info:build Code: 3
1185:info:build Failure Reason: The version of the CoreSimulator framework installed on this Mac is out-of-date and not supported by this version of Xcode.
1186:info:build Recovery Suggestion: Please ensure that you have installed all available updates to your Mac's software, and that you are running the most recent version of Xcode supported by macOS.
1187:info:build --
1188:info:build CoreSimulator is out of date. Current version (776.4.0) is older than build version (802.6.0).
1189:info:build Domain: DVTCoreSimulatorAdditionsErrorDomain
1190:info:build Code: 3
1191:info:build --
1192:info:build 2022-05-05 12:03:14.525 xcodebuild[92002:2074573]  iOSSimulator: [SimServiceContext sharedServiceContextForDeveloperDir:error:] returned nil (Error Domain=DVTCoreSimulatorAdditionsErrorDomain Code=3 "CoreSimulator is out of date. Current version (776.4.0) is older than build version (802.6.0)." UserInfo={NSLocalizedDescription=CoreSimulator is out of date. Current version (776.4.0) is older than build version (802.6.0).}). Simulator device support disabled.
1193:info:build 2022-05-05 12:03:14.672 xcodebuild[92002:2074566] [MT] IDELogStore: Failed to open log store at /opt/local/var/macports/home/Library/Developer/Xcode/DerivedData/MacVim-hirxhaymuxqztehdqsktqackpvpt/Logs/Build
1194:info:build 2022-05-05 12:03:14.672 xcodebuild[92002:2074566] [MT] IDELogStore: Failed to open Build log store: Error Domain=IDEFoundationErrorDomain Code=1 "Unable to create log store directory at '/opt/local/var/macports/home/Library/Developer/Xcode/DerivedData/MacVim-hirxhaymuxqztehdqsktqackpvpt/Logs/Build': (513) You don’t have permission to save the file “Build” in the folder “Logs”." UserInfo={NSLocalizedDescription=Unable to create log store directory at '/opt/local/var/macports/home/Library/Developer/Xcode/DerivedData/MacVim-hirxhaymuxqztehdqsktqackpvpt/Logs/Build': (513) You don’t have permission to save the file “Build” in the folder “Logs”.}. User info: {
1195:info:build     NSLocalizedDescription = "Unable to create log store directory at '/opt/local/var/macports/home/Library/Developer/Xcode/DerivedData/MacVim-hirxhaymuxqztehdqsktqackpvpt/Logs/Build': (513) You don\U2019t have permission to save the file \U201cBuild\U201d in the folder \U201cLogs\U201d.";
1196:info:build }.
1197:info:build 2022-05-05 12:03:14.681 xcodebuild[92002:2074566] [MT] IDELogStore: Failed to open log store at /opt/local/var/macports/home/Library/Developer/Xcode/DerivedData/MacVim-hirxhaymuxqztehdqsktqackpvpt/Logs/Localization
1198:info:build 2022-05-05 12:03:14.681 xcodebuild[92002:2074566] [MT] IDELogStore: Failed to open Localization log store: Error Domain=IDEFoundationErrorDomain Code=1 "Unable to create log store directory at '/opt/local/var/macports/home/Library/Developer/Xcode/DerivedData/MacVim-hirxhaymuxqztehdqsktqackpvpt/Logs/Localization': (513) You don’t have permission to save the file “Localization” in the folder “Logs”." UserInfo={NSLocalizedDescription=Unable to create log store directory at '/opt/local/var/macports/home/Library/Developer/Xcode/DerivedData/MacVim-hirxhaymuxqztehdqsktqackpvpt/Logs/Localization': (513) You don’t have permission to save the file “Localization” in the folder “Logs”.}. User info: {
1199:info:build     NSLocalizedDescription = "Unable to create log store directory at '/opt/local/var/macports/home/Library/Developer/Xcode/DerivedData/MacVim-hirxhaymuxqztehdqsktqackpvpt/Logs/Localization': (513) You don\U2019t have permission to save the file \U201cLocalization\U201d in the folder \U201cLogs\U201d.";
1200:info:build }.
1201:info:build 2022-05-05 12:03:14.684 xcodebuild[92002:2074566] [MT] IDELogStore: Failed to open log store at /opt/local/var/macports/home/Library/Developer/Xcode/DerivedData/MacVim-hirxhaymuxqztehdqsktqackpvpt/Logs/Package
1202:info:build 2022-05-05 12:03:14.685 xcodebuild[92002:2074566] [MT] IDELogStore: Failed to open Package log store: Error Domain=IDEFoundationErrorDomain Code=1 "Unable to create log store directory at '/opt/local/var/macports/home/Library/Developer/Xcode/DerivedData/MacVim-hirxhaymuxqztehdqsktqackpvpt/Logs/Package': (513) You don’t have permission to save the file “Package” in the folder “Logs”." UserInfo={NSLocalizedDescription=Unable to create log store directory at '/opt/local/var/macports/home/Library/Developer/Xcode/DerivedData/MacVim-hirxhaymuxqztehdqsktqackpvpt/Logs/Package': (513) You don’t have permission to save the file “Package” in the folder “Logs”.}. User info: {
1203:info:build     NSLocalizedDescription = "Unable to create log store directory at '/opt/local/var/macports/home/Library/Developer/Xcode/DerivedData/MacVim-hirxhaymuxqztehdqsktqackpvpt/Logs/Package': (513) You don\U2019t have permission to save the file \U201cPackage\U201d in the folder \U201cLogs\U201d.";
1204:info:build }.
1205:info:build 2022-05-05 12:03:14.698 xcodebuild[92002:2074566] [MT] IDELogStore: Failed to open log store at /opt/local/var/macports/home/Library/Developer/Xcode/DerivedData/MacVim-hirxhaymuxqztehdqsktqackpvpt/Logs/Test
1206:info:build 2022-05-05 12:03:14.698 xcodebuild[92002:2074566] [MT] IDELogStore: Failed to open Test log store: Error Domain=IDEFoundationErrorDomain Code=1 "Unable to create log store directory at '/opt/local/var/macports/home/Library/Developer/Xcode/DerivedData/MacVim-hirxhaymuxqztehdqsktqackpvpt/Logs/Test': (513) You don’t have permission to save the file “Test” in the folder “Logs”." UserInfo={NSLocalizedDescription=Unable to create log store directory at '/opt/local/var/macports/home/Library/Developer/Xcode/DerivedData/MacVim-hirxhaymuxqztehdqsktqackpvpt/Logs/Test': (513) You don’t have permission to save the file “Test” in the folder “Logs”.}. User info: {
1207:info:build     NSLocalizedDescription = "Unable to create log store directory at '/opt/local/var/macports/home/Library/Developer/Xcode/DerivedData/MacVim-hirxhaymuxqztehdqsktqackpvpt/Logs/Test': (513) You don\U2019t have permission to save the file \U201cTest\U201d in the folder \U201cLogs\U201d.";
1208:info:build }.
1209:info:build 2022-05-05 12:03:14.708 xcodebuild[92002:2074566] Couldn't create intermediates directory: You don’t have permission to save the file “MacVim-hirxhaymuxqztehdqsktqackpvpt” in the folder “DerivedData”.
1210:info:build 2022-05-05 12:03:15.132 xcodebuild[92002:2074566] [MT] DVTAssertions: Warning in /Library/Caches/com.apple.xbs/Sources/IDEFrameworks/IDEFrameworks-20103/IDEFoundation/Buildables/IDEWorkspaceArena.m:1134
1211:info:build Details:  Failed to create workspace arena at <DVTFilePath:0x600001398ab0:'/opt/local/var/macports/home/Library/Developer/Xcode/DerivedData/MacVim-hirxhaymuxqztehdqsktqackpvpt'>: Error Domain=NSCocoaErrorDomain Code=513 "You don’t have permission to save the file “MacVim-hirxhaymuxqztehdqsktqackpvpt” in the folder “DerivedData”." UserInfo={NSFilePath=/opt/local/var/macports/home/Library/Developer/Xcode/DerivedData/MacVim-hirxhaymuxqztehdqsktqackpvpt, NSUnderlyingError=0x600002d2ff90 {Error Domain=NSPOSIXErrorDomain Code=1 "Operation not permitted"}}
1212:info:build Object:   <IDEWorkspaceArena: 0x600000eaf780>
1213:info:build Method:   -createWorkspaceArenaFolderIfNecessary
1214:info:build Thread:   <_NSMainThread: 0x6000034a4200>{number = 1, name = main}
1215:info:build Please file a bug at https://feedbackassistant.apple.com with this warning message and any useful information you can provide.
1216:info:build note: Using new build system
1217:info:build error: Build service could not create build operation: unknown error while handling message: fopen(/opt/local/var/macports/home/Library/Developer/Xcode/DerivedData/MacVim-hirxhaymuxqztehdqsktqackpvpt/XCBuildData/PIFCache/WORKSPACE@v11_hash=(null)_subobjects=dbea6aa6c9117cb834b322d1e4e14844-Workspace.lock, wb): No such file or directory (2)
1218:info:build ** BUILD FAILED **
1219:info:build Couldn't set atribute on intermediates directory: setxattr(/opt/local/var/macports/home/Library/Developer/Xcode/DerivedData/MacVim-hirxhaymuxqztehdqsktqackpvpt, com.apple.xcode.CreatedByBuildSystem, true): No such file or directory (2)
1220:info:build Couldn't set atribute on intermediates directory: setxattr(/opt/local/var/macports/home/Library/Developer/Xcode/DerivedData/MacVim-hirxhaymuxqztehdqsktqackpvpt, com.apple.xcode.CreatedByBuildSystem, true): No such file or directory (2)
1221:info:build Couldn't set atribute on intermediates directory: setxattr(/opt/local/var/macports/home/Library/Developer/Xcode/DerivedData/MacVim-hirxhaymuxqztehdqsktqackpvpt, com.apple.xcode.CreatedByBuildSystem, true): No such file or directory (2)
1222:info:build Couldn't set atribute on intermediates directory: setxattr(/opt/local/var/macports/home/Library/Developer/Xcode/DerivedData/MacVim-hirxhaymuxqztehdqsktqackpvpt, com.apple.xcode.CreatedByBuildSystem, true): No such file or directory (2)
1223:info:build make[1]: *** [macvim] Error 65
1224:info:build make[1]: Leaving directory `/opt/local/var/macports/build/_opt_local_var_macports_sources_rsync.macports.org_macports_release_tarballs_ports_editors_MacVim/MacVim/work/macvim-dev-macvim-e65c14c/src'
1225:info:build make: *** [all] Error 2
1226:info:build make: Leaving directory `/opt/local/var/macports/build/_opt_local_var_macports_sources_rsync.macports.org_macports_release_tarballs_ports_editors_MacVim/MacVim/work/macvim-dev-macvim-e65c14c'
1227:info:build Command failed:  cd "/opt/local/var/macports/build/_opt_local_var_macports_sources_rsync.macports.org_macports_release_tarballs_ports_editors_MacVim/MacVim/work/macvim-171" && /usr/bin/make -j8 -w all XCODEFLAGS="CACHE_ROOT=/opt/local/var/macports/build/_opt_local_var_macports_sources_rsync.macports.org_macports_release_tarballs_ports_editors_MacVim/MacVim/work/caches -UseNewBuildSystem=NO MACOSX_DEPLOYMENT_TARGET=12.0 ARCHS=x86_64"
1228:info:build Exit code: 2
1229:error:build Failed to build MacVim: command execution failed
1230:debug:build Error code: CHILDSTATUS 91507 2
1231:debug:build Backtrace: command execution failed
1232:debug:build     while executing
1233:debug:build "system {*}$notty {*}$callback {*}$nice $fullcmdstring"
1234:debug:build     invoked from within
1235:debug:build "command_exec -callback portprogress::target_progress_callback build"
1236:debug:build     (procedure "portbuild::build_main" line 8)
1237:debug:build     invoked from within
1238:debug:build "$procedure $targetname"
1239:error:build See /opt/local/var/macports/logs/_opt_local_var_macports_sources_rsync.macports.org_macports_release_tarballs_ports_editors_MacVim/MacVim/main.log for details.