| 1 | version:1 |
|---|
| 2 | :debug:clean Starting logging for umem @1.0.1_1 |
|---|
| 3 | :debug:sysinfo macOS 15.0.1 (darwin/24.0.0) arch arm |
|---|
| 4 | :debug:sysinfo MacPorts 2.10.2 |
|---|
| 5 | :debug:sysinfo Xcode 16.0, CLT 16.0.0.0.1.1724870825 |
|---|
| 6 | :debug:sysinfo SDK 15 |
|---|
| 7 | :debug:sysinfo MACOSX_DEPLOYMENT_TARGET: 15.0 |
|---|
| 8 | :debug:clean Attempting ln -sf /opt/local/var/macports/build/_opt_local_var_macports_sources_rsync.macports.org_macports_release_tarballs_ports_devel_umem/umem/work /opt/local/var/macports/sources/rsync.macports.org/macports/release/tarballs/ports/devel/umem/work |
|---|
| 9 | :debug:clean dropping privileges: euid changed to 502, egid changed to 501. |
|---|
| 10 | :debug:main Executing org.macports.main (umem) |
|---|
| 11 | :debug:main Privilege de-escalation not attempted as not running as root. |
|---|
| 12 | :debug:archivefetch archivefetch phase started at Wed Oct 9 22:00:56 EEST 2024 |
|---|
| 13 | :msg:archivefetch ---> Fetching archive for umem |
|---|
| 14 | :debug:archivefetch Executing org.macports.archivefetch (umem) |
|---|
| 15 | :debug:archivefetch euid/egid changed to: 0/0 |
|---|
| 16 | :debug:archivefetch chowned /opt/local/var/macports/incoming to macports |
|---|
| 17 | :debug:archivefetch euid/egid changed to: 502/501 |
|---|
| 18 | :info:archivefetch ---> umem-1.0.1_1.darwin_24.arm64.tbz2 doesn't seem to exist in /opt/local/var/macports/incoming/verified |
|---|
| 19 | :msg:archivefetch ---> Attempting to fetch umem-1.0.1_1.darwin_24.arm64.tbz2 from https://packages.macports.org/umem |
|---|
| 20 | :debug:archivefetch Fetching archive failed: The requested URL returned error: 404 |
|---|
| 21 | :msg:archivefetch ---> Attempting to fetch umem-1.0.1_1.darwin_24.arm64.tbz2 from https://cph.dk.packages.macports.org/umem |
|---|
| 22 | :debug:archivefetch Fetching archive failed: The requested URL returned error: 404 |
|---|
| 23 | :msg:archivefetch ---> Attempting to fetch umem-1.0.1_1.darwin_24.arm64.tbz2 from https://nue.de.packages.macports.org/umem |
|---|
| 24 | :debug:archivefetch Fetching archive failed: The requested URL returned error: 404 |
|---|
| 25 | :debug:archivefetch Privilege de-escalation not attempted as not running as root. |
|---|
| 26 | :debug:fetch fetch phase started at Wed Oct 9 22:00:56 EEST 2024 |
|---|
| 27 | :notice:fetch ---> Fetching distfiles for umem |
|---|
| 28 | :debug:fetch elevating privileges for fetch: euid changed to 0, egid changed to 0. |
|---|
| 29 | :debug:fetch dropping privileges: euid changed to 502, egid changed to 501. |
|---|
| 30 | :debug:fetch Executing org.macports.fetch (umem) |
|---|
| 31 | :info:fetch ---> umem-1.0.1.tar.bz2 does not exist in /opt/local/var/macports/distfiles/umem |
|---|
| 32 | :notice:fetch ---> Attempting to fetch umem-1.0.1.tar.bz2 from https://distfiles.macports.org/umem |
|---|
| 33 | :debug:fetch Privilege de-escalation not attempted as not running as root. |
|---|
| 34 | :debug:checksum checksum phase started at Wed Oct 9 22:01:00 EEST 2024 |
|---|
| 35 | :notice:checksum ---> Verifying checksums for umem |
|---|
| 36 | :debug:checksum Executing org.macports.checksum (umem) |
|---|
| 37 | :info:checksum ---> Checksumming umem-1.0.1.tar.bz2 |
|---|
| 38 | :debug:checksum Calculated (sha1) is cdb2a7d3c29df21fc2ca85bcff6d2367c89c5bbe |
|---|
| 39 | :debug:checksum Correct (sha1) checksum for umem-1.0.1.tar.bz2 |
|---|
| 40 | :debug:checksum Calculated (rmd160) is ddfe124cc5e8494bf73e7bcec2aec09b1bbbe745 |
|---|
| 41 | :debug:checksum Correct (rmd160) checksum for umem-1.0.1.tar.bz2 |
|---|
| 42 | :debug:checksum Calculated (sha256) is d6148d236c6e49f0243c712b939f08d654498f3bea80b2319c74247220972cf2 |
|---|
| 43 | :debug:checksum Correct (sha256) checksum for umem-1.0.1.tar.bz2 |
|---|
| 44 | :debug:checksum Calculated (size) is 305999 |
|---|
| 45 | :debug:checksum Correct (size) checksum for umem-1.0.1.tar.bz2 |
|---|
| 46 | :debug:checksum Privilege de-escalation not attempted as not running as root. |
|---|
| 47 | :debug:extract extract phase started at Wed Oct 9 22:01:00 EEST 2024 |
|---|
| 48 | :notice:extract ---> Extracting umem |
|---|
| 49 | :debug:extract setting option extract.cmd to /usr/bin/bzip2 |
|---|
| 50 | :debug:extract Executing org.macports.extract (umem) |
|---|
| 51 | :info:extract ---> Extracting umem-1.0.1.tar.bz2 |
|---|
| 52 | :debug:extract setting option extract.args to '/opt/local/var/macports/distfiles/umem/umem-1.0.1.tar.bz2' |
|---|
| 53 | :debug:extract Environment: |
|---|
| 54 | :debug:extract CC_PRINT_OPTIONS='YES' |
|---|
| 55 | :debug:extract CC_PRINT_OPTIONS_FILE='/opt/local/var/macports/build/_opt_local_var_macports_sources_rsync.macports.org_macports_release_tarballs_ports_devel_umem/umem/work/.CC_PRINT_OPTIONS' |
|---|
| 56 | :debug:extract CPATH='/opt/local/include' |
|---|
| 57 | :debug:extract DEVELOPER_DIR='/Library/Developer/CommandLineTools' |
|---|
| 58 | :debug:extract LIBRARY_PATH='/opt/local/lib' |
|---|
| 59 | :debug:extract MACOSX_DEPLOYMENT_TARGET='15.0' |
|---|
| 60 | :debug:extract SDKROOT='/Library/Developer/CommandLineTools/SDKs/MacOSX15.sdk' |
|---|
| 61 | :debug:extract SOURCE_DATE_EPOCH='1727388815' |
|---|
| 62 | :info:extract Executing: cd "/opt/local/var/macports/build/_opt_local_var_macports_sources_rsync.macports.org_macports_release_tarballs_ports_devel_umem/umem/work" && /usr/bin/bzip2 -dc '/opt/local/var/macports/distfiles/umem/umem-1.0.1.tar.bz2' | /usr/bin/tar -xf - |
|---|
| 63 | :debug:extract system: cd "/opt/local/var/macports/build/_opt_local_var_macports_sources_rsync.macports.org_macports_release_tarballs_ports_devel_umem/umem/work" && /usr/bin/bzip2 -dc '/opt/local/var/macports/distfiles/umem/umem-1.0.1.tar.bz2' | /usr/bin/tar -xf - |
|---|
| 64 | :debug:extract euid/egid changed to: 0/0 |
|---|
| 65 | :debug:extract chowned /opt/local/var/macports/build/_opt_local_var_macports_sources_rsync.macports.org_macports_release_tarballs_ports_devel_umem/umem/work to macports |
|---|
| 66 | :debug:extract euid/egid changed to: 502/501 |
|---|
| 67 | :debug:extract Privilege de-escalation not attempted as not running as root. |
|---|
| 68 | :debug:patch patch phase started at Wed Oct 9 22:01:00 EEST 2024 |
|---|
| 69 | :debug:patch Executing org.macports.patch (umem) |
|---|
| 70 | :notice:patch ---> Applying patches to umem |
|---|
| 71 | :info:patch ---> Applying atomic.patch |
|---|
| 72 | :debug:patch Environment: |
|---|
| 73 | :debug:patch CC_PRINT_OPTIONS='YES' |
|---|
| 74 | :debug:patch CC_PRINT_OPTIONS_FILE='/opt/local/var/macports/build/_opt_local_var_macports_sources_rsync.macports.org_macports_release_tarballs_ports_devel_umem/umem/work/.CC_PRINT_OPTIONS' |
|---|
| 75 | :debug:patch CPATH='/opt/local/include' |
|---|
| 76 | :debug:patch DEVELOPER_DIR='/Library/Developer/CommandLineTools' |
|---|
| 77 | :debug:patch LIBRARY_PATH='/opt/local/lib' |
|---|
| 78 | :debug:patch MACOSX_DEPLOYMENT_TARGET='15.0' |
|---|
| 79 | :debug:patch SDKROOT='/Library/Developer/CommandLineTools/SDKs/MacOSX15.sdk' |
|---|
| 80 | :debug:patch SOURCE_DATE_EPOCH='1727388815' |
|---|
| 81 | :info:patch Executing: cd "/opt/local/var/macports/build/_opt_local_var_macports_sources_rsync.macports.org_macports_release_tarballs_ports_devel_umem/umem/work/umem-1.0.1" && /usr/bin/patch -t -N -p0 < '/opt/local/var/macports/sources/rsync.macports.org/macports/release/tarballs/ports/devel/umem/files/atomic.patch' |
|---|
| 82 | :debug:patch system: cd "/opt/local/var/macports/build/_opt_local_var_macports_sources_rsync.macports.org_macports_release_tarballs_ports_devel_umem/umem/work/umem-1.0.1" && /usr/bin/patch -t -N -p0 < '/opt/local/var/macports/sources/rsync.macports.org/macports/release/tarballs/ports/devel/umem/files/atomic.patch' |
|---|
| 83 | :info:patch patching file misc.c |
|---|
| 84 | :info:patch patching file sol_compat.h |
|---|
| 85 | :info:patch patching file umem.c |
|---|
| 86 | :info:patch ---> Applying implicit.patch |
|---|
| 87 | :debug:patch Environment: |
|---|
| 88 | :debug:patch CC_PRINT_OPTIONS='YES' |
|---|
| 89 | :debug:patch CC_PRINT_OPTIONS_FILE='/opt/local/var/macports/build/_opt_local_var_macports_sources_rsync.macports.org_macports_release_tarballs_ports_devel_umem/umem/work/.CC_PRINT_OPTIONS' |
|---|
| 90 | :debug:patch CPATH='/opt/local/include' |
|---|
| 91 | :debug:patch DEVELOPER_DIR='/Library/Developer/CommandLineTools' |
|---|
| 92 | :debug:patch LIBRARY_PATH='/opt/local/lib' |
|---|
| 93 | :debug:patch MACOSX_DEPLOYMENT_TARGET='15.0' |
|---|
| 94 | :debug:patch SDKROOT='/Library/Developer/CommandLineTools/SDKs/MacOSX15.sdk' |
|---|
| 95 | :debug:patch SOURCE_DATE_EPOCH='1727388815' |
|---|
| 96 | :info:patch Executing: cd "/opt/local/var/macports/build/_opt_local_var_macports_sources_rsync.macports.org_macports_release_tarballs_ports_devel_umem/umem/work/umem-1.0.1" && /usr/bin/patch -t -N -p0 < '/opt/local/var/macports/sources/rsync.macports.org/macports/release/tarballs/ports/devel/umem/files/implicit.patch' |
|---|
| 97 | :debug:patch system: cd "/opt/local/var/macports/build/_opt_local_var_macports_sources_rsync.macports.org_macports_release_tarballs_ports_devel_umem/umem/work/umem-1.0.1" && /usr/bin/patch -t -N -p0 < '/opt/local/var/macports/sources/rsync.macports.org/macports/release/tarballs/ports/devel/umem/files/implicit.patch' |
|---|
| 98 | :info:patch patching file configure |
|---|
| 99 | :info:patch patching file malloc.c |
|---|
| 100 | :info:patch patching file umem_test.c |
|---|
| 101 | :info:patch patching file umem_test2.c |
|---|
| 102 | :debug:patch Executing proc-post-org.macports.patch-patch-0 |
|---|
| 103 | :debug:patch Privilege de-escalation not attempted as not running as root. |
|---|
| 104 | :debug:configure configure phase started at Wed Oct 9 22:01:00 EEST 2024 |
|---|
| 105 | :notice:configure ---> Configuring umem |
|---|
| 106 | :debug:configure Preferred compilers: clang macports-clang-18 macports-clang-17 macports-clang-16 macports-clang-15 macports-clang-14 macports-clang-13 |
|---|
| 107 | :debug:configure Using compiler 'Xcode Clang' |
|---|
| 108 | :debug:configure Executing org.macports.configure (umem) |
|---|
| 109 | :debug:configure Environment: |
|---|
| 110 | :debug:configure CC='/usr/bin/clang' |
|---|
| 111 | :debug:configure CC_PRINT_OPTIONS='YES' |
|---|
| 112 | :debug:configure CC_PRINT_OPTIONS_FILE='/opt/local/var/macports/build/_opt_local_var_macports_sources_rsync.macports.org_macports_release_tarballs_ports_devel_umem/umem/work/.CC_PRINT_OPTIONS' |
|---|
| 113 | :debug:configure CFLAGS='-pipe -Os -isysroot/Library/Developer/CommandLineTools/SDKs/MacOSX15.sdk -arch arm64' |
|---|
| 114 | :debug:configure CPATH='/opt/local/include' |
|---|
| 115 | :debug:configure CPPFLAGS='-I/opt/local/include -isysroot/Library/Developer/CommandLineTools/SDKs/MacOSX15.sdk' |
|---|
| 116 | :debug:configure CXX='/usr/bin/clang++' |
|---|
| 117 | :debug:configure CXXFLAGS='-pipe -Os -stdlib=libc++ -isysroot/Library/Developer/CommandLineTools/SDKs/MacOSX15.sdk -arch arm64' |
|---|
| 118 | :debug:configure DEVELOPER_DIR='/Library/Developer/CommandLineTools' |
|---|
| 119 | :debug:configure F90FLAGS='-pipe -Os -m64' |
|---|
| 120 | :debug:configure FCFLAGS='-pipe -Os -m64' |
|---|
| 121 | :debug:configure FFLAGS='-pipe -Os -m64' |
|---|
| 122 | :debug:configure INSTALL='/usr/bin/install -c' |
|---|
| 123 | :debug:configure LDFLAGS='-L/opt/local/lib -Wl,-headerpad_max_install_names -Wl,-syslibroot,/Library/Developer/CommandLineTools/SDKs/MacOSX15.sdk -arch arm64' |
|---|
| 124 | :debug:configure LIBRARY_PATH='/opt/local/lib' |
|---|
| 125 | :debug:configure MACOSX_DEPLOYMENT_TARGET='15.0' |
|---|
| 126 | :debug:configure OBJC='/usr/bin/clang' |
|---|
| 127 | :debug:configure OBJCFLAGS='-pipe -Os -isysroot/Library/Developer/CommandLineTools/SDKs/MacOSX15.sdk -arch arm64' |
|---|
| 128 | :debug:configure OBJCXX='/usr/bin/clang++' |
|---|
| 129 | :debug:configure OBJCXXFLAGS='-pipe -Os -stdlib=libc++ -isysroot/Library/Developer/CommandLineTools/SDKs/MacOSX15.sdk -arch arm64' |
|---|
| 130 | :debug:configure SDKROOT='/Library/Developer/CommandLineTools/SDKs/MacOSX15.sdk' |
|---|
| 131 | :debug:configure SOURCE_DATE_EPOCH='1727388815' |
|---|
| 132 | :info:configure Executing: cd "/opt/local/var/macports/build/_opt_local_var_macports_sources_rsync.macports.org_macports_release_tarballs_ports_devel_umem/umem/work/umem-1.0.1" && ./configure --prefix=/opt/local --mandir=/opt/local/share/man |
|---|
| 133 | :debug:configure system: cd "/opt/local/var/macports/build/_opt_local_var_macports_sources_rsync.macports.org_macports_release_tarballs_ports_devel_umem/umem/work/umem-1.0.1" && ./configure --prefix=/opt/local --mandir=/opt/local/share/man |
|---|
| 134 | :info:configure checking for a BSD-compatible install... /usr/bin/install -c |
|---|
| 135 | :info:configure checking whether build environment is sane... yes |
|---|
| 136 | :info:configure checking for gawk... no |
|---|
| 137 | :info:configure checking for mawk... no |
|---|
| 138 | :info:configure checking for nawk... no |
|---|
| 139 | :info:configure checking for awk... awk |
|---|
| 140 | :info:configure checking whether make sets $(MAKE)... yes |
|---|
| 141 | :info:configure checking for gcc... /usr/bin/clang |
|---|
| 142 | :info:configure checking for C compiler default output file name... a.out |
|---|
| 143 | :info:configure checking whether the C compiler works... yes |
|---|
| 144 | :info:configure checking whether we are cross compiling... no |
|---|
| 145 | :info:configure checking for suffix of executables... |
|---|
| 146 | :info:configure checking for suffix of object files... o |
|---|
| 147 | :info:configure checking whether we are using the GNU C compiler... yes |
|---|
| 148 | :info:configure checking whether /usr/bin/clang accepts -g... yes |
|---|
| 149 | :info:configure checking for /usr/bin/clang option to accept ANSI C... none needed |
|---|
| 150 | :info:configure checking for style of include used by make... GNU |
|---|
| 151 | :info:configure checking dependency style of /usr/bin/clang... gcc3 |
|---|
| 152 | :info:configure checking build system type... aarch64-apple-darwin24.0.0 |
|---|
| 153 | :info:configure checking host system type... aarch64-apple-darwin24.0.0 |
|---|
| 154 | :info:configure checking for a sed that does not truncate output... /opt/local/bin/gsed |
|---|
| 155 | :info:configure checking for egrep... grep -E |
|---|
| 156 | :info:configure checking for ld used by /usr/bin/clang... /Library/Developer/CommandLineTools/usr/bin/ld |
|---|
| 157 | :info:configure checking if the linker (/Library/Developer/CommandLineTools/usr/bin/ld) is GNU ld... no |
|---|
| 158 | :info:configure checking for /Library/Developer/CommandLineTools/usr/bin/ld option to reload object files... -r |
|---|
| 159 | :info:configure checking for BSD-compatible nm... /opt/local/bin/nm -B |
|---|
| 160 | :info:configure checking whether ln -s works... yes |
|---|
| 161 | :info:configure checking how to recognise dependent libraries... pass_all |
|---|
| 162 | :info:configure checking how to run the C preprocessor... /usr/bin/clang -E |
|---|
| 163 | :info:configure checking for ANSI C header files... yes |
|---|
| 164 | :info:configure checking for sys/types.h... yes |
|---|
| 165 | :info:configure checking for sys/stat.h... yes |
|---|
| 166 | :info:configure checking for stdlib.h... yes |
|---|
| 167 | :info:configure checking for string.h... yes |
|---|
| 168 | :info:configure checking for memory.h... yes |
|---|
| 169 | :info:configure checking for strings.h... yes |
|---|
| 170 | :info:configure checking for inttypes.h... yes |
|---|
| 171 | :info:configure checking for stdint.h... yes |
|---|
| 172 | :info:configure checking for unistd.h... yes |
|---|
| 173 | :info:configure checking dlfcn.h usability... yes |
|---|
| 174 | :info:configure checking dlfcn.h presence... yes |
|---|
| 175 | :info:configure checking for dlfcn.h... yes |
|---|
| 176 | :info:configure checking whether we are using the GNU C++ compiler... yes |
|---|
| 177 | :info:configure checking whether /usr/bin/clang++ accepts -g... yes |
|---|
| 178 | :info:configure checking dependency style of /usr/bin/clang++... gcc3 |
|---|
| 179 | :info:configure checking how to run the C++ preprocessor... /usr/bin/clang++ -E |
|---|
| 180 | :info:configure checking for g77... no |
|---|
| 181 | :info:configure checking for f77... no |
|---|
| 182 | :info:configure checking for xlf... no |
|---|
| 183 | :info:configure checking for frt... no |
|---|
| 184 | :info:configure checking for pgf77... no |
|---|
| 185 | :info:configure checking for fort77... no |
|---|
| 186 | :info:configure checking for fl32... no |
|---|
| 187 | :info:configure checking for af77... no |
|---|
| 188 | :info:configure checking for f90... no |
|---|
| 189 | :info:configure checking for xlf90... no |
|---|
| 190 | :info:configure checking for pgf90... no |
|---|
| 191 | :info:configure checking for epcf90... no |
|---|
| 192 | :info:configure checking for f95... no |
|---|
| 193 | :info:configure checking for fort... no |
|---|
| 194 | :info:configure checking for xlf95... no |
|---|
| 195 | :info:configure checking for ifc... no |
|---|
| 196 | :info:configure checking for efc... no |
|---|
| 197 | :info:configure checking for pgf95... no |
|---|
| 198 | :info:configure checking for lf95... no |
|---|
| 199 | :info:configure checking for gfortran... no |
|---|
| 200 | :info:configure checking whether we are using the GNU Fortran 77 compiler... no |
|---|
| 201 | :info:configure checking whether accepts -g... no |
|---|
| 202 | :info:configure checking the maximum length of command line arguments... 786432 |
|---|
| 203 | :info:configure checking command to parse /opt/local/bin/nm -B output from /usr/bin/clang object... ok |
|---|
| 204 | :info:configure checking for objdir... .libs |
|---|
| 205 | :info:configure checking for ar... ar |
|---|
| 206 | :info:configure checking for ranlib... ranlib |
|---|
| 207 | :info:configure checking for strip... strip |
|---|
| 208 | :info:configure checking if /usr/bin/clang supports -fno-rtti -fno-exceptions... yes |
|---|
| 209 | :info:configure checking for /usr/bin/clang option to produce PIC... -fno-common |
|---|
| 210 | :info:configure checking if /usr/bin/clang PIC flag -fno-common works... yes |
|---|
| 211 | :info:configure checking if /usr/bin/clang static flag -static works... no |
|---|
| 212 | :info:configure checking if /usr/bin/clang supports -c -o file.o... yes |
|---|
| 213 | :info:configure checking whether the /usr/bin/clang linker (/Library/Developer/CommandLineTools/usr/bin/ld) supports shared libraries... yes |
|---|
| 214 | :info:configure checking dynamic linker characteristics... darwin24.0.0 dyld |
|---|
| 215 | :info:configure checking how to hardcode library paths into programs... immediate |
|---|
| 216 | :info:configure checking whether stripping libraries is possible... yes |
|---|
| 217 | :info:configure checking if libtool supports shared libraries... yes |
|---|
| 218 | :info:configure checking whether to build shared libraries... yes |
|---|
| 219 | :info:configure checking whether to build static libraries... yes |
|---|
| 220 | :info:configure configure: creating libtool |
|---|
| 221 | :info:configure appending configuration tag "CXX" to libtool |
|---|
| 222 | :info:configure checking for ld used by /usr/bin/clang++... /Library/Developer/CommandLineTools/usr/bin/ld |
|---|
| 223 | :info:configure checking if the linker (/Library/Developer/CommandLineTools/usr/bin/ld) is GNU ld... no |
|---|
| 224 | :info:configure checking whether the /usr/bin/clang++ linker (/Library/Developer/CommandLineTools/usr/bin/ld) supports shared libraries... yes |
|---|
| 225 | :info:configure checking for /usr/bin/clang++ option to produce PIC... -fno-common |
|---|
| 226 | :info:configure checking if /usr/bin/clang++ PIC flag -fno-common works... yes |
|---|
| 227 | :info:configure checking if /usr/bin/clang++ static flag -static works... no |
|---|
| 228 | :info:configure checking if /usr/bin/clang++ supports -c -o file.o... yes |
|---|
| 229 | :info:configure checking whether the /usr/bin/clang++ linker (/Library/Developer/CommandLineTools/usr/bin/ld) supports shared libraries... yes |
|---|
| 230 | :info:configure checking dynamic linker characteristics... darwin24.0.0 dyld |
|---|
| 231 | :info:configure checking how to hardcode library paths into programs... immediate |
|---|
| 232 | :info:configure appending configuration tag "F77" to libtool |
|---|
| 233 | :info:configure checking for inline... inline |
|---|
| 234 | :info:configure checking whether pthread_mutex_t is larger than 24 bytes... no |
|---|
| 235 | :info:configure configure: WARNING: *** increasing umem cpu cache size to compensate. |
|---|
| 236 | :info:configure checking sys/mman.h usability... yes |
|---|
| 237 | :info:configure checking sys/mman.h presence... yes |
|---|
| 238 | :info:configure checking for sys/mman.h... yes |
|---|
| 239 | :info:configure checking sys/sysmacros.h usability... no |
|---|
| 240 | :info:configure checking sys/sysmacros.h presence... no |
|---|
| 241 | :info:configure checking for sys/sysmacros.h... no |
|---|
| 242 | :info:configure checking sys/time.h usability... yes |
|---|
| 243 | :info:configure checking sys/time.h presence... yes |
|---|
| 244 | :info:configure checking for sys/time.h... yes |
|---|
| 245 | :info:configure checking malloc.h usability... no |
|---|
| 246 | :info:configure checking malloc.h presence... no |
|---|
| 247 | :info:configure checking for malloc.h... no |
|---|
| 248 | :info:configure checking for issetugid... yes |
|---|
| 249 | :info:configure checking for mallinfo... no |
|---|
| 250 | :info:configure checking for malloc_stats... no |
|---|
| 251 | :info:configure configure: creating ./config.status |
|---|
| 252 | :info:configure config.status: creating Makefile |
|---|
| 253 | :info:configure config.status: creating Doxyfile |
|---|
| 254 | :info:configure config.status: creating umem.spec |
|---|
| 255 | :info:configure config.status: creating config.h |
|---|
| 256 | :info:configure config.status: executing depfiles commands |
|---|
| 257 | :debug:configure Executing portconfigure::configure_finish |
|---|
| 258 | :debug:configure Privilege de-escalation not attempted as not running as root. |
|---|
| 259 | :debug:build build phase started at Wed Oct 9 22:01:05 EEST 2024 |
|---|
| 260 | :notice:build ---> Building umem |
|---|
| 261 | :debug:build Executing org.macports.build (umem) |
|---|
| 262 | :debug:build port disallows a parallel build, setting build jobs to 1 |
|---|
| 263 | :debug:build port disallows a parallel build, setting build jobs to 1 |
|---|
| 264 | :debug:build Environment: |
|---|
| 265 | :debug:build CC_PRINT_OPTIONS='YES' |
|---|
| 266 | :debug:build CC_PRINT_OPTIONS_FILE='/opt/local/var/macports/build/_opt_local_var_macports_sources_rsync.macports.org_macports_release_tarballs_ports_devel_umem/umem/work/.CC_PRINT_OPTIONS' |
|---|
| 267 | :debug:build CPATH='/opt/local/include' |
|---|
| 268 | :debug:build DEVELOPER_DIR='/Library/Developer/CommandLineTools' |
|---|
| 269 | :debug:build LIBRARY_PATH='/opt/local/lib' |
|---|
| 270 | :debug:build MACOSX_DEPLOYMENT_TARGET='15.0' |
|---|
| 271 | :debug:build SDKROOT='/Library/Developer/CommandLineTools/SDKs/MacOSX15.sdk' |
|---|
| 272 | :debug:build SOURCE_DATE_EPOCH='1727388815' |
|---|
| 273 | :info:build Executing: cd "/opt/local/var/macports/build/_opt_local_var_macports_sources_rsync.macports.org_macports_release_tarballs_ports_devel_umem/umem/work/umem-1.0.1" && /usr/bin/make -w all |
|---|
| 274 | :debug:build system: cd "/opt/local/var/macports/build/_opt_local_var_macports_sources_rsync.macports.org_macports_release_tarballs_ports_devel_umem/umem/work/umem-1.0.1" && /usr/bin/make -w all |
|---|
| 275 | :info:build make: Entering directory `/opt/local/var/macports/build/_opt_local_var_macports_sources_rsync.macports.org_macports_release_tarballs_ports_devel_umem/umem/work/umem-1.0.1' |
|---|
| 276 | :info:build /Library/Developer/CommandLineTools/usr/bin/make all-am |
|---|
| 277 | :info:build make[1]: Entering directory `/opt/local/var/macports/build/_opt_local_var_macports_sources_rsync.macports.org_macports_release_tarballs_ports_devel_umem/umem/work/umem-1.0.1' |
|---|
| 278 | :info:build if /bin/sh ./libtool --tag=CC --mode=compile /usr/bin/clang -DHAVE_CONFIG_H -I. -I. -I. -I/opt/local/include -isysroot/Library/Developer/CommandLineTools/SDKs/MacOSX15.sdk -pipe -Os -isysroot/Library/Developer/CommandLineTools/SDKs/MacOSX15.sdk -arch arm64 -MT init_lib.lo -MD -MP -MF ".deps/init_lib.Tpo" -c -o init_lib.lo init_lib.c; \ |
|---|
| 279 | :info:build then mv -f ".deps/init_lib.Tpo" ".deps/init_lib.Plo"; else rm -f ".deps/init_lib.Tpo"; exit 1; fi |
|---|
| 280 | :info:build mkdir .libs |
|---|
| 281 | :info:build /usr/bin/clang -DHAVE_CONFIG_H -I. -I. -I. -I/opt/local/include -isysroot/Library/Developer/CommandLineTools/SDKs/MacOSX15.sdk -pipe -Os -isysroot/Library/Developer/CommandLineTools/SDKs/MacOSX15.sdk -arch arm64 -MT init_lib.lo -MD -MP -MF .deps/init_lib.Tpo -c init_lib.c -fno-common -DPIC -o .libs/init_lib.o |
|---|
| 282 | :info:build /usr/bin/clang -DHAVE_CONFIG_H -I. -I. -I. -I/opt/local/include -isysroot/Library/Developer/CommandLineTools/SDKs/MacOSX15.sdk -pipe -Os -isysroot/Library/Developer/CommandLineTools/SDKs/MacOSX15.sdk -arch arm64 -MT init_lib.lo -MD -MP -MF .deps/init_lib.Tpo -c init_lib.c -o init_lib.o >/dev/null 2>&1 |
|---|
| 283 | :info:build if /bin/sh ./libtool --tag=CC --mode=compile /usr/bin/clang -DHAVE_CONFIG_H -I. -I. -I. -I/opt/local/include -isysroot/Library/Developer/CommandLineTools/SDKs/MacOSX15.sdk -pipe -Os -isysroot/Library/Developer/CommandLineTools/SDKs/MacOSX15.sdk -arch arm64 -MT umem_agent_support.lo -MD -MP -MF ".deps/umem_agent_support.Tpo" -c -o umem_agent_support.lo umem_agent_support.c; \ |
|---|
| 284 | :info:build then mv -f ".deps/umem_agent_support.Tpo" ".deps/umem_agent_support.Plo"; else rm -f ".deps/umem_agent_support.Tpo"; exit 1; fi |
|---|
| 285 | :info:build /usr/bin/clang -DHAVE_CONFIG_H -I. -I. -I. -I/opt/local/include -isysroot/Library/Developer/CommandLineTools/SDKs/MacOSX15.sdk -pipe -Os -isysroot/Library/Developer/CommandLineTools/SDKs/MacOSX15.sdk -arch arm64 -MT umem_agent_support.lo -MD -MP -MF .deps/umem_agent_support.Tpo -c umem_agent_support.c -fno-common -DPIC -o .libs/umem_agent_support.o |
|---|
| 286 | :info:build /usr/bin/clang -DHAVE_CONFIG_H -I. -I. -I. -I/opt/local/include -isysroot/Library/Developer/CommandLineTools/SDKs/MacOSX15.sdk -pipe -Os -isysroot/Library/Developer/CommandLineTools/SDKs/MacOSX15.sdk -arch arm64 -MT umem_agent_support.lo -MD -MP -MF .deps/umem_agent_support.Tpo -c umem_agent_support.c -o umem_agent_support.o >/dev/null 2>&1 |
|---|
| 287 | :info:build if /bin/sh ./libtool --tag=CC --mode=compile /usr/bin/clang -DHAVE_CONFIG_H -I. -I. -I. -I/opt/local/include -isysroot/Library/Developer/CommandLineTools/SDKs/MacOSX15.sdk -pipe -Os -isysroot/Library/Developer/CommandLineTools/SDKs/MacOSX15.sdk -arch arm64 -MT umem_fail.lo -MD -MP -MF ".deps/umem_fail.Tpo" -c -o umem_fail.lo umem_fail.c; \ |
|---|
| 288 | :info:build then mv -f ".deps/umem_fail.Tpo" ".deps/umem_fail.Plo"; else rm -f ".deps/umem_fail.Tpo"; exit 1; fi |
|---|
| 289 | :info:build /usr/bin/clang -DHAVE_CONFIG_H -I. -I. -I. -I/opt/local/include -isysroot/Library/Developer/CommandLineTools/SDKs/MacOSX15.sdk -pipe -Os -isysroot/Library/Developer/CommandLineTools/SDKs/MacOSX15.sdk -arch arm64 -MT umem_fail.lo -MD -MP -MF .deps/umem_fail.Tpo -c umem_fail.c -fno-common -DPIC -o .libs/umem_fail.o |
|---|
| 290 | :info:build umem_fail.c:176:2: warning: function '__umem_assert_failed' declared 'noreturn' should not return [-Winvalid-noreturn] |
|---|
| 291 | :info:build 176 | return (0); |
|---|
| 292 | :info:build | ^ |
|---|
| 293 | :info:build 1 warning generated. |
|---|
| 294 | :info:build /usr/bin/clang -DHAVE_CONFIG_H -I. -I. -I. -I/opt/local/include -isysroot/Library/Developer/CommandLineTools/SDKs/MacOSX15.sdk -pipe -Os -isysroot/Library/Developer/CommandLineTools/SDKs/MacOSX15.sdk -arch arm64 -MT umem_fail.lo -MD -MP -MF .deps/umem_fail.Tpo -c umem_fail.c -o umem_fail.o >/dev/null 2>&1 |
|---|
| 295 | :info:build if /bin/sh ./libtool --tag=CC --mode=compile /usr/bin/clang -DHAVE_CONFIG_H -I. -I. -I. -I/opt/local/include -isysroot/Library/Developer/CommandLineTools/SDKs/MacOSX15.sdk -pipe -Os -isysroot/Library/Developer/CommandLineTools/SDKs/MacOSX15.sdk -arch arm64 -MT umem_fork.lo -MD -MP -MF ".deps/umem_fork.Tpo" -c -o umem_fork.lo umem_fork.c; \ |
|---|
| 296 | :info:build then mv -f ".deps/umem_fork.Tpo" ".deps/umem_fork.Plo"; else rm -f ".deps/umem_fork.Tpo"; exit 1; fi |
|---|
| 297 | :info:build /usr/bin/clang -DHAVE_CONFIG_H -I. -I. -I. -I/opt/local/include -isysroot/Library/Developer/CommandLineTools/SDKs/MacOSX15.sdk -pipe -Os -isysroot/Library/Developer/CommandLineTools/SDKs/MacOSX15.sdk -arch arm64 -MT umem_fork.lo -MD -MP -MF .deps/umem_fork.Tpo -c umem_fork.c -fno-common -DPIC -o .libs/umem_fork.o |
|---|
| 298 | :info:build /usr/bin/clang -DHAVE_CONFIG_H -I. -I. -I. -I/opt/local/include -isysroot/Library/Developer/CommandLineTools/SDKs/MacOSX15.sdk -pipe -Os -isysroot/Library/Developer/CommandLineTools/SDKs/MacOSX15.sdk -arch arm64 -MT umem_fork.lo -MD -MP -MF .deps/umem_fork.Tpo -c umem_fork.c -o umem_fork.o >/dev/null 2>&1 |
|---|
| 299 | :info:build if /bin/sh ./libtool --tag=CC --mode=compile /usr/bin/clang -DHAVE_CONFIG_H -I. -I. -I. -I/opt/local/include -isysroot/Library/Developer/CommandLineTools/SDKs/MacOSX15.sdk -pipe -Os -isysroot/Library/Developer/CommandLineTools/SDKs/MacOSX15.sdk -arch arm64 -MT umem_update_thread.lo -MD -MP -MF ".deps/umem_update_thread.Tpo" -c -o umem_update_thread.lo umem_update_thread.c; \ |
|---|
| 300 | :info:build then mv -f ".deps/umem_update_thread.Tpo" ".deps/umem_update_thread.Plo"; else rm -f ".deps/umem_update_thread.Tpo"; exit 1; fi |
|---|
| 301 | :info:build /usr/bin/clang -DHAVE_CONFIG_H -I. -I. -I. -I/opt/local/include -isysroot/Library/Developer/CommandLineTools/SDKs/MacOSX15.sdk -pipe -Os -isysroot/Library/Developer/CommandLineTools/SDKs/MacOSX15.sdk -arch arm64 -MT umem_update_thread.lo -MD -MP -MF .deps/umem_update_thread.Tpo -c umem_update_thread.c -fno-common -DPIC -o .libs/umem_update_thread.o |
|---|
| 302 | :info:build /usr/bin/clang -DHAVE_CONFIG_H -I. -I. -I. -I/opt/local/include -isysroot/Library/Developer/CommandLineTools/SDKs/MacOSX15.sdk -pipe -Os -isysroot/Library/Developer/CommandLineTools/SDKs/MacOSX15.sdk -arch arm64 -MT umem_update_thread.lo -MD -MP -MF .deps/umem_update_thread.Tpo -c umem_update_thread.c -o umem_update_thread.o >/dev/null 2>&1 |
|---|
| 303 | :info:build if /bin/sh ./libtool --tag=CC --mode=compile /usr/bin/clang -DHAVE_CONFIG_H -I. -I. -I. -I/opt/local/include -isysroot/Library/Developer/CommandLineTools/SDKs/MacOSX15.sdk -pipe -Os -isysroot/Library/Developer/CommandLineTools/SDKs/MacOSX15.sdk -arch arm64 -MT vmem_mmap.lo -MD -MP -MF ".deps/vmem_mmap.Tpo" -c -o vmem_mmap.lo vmem_mmap.c; \ |
|---|
| 304 | :info:build then mv -f ".deps/vmem_mmap.Tpo" ".deps/vmem_mmap.Plo"; else rm -f ".deps/vmem_mmap.Tpo"; exit 1; fi |
|---|
| 305 | :info:build /usr/bin/clang -DHAVE_CONFIG_H -I. -I. -I. -I/opt/local/include -isysroot/Library/Developer/CommandLineTools/SDKs/MacOSX15.sdk -pipe -Os -isysroot/Library/Developer/CommandLineTools/SDKs/MacOSX15.sdk -arch arm64 -MT vmem_mmap.lo -MD -MP -MF .deps/vmem_mmap.Tpo -c vmem_mmap.c -fno-common -DPIC -o .libs/vmem_mmap.o |
|---|
| 306 | :info:build /usr/bin/clang -DHAVE_CONFIG_H -I. -I. -I. -I/opt/local/include -isysroot/Library/Developer/CommandLineTools/SDKs/MacOSX15.sdk -pipe -Os -isysroot/Library/Developer/CommandLineTools/SDKs/MacOSX15.sdk -arch arm64 -MT vmem_mmap.lo -MD -MP -MF .deps/vmem_mmap.Tpo -c vmem_mmap.c -o vmem_mmap.o >/dev/null 2>&1 |
|---|
| 307 | :info:build if /bin/sh ./libtool --tag=CC --mode=compile /usr/bin/clang -DHAVE_CONFIG_H -I. -I. -I. -I/opt/local/include -isysroot/Library/Developer/CommandLineTools/SDKs/MacOSX15.sdk -pipe -Os -isysroot/Library/Developer/CommandLineTools/SDKs/MacOSX15.sdk -arch arm64 -MT vmem_sbrk.lo -MD -MP -MF ".deps/vmem_sbrk.Tpo" -c -o vmem_sbrk.lo vmem_sbrk.c; \ |
|---|
| 308 | :info:build then mv -f ".deps/vmem_sbrk.Tpo" ".deps/vmem_sbrk.Plo"; else rm -f ".deps/vmem_sbrk.Tpo"; exit 1; fi |
|---|
| 309 | :info:build /usr/bin/clang -DHAVE_CONFIG_H -I. -I. -I. -I/opt/local/include -isysroot/Library/Developer/CommandLineTools/SDKs/MacOSX15.sdk -pipe -Os -isysroot/Library/Developer/CommandLineTools/SDKs/MacOSX15.sdk -arch arm64 -MT vmem_sbrk.lo -MD -MP -MF .deps/vmem_sbrk.Tpo -c vmem_sbrk.c -fno-common -DPIC -o .libs/vmem_sbrk.o |
|---|
| 310 | :info:build vmem_sbrk.c:124:33: warning: 'sbrk' is deprecated [-Wdeprecated-declarations] |
|---|
| 311 | :info:build 124 | old_brk = (uintptr_t)BRKALIGN(sbrk(0)); |
|---|
| 312 | :info:build | ^ |
|---|
| 313 | :info:build /Library/Developer/CommandLineTools/SDKs/MacOSX15.sdk/usr/include/unistd.h:582:1: note: 'sbrk' has been explicitly marked deprecated here |
|---|
| 314 | :info:build 582 | __deprecated __WATCHOS_PROHIBITED __TVOS_PROHIBITED |
|---|
| 315 | :info:build | ^ |
|---|
| 316 | :info:build /Library/Developer/CommandLineTools/SDKs/MacOSX15.sdk/usr/include/sys/cdefs.h:214:40: note: expanded from macro '__deprecated' |
|---|
| 317 | :info:build 214 | #define __deprecated __attribute__((__deprecated__)) |
|---|
| 318 | :info:build | ^ |
|---|
| 319 | :info:build vmem_sbrk.c:137:16: warning: 'brk' is deprecated [-Wdeprecated-declarations] |
|---|
| 320 | :info:build 137 | brk_result = brk((void *)new_brk); |
|---|
| 321 | :info:build | ^ |
|---|
| 322 | :info:build /Library/Developer/CommandLineTools/SDKs/MacOSX15.sdk/usr/include/unistd.h:538:1: note: 'brk' has been explicitly marked deprecated here |
|---|
| 323 | :info:build 538 | __deprecated __WATCHOS_PROHIBITED __TVOS_PROHIBITED |
|---|
| 324 | :info:build | ^ |
|---|
| 325 | :info:build /Library/Developer/CommandLineTools/SDKs/MacOSX15.sdk/usr/include/sys/cdefs.h:214:40: note: expanded from macro '__deprecated' |
|---|
| 326 | :info:build 214 | #define __deprecated __attribute__((__deprecated__)) |
|---|
| 327 | :info:build | ^ |
|---|
| 328 | :info:build vmem_sbrk.c:137:14: error: incompatible pointer to integer conversion assigning to 'int' from 'void *' [-Wint-conversion] |
|---|
| 329 | :info:build 137 | brk_result = brk((void *)new_brk); |
|---|
| 330 | :info:build | ^ ~~~~~~~~~~~~~~~~~~~~ |
|---|
| 331 | :info:build 2 warnings and 1 error generated. |
|---|
| 332 | :info:build make[1]: *** [vmem_sbrk.lo] Error 1 |
|---|
| 333 | :info:build make[1]: Leaving directory `/opt/local/var/macports/build/_opt_local_var_macports_sources_rsync.macports.org_macports_release_tarballs_ports_devel_umem/umem/work/umem-1.0.1' |
|---|
| 334 | :info:build make: *** [all] Error 2 |
|---|
| 335 | :info:build make: Leaving directory `/opt/local/var/macports/build/_opt_local_var_macports_sources_rsync.macports.org_macports_release_tarballs_ports_devel_umem/umem/work/umem-1.0.1' |
|---|
| 336 | :info:build Command failed: cd "/opt/local/var/macports/build/_opt_local_var_macports_sources_rsync.macports.org_macports_release_tarballs_ports_devel_umem/umem/work/umem-1.0.1" && /usr/bin/make -w all |
|---|
| 337 | :info:build Exit code: 2 |
|---|
| 338 | :error:build Failed to build umem: command execution failed |
|---|
| 339 | :debug:build Error code: CHILDSTATUS 23638 2 |
|---|
| 340 | :debug:build Backtrace: command execution failed |
|---|
| 341 | :debug:build while executing |
|---|
| 342 | :debug:build "system {*}$notty {*}$callback {*}$nice $fullcmdstring" |
|---|
| 343 | :debug:build invoked from within |
|---|
| 344 | :debug:build "command_exec -callback portprogress::target_progress_callback build" |
|---|
| 345 | :debug:build (procedure "portbuild::build_main" line 10) |
|---|
| 346 | :debug:build invoked from within |
|---|
| 347 | :debug:build "$procedure $targetname" |
|---|
| 348 | :error:build See /opt/local/var/macports/logs/_opt_local_var_macports_sources_rsync.macports.org_macports_release_tarballs_ports_devel_umem/umem/main.log for details. |
|---|
| 349 | version:1 |
|---|
| 350 | :debug:main Starting logging for umem @1.0.1_1 |
|---|
| 351 | :debug:sysinfo macOS 15.0.1 (darwin/24.0.0) arch arm |
|---|
| 352 | :debug:sysinfo MacPorts 2.10.2 |
|---|
| 353 | :debug:sysinfo Xcode 16.0, CLT 16.0.0.0.1.1724870825 |
|---|
| 354 | :debug:sysinfo SDK 15 |
|---|
| 355 | :debug:sysinfo MACOSX_DEPLOYMENT_TARGET: 15.0 |
|---|
| 356 | :debug:main dropping privileges: euid changed to 502, egid changed to 501. |
|---|
| 357 | :debug:main Executing org.macports.main (umem) |
|---|
| 358 | :debug:main Privilege de-escalation not attempted as not running as root. |
|---|
| 359 | :debug:archivefetch archivefetch phase started at Wed Oct 9 22:02:16 EEST 2024 |
|---|
| 360 | :msg:archivefetch ---> Fetching archive for umem |
|---|
| 361 | :debug:archivefetch Executing org.macports.archivefetch (umem) |
|---|
| 362 | :debug:archivefetch euid/egid changed to: 0/0 |
|---|
| 363 | :debug:archivefetch chowned /opt/local/var/macports/incoming to macports |
|---|
| 364 | :debug:archivefetch euid/egid changed to: 502/501 |
|---|
| 365 | :info:archivefetch ---> umem-1.0.1_1.darwin_24.arm64.tbz2 doesn't seem to exist in /opt/local/var/macports/incoming/verified |
|---|
| 366 | :msg:archivefetch ---> Attempting to fetch umem-1.0.1_1.darwin_24.arm64.tbz2 from https://packages.macports.org/umem |
|---|
| 367 | :debug:archivefetch Fetching archive failed: The requested URL returned error: 404 |
|---|
| 368 | :msg:archivefetch ---> Attempting to fetch umem-1.0.1_1.darwin_24.arm64.tbz2 from https://cph.dk.packages.macports.org/umem |
|---|
| 369 | :debug:archivefetch Fetching archive failed: The requested URL returned error: 404 |
|---|
| 370 | :msg:archivefetch ---> Attempting to fetch umem-1.0.1_1.darwin_24.arm64.tbz2 from https://nue.de.packages.macports.org/umem |
|---|
| 371 | :debug:archivefetch Fetching archive failed: The requested URL returned error: 404 |
|---|
| 372 | :debug:archivefetch Privilege de-escalation not attempted as not running as root. |
|---|
| 373 | :debug:archivefetch Skipping completed org.macports.fetch (umem) |
|---|
| 374 | :debug:archivefetch Privilege de-escalation not attempted as not running as root. |
|---|
| 375 | :debug:archivefetch Skipping completed org.macports.checksum (umem) |
|---|
| 376 | :debug:archivefetch Privilege de-escalation not attempted as not running as root. |
|---|
| 377 | :debug:archivefetch Skipping completed org.macports.extract (umem) |
|---|
| 378 | :debug:archivefetch Privilege de-escalation not attempted as not running as root. |
|---|
| 379 | :debug:archivefetch Skipping completed org.macports.patch (umem) |
|---|
| 380 | :debug:archivefetch Privilege de-escalation not attempted as not running as root. |
|---|
| 381 | :debug:archivefetch Skipping completed org.macports.configure (umem) |
|---|
| 382 | :debug:archivefetch Privilege de-escalation not attempted as not running as root. |
|---|
| 383 | :debug:build build phase started at Wed Oct 9 22:02:16 EEST 2024 |
|---|
| 384 | :notice:build ---> Building umem |
|---|
| 385 | :debug:build Executing org.macports.build (umem) |
|---|
| 386 | :debug:build port disallows a parallel build, setting build jobs to 1 |
|---|
| 387 | :debug:build port disallows a parallel build, setting build jobs to 1 |
|---|
| 388 | :debug:build Environment: |
|---|
| 389 | :debug:build CC_PRINT_OPTIONS='YES' |
|---|
| 390 | :debug:build CC_PRINT_OPTIONS_FILE='/opt/local/var/macports/build/_opt_local_var_macports_sources_rsync.macports.org_macports_release_tarballs_ports_devel_umem/umem/work/.CC_PRINT_OPTIONS' |
|---|
| 391 | :debug:build CPATH='/opt/local/include' |
|---|
| 392 | :debug:build DEVELOPER_DIR='/Library/Developer/CommandLineTools' |
|---|
| 393 | :debug:build LIBRARY_PATH='/opt/local/lib' |
|---|
| 394 | :debug:build MACOSX_DEPLOYMENT_TARGET='15.0' |
|---|
| 395 | :debug:build SDKROOT='/Library/Developer/CommandLineTools/SDKs/MacOSX15.sdk' |
|---|
| 396 | :debug:build SOURCE_DATE_EPOCH='1727388815' |
|---|
| 397 | :info:build Executing: cd "/opt/local/var/macports/build/_opt_local_var_macports_sources_rsync.macports.org_macports_release_tarballs_ports_devel_umem/umem/work/umem-1.0.1" && /usr/bin/make -w all |
|---|
| 398 | :debug:build system: cd "/opt/local/var/macports/build/_opt_local_var_macports_sources_rsync.macports.org_macports_release_tarballs_ports_devel_umem/umem/work/umem-1.0.1" && /usr/bin/make -w all |
|---|
| 399 | :info:build make: Entering directory `/opt/local/var/macports/build/_opt_local_var_macports_sources_rsync.macports.org_macports_release_tarballs_ports_devel_umem/umem/work/umem-1.0.1' |
|---|
| 400 | :info:build /Library/Developer/CommandLineTools/usr/bin/make all-am |
|---|
| 401 | :info:build make[1]: Entering directory `/opt/local/var/macports/build/_opt_local_var_macports_sources_rsync.macports.org_macports_release_tarballs_ports_devel_umem/umem/work/umem-1.0.1' |
|---|
| 402 | :info:build if /bin/sh ./libtool --tag=CC --mode=compile /usr/bin/clang -DHAVE_CONFIG_H -I. -I. -I. -I/opt/local/include -isysroot/Library/Developer/CommandLineTools/SDKs/MacOSX15.sdk -pipe -Os -isysroot/Library/Developer/CommandLineTools/SDKs/MacOSX15.sdk -arch arm64 -MT vmem_sbrk.lo -MD -MP -MF ".deps/vmem_sbrk.Tpo" -c -o vmem_sbrk.lo vmem_sbrk.c; \ |
|---|
| 403 | :info:build then mv -f ".deps/vmem_sbrk.Tpo" ".deps/vmem_sbrk.Plo"; else rm -f ".deps/vmem_sbrk.Tpo"; exit 1; fi |
|---|
| 404 | :info:build /usr/bin/clang -DHAVE_CONFIG_H -I. -I. -I. -I/opt/local/include -isysroot/Library/Developer/CommandLineTools/SDKs/MacOSX15.sdk -pipe -Os -isysroot/Library/Developer/CommandLineTools/SDKs/MacOSX15.sdk -arch arm64 -MT vmem_sbrk.lo -MD -MP -MF .deps/vmem_sbrk.Tpo -c vmem_sbrk.c -fno-common -DPIC -o .libs/vmem_sbrk.o |
|---|
| 405 | :info:build vmem_sbrk.c:124:33: warning: 'sbrk' is deprecated [-Wdeprecated-declarations] |
|---|
| 406 | :info:build 124 | old_brk = (uintptr_t)BRKALIGN(sbrk(0)); |
|---|
| 407 | :info:build | ^ |
|---|
| 408 | :info:build /Library/Developer/CommandLineTools/SDKs/MacOSX15.sdk/usr/include/unistd.h:582:1: note: 'sbrk' has been explicitly marked deprecated here |
|---|
| 409 | :info:build 582 | __deprecated __WATCHOS_PROHIBITED __TVOS_PROHIBITED |
|---|
| 410 | :info:build | ^ |
|---|
| 411 | :info:build /Library/Developer/CommandLineTools/SDKs/MacOSX15.sdk/usr/include/sys/cdefs.h:214:40: note: expanded from macro '__deprecated' |
|---|
| 412 | :info:build 214 | #define __deprecated __attribute__((__deprecated__)) |
|---|
| 413 | :info:build | ^ |
|---|
| 414 | :info:build vmem_sbrk.c:137:16: warning: 'brk' is deprecated [-Wdeprecated-declarations] |
|---|
| 415 | :info:build 137 | brk_result = brk((void *)new_brk); |
|---|
| 416 | :info:build | ^ |
|---|
| 417 | :info:build /Library/Developer/CommandLineTools/SDKs/MacOSX15.sdk/usr/include/unistd.h:538:1: note: 'brk' has been explicitly marked deprecated here |
|---|
| 418 | :info:build 538 | __deprecated __WATCHOS_PROHIBITED __TVOS_PROHIBITED |
|---|
| 419 | :info:build | ^ |
|---|
| 420 | :info:build /Library/Developer/CommandLineTools/SDKs/MacOSX15.sdk/usr/include/sys/cdefs.h:214:40: note: expanded from macro '__deprecated' |
|---|
| 421 | :info:build 214 | #define __deprecated __attribute__((__deprecated__)) |
|---|
| 422 | :info:build | ^ |
|---|
| 423 | :info:build vmem_sbrk.c:137:14: error: incompatible pointer to integer conversion assigning to 'int' from 'void *' [-Wint-conversion] |
|---|
| 424 | :info:build 137 | brk_result = brk((void *)new_brk); |
|---|
| 425 | :info:build | ^ ~~~~~~~~~~~~~~~~~~~~ |
|---|
| 426 | :info:build 2 warnings and 1 error generated. |
|---|
| 427 | :info:build make[1]: *** [vmem_sbrk.lo] Error 1 |
|---|
| 428 | :info:build make[1]: Leaving directory `/opt/local/var/macports/build/_opt_local_var_macports_sources_rsync.macports.org_macports_release_tarballs_ports_devel_umem/umem/work/umem-1.0.1' |
|---|
| 429 | :info:build make: *** [all] Error 2 |
|---|
| 430 | :info:build make: Leaving directory `/opt/local/var/macports/build/_opt_local_var_macports_sources_rsync.macports.org_macports_release_tarballs_ports_devel_umem/umem/work/umem-1.0.1' |
|---|
| 431 | :info:build Command failed: cd "/opt/local/var/macports/build/_opt_local_var_macports_sources_rsync.macports.org_macports_release_tarballs_ports_devel_umem/umem/work/umem-1.0.1" && /usr/bin/make -w all |
|---|
| 432 | :info:build Exit code: 2 |
|---|
| 433 | :error:build Failed to build umem: command execution failed |
|---|
| 434 | :debug:build Error code: CHILDSTATUS 47411 2 |
|---|
| 435 | :debug:build Backtrace: command execution failed |
|---|
| 436 | :debug:build while executing |
|---|
| 437 | :debug:build "system {*}$notty {*}$callback {*}$nice $fullcmdstring" |
|---|
| 438 | :debug:build invoked from within |
|---|
| 439 | :debug:build "command_exec -callback portprogress::target_progress_callback build" |
|---|
| 440 | :debug:build (procedure "portbuild::build_main" line 10) |
|---|
| 441 | :debug:build invoked from within |
|---|
| 442 | :debug:build "$procedure $targetname" |
|---|
| 443 | :error:build See /opt/local/var/macports/logs/_opt_local_var_macports_sources_rsync.macports.org_macports_release_tarballs_ports_devel_umem/umem/main.log for details. |
|---|
| 444 | version:1 |
|---|
| 445 | :debug:main Starting logging for umem @1.0.1_1 |
|---|
| 446 | :debug:sysinfo macOS 15.0.1 (darwin/24.0.0) arch arm |
|---|
| 447 | :debug:sysinfo MacPorts 2.10.2 |
|---|
| 448 | :debug:sysinfo Xcode 16.0, CLT 16.0.0.0.1.1724870825 |
|---|
| 449 | :debug:sysinfo SDK 15 |
|---|
| 450 | :debug:sysinfo MACOSX_DEPLOYMENT_TARGET: 15.0 |
|---|
| 451 | :debug:main Fetching umem-1.0.1_1.darwin_24.arm64.tbz2 archive size |
|---|
| 452 | :debug:main epoch: in tree: 0 installed: 0 |
|---|
| 453 | :debug:main automake 1.17_0 exists in the ports tree |
|---|
| 454 | :debug:main automake 1.17_0 is the latest installed |
|---|
| 455 | :debug:main automake 1.17_0 is active |
|---|
| 456 | :debug:main Merging existing requested variants '' into variants |
|---|
| 457 | :debug:main new fully merged portvariants: |
|---|
| 458 | :debug:main Opening port in directory: /opt/local/var/macports/sources/rsync.macports.org/macports/release/tarballs/ports/devel/automake |
|---|
| 459 | :debug:main OS darwin/24.0.0 (macOS 15.0.1) arch arm |
|---|
| 460 | :debug:main only one arch supported, so not adding the default universal variant |
|---|
| 461 | :debug:main Running callback portconfigure::add_automatic_compiler_dependencies |
|---|
| 462 | :debug:main Finished running callback portconfigure::add_automatic_compiler_dependencies |
|---|
| 463 | :debug:main Running callback portbuild::add_automatic_buildsystem_dependencies |
|---|
| 464 | :debug:main Finished running callback portbuild::add_automatic_buildsystem_dependencies |
|---|
| 465 | :debug:main Running callback portstartupitem::add_notes |
|---|
| 466 | :debug:main Finished running callback portstartupitem::add_notes |
|---|
| 467 | :debug:main No need to upgrade! automake 1.17_0 >= automake 1.17_0 |
|---|
| 468 | :msg:main ---> Computing dependencies for umem:info:main .:debug:main umem has no conflicts |
|---|
| 469 | :debug:main Searching for dependency: automake |
|---|
| 470 | :debug:main Found Dependency: receipt exists for automake |
|---|
| 471 | :debug:main Executing org.macports.main (umem) |
|---|
| 472 | :debug:main dropping privileges: euid changed to 502, egid changed to 501. |
|---|
| 473 | :debug:main Privilege de-escalation not attempted as not running as root. |
|---|
| 474 | :debug:archivefetch archivefetch phase started at Wed Oct 9 22:02:36 EEST 2024 |
|---|
| 475 | :msg:archivefetch ---> Fetching archive for umem |
|---|
| 476 | :debug:archivefetch Executing org.macports.archivefetch (umem) |
|---|
| 477 | :debug:archivefetch euid/egid changed to: 0/0 |
|---|
| 478 | :debug:archivefetch chowned /opt/local/var/macports/incoming to macports |
|---|
| 479 | :debug:archivefetch euid/egid changed to: 502/501 |
|---|
| 480 | :info:archivefetch ---> umem-1.0.1_1.darwin_24.arm64.tbz2 doesn't seem to exist in /opt/local/var/macports/incoming/verified |
|---|
| 481 | :msg:archivefetch ---> Attempting to fetch umem-1.0.1_1.darwin_24.arm64.tbz2 from https://packages.macports.org/umem |
|---|
| 482 | :debug:archivefetch Fetching archive failed: The requested URL returned error: 404 |
|---|
| 483 | :msg:archivefetch ---> Attempting to fetch umem-1.0.1_1.darwin_24.arm64.tbz2 from https://cph.dk.packages.macports.org/umem |
|---|
| 484 | :debug:archivefetch Fetching archive failed: The requested URL returned error: 404 |
|---|
| 485 | :msg:archivefetch ---> Attempting to fetch umem-1.0.1_1.darwin_24.arm64.tbz2 from https://nue.de.packages.macports.org/umem |
|---|
| 486 | :debug:archivefetch Fetching archive failed: The requested URL returned error: 404 |
|---|
| 487 | :debug:archivefetch Privilege de-escalation not attempted as not running as root. |
|---|
| 488 | :debug:archivefetch Skipping completed org.macports.fetch (umem) |
|---|
| 489 | :debug:archivefetch Privilege de-escalation not attempted as not running as root. |
|---|
| 490 | :debug:archivefetch Skipping completed org.macports.checksum (umem) |
|---|
| 491 | :debug:archivefetch Privilege de-escalation not attempted as not running as root. |
|---|
| 492 | :debug:archivefetch Skipping completed org.macports.extract (umem) |
|---|
| 493 | :debug:archivefetch Privilege de-escalation not attempted as not running as root. |
|---|
| 494 | :debug:archivefetch Skipping completed org.macports.patch (umem) |
|---|
| 495 | :debug:archivefetch Privilege de-escalation not attempted as not running as root. |
|---|
| 496 | :debug:archivefetch Skipping completed org.macports.configure (umem) |
|---|
| 497 | :debug:archivefetch Privilege de-escalation not attempted as not running as root. |
|---|
| 498 | :debug:build build phase started at Wed Oct 9 22:02:37 EEST 2024 |
|---|
| 499 | :notice:build ---> Building umem |
|---|
| 500 | :debug:build Executing org.macports.build (umem) |
|---|
| 501 | :debug:build port disallows a parallel build, setting build jobs to 1 |
|---|
| 502 | :debug:build port disallows a parallel build, setting build jobs to 1 |
|---|
| 503 | :debug:build Environment: |
|---|
| 504 | :debug:build CC_PRINT_OPTIONS='YES' |
|---|
| 505 | :debug:build CC_PRINT_OPTIONS_FILE='/opt/local/var/macports/build/_opt_local_var_macports_sources_rsync.macports.org_macports_release_tarballs_ports_devel_umem/umem/work/.CC_PRINT_OPTIONS' |
|---|
| 506 | :debug:build CPATH='/opt/local/include' |
|---|
| 507 | :debug:build DEVELOPER_DIR='/Library/Developer/CommandLineTools' |
|---|
| 508 | :debug:build LIBRARY_PATH='/opt/local/lib' |
|---|
| 509 | :debug:build MACOSX_DEPLOYMENT_TARGET='15.0' |
|---|
| 510 | :debug:build SDKROOT='/Library/Developer/CommandLineTools/SDKs/MacOSX15.sdk' |
|---|
| 511 | :debug:build SOURCE_DATE_EPOCH='1727388815' |
|---|
| 512 | :info:build Executing: cd "/opt/local/var/macports/build/_opt_local_var_macports_sources_rsync.macports.org_macports_release_tarballs_ports_devel_umem/umem/work/umem-1.0.1" && /usr/bin/make -w all |
|---|
| 513 | :debug:build system: cd "/opt/local/var/macports/build/_opt_local_var_macports_sources_rsync.macports.org_macports_release_tarballs_ports_devel_umem/umem/work/umem-1.0.1" && /usr/bin/make -w all |
|---|
| 514 | :info:build make: Entering directory `/opt/local/var/macports/build/_opt_local_var_macports_sources_rsync.macports.org_macports_release_tarballs_ports_devel_umem/umem/work/umem-1.0.1' |
|---|
| 515 | :info:build /Library/Developer/CommandLineTools/usr/bin/make all-am |
|---|
| 516 | :info:build make[1]: Entering directory `/opt/local/var/macports/build/_opt_local_var_macports_sources_rsync.macports.org_macports_release_tarballs_ports_devel_umem/umem/work/umem-1.0.1' |
|---|
| 517 | :info:build if /bin/sh ./libtool --tag=CC --mode=compile /usr/bin/clang -DHAVE_CONFIG_H -I. -I. -I. -I/opt/local/include -isysroot/Library/Developer/CommandLineTools/SDKs/MacOSX15.sdk -pipe -Os -isysroot/Library/Developer/CommandLineTools/SDKs/MacOSX15.sdk -arch arm64 -MT vmem_sbrk.lo -MD -MP -MF ".deps/vmem_sbrk.Tpo" -c -o vmem_sbrk.lo vmem_sbrk.c; \ |
|---|
| 518 | :info:build then mv -f ".deps/vmem_sbrk.Tpo" ".deps/vmem_sbrk.Plo"; else rm -f ".deps/vmem_sbrk.Tpo"; exit 1; fi |
|---|
| 519 | :info:build /usr/bin/clang -DHAVE_CONFIG_H -I. -I. -I. -I/opt/local/include -isysroot/Library/Developer/CommandLineTools/SDKs/MacOSX15.sdk -pipe -Os -isysroot/Library/Developer/CommandLineTools/SDKs/MacOSX15.sdk -arch arm64 -MT vmem_sbrk.lo -MD -MP -MF .deps/vmem_sbrk.Tpo -c vmem_sbrk.c -fno-common -DPIC -o .libs/vmem_sbrk.o |
|---|
| 520 | :info:build vmem_sbrk.c:124:33: warning: 'sbrk' is deprecated [-Wdeprecated-declarations] |
|---|
| 521 | :info:build 124 | old_brk = (uintptr_t)BRKALIGN(sbrk(0)); |
|---|
| 522 | :info:build | ^ |
|---|
| 523 | :info:build /Library/Developer/CommandLineTools/SDKs/MacOSX15.sdk/usr/include/unistd.h:582:1: note: 'sbrk' has been explicitly marked deprecated here |
|---|
| 524 | :info:build 582 | __deprecated __WATCHOS_PROHIBITED __TVOS_PROHIBITED |
|---|
| 525 | :info:build | ^ |
|---|
| 526 | :info:build /Library/Developer/CommandLineTools/SDKs/MacOSX15.sdk/usr/include/sys/cdefs.h:214:40: note: expanded from macro '__deprecated' |
|---|
| 527 | :info:build 214 | #define __deprecated __attribute__((__deprecated__)) |
|---|
| 528 | :info:build | ^ |
|---|
| 529 | :info:build vmem_sbrk.c:137:16: warning: 'brk' is deprecated [-Wdeprecated-declarations] |
|---|
| 530 | :info:build 137 | brk_result = brk((void *)new_brk); |
|---|
| 531 | :info:build | ^ |
|---|
| 532 | :info:build /Library/Developer/CommandLineTools/SDKs/MacOSX15.sdk/usr/include/unistd.h:538:1: note: 'brk' has been explicitly marked deprecated here |
|---|
| 533 | :info:build 538 | __deprecated __WATCHOS_PROHIBITED __TVOS_PROHIBITED |
|---|
| 534 | :info:build | ^ |
|---|
| 535 | :info:build /Library/Developer/CommandLineTools/SDKs/MacOSX15.sdk/usr/include/sys/cdefs.h:214:40: note: expanded from macro '__deprecated' |
|---|
| 536 | :info:build 214 | #define __deprecated __attribute__((__deprecated__)) |
|---|
| 537 | :info:build | ^ |
|---|
| 538 | :info:build vmem_sbrk.c:137:14: error: incompatible pointer to integer conversion assigning to 'int' from 'void *' [-Wint-conversion] |
|---|
| 539 | :info:build 137 | brk_result = brk((void *)new_brk); |
|---|
| 540 | :info:build | ^ ~~~~~~~~~~~~~~~~~~~~ |
|---|
| 541 | :info:build 2 warnings and 1 error generated. |
|---|
| 542 | :info:build make[1]: *** [vmem_sbrk.lo] Error 1 |
|---|
| 543 | :info:build make[1]: Leaving directory `/opt/local/var/macports/build/_opt_local_var_macports_sources_rsync.macports.org_macports_release_tarballs_ports_devel_umem/umem/work/umem-1.0.1' |
|---|
| 544 | :info:build make: *** [all] Error 2 |
|---|
| 545 | :info:build make: Leaving directory `/opt/local/var/macports/build/_opt_local_var_macports_sources_rsync.macports.org_macports_release_tarballs_ports_devel_umem/umem/work/umem-1.0.1' |
|---|
| 546 | :info:build Command failed: cd "/opt/local/var/macports/build/_opt_local_var_macports_sources_rsync.macports.org_macports_release_tarballs_ports_devel_umem/umem/work/umem-1.0.1" && /usr/bin/make -w all |
|---|
| 547 | :info:build Exit code: 2 |
|---|
| 548 | :error:build Failed to build umem: command execution failed |
|---|
| 549 | :debug:build Error code: CHILDSTATUS 47758 2 |
|---|
| 550 | :debug:build Backtrace: command execution failed |
|---|
| 551 | :debug:build while executing |
|---|
| 552 | :debug:build "system {*}$notty {*}$callback {*}$nice $fullcmdstring" |
|---|
| 553 | :debug:build invoked from within |
|---|
| 554 | :debug:build "command_exec -callback portprogress::target_progress_callback build" |
|---|
| 555 | :debug:build (procedure "portbuild::build_main" line 10) |
|---|
| 556 | :debug:build invoked from within |
|---|
| 557 | :debug:build "$procedure $targetname" |
|---|
| 558 | :error:build See /opt/local/var/macports/logs/_opt_local_var_macports_sources_rsync.macports.org_macports_release_tarballs_ports_devel_umem/umem/main.log for details. |
|---|
| 559 | version:1 |
|---|
| 560 | :debug:main Starting logging for umem @1.0.1_1 |
|---|
| 561 | :debug:sysinfo macOS 15.0.1 (darwin/24.0.0) arch arm |
|---|
| 562 | :debug:sysinfo MacPorts 2.10.2 |
|---|
| 563 | :debug:sysinfo Xcode 16.0, CLT 16.0.0.0.1.1724870825 |
|---|
| 564 | :debug:sysinfo SDK 15 |
|---|
| 565 | :debug:sysinfo MACOSX_DEPLOYMENT_TARGET: 15.0 |
|---|
| 566 | :debug:main Fetching umem-1.0.1_1.darwin_24.arm64.tbz2 archive size |
|---|
| 567 | :debug:main epoch: in tree: 0 installed: 0 |
|---|
| 568 | :debug:main automake 1.17_0 exists in the ports tree |
|---|
| 569 | :debug:main automake 1.17_0 is the latest installed |
|---|
| 570 | :debug:main automake 1.17_0 is active |
|---|
| 571 | :debug:main Merging existing requested variants '' into variants |
|---|
| 572 | :debug:main new fully merged portvariants: |
|---|
| 573 | :debug:main Opening port in directory: /opt/local/var/macports/sources/rsync.macports.org/macports/release/tarballs/ports/devel/automake |
|---|
| 574 | :debug:main OS darwin/24.0.0 (macOS 15.0.1) arch arm |
|---|
| 575 | :debug:main only one arch supported, so not adding the default universal variant |
|---|
| 576 | :debug:main Running callback portconfigure::add_automatic_compiler_dependencies |
|---|
| 577 | :debug:main Finished running callback portconfigure::add_automatic_compiler_dependencies |
|---|
| 578 | :debug:main Running callback portbuild::add_automatic_buildsystem_dependencies |
|---|
| 579 | :debug:main Finished running callback portbuild::add_automatic_buildsystem_dependencies |
|---|
| 580 | :debug:main Running callback portstartupitem::add_notes |
|---|
| 581 | :debug:main Finished running callback portstartupitem::add_notes |
|---|
| 582 | :debug:main No need to upgrade! automake 1.17_0 >= automake 1.17_0 |
|---|
| 583 | :msg:main ---> Computing dependencies for umem:info:main .:debug:main umem has no conflicts |
|---|
| 584 | :debug:main Searching for dependency: automake |
|---|
| 585 | :debug:main Found Dependency: receipt exists for automake |
|---|
| 586 | :debug:main Executing org.macports.main (umem) |
|---|
| 587 | :debug:main dropping privileges: euid changed to 502, egid changed to 501. |
|---|
| 588 | :debug:main Privilege de-escalation not attempted as not running as root. |
|---|
| 589 | :debug:archivefetch archivefetch phase started at Wed Oct 9 22:04:26 EEST 2024 |
|---|
| 590 | :msg:archivefetch ---> Fetching archive for umem |
|---|
| 591 | :debug:archivefetch Executing org.macports.archivefetch (umem) |
|---|
| 592 | :debug:archivefetch euid/egid changed to: 0/0 |
|---|
| 593 | :debug:archivefetch chowned /opt/local/var/macports/incoming to macports |
|---|
| 594 | :debug:archivefetch euid/egid changed to: 502/501 |
|---|
| 595 | :info:archivefetch ---> umem-1.0.1_1.darwin_24.arm64.tbz2 doesn't seem to exist in /opt/local/var/macports/incoming/verified |
|---|
| 596 | :msg:archivefetch ---> Attempting to fetch umem-1.0.1_1.darwin_24.arm64.tbz2 from https://packages.macports.org/umem |
|---|
| 597 | :debug:archivefetch Fetching archive failed: The requested URL returned error: 404 |
|---|
| 598 | :msg:archivefetch ---> Attempting to fetch umem-1.0.1_1.darwin_24.arm64.tbz2 from https://cph.dk.packages.macports.org/umem |
|---|
| 599 | :debug:archivefetch Fetching archive failed: The requested URL returned error: 404 |
|---|
| 600 | :msg:archivefetch ---> Attempting to fetch umem-1.0.1_1.darwin_24.arm64.tbz2 from https://nue.de.packages.macports.org/umem |
|---|
| 601 | :debug:archivefetch Fetching archive failed: The requested URL returned error: 404 |
|---|
| 602 | :debug:archivefetch Privilege de-escalation not attempted as not running as root. |
|---|
| 603 | :debug:archivefetch Skipping completed org.macports.fetch (umem) |
|---|
| 604 | :debug:archivefetch Privilege de-escalation not attempted as not running as root. |
|---|
| 605 | :debug:archivefetch Skipping completed org.macports.checksum (umem) |
|---|
| 606 | :debug:archivefetch Privilege de-escalation not attempted as not running as root. |
|---|
| 607 | :debug:archivefetch Skipping completed org.macports.extract (umem) |
|---|
| 608 | :debug:archivefetch Privilege de-escalation not attempted as not running as root. |
|---|
| 609 | :debug:archivefetch Skipping completed org.macports.patch (umem) |
|---|
| 610 | :debug:archivefetch Privilege de-escalation not attempted as not running as root. |
|---|
| 611 | :debug:archivefetch Skipping completed org.macports.configure (umem) |
|---|
| 612 | :debug:archivefetch Privilege de-escalation not attempted as not running as root. |
|---|
| 613 | :debug:build build phase started at Wed Oct 9 22:04:26 EEST 2024 |
|---|
| 614 | :notice:build ---> Building umem |
|---|
| 615 | :debug:build Executing org.macports.build (umem) |
|---|
| 616 | :debug:build port disallows a parallel build, setting build jobs to 1 |
|---|
| 617 | :debug:build port disallows a parallel build, setting build jobs to 1 |
|---|
| 618 | :debug:build Environment: |
|---|
| 619 | :debug:build CC_PRINT_OPTIONS='YES' |
|---|
| 620 | :debug:build CC_PRINT_OPTIONS_FILE='/opt/local/var/macports/build/_opt_local_var_macports_sources_rsync.macports.org_macports_release_tarballs_ports_devel_umem/umem/work/.CC_PRINT_OPTIONS' |
|---|
| 621 | :debug:build CPATH='/opt/local/include' |
|---|
| 622 | :debug:build DEVELOPER_DIR='/Library/Developer/CommandLineTools' |
|---|
| 623 | :debug:build LIBRARY_PATH='/opt/local/lib' |
|---|
| 624 | :debug:build MACOSX_DEPLOYMENT_TARGET='15.0' |
|---|
| 625 | :debug:build SDKROOT='/Library/Developer/CommandLineTools/SDKs/MacOSX15.sdk' |
|---|
| 626 | :debug:build SOURCE_DATE_EPOCH='1727388815' |
|---|
| 627 | :info:build Executing: cd "/opt/local/var/macports/build/_opt_local_var_macports_sources_rsync.macports.org_macports_release_tarballs_ports_devel_umem/umem/work/umem-1.0.1" && /usr/bin/make -w all |
|---|
| 628 | :debug:build system: cd "/opt/local/var/macports/build/_opt_local_var_macports_sources_rsync.macports.org_macports_release_tarballs_ports_devel_umem/umem/work/umem-1.0.1" && /usr/bin/make -w all |
|---|
| 629 | :info:build make: Entering directory `/opt/local/var/macports/build/_opt_local_var_macports_sources_rsync.macports.org_macports_release_tarballs_ports_devel_umem/umem/work/umem-1.0.1' |
|---|
| 630 | :info:build /Library/Developer/CommandLineTools/usr/bin/make all-am |
|---|
| 631 | :info:build make[1]: Entering directory `/opt/local/var/macports/build/_opt_local_var_macports_sources_rsync.macports.org_macports_release_tarballs_ports_devel_umem/umem/work/umem-1.0.1' |
|---|
| 632 | :info:build if /bin/sh ./libtool --tag=CC --mode=compile /usr/bin/clang -DHAVE_CONFIG_H -I. -I. -I. -I/opt/local/include -isysroot/Library/Developer/CommandLineTools/SDKs/MacOSX15.sdk -pipe -Os -isysroot/Library/Developer/CommandLineTools/SDKs/MacOSX15.sdk -arch arm64 -MT vmem_sbrk.lo -MD -MP -MF ".deps/vmem_sbrk.Tpo" -c -o vmem_sbrk.lo vmem_sbrk.c; \ |
|---|
| 633 | :info:build then mv -f ".deps/vmem_sbrk.Tpo" ".deps/vmem_sbrk.Plo"; else rm -f ".deps/vmem_sbrk.Tpo"; exit 1; fi |
|---|
| 634 | :info:build /usr/bin/clang -DHAVE_CONFIG_H -I. -I. -I. -I/opt/local/include -isysroot/Library/Developer/CommandLineTools/SDKs/MacOSX15.sdk -pipe -Os -isysroot/Library/Developer/CommandLineTools/SDKs/MacOSX15.sdk -arch arm64 -MT vmem_sbrk.lo -MD -MP -MF .deps/vmem_sbrk.Tpo -c vmem_sbrk.c -fno-common -DPIC -o .libs/vmem_sbrk.o |
|---|
| 635 | :info:build vmem_sbrk.c:124:33: warning: 'sbrk' is deprecated [-Wdeprecated-declarations] |
|---|
| 636 | :info:build 124 | old_brk = (uintptr_t)BRKALIGN(sbrk(0)); |
|---|
| 637 | :info:build | ^ |
|---|
| 638 | :info:build /Library/Developer/CommandLineTools/SDKs/MacOSX15.sdk/usr/include/unistd.h:582:1: note: 'sbrk' has been explicitly marked deprecated here |
|---|
| 639 | :info:build 582 | __deprecated __WATCHOS_PROHIBITED __TVOS_PROHIBITED |
|---|
| 640 | :info:build | ^ |
|---|
| 641 | :info:build /Library/Developer/CommandLineTools/SDKs/MacOSX15.sdk/usr/include/sys/cdefs.h:214:40: note: expanded from macro '__deprecated' |
|---|
| 642 | :info:build 214 | #define __deprecated __attribute__((__deprecated__)) |
|---|
| 643 | :info:build | ^ |
|---|
| 644 | :info:build vmem_sbrk.c:137:16: warning: 'brk' is deprecated [-Wdeprecated-declarations] |
|---|
| 645 | :info:build 137 | brk_result = brk((void *)new_brk); |
|---|
| 646 | :info:build | ^ |
|---|
| 647 | :info:build /Library/Developer/CommandLineTools/SDKs/MacOSX15.sdk/usr/include/unistd.h:538:1: note: 'brk' has been explicitly marked deprecated here |
|---|
| 648 | :info:build 538 | __deprecated __WATCHOS_PROHIBITED __TVOS_PROHIBITED |
|---|
| 649 | :info:build | ^ |
|---|
| 650 | :info:build /Library/Developer/CommandLineTools/SDKs/MacOSX15.sdk/usr/include/sys/cdefs.h:214:40: note: expanded from macro '__deprecated' |
|---|
| 651 | :info:build 214 | #define __deprecated __attribute__((__deprecated__)) |
|---|
| 652 | :info:build | ^ |
|---|
| 653 | :info:build vmem_sbrk.c:137:14: error: incompatible pointer to integer conversion assigning to 'int' from 'void *' [-Wint-conversion] |
|---|
| 654 | :info:build 137 | brk_result = brk((void *)new_brk); |
|---|
| 655 | :info:build | ^ ~~~~~~~~~~~~~~~~~~~~ |
|---|
| 656 | :info:build 2 warnings and 1 error generated. |
|---|
| 657 | :info:build make[1]: *** [vmem_sbrk.lo] Error 1 |
|---|
| 658 | :info:build make[1]: Leaving directory `/opt/local/var/macports/build/_opt_local_var_macports_sources_rsync.macports.org_macports_release_tarballs_ports_devel_umem/umem/work/umem-1.0.1' |
|---|
| 659 | :info:build make: *** [all] Error 2 |
|---|
| 660 | :info:build make: Leaving directory `/opt/local/var/macports/build/_opt_local_var_macports_sources_rsync.macports.org_macports_release_tarballs_ports_devel_umem/umem/work/umem-1.0.1' |
|---|
| 661 | :info:build Command failed: cd "/opt/local/var/macports/build/_opt_local_var_macports_sources_rsync.macports.org_macports_release_tarballs_ports_devel_umem/umem/work/umem-1.0.1" && /usr/bin/make -w all |
|---|
| 662 | :info:build Exit code: 2 |
|---|
| 663 | :error:build Failed to build umem: command execution failed |
|---|
| 664 | :debug:build Error code: CHILDSTATUS 51424 2 |
|---|
| 665 | :debug:build Backtrace: command execution failed |
|---|
| 666 | :debug:build while executing |
|---|
| 667 | :debug:build "system {*}$notty {*}$callback {*}$nice $fullcmdstring" |
|---|
| 668 | :debug:build invoked from within |
|---|
| 669 | :debug:build "command_exec -callback portprogress::target_progress_callback build" |
|---|
| 670 | :debug:build (procedure "portbuild::build_main" line 10) |
|---|
| 671 | :debug:build invoked from within |
|---|
| 672 | :debug:build "$procedure $targetname" |
|---|
| 673 | :error:build See /opt/local/var/macports/logs/_opt_local_var_macports_sources_rsync.macports.org_macports_release_tarballs_ports_devel_umem/umem/main.log for details. |
|---|
| 674 | version:1 |
|---|
| 675 | :debug:main Starting logging for umem @1.0.1_1 |
|---|
| 676 | :debug:sysinfo macOS 15.0.1 (darwin/24.0.0) arch arm |
|---|
| 677 | :debug:sysinfo MacPorts 2.10.2 |
|---|
| 678 | :debug:sysinfo Xcode 16.0, CLT 16.0.0.0.1.1724870825 |
|---|
| 679 | :debug:sysinfo SDK 15 |
|---|
| 680 | :debug:sysinfo MACOSX_DEPLOYMENT_TARGET: 15.0 |
|---|
| 681 | :debug:main Fetching umem-1.0.1_1.darwin_24.arm64.tbz2 archive size |
|---|
| 682 | :debug:main epoch: in tree: 0 installed: 0 |
|---|
| 683 | :debug:main automake 1.17_0 exists in the ports tree |
|---|
| 684 | :debug:main automake 1.17_0 is the latest installed |
|---|
| 685 | :debug:main automake 1.17_0 is active |
|---|
| 686 | :debug:main Merging existing requested variants '' into variants |
|---|
| 687 | :debug:main new fully merged portvariants: |
|---|
| 688 | :debug:main Opening port in directory: /opt/local/var/macports/sources/rsync.macports.org/macports/release/tarballs/ports/devel/automake |
|---|
| 689 | :debug:main OS darwin/24.0.0 (macOS 15.0.1) arch arm |
|---|
| 690 | :debug:main only one arch supported, so not adding the default universal variant |
|---|
| 691 | :debug:main Running callback portconfigure::add_automatic_compiler_dependencies |
|---|
| 692 | :debug:main Finished running callback portconfigure::add_automatic_compiler_dependencies |
|---|
| 693 | :debug:main Running callback portbuild::add_automatic_buildsystem_dependencies |
|---|
| 694 | :debug:main Finished running callback portbuild::add_automatic_buildsystem_dependencies |
|---|
| 695 | :debug:main Running callback portstartupitem::add_notes |
|---|
| 696 | :debug:main Finished running callback portstartupitem::add_notes |
|---|
| 697 | :debug:main No need to upgrade! automake 1.17_0 >= automake 1.17_0 |
|---|
| 698 | :msg:main ---> Computing dependencies for umem:info:main .:debug:main umem has no conflicts |
|---|
| 699 | :debug:main Searching for dependency: automake |
|---|
| 700 | :debug:main Found Dependency: receipt exists for automake |
|---|
| 701 | :debug:main Executing org.macports.main (umem) |
|---|
| 702 | :debug:main dropping privileges: euid changed to 502, egid changed to 501. |
|---|
| 703 | :debug:main Privilege de-escalation not attempted as not running as root. |
|---|
| 704 | :debug:archivefetch archivefetch phase started at Wed Oct 9 22:13:50 EEST 2024 |
|---|
| 705 | :msg:archivefetch ---> Fetching archive for umem |
|---|
| 706 | :debug:archivefetch Executing org.macports.archivefetch (umem) |
|---|
| 707 | :debug:archivefetch euid/egid changed to: 0/0 |
|---|
| 708 | :debug:archivefetch chowned /opt/local/var/macports/incoming to macports |
|---|
| 709 | :debug:archivefetch euid/egid changed to: 502/501 |
|---|
| 710 | :info:archivefetch ---> umem-1.0.1_1.darwin_24.arm64.tbz2 doesn't seem to exist in /opt/local/var/macports/incoming/verified |
|---|
| 711 | :msg:archivefetch ---> Attempting to fetch umem-1.0.1_1.darwin_24.arm64.tbz2 from https://packages.macports.org/umem |
|---|
| 712 | :debug:archivefetch Fetching archive failed: The requested URL returned error: 404 |
|---|
| 713 | :msg:archivefetch ---> Attempting to fetch umem-1.0.1_1.darwin_24.arm64.tbz2 from https://cph.dk.packages.macports.org/umem |
|---|
| 714 | :debug:archivefetch Fetching archive failed: The requested URL returned error: 404 |
|---|
| 715 | :msg:archivefetch ---> Attempting to fetch umem-1.0.1_1.darwin_24.arm64.tbz2 from https://nue.de.packages.macports.org/umem |
|---|
| 716 | :debug:archivefetch Fetching archive failed: The requested URL returned error: 404 |
|---|
| 717 | :debug:archivefetch Privilege de-escalation not attempted as not running as root. |
|---|
| 718 | :debug:archivefetch Skipping completed org.macports.fetch (umem) |
|---|
| 719 | :debug:archivefetch Privilege de-escalation not attempted as not running as root. |
|---|
| 720 | :debug:archivefetch Skipping completed org.macports.checksum (umem) |
|---|
| 721 | :debug:archivefetch Privilege de-escalation not attempted as not running as root. |
|---|
| 722 | :debug:archivefetch Skipping completed org.macports.extract (umem) |
|---|
| 723 | :debug:archivefetch Privilege de-escalation not attempted as not running as root. |
|---|
| 724 | :debug:archivefetch Skipping completed org.macports.patch (umem) |
|---|
| 725 | :debug:archivefetch Privilege de-escalation not attempted as not running as root. |
|---|
| 726 | :debug:archivefetch Skipping completed org.macports.configure (umem) |
|---|
| 727 | :debug:archivefetch Privilege de-escalation not attempted as not running as root. |
|---|
| 728 | :debug:build build phase started at Wed Oct 9 22:13:51 EEST 2024 |
|---|
| 729 | :notice:build ---> Building umem |
|---|
| 730 | :debug:build Executing org.macports.build (umem) |
|---|
| 731 | :debug:build port disallows a parallel build, setting build jobs to 1 |
|---|
| 732 | :debug:build port disallows a parallel build, setting build jobs to 1 |
|---|
| 733 | :debug:build Environment: |
|---|
| 734 | :debug:build CC_PRINT_OPTIONS='YES' |
|---|
| 735 | :debug:build CC_PRINT_OPTIONS_FILE='/opt/local/var/macports/build/_opt_local_var_macports_sources_rsync.macports.org_macports_release_tarballs_ports_devel_umem/umem/work/.CC_PRINT_OPTIONS' |
|---|
| 736 | :debug:build CPATH='/opt/local/include' |
|---|
| 737 | :debug:build DEVELOPER_DIR='/Library/Developer/CommandLineTools' |
|---|
| 738 | :debug:build LIBRARY_PATH='/opt/local/lib' |
|---|
| 739 | :debug:build MACOSX_DEPLOYMENT_TARGET='15.0' |
|---|
| 740 | :debug:build SDKROOT='/Library/Developer/CommandLineTools/SDKs/MacOSX15.sdk' |
|---|
| 741 | :debug:build SOURCE_DATE_EPOCH='1727388815' |
|---|
| 742 | :info:build Executing: cd "/opt/local/var/macports/build/_opt_local_var_macports_sources_rsync.macports.org_macports_release_tarballs_ports_devel_umem/umem/work/umem-1.0.1" && /usr/bin/make -w all |
|---|
| 743 | :debug:build system: cd "/opt/local/var/macports/build/_opt_local_var_macports_sources_rsync.macports.org_macports_release_tarballs_ports_devel_umem/umem/work/umem-1.0.1" && /usr/bin/make -w all |
|---|
| 744 | :info:build make: Entering directory `/opt/local/var/macports/build/_opt_local_var_macports_sources_rsync.macports.org_macports_release_tarballs_ports_devel_umem/umem/work/umem-1.0.1' |
|---|
| 745 | :info:build /Library/Developer/CommandLineTools/usr/bin/make all-am |
|---|
| 746 | :info:build make[1]: Entering directory `/opt/local/var/macports/build/_opt_local_var_macports_sources_rsync.macports.org_macports_release_tarballs_ports_devel_umem/umem/work/umem-1.0.1' |
|---|
| 747 | :info:build if /bin/sh ./libtool --tag=CC --mode=compile /usr/bin/clang -DHAVE_CONFIG_H -I. -I. -I. -I/opt/local/include -isysroot/Library/Developer/CommandLineTools/SDKs/MacOSX15.sdk -pipe -Os -isysroot/Library/Developer/CommandLineTools/SDKs/MacOSX15.sdk -arch arm64 -MT vmem_sbrk.lo -MD -MP -MF ".deps/vmem_sbrk.Tpo" -c -o vmem_sbrk.lo vmem_sbrk.c; \ |
|---|
| 748 | :info:build then mv -f ".deps/vmem_sbrk.Tpo" ".deps/vmem_sbrk.Plo"; else rm -f ".deps/vmem_sbrk.Tpo"; exit 1; fi |
|---|
| 749 | :info:build /usr/bin/clang -DHAVE_CONFIG_H -I. -I. -I. -I/opt/local/include -isysroot/Library/Developer/CommandLineTools/SDKs/MacOSX15.sdk -pipe -Os -isysroot/Library/Developer/CommandLineTools/SDKs/MacOSX15.sdk -arch arm64 -MT vmem_sbrk.lo -MD -MP -MF .deps/vmem_sbrk.Tpo -c vmem_sbrk.c -fno-common -DPIC -o .libs/vmem_sbrk.o |
|---|
| 750 | :info:build vmem_sbrk.c:124:33: warning: 'sbrk' is deprecated [-Wdeprecated-declarations] |
|---|
| 751 | :info:build 124 | old_brk = (uintptr_t)BRKALIGN(sbrk(0)); |
|---|
| 752 | :info:build | ^ |
|---|
| 753 | :info:build /Library/Developer/CommandLineTools/SDKs/MacOSX15.sdk/usr/include/unistd.h:582:1: note: 'sbrk' has been explicitly marked deprecated here |
|---|
| 754 | :info:build 582 | __deprecated __WATCHOS_PROHIBITED __TVOS_PROHIBITED |
|---|
| 755 | :info:build | ^ |
|---|
| 756 | :info:build /Library/Developer/CommandLineTools/SDKs/MacOSX15.sdk/usr/include/sys/cdefs.h:214:40: note: expanded from macro '__deprecated' |
|---|
| 757 | :info:build 214 | #define __deprecated __attribute__((__deprecated__)) |
|---|
| 758 | :info:build | ^ |
|---|
| 759 | :info:build vmem_sbrk.c:137:16: warning: 'brk' is deprecated [-Wdeprecated-declarations] |
|---|
| 760 | :info:build 137 | brk_result = brk((void *)new_brk); |
|---|
| 761 | :info:build | ^ |
|---|
| 762 | :info:build /Library/Developer/CommandLineTools/SDKs/MacOSX15.sdk/usr/include/unistd.h:538:1: note: 'brk' has been explicitly marked deprecated here |
|---|
| 763 | :info:build 538 | __deprecated __WATCHOS_PROHIBITED __TVOS_PROHIBITED |
|---|
| 764 | :info:build | ^ |
|---|
| 765 | :info:build /Library/Developer/CommandLineTools/SDKs/MacOSX15.sdk/usr/include/sys/cdefs.h:214:40: note: expanded from macro '__deprecated' |
|---|
| 766 | :info:build 214 | #define __deprecated __attribute__((__deprecated__)) |
|---|
| 767 | :info:build | ^ |
|---|
| 768 | :info:build vmem_sbrk.c:137:14: error: incompatible pointer to integer conversion assigning to 'int' from 'void *' [-Wint-conversion] |
|---|
| 769 | :info:build 137 | brk_result = brk((void *)new_brk); |
|---|
| 770 | :info:build | ^ ~~~~~~~~~~~~~~~~~~~~ |
|---|
| 771 | :info:build 2 warnings and 1 error generated. |
|---|
| 772 | :info:build make[1]: *** [vmem_sbrk.lo] Error 1 |
|---|
| 773 | :info:build make[1]: Leaving directory `/opt/local/var/macports/build/_opt_local_var_macports_sources_rsync.macports.org_macports_release_tarballs_ports_devel_umem/umem/work/umem-1.0.1' |
|---|
| 774 | :info:build make: *** [all] Error 2 |
|---|
| 775 | :info:build make: Leaving directory `/opt/local/var/macports/build/_opt_local_var_macports_sources_rsync.macports.org_macports_release_tarballs_ports_devel_umem/umem/work/umem-1.0.1' |
|---|
| 776 | :info:build Command failed: cd "/opt/local/var/macports/build/_opt_local_var_macports_sources_rsync.macports.org_macports_release_tarballs_ports_devel_umem/umem/work/umem-1.0.1" && /usr/bin/make -w all |
|---|
| 777 | :info:build Exit code: 2 |
|---|
| 778 | :error:build Failed to build umem: command execution failed |
|---|
| 779 | :debug:build Error code: CHILDSTATUS 57761 2 |
|---|
| 780 | :debug:build Backtrace: command execution failed |
|---|
| 781 | :debug:build while executing |
|---|
| 782 | :debug:build "system {*}$notty {*}$callback {*}$nice $fullcmdstring" |
|---|
| 783 | :debug:build invoked from within |
|---|
| 784 | :debug:build "command_exec -callback portprogress::target_progress_callback build" |
|---|
| 785 | :debug:build (procedure "portbuild::build_main" line 10) |
|---|
| 786 | :debug:build invoked from within |
|---|
| 787 | :debug:build "$procedure $targetname" |
|---|
| 788 | :error:build See /opt/local/var/macports/logs/_opt_local_var_macports_sources_rsync.macports.org_macports_release_tarballs_ports_devel_umem/umem/main.log for details. |
|---|
| 789 | version:1 |
|---|
| 790 | :debug:main Starting logging for umem @1.0.1_1 |
|---|
| 791 | :debug:sysinfo macOS 15.0.1 (darwin/24.0.0) arch arm |
|---|
| 792 | :debug:sysinfo MacPorts 2.10.2 |
|---|
| 793 | :debug:sysinfo Xcode 16.0, CLT 16.0.0.0.1.1724870825 |
|---|
| 794 | :debug:sysinfo SDK 15 |
|---|
| 795 | :debug:sysinfo MACOSX_DEPLOYMENT_TARGET: 15.0 |
|---|
| 796 | :debug:main dropping privileges: euid changed to 502, egid changed to 501. |
|---|
| 797 | :debug:main Executing org.macports.main (umem) |
|---|
| 798 | :debug:main Privilege de-escalation not attempted as not running as root. |
|---|
| 799 | :debug:archivefetch archivefetch phase started at Fri Oct 11 11:05:30 EEST 2024 |
|---|
| 800 | :msg:archivefetch ---> Fetching archive for umem |
|---|
| 801 | :debug:archivefetch Executing org.macports.archivefetch (umem) |
|---|
| 802 | :debug:archivefetch euid/egid changed to: 0/0 |
|---|
| 803 | :debug:archivefetch chowned /opt/local/var/macports/incoming to macports |
|---|
| 804 | :debug:archivefetch euid/egid changed to: 502/501 |
|---|
| 805 | :info:archivefetch ---> umem-1.0.1_1.darwin_24.arm64.tbz2 doesn't seem to exist in /opt/local/var/macports/incoming/verified |
|---|
| 806 | :msg:archivefetch ---> Attempting to fetch umem-1.0.1_1.darwin_24.arm64.tbz2 from https://packages.macports.org/umem |
|---|
| 807 | :debug:archivefetch Fetching archive failed: The requested URL returned error: 404 |
|---|
| 808 | :msg:archivefetch ---> Attempting to fetch umem-1.0.1_1.darwin_24.arm64.tbz2 from https://cph.dk.packages.macports.org/umem |
|---|
| 809 | :debug:archivefetch Fetching archive failed: The requested URL returned error: 404 |
|---|
| 810 | :msg:archivefetch ---> Attempting to fetch umem-1.0.1_1.darwin_24.arm64.tbz2 from https://nue.de.packages.macports.org/umem |
|---|
| 811 | :debug:archivefetch Fetching archive failed: The requested URL returned error: 404 |
|---|
| 812 | :debug:archivefetch Privilege de-escalation not attempted as not running as root. |
|---|
| 813 | :debug:archivefetch Skipping completed org.macports.fetch (umem) |
|---|
| 814 | :debug:archivefetch Privilege de-escalation not attempted as not running as root. |
|---|
| 815 | :debug:archivefetch Skipping completed org.macports.checksum (umem) |
|---|
| 816 | :debug:archivefetch Privilege de-escalation not attempted as not running as root. |
|---|
| 817 | :debug:archivefetch Skipping completed org.macports.extract (umem) |
|---|
| 818 | :debug:archivefetch Privilege de-escalation not attempted as not running as root. |
|---|
| 819 | :debug:archivefetch Skipping completed org.macports.patch (umem) |
|---|
| 820 | :debug:archivefetch Privilege de-escalation not attempted as not running as root. |
|---|
| 821 | :debug:archivefetch Skipping completed org.macports.configure (umem) |
|---|
| 822 | :debug:archivefetch Privilege de-escalation not attempted as not running as root. |
|---|
| 823 | :debug:build build phase started at Fri Oct 11 11:05:33 EEST 2024 |
|---|
| 824 | :notice:build ---> Building umem |
|---|
| 825 | :debug:build Executing org.macports.build (umem) |
|---|
| 826 | :debug:build port disallows a parallel build, setting build jobs to 1 |
|---|
| 827 | :debug:build port disallows a parallel build, setting build jobs to 1 |
|---|
| 828 | :debug:build Environment: |
|---|
| 829 | :debug:build CC_PRINT_OPTIONS='YES' |
|---|
| 830 | :debug:build CC_PRINT_OPTIONS_FILE='/opt/local/var/macports/build/_opt_local_var_macports_sources_rsync.macports.org_macports_release_tarballs_ports_devel_umem/umem/work/.CC_PRINT_OPTIONS' |
|---|
| 831 | :debug:build CPATH='/opt/local/include' |
|---|
| 832 | :debug:build DEVELOPER_DIR='/Library/Developer/CommandLineTools' |
|---|
| 833 | :debug:build LIBRARY_PATH='/opt/local/lib' |
|---|
| 834 | :debug:build MACOSX_DEPLOYMENT_TARGET='15.0' |
|---|
| 835 | :debug:build SDKROOT='/Library/Developer/CommandLineTools/SDKs/MacOSX15.sdk' |
|---|
| 836 | :debug:build SOURCE_DATE_EPOCH='1727388815' |
|---|
| 837 | :info:build Executing: cd "/opt/local/var/macports/build/_opt_local_var_macports_sources_rsync.macports.org_macports_release_tarballs_ports_devel_umem/umem/work/umem-1.0.1" && /usr/bin/make -w all |
|---|
| 838 | :debug:build system: cd "/opt/local/var/macports/build/_opt_local_var_macports_sources_rsync.macports.org_macports_release_tarballs_ports_devel_umem/umem/work/umem-1.0.1" && /usr/bin/make -w all |
|---|
| 839 | :info:build make: Entering directory `/opt/local/var/macports/build/_opt_local_var_macports_sources_rsync.macports.org_macports_release_tarballs_ports_devel_umem/umem/work/umem-1.0.1' |
|---|
| 840 | :info:build /Library/Developer/CommandLineTools/usr/bin/make all-am |
|---|
| 841 | :info:build make[1]: Entering directory `/opt/local/var/macports/build/_opt_local_var_macports_sources_rsync.macports.org_macports_release_tarballs_ports_devel_umem/umem/work/umem-1.0.1' |
|---|
| 842 | :info:build if /bin/sh ./libtool --tag=CC --mode=compile /usr/bin/clang -DHAVE_CONFIG_H -I. -I. -I. -I/opt/local/include -isysroot/Library/Developer/CommandLineTools/SDKs/MacOSX15.sdk -pipe -Os -isysroot/Library/Developer/CommandLineTools/SDKs/MacOSX15.sdk -arch arm64 -MT vmem_sbrk.lo -MD -MP -MF ".deps/vmem_sbrk.Tpo" -c -o vmem_sbrk.lo vmem_sbrk.c; \ |
|---|
| 843 | :info:build then mv -f ".deps/vmem_sbrk.Tpo" ".deps/vmem_sbrk.Plo"; else rm -f ".deps/vmem_sbrk.Tpo"; exit 1; fi |
|---|
| 844 | :info:build /usr/bin/clang -DHAVE_CONFIG_H -I. -I. -I. -I/opt/local/include -isysroot/Library/Developer/CommandLineTools/SDKs/MacOSX15.sdk -pipe -Os -isysroot/Library/Developer/CommandLineTools/SDKs/MacOSX15.sdk -arch arm64 -MT vmem_sbrk.lo -MD -MP -MF .deps/vmem_sbrk.Tpo -c vmem_sbrk.c -fno-common -DPIC -o .libs/vmem_sbrk.o |
|---|
| 845 | :info:build vmem_sbrk.c:124:33: warning: 'sbrk' is deprecated [-Wdeprecated-declarations] |
|---|
| 846 | :info:build 124 | old_brk = (uintptr_t)BRKALIGN(sbrk(0)); |
|---|
| 847 | :info:build | ^ |
|---|
| 848 | :info:build /Library/Developer/CommandLineTools/SDKs/MacOSX15.sdk/usr/include/unistd.h:582:1: note: 'sbrk' has been explicitly marked deprecated here |
|---|
| 849 | :info:build 582 | __deprecated __WATCHOS_PROHIBITED __TVOS_PROHIBITED |
|---|
| 850 | :info:build | ^ |
|---|
| 851 | :info:build /Library/Developer/CommandLineTools/SDKs/MacOSX15.sdk/usr/include/sys/cdefs.h:214:40: note: expanded from macro '__deprecated' |
|---|
| 852 | :info:build 214 | #define __deprecated __attribute__((__deprecated__)) |
|---|
| 853 | :info:build | ^ |
|---|
| 854 | :info:build vmem_sbrk.c:137:16: warning: 'brk' is deprecated [-Wdeprecated-declarations] |
|---|
| 855 | :info:build 137 | brk_result = brk((void *)new_brk); |
|---|
| 856 | :info:build | ^ |
|---|
| 857 | :info:build /Library/Developer/CommandLineTools/SDKs/MacOSX15.sdk/usr/include/unistd.h:538:1: note: 'brk' has been explicitly marked deprecated here |
|---|
| 858 | :info:build 538 | __deprecated __WATCHOS_PROHIBITED __TVOS_PROHIBITED |
|---|
| 859 | :info:build | ^ |
|---|
| 860 | :info:build /Library/Developer/CommandLineTools/SDKs/MacOSX15.sdk/usr/include/sys/cdefs.h:214:40: note: expanded from macro '__deprecated' |
|---|
| 861 | :info:build 214 | #define __deprecated __attribute__((__deprecated__)) |
|---|
| 862 | :info:build | ^ |
|---|
| 863 | :info:build vmem_sbrk.c:137:14: error: incompatible pointer to integer conversion assigning to 'int' from 'void *' [-Wint-conversion] |
|---|
| 864 | :info:build 137 | brk_result = brk((void *)new_brk); |
|---|
| 865 | :info:build | ^ ~~~~~~~~~~~~~~~~~~~~ |
|---|
| 866 | :info:build 2 warnings and 1 error generated. |
|---|
| 867 | :info:build make[1]: *** [vmem_sbrk.lo] Error 1 |
|---|
| 868 | :info:build make[1]: Leaving directory `/opt/local/var/macports/build/_opt_local_var_macports_sources_rsync.macports.org_macports_release_tarballs_ports_devel_umem/umem/work/umem-1.0.1' |
|---|
| 869 | :info:build make: *** [all] Error 2 |
|---|
| 870 | :info:build make: Leaving directory `/opt/local/var/macports/build/_opt_local_var_macports_sources_rsync.macports.org_macports_release_tarballs_ports_devel_umem/umem/work/umem-1.0.1' |
|---|
| 871 | :info:build Command failed: cd "/opt/local/var/macports/build/_opt_local_var_macports_sources_rsync.macports.org_macports_release_tarballs_ports_devel_umem/umem/work/umem-1.0.1" && /usr/bin/make -w all |
|---|
| 872 | :info:build Exit code: 2 |
|---|
| 873 | :error:build Failed to build umem: command execution failed |
|---|
| 874 | :debug:build Error code: CHILDSTATUS 69462 2 |
|---|
| 875 | :debug:build Backtrace: command execution failed |
|---|
| 876 | :debug:build while executing |
|---|
| 877 | :debug:build "system {*}$notty {*}$callback {*}$nice $fullcmdstring" |
|---|
| 878 | :debug:build invoked from within |
|---|
| 879 | :debug:build "command_exec -callback portprogress::target_progress_callback build" |
|---|
| 880 | :debug:build (procedure "portbuild::build_main" line 10) |
|---|
| 881 | :debug:build invoked from within |
|---|
| 882 | :debug:build "$procedure $targetname" |
|---|
| 883 | :error:build See /opt/local/var/macports/logs/_opt_local_var_macports_sources_rsync.macports.org_macports_release_tarballs_ports_devel_umem/umem/main.log for details. |
|---|