Ticket #71802: main.log

File main.log, 14.1 KB (added by amadeus24, 20 months ago)
Line 
1version:1
2:debug:clean Starting logging for mmencode @2.7_0
3:debug:sysinfo macOS 15.2 (darwin/24.2.0) arch arm
4:debug:sysinfo MacPorts 2.10.5
5:debug:sysinfo Xcode 16.0, CLT 16.2.0.0.1.1733547573
6:debug:sysinfo SDK 15
7:debug:sysinfo MACOSX_DEPLOYMENT_TARGET: 15.0
8:debug:clean Fetching mmencode-2.7_0.darwin_24.arm64.tbz2 archive size
9:debug:clean mmencode has no conflicts
10:debug:main Executing org.macports.main (mmencode)
11:debug:main dropping privileges: euid changed to 502, egid changed to 501.
12:debug:main Privilege de-escalation not attempted as not running as root.
13:debug:archivefetch archivefetch phase started at Fri Jan 10 10:57:21 CET 2025
14:msg:archivefetch --->  Fetching archive for mmencode
15:debug:archivefetch Executing org.macports.archivefetch (mmencode)
16:debug:archivefetch euid/egid changed to: 0/0
17:debug:archivefetch chowned /opt/local/var/macports/incoming to macports
18:debug:archivefetch euid/egid changed to: 502/501
19:info:archivefetch --->  mmencode-2.7_0.darwin_24.arm64.tbz2 doesn't seem to exist in /opt/local/var/macports/incoming/verified
20:msg:archivefetch --->  Attempting to fetch mmencode-2.7_0.darwin_24.arm64.tbz2 from https://packages.macports.org/mmencode
21:debug:archivefetch Fetching archive failed: The requested URL returned error: 404
22:msg:archivefetch --->  Attempting to fetch mmencode-2.7_0.darwin_24.arm64.tbz2 from https://fra.de.packages.macports.org/mmencode
23:debug:archivefetch Fetching archive failed: The requested URL returned error: 404
24:msg:archivefetch --->  Attempting to fetch mmencode-2.7_0.darwin_24.arm64.tbz2 from https://nue.de.packages.macports.org/mmencode
25:debug:archivefetch Fetching archive failed: The requested URL returned error: 404
26:debug:archivefetch Privilege de-escalation not attempted as not running as root.
27:debug:fetch fetch phase started at Fri Jan 10 10:57:21 CET 2025
28:notice:fetch --->  Fetching distfiles for mmencode
29:debug:fetch elevating privileges for fetch: euid changed to 0, egid changed to 0.
30:debug:fetch dropping privileges: euid changed to 502, egid changed to 501.
31:debug:fetch Executing org.macports.fetch (mmencode)
32:info:fetch --->  mm2.7.tar.Z does not exist in /opt/local/var/macports/distfiles/mmencode
33:notice:fetch --->  Attempting to fetch mm2.7.tar.Z from http://distcache.FreeBSD.org/ports-distfiles/
34:debug:fetch Privilege de-escalation not attempted as not running as root.
35:debug:checksum checksum phase started at Fri Jan 10 10:57:22 CET 2025
36:notice:checksum --->  Verifying checksums for mmencode
37:debug:checksum Executing org.macports.checksum (mmencode)
38:info:checksum --->  Checksumming mm2.7.tar.Z
39:debug:checksum Calculated (rmd160) is ae322cad0653140cbe7f0148ce48757df98c26b0
40:debug:checksum Correct (rmd160) checksum for mm2.7.tar.Z
41:debug:checksum Calculated (sha256) is 9c0281bdce32a7d3e61c1e3c703a748acb5d216d082a718efa316f68b9808a96
42:debug:checksum Correct (sha256) checksum for mm2.7.tar.Z
43:debug:checksum Calculated (size) is 262881
44:debug:checksum Correct (size) checksum for mm2.7.tar.Z
45:debug:checksum Privilege de-escalation not attempted as not running as root.
46:debug:extract extract phase started at Fri Jan 10 10:57:22 CET 2025
47:notice:extract --->  Extracting mmencode
48:debug:extract Executing org.macports.extract (mmencode)
49:info:extract --->  Extracting mm2.7.tar.Z
50:debug:extract setting option extract.args to '/opt/local/var/macports/distfiles/mmencode/mm2.7.tar.Z'
51:debug:extract Environment:
52:debug:extract CC_PRINT_OPTIONS='YES'
53:debug:extract CC_PRINT_OPTIONS_FILE='/opt/local/var/macports/build/_opt_local_var_macports_sources_rsync.macports.org_macports_release_tarballs_ports_textproc_mmencode/mmencode/work/.CC_PRINT_OPTIONS'
54:debug:extract CPATH='/opt/local/include'
55:debug:extract DEVELOPER_DIR='/Library/Developer/CommandLineTools'
56:debug:extract LIBRARY_PATH='/opt/local/lib'
57:debug:extract MACOSX_DEPLOYMENT_TARGET='15.0'
58:debug:extract SDKROOT='/Library/Developer/CommandLineTools/SDKs/MacOSX15.sdk'
59:debug:extract SOURCE_DATE_EPOCH='1643181281'
60:info:extract Executing:  cd "/opt/local/var/macports/build/_opt_local_var_macports_sources_rsync.macports.org_macports_release_tarballs_ports_textproc_mmencode/mmencode/work" && /usr/bin/gzip -dc '/opt/local/var/macports/distfiles/mmencode/mm2.7.tar.Z' | /usr/bin/tar -xf -
61:debug:extract system:  cd "/opt/local/var/macports/build/_opt_local_var_macports_sources_rsync.macports.org_macports_release_tarballs_ports_textproc_mmencode/mmencode/work" && /usr/bin/gzip -dc '/opt/local/var/macports/distfiles/mmencode/mm2.7.tar.Z' | /usr/bin/tar -xf -
62:debug:extract euid/egid changed to: 0/0
63:debug:extract chowned /opt/local/var/macports/build/_opt_local_var_macports_sources_rsync.macports.org_macports_release_tarballs_ports_textproc_mmencode/mmencode/work to macports
64:debug:extract euid/egid changed to: 502/501
65:debug:extract Privilege de-escalation not attempted as not running as root.
66:debug:patch patch phase started at Fri Jan 10 10:57:22 CET 2025
67:debug:patch Executing org.macports.patch (mmencode)
68:notice:patch --->  Applying patches to mmencode
69:info:patch --->  Applying implicit.patch
70:debug:patch Environment:
71:debug:patch CC_PRINT_OPTIONS='YES'
72:debug:patch CC_PRINT_OPTIONS_FILE='/opt/local/var/macports/build/_opt_local_var_macports_sources_rsync.macports.org_macports_release_tarballs_ports_textproc_mmencode/mmencode/work/.CC_PRINT_OPTIONS'
73:debug:patch CPATH='/opt/local/include'
74:debug:patch DEVELOPER_DIR='/Library/Developer/CommandLineTools'
75:debug:patch LIBRARY_PATH='/opt/local/lib'
76:debug:patch MACOSX_DEPLOYMENT_TARGET='15.0'
77:debug:patch SDKROOT='/Library/Developer/CommandLineTools/SDKs/MacOSX15.sdk'
78:debug:patch SOURCE_DATE_EPOCH='1643181281'
79:info:patch Executing:  cd "/opt/local/var/macports/build/_opt_local_var_macports_sources_rsync.macports.org_macports_release_tarballs_ports_textproc_mmencode/mmencode/work/mm2.7" && /usr/bin/patch -t -N -p0 < '/opt/local/var/macports/sources/rsync.macports.org/macports/release/tarballs/ports/textproc/mmencode/files/implicit.patch'
80:debug:patch system:  cd "/opt/local/var/macports/build/_opt_local_var_macports_sources_rsync.macports.org_macports_release_tarballs_ports_textproc_mmencode/mmencode/work/mm2.7" && /usr/bin/patch -t -N -p0 < '/opt/local/var/macports/sources/rsync.macports.org/macports/release/tarballs/ports/textproc/mmencode/files/implicit.patch'
81:info:patch patching file 'src/metamail/codes.c'
82:info:patch patching file 'src/metamail/mmencode.c'
83:debug:patch Privilege de-escalation not attempted as not running as root.
84:debug:configure configure phase started at Fri Jan 10 10:57:22 CET 2025
85:notice:configure --->  Configuring mmencode
86:debug:configure Preferred compilers: clang macports-clang-18 macports-clang-17 macports-clang-16 macports-clang-15 macports-clang-14 macports-clang-13
87:debug:configure Using compiler 'Xcode Clang'
88:debug:configure Executing org.macports.configure (mmencode)
89:debug:configure Executing portconfigure::configure_finish
90:debug:configure Privilege de-escalation not attempted as not running as root.
91:debug:build build phase started at Fri Jan 10 10:57:22 CET 2025
92:notice:build --->  Building mmencode
93:debug:build Executing org.macports.build (mmencode)
94:debug:build Environment:
95:debug:build CC_PRINT_OPTIONS='YES'
96:debug:build CC_PRINT_OPTIONS_FILE='/opt/local/var/macports/build/_opt_local_var_macports_sources_rsync.macports.org_macports_release_tarballs_ports_textproc_mmencode/mmencode/work/.CC_PRINT_OPTIONS'
97:debug:build CPATH='/opt/local/include'
98:debug:build DEVELOPER_DIR='/Library/Developer/CommandLineTools'
99:debug:build LIBRARY_PATH='/opt/local/lib'
100:debug:build MACOSX_DEPLOYMENT_TARGET='15.0'
101:debug:build SDKROOT='/Library/Developer/CommandLineTools/SDKs/MacOSX15.sdk'
102:debug:build SOURCE_DATE_EPOCH='1643181281'
103:info:build Executing:  cd "/opt/local/var/macports/build/_opt_local_var_macports_sources_rsync.macports.org_macports_release_tarballs_ports_textproc_mmencode/mmencode/work/mm2.7/src/metamail" && /usr/bin/make -j10 -w mmencode CC="/usr/bin/clang -arch arm64"
104:debug:build system:  cd "/opt/local/var/macports/build/_opt_local_var_macports_sources_rsync.macports.org_macports_release_tarballs_ports_textproc_mmencode/mmencode/work/mm2.7/src/metamail" && /usr/bin/make -j10 -w mmencode CC="/usr/bin/clang -arch arm64"
105:info:build make: Entering directory `/opt/local/var/macports/build/_opt_local_var_macports_sources_rsync.macports.org_macports_release_tarballs_ports_textproc_mmencode/mmencode/work/mm2.7/src/metamail'
106:info:build rm -f mmencode.o
107:info:build rm -f codes.o
108:info:build /usr/bin/clang -arch arm64 -c  -I.. -g -I.    mmencode.c
109:info:build /usr/bin/clang -arch arm64 -c  -I.. -g -I.    codes.c
110:info:build codes.c:20:14: warning: a function declaration without a prototype is deprecated in all versions of C and is treated as a zero-parameter prototype in C2x, conflicting with a previous declaration [-Wdeprecated-non-prototype]
111:info:build    20 | extern char *index();
112:info:build       |              ^
113:info:build codes.c:52:5: warning: a function definition without a prototype is deprecated in all versions of C and is not supported in C2x [-Wdeprecated-non-prototype]
114:info:build    52 | int nextcharin(infile, PortableNewlines)
115:info:build       |     ^
116:info:build codes.c:76:1: warning: a function definition without a prototype is deprecated in all versions of C and is not supported in C2x [-Wdeprecated-non-prototype]
117:info:build    76 | to64(infile, outfile, PortableNewlines)
118:info:build       | ^
119:info:build codes.c:105:27: error: parameter 'pads' was not declared, defaults to 'int'; ISO C99 and later do not support implicit int [-Wimplicit-int]
120:info:build   105 | output64chunk(c1, c2, c3, pads, outfile)
121:info:build       |                           ^
122:info:build   106 | FILE *outfile;
123:info:build   107 | {
124:info:build codes.c:105:23: error: parameter 'c3' was not declared, defaults to 'int'; ISO C99 and later do not support implicit int [-Wimplicit-int]
125:info:build   105 | output64chunk(c1, c2, c3, pads, outfile)
126:info:build       |                       ^
127:info:build   106 | FILE *outfile;
128:info:build   107 | {
129:info:build codes.c:105:19: error: parameter 'c2' was not declared, defaults to 'int'; ISO C99 and later do not support implicit int [-Wimplicit-int]
130:info:build   105 | output64chunk(c1, c2, c3, pads, outfile)
131:info:build       |                   ^
132:info:build   106 | FILE *outfile;
133:info:build   107 | {
134:info:build codes.c:105:15: error: parameter 'c1' was not declared, defaults to 'int'; ISO C99 and later do not support implicit int [-Wimplicit-int]
135:info:build   105 | output64chunk(c1, c2, c3, pads, outfile)
136:info:build       |               ^
137:info:build   106 | FILE *outfile;
138:info:build   107 | {
139:info:build codes.c:105:1: warning: a function definition without a prototype is deprecated in all versions of C and is not supported in C2x [-Wdeprecated-non-prototype]
140:info:build   105 | output64chunk(c1, c2, c3, pads, outfile)
141:info:build       | ^
142:info:build codes.c:122:1: error: type specifier missing, defaults to 'int'; ISO C99 and later do not support implicit int [-Wimplicit-int]
143:info:build   122 | PendingBoundary(s, Boundaries, BoundaryCt)
144:info:build       | ^
145:info:build       | int
146:info:build codes.c:122:1: warning: a function definition without a prototype is deprecated in all versions of C and is not supported in C2x [-Wdeprecated-non-prototype]
147:info:build codes.c:148:1: error: type specifier missing, defaults to 'int'; ISO C99 and later do not support implicit int [-Wimplicit-int]
148:info:build   148 | almostputc(c, outfile, PortableNewlines)
149:info:build       | ^
150:info:build       | int
151:info:build codes.c:148:1: warning: a function definition without a prototype is deprecated in all versions of C and is not supported in C2x [-Wdeprecated-non-prototype]
152:info:build codes.c:183:1: warning: a function definition without a prototype is deprecated in all versions of C and is not supported in C2x [-Wdeprecated-non-prototype]
153:info:build   183 | from64(infile, outfile, boundaries, boundaryct, PortableNewlines)
154:info:build       | ^
155:info:build codes.c:285:1: warning: a function definition without a prototype is deprecated in all versions of C and is not supported in C2x [-Wdeprecated-non-prototype]
156:info:build   285 | toqp(infile, outfile)
157:info:build       | ^
158:info:build codes.c:361:1: warning: a function definition without a prototype is deprecated in all versions of C and is not supported in C2x [-Wdeprecated-non-prototype]
159:info:build   361 | fromqp(infile, outfile, boundaries, boundaryct)
160:info:build       | ^
161:info:build 9 warnings and 6 errors generated.
162:info:build mmencode.c:30:1: error: type specifier missing, defaults to 'int'; ISO C99 and later do not support implicit int [-Wimplicit-int]
163:info:build    30 | main(argc, argv)
164:info:build       | ^
165:info:build       | int
166:info:build mmencode.c:30:1: warning: a function definition without a prototype is deprecated in all versions of C and is not supported in C2x [-Wdeprecated-non-prototype]
167:info:build 1 warning and 1 error generated.
168:info:build make: *** [codes.o] Error 1
169:info:build make: *** Waiting for unfinished jobs....
170:info:build make: *** [mmencode.o] Error 1
171:info:build make: Leaving directory `/opt/local/var/macports/build/_opt_local_var_macports_sources_rsync.macports.org_macports_release_tarballs_ports_textproc_mmencode/mmencode/work/mm2.7/src/metamail'
172:info:build Command failed:  cd "/opt/local/var/macports/build/_opt_local_var_macports_sources_rsync.macports.org_macports_release_tarballs_ports_textproc_mmencode/mmencode/work/mm2.7/src/metamail" && /usr/bin/make -j10 -w mmencode CC="/usr/bin/clang -arch arm64"
173:info:build Exit code: 2
174:error:build Failed to build mmencode: command execution failed
175:debug:build Error code: CHILDSTATUS 32998 2
176:debug:build Backtrace: command execution failed
177:debug:build     while executing
178:debug:build "system {*}$notty {*}$callback {*}$nice $fullcmdstring"
179:debug:build     invoked from within
180:debug:build "command_exec -callback portprogress::target_progress_callback build"
181:debug:build     (procedure "portbuild::build_main" line 10)
182:debug:build     invoked from within
183:debug:build "$procedure $targetname"
184:error:build See /opt/local/var/macports/logs/_opt_local_var_macports_sources_rsync.macports.org_macports_release_tarballs_ports_textproc_mmencode/mmencode/main.log for details.